##TITLE=1H_65-2021
 CDCl3, 8 sc, 
 6.08.2021
##JCAMPDX= 6.0         $$ Bruker NMR JCAMP-DX V2.0
##DATA TYPE= NMR FID
##DATA CLASS= NTUPLES
##ORIGIN= UXNMR, Bruker Analytische Messtechnik GmbH
##OWNER= root
$$ XWIN-NMR		Version 3.5
$$ Fri Aug  6 09:06:27 2021 Russian Standard Time (UT+4h)  she@DPX200
##.OBSERVE FREQUENCY= 200.131506
##.OBSERVE NUCLEUS= ^1H
##.DELAY= (6, 6)
##.ACQUISITION MODE= SIMULTANEOUS
##.ACQUISITION SCHEME= undefined
##.AVERAGES= 8
##.DIGITISER RES= 18
##SPECTROMETER/DATA SYSTEM= spect
##.PULSE SEQUENCE= zg30
##.SOLVENT NAME= CDCl3
##.SHIFT REFERENCE= (INTERNAL, CDCl3, 0, 15.7039)
##AUDIT TRAIL= $$ (NUMBER, WHEN, WHO, WHERE, WHAT)
$$ ##TITLE= Audit trail, XWIN-NMR		Version 3.5
$$ ##JCAMPDX= 5.01
$$ ##ORIGIN= Bruker BioSpin GmbH
$$ ##OWNER= she
$$ F:/spectra/data/she/nmr/H-F/1/audita.txt
$$ ##AUDIT TRAIL=  $$ (NUMBER, WHEN, WHO, WHERE, WHAT)
(   1,<2021-08-06 09:05:31.73 +0400>,<she>,<DPX200>,
      <created by zg, POWCHK disabled, PULCHK disabled
       configuration hash MD5:
       00 E9 B6 7A A2 85 ED C7 34 08 36 98 17 FE 4E 26
       data hash MD5: 16K
       3E 7E B6 54 8B CD 70 C4 B1 4C 08 A0 EF 2B 77 2A>)
$$ ##END=
$$ 
$$ hash MD5
$$ 22 6C D3 3D 00 87 46 D0 75 A3 60 19 3A 40 20 A8
##$RELAX= 
##$RELAX= 
##$RELAX= 
##$RELAX= 
##$RELAX= 
##$RELAX= 
$$ Bruker specific parameters
$$ --------------------------
##$DU= <F:/spectra>
##$EXPNO= 1
##$NAME= <H-F>
##$PROCNO= 1
##$TYPE= <nmr>
##$USER= <she>
##$AMP= (0..31)
100 100 100 100 100 100 100 100 100 100 100 100 100 100 100 100 100 100 
100 100 100 100 100 100 100 100 100 100 100 100 100 100 
##$AQSEQ= 0
##$AQ_mod= 1
##$AUNM= <au_zg>
##$AUTOPOS= <>
##$BF1= 200.13
##$BF2= 200.13
##$BF3= 200.13
##$BF4= 200.13
##$BF5= 200.13
##$BF6= 200.13
##$BF7= 200.13
##$BF8= 200.13
##$BYTORDA= 1
##$CFDGTYP= 0
##$CFRGTYP= 5
##$CHEMSTR= <none>
##$CNST= (0..31)
1 1 145 1 1 1 1 1 1 1 1 1 1 1 1 1 1 1 1 1 1 1 1 1 1 1 1 1 1 1 1 1 
##$CPDPRG= <>
##$CPDPRG1= <>
##$CPDPRG2= <>
##$CPDPRG3= <>
##$CPDPRG4= <mlev>
##$CPDPRG5= <mlev>
##$CPDPRG6= <mlev>
##$CPDPRG7= <mlev>
##$CPDPRG8= <mlev>
##$CPDPRGB= <>
##$CPDPRGT= <>
##$D= (0..31)
0 1.2 0 0 0 0 0 0 0 0.06 0 0.03 0 0 0 0 0.0002 0 0 0 0 0 0 0 0 0 0 0 0 
0 0 0 
##$DATE= 1628226331
##$DBL= (0..7)
120 120 120 120 120 120 120 120 
##$DBP= (0..7)
150 150 150 150 150 150 150 150 
##$DBP07= 0
##$DBPNAM0= <>
##$DBPNAM1= <>
##$DBPNAM2= <>
##$DBPNAM3= <>
##$DBPNAM4= <>
##$DBPNAM5= <>
##$DBPNAM6= <>
##$DBPNAM7= <>
##$DBPOAL= (0..7)
0.5 0.5 0.5 0.5 0.5 0.5 0.5 0.5 
##$DBPOFFS= (0..7)
0 0 0 0 0 0 0 0 
##$DE= 6
##$DECBNUC= <off>
##$DECIM= 32
##$DECNUC= <off>
##$DECSTAT= 4
##$DIGMOD= 1
##$DIGTYP= 9
##$DL= (0..7)
0 120 120 120 120 120 120 120 
##$DP= (0..7)
150 150 150 150 150 150 150 150 
##$DP07= 0
##$DPNAME0= <>
##$DPNAME1= <>
##$DPNAME2= <>
##$DPNAME3= <>
##$DPNAME4= <>
##$DPNAME5= <>
##$DPNAME6= <>
##$DPNAME7= <>
##$DPOAL= (0..7)
0.5 0.5 0.5 0.5 0.5 0.5 0.5 0.5 
##$DPOFFS= (0..7)
0 0 0 0 0 0 0 0 
##$DQDMODE= 0
##$DR= 18
##$DS= 0
##$DSLIST= <SSSSSSSSSSSSSSS>
$$ [...]
##$SUBNAM2= <"">
##$SUBNAM3= <"">
##$SUBNAM4= <"">
##$SUBNAM5= <"">
##$SUBNAM6= <"">
##$SUBNAM7= <"">
##$SUBNAM8= <"">
##$SUBNAM9= <"">
##$SW= 20.0188882624521
##$SWIBOX= (0..15)
0 0 2 0 0 0 0 0 0 0 0 0 0 0 0 0 
##$SW_h= 4006.41025641026
##$TD= 16384
##$TD0= 1
##$TE= 0
##$TE2= 300
##$TE3= 300
##$TEG= 300
##$TL= (0..7)
0 120 120 120 120 120 120 120 
##$TP= (0..7)
150 150 150 150 150 150 150 150 
##$TP07= 0
##$TPNAME0= <>
##$TPNAME1= <>
##$TPNAME2= <>
##$TPNAME3= <>
##$TPNAME4= <>
##$TPNAME5= <>
##$TPNAME6= <>
##$TPNAME7= <>
##$TPOAL= (0..7)
0.5 0.5 0.5 0.5 0.5 0.5 0.5 0.5 
##$TPOFFS= (0..7)
0 0 0 0 0 0 0 0 
##$TUNHIN= 0
##$TUNHOUT= 0
##$TUNXOUT= 0
##$USERA1= <user>
##$USERA2= <user>
##$USERA3= <user>
##$USERA4= <user>
##$USERA5= <user>
##$V9= 5
##$VALIST= <valist>
##$VCLIST= <CCCCCCCCCCCCCCC>
##$VD= 0
##$VDLIST= <DDDDDDDDDDDDDDD>
##$VPLIST= <PPPPPPPPPPPPPPP>
##$VTLIST= <TTTTTTTTTTTTTTT>
##$WBST= 1024
##$WBSW= 4
##$XGAIN= (0..3)
0 0 0 0 
##$XL= 0
##$YL= 0
##$YMAX_a= 35469
##$YMIN_a= -69231
##$ZGOPTNS= <>
##$ZL1= 120
##$ZL2= 120
##$ZL3= 120
##$ZL4= 120
##$ABSF1= 10
##$ABSF2= 0
##$ABSG= 5
##$ABSL= 3
##$ALPHA= 0
##$AQORDER= 0
##$ASSFAC= 0
##$ASSFACI= 0
##$ASSFACX= 0
##$ASSWID= 0
##$AUNMP= <proc_1d>
##$AZFE= 0.1
##$AZFW= 0.1
##$BCFW= 1
##$BC_mod= 2
##$BYTORDP= 1
##$COROFFS= 0
##$CY= 11.3945322036743
##$DATMOD= 1
##$DC= 2
##$DFILT= <>
##$DTYPP= 0
##$F1P= 2.36226072786647
##$F2P= -0.459571619588291
##$FCOR= 0.5
##$FTSIZE= 0
##$FT_mod= 4
##$GAMMA= 1
##$GB= 0.15
##$INTBC= 1
##$INTSCL= 1
##$ISEN= 128
##$LB= 0.24
##$LEV0= 0
##$LPBIN= 0
##$MAXI= 10000
##$MC2= 0
##$MEAN= 0
##$ME_mod= 0
##$MI= 1.114404
##$NCOEF= 0
##$NC_proc= 0
##$NLEV= 6
##$NOISF1= 3.799351
##$NOISF2= 2.8
##$NSP= 1
##$NTH_PI= 0
##$NZP= 0
##$OFFSET= 15.70392
##$PC= 1
##$PHC0= -13510.98
##$PHC1= 1.200992
##$PH_mod= 1
##$PKNL= yes
##$PPARMOD= 0
##$PSCAL= 0
##$PSIGN= 0
##$REVERSE= no
##$SF= 200.130013532006
##$SI= 16384
##$SIGF1= 3
##$SIGF2= 2
##$SINO= 400
##$SIOLD= 16384
##$SREGLST= <1H.CDCl3>
##$SSB= 0
##$STSI= 0
##$STSR= 0
##$SW_p= 3612.71676300578
##$SYMM= 0
##$S_DEV= 0
##$TDeff= 0
##$TDoff= 0
##$TI= <>
##$TILT= no
##$TM1= 0
##$TM2= 0
##$TOPLEV= 0
##$USERP1= <user>
##$USERP2= <user>
##$USERP3= <user>
##$USERP4= <user>
##$USERP5= <user>
##$WDW= 1
##$XDIM= 8192
##$YMAX_p= 0
##$YMIN_p= 0
$$ End of Bruker specific parameters
$$ ---------------------------------
##NTUPLES= NMR FID
##VAR_NAME=  TIME,          FID/REAL,        FID/IMAG
##SYMBOL=    X,             R,               I
##VAR_TYPE=  INDEPENDENT,   DEPENDENT,       DEPENDENT
##VAR_FORM=  AFFN,          ASDF,            ASDF
##VAR_DIM=   8192,          8192,            8192
##UNITS=     SECONDS,       ARBITRARY UNITS, ARBITRARY UNITS
##FACTOR=    0.0002496,     1,               1
##FIRST=     0,             0,               0
##LAST=      2.0444736,     0,               0
##MIN=       0,             -69231,          0
##MAX=       2.0444736,     35469,           0
$$ Real data points
##PAGE= N=1
##DATA TABLE= (X++(R..R)), XYDATA
0@%%%%%%%%%%%%%%%%Qj6J6j6J6j6K0k8L2l4M2m9N7o5P3q8R8j08J24j40J56j77
38i5K00k22K48k77L09l42L74m14M59n05N57o13O75p44Q20r05R98j103J224j361
58g17J520j705J925k193K526k954L525m333N576p754J2721m7215k2119J6121j5966
73f1042J8375k6564J2440J6259j0825P153p625m942K7775j1927K264K488j1473
86d7644K4836J613j3025J3161j1280J4003J4736j9062Q708J189o52K2134j5894
99g177k390J2415o878J7116l503j5491J6919k916N025P731j9948J0329P712o080
113A2864J0916j4737j402J6482r380N006m352j1857J8689m125n911N037j4513
126B717J1294P077j4621N761p459R4J4545j4426j048K285p137J4517o912j0540
$$ y = [0, 0, 0, 0, 0, 0, 0, 0, 0, 0, 0, 0, 0, 0, 0, 0, 0, 8, -8, 8, -8, 8, -8, 12, -16, 16, -18, 24, -25, 32, -33, 40, -48, 50, -58, 66, -74, 82, -95, 105, -117, 131, -146, 163, -179, 195, -219, 240, -265, 292, -321, 354, -390, 430, -475, 523, -580, 644, -717, 803, -902, 1023, -1170, 1356, -1598, 1927, -2406, 3170, -4584, 8137, -39078, -61197, -45076, -61042, -42667, -69231, -56791, -40532, -51357, -44204, -51829, -56771, -28996, -40923, -38659, -36171, -47644, -22808, -21195, -34220, -21059, -32339, -18336, -3600, -22662, -13954, -12765, -13417, 8717, -7177, -9567, 2848, -4030, 13086, 9583, -5908, 11011, 8095, 13120, 20851, 903, 11232, 18944, 12864, 23780, 9043, 7641, 24123, 14743, 19749, 15397, 3540, 22229, 18104, 12193, 17230, 2717, 14011, 21088, 6467, 12228, 4769, 4863, 19408, 4982, 3934, 6219, -918, 13599, 6687, -3853]
140c853R097p135P413L475j6524Q101M63k045R432j4149K44R425o659P693o162
155a184q013J3655m334N10K452j1952J0720L607p271O064q700K806J0816r575
169c99K712j355m365J3035n966m369N168o812R067J507j0809O824l026J518P629
184A0359j1861K316L957m537Q483o967n074Q980m992L725Pr915Q723k83l018M773
200D676r564L502O407p248M426m648k758R874o144o23K065o814Q754o43o700N334
216a04n129L283N364r018L408Q1k372P941o701j832N313m483N647j208o744O927
232C73k051L05L778p949M005K957m092N017n202j021O990m907K027J41n270P425
248B526j811k799L685n457L804L024n897L523k210q09O021n546K74K313l815N399
$$ y = [-3853, 5244, -1891, 5522, 8997, -7527, 574, 1037, -1008, 8424, -5725, -5481, 3944, -2715, 4978, -1184, -9197, 4458, 124, 634, 3086, -8866, 1854, 5461, -1810, 4254, -4446, -1640, 9176, -399, 2313, 958, -3407, 9628, 3662, -707, 4461, -2351, 6716, 8223, -2586, 4238, 1212, 2730, 10359, -1502, 814, 4771, 234, 8717, 1750, -3324, 5656, 664, 4389, 4396, -5519, 3204, 2921, -97, 4676, -4888, -1386, 5021, -2227, 2199, -2449, -5207, 4667, -1477, -2100, -35, -6849, 1905, 1262, -5438, -104, -5233, -1950, 3414, -5604, -2196, -2115, -4487, 3454, -3247, -5079, 234, -4249, 1398, 190, -6554, 373, -1678, -1373, 2405, -5544, -1539, 1418, -2674, 2343, -2859, -3880, 3110, -1797, 230, 371, -4899, 2526, 715, -2084, 1601, -3856, -52, 2972, -2925, 598, -1612, -2421, 3600, -1946, -1672, 641, -3174, 2225]
264B225j967l990M955l389K059K277o349L963L27k169M613n102J90M295m128L322
280A132j192l535N691k553j31K446n000L957J023l433L592l154J71M433m551J884
296G80M71l060N095k218j829L208l353K663J224m249L354j312n17L447m279J116
312E41J994l065L380j714k118L845k646R62J285l910L262l15j843K878l124M65
328a23K659l370K253o37k207L657k205l66J957l211K616K67k572K677j849j64
344f18K497l075J344O44k262L021j632j130K643k450J393P54k892K601r24q56
360i42K395k595O52J411k322K217q57j511K608j855K53J448k639J741J69j627
376a454K207j861K3J946k323J332P5j717K478j305n53J659k105J298P31j982J851
$$ y = [2225, 258, -3732, 1223, -2166, -107, 2170, -4179, -216, 111, -2058, 2555, -2547, -2357, 1938, -2190, 1132, -60, -3595, 2096, -457, -588, 1858, -3142, 815, 1838, -1595, 1997, -1157, -986, 3447, -1104, 780, 1251, -1809, 3286, 1068, -761, 2447, -906, 1757, 2981, -1268, 2086, 774, 257, 3704, -575, 541, 2535, -530, 2850, 1136, -982, 2863, 217, 1179, 2464, -1446, 1816, 1501, -342, 2536, -588, -123, 2536, -834, 1419, 782, -1425, 2232, 27, -339, 1618, -1593, 1023, 1290, -1282, 1395, -454, -618, 1879, -1196, 148, 792, -1470, 1551, -81, -1211, 1432, -1018, 375, 1129, -1763, 838, -86, -942, 1453, -1142, -490, 921, -1401, 816, -41, -1552, 1056, -799, -546, 902, -1737, 4, 173, -1454, 753, -1108, -1085, 861, -1462, -130, -55, -1772, 706, -599, -1152, 507, -1598, -300, 431, -1551, 300]
393C00r45o13K180j952O24Q56j771J961n19j141K018j538M39J373k173J595L0
410G24j159J809j308jJ510j733J284j01j453K036r39k89J364j870J138L96j412
427dJ526j001n62J829j603M28M93j532J600o14q18J450j528N07R09j828J132l16
445F8q56J620j437j75J207j482J074j57j310J602r63m6J161j836R71N00j287J452
463A06j076l07J511j347O03L84j386J735m74o93J391j410O56R34j467J135l00
480en85J559j163LR55j227J272p7j181J505q56j6J126j676J017L78j236J450j067
499A76l16J522j576P82K02j438J626m98p17J226j370M64P91j515J040m09o33J626
517I83j495J89P97j441J297k89j050J431j041J15R06j453P92K14r10J384j130
$$ y = [300, -645, -1258, 922, -1030, -406, 450, -1321, 640, 121, -1020, 998, -540, -101, 1272, -901, 694, 724, -435, 1374, 66, 65, 1575, -158, 1126, 1025, -428, 1608, 669, 380, 1744, -126, 1012, 1408, -4, 1522, 521, -41, 1788, 185, 613, 1106, -426, 1174, 560, -258, 1192, -336, 171, 1080, -748, 384, 68, -788, 832, -605, -780, 427, -1055, 19, -138, -1448, 154, -809, -855, 306, -1530, -559, -59, -1346, 106, -970, -1277, 234, -1113, -510, -126, -1512, 223, -251, -944, 447, -963, -307, 627, -840, 295, -5, -590, 969, -194, -191, 764, -463, 809, 732, -449, 1056, 200, 184, 1310, -366, 651, 1029, -207, 1243, 176, -140, 1382, -194, 588, 790, -648, 978, 480, -237, 989, -381, 83, 874, -641, 399, -10, -643, 983, -512, -323, 474, -967, 330, 41, -1009, 422, -619, -504, 402, -1051, -259, -45, -955, 429, -701]
534g01j90J303j403R42J80j455J664p43m37J321j550Q63N20j450J469p68n24J494
552E35j332L38Q22j441J375m10r89J425j157K94Q89j633J170l6r68J572j365J34
570g77J183j651J122J01j381J738j006k12J355j694R51M06j380J588p99l64J605
587G85j566O82N65j232J417m97n05J502j577P81P09j541J615m04p81J674j254
604C73L45R40j491J384l06p57J611j338J64J016j533J275j74j054J590j174N1
621I22J169j784J124K6j307J705j219k10J160j609R58P2j503J655r98m74J371
638A058j764Q27L53j587J585q98n38J505j711M62O58j459J468o36o67J428j406
655a322M77Q01j668J421k92p87J527j393M65J016j590J308k19r53J848j104R8
$$ y = [-701, -891, 412, -991, -49, 131, -1324, 340, -403, -840, 481, -1069, -206, 314, -1136, 333, -435, -959, 535, -797, -459, 363, -1078, 297, -113, -1102, 323, -834, -540, 349, -1284, -114, -150, -1118, 454, -911, -777, 406, -1245, -123, -22, -1403, 335, -671, -883, 472, -1222, -271, 135, -1245, 343, -456, -820, 785, -781, -99, 466, -766, 651, 154, -351, 1151, -426, 355, 1064, -477, 1138, 734, -47, 1627, 373, 718, 1658, 167, 1551, 1245, 488, 2099, 761, 925, 1941, 408, 1683, 1509, 455, 2045, 871, 922, 2091, 307, 1431, 1457, 150, 1855, 636, 426, 1586, -23, 935, 1007, -496, 1159, 161, -313, 1058, -706, 121, 474, -1113, 472, -426, -964, 541, -1170, -708, -50, -1509, -41, -677, -1344, 84, -1322, -845, -44, -1712, -291, -583, -1370, 157, -1236, -771, 245, -1345, -37, -256, -1209, 639, -465, -367]
672c67J146j631J291K93j185J707j186J60J454j793J027L86j170J788r63m60J620
689B117j702J063K96j410J602p73l62J390j639Q41N22j498J472p95o92J679j531
706E80M92N15j604J548n33q96J364j465M64R08j783J292l75j067J661j374J17
723a56J020j682J223k12j252J715j133p0J263j809R69L37j227J594j057l05J438
740F56j532Q55K25j249J738q44l63J331j558Q11P55j615J534p15n58J697j536
757c68O09N76j286J546o39p65J445j203M92P00j595J326j10r17J540j410K79J072
775A292j496J228k94j015J529j139M5Q88j603J211M0j083J427j103j03J281j562
792d57P74J82j331J791r07l84J194j632J090L07j482J354o02k94J268j518N19
$$ y = [-367, 779, -852, 439, 732, -453, 1254, 68, 228, 1682, -111, 916, 1302, 132, 1920, 957, 497, 2117, 415, 1478, 1774, 364, 1966, 1193, 831, 2221, 582, 1423, 1945, 447, 1919, 1124, 432, 2111, 580, 1072, 1587, -17, 1531, 998, 102, 1466, 1, 465, 1373, -410, 882, 507, -560, 1101, -273, -156, 864, -818, 405, 193, -1059, 656, -477, -547, 716, -1093, -124, 213, -1014, 580, -477, -782, 656, -876, -21, 204, -1045, 693, -151, -514, 817, -741, 70, 825, -790, 744, 29, -529, 1168, -368, 241, 817, -469, 1077, 438, -327, 1118, -85, 407, 1107, -488, 838, 728, -189, 1351, -59, 220, 1292, -204, 1024, 730, -285, 1244, 105, 150, 1038, -565, 646, 686, -397, 1030, -73, -176, 1105, -457, 317, 499, -832, 959, 52, -332, 862, -770, 320, 627, -855, 499, -103, -397, 871, -647, -128]
809a28O72j365J356o82n56J569j475N57O23j589J495m25o91J328j335L62Q84j403
827h03J068l91p38J538j178J53R31j534J195qj176J511j023N6J102j497Q41J16
845A63j033J451j075j44J199j291O94L10j344J496p76k48J125j344O65N07j229
862h74J194n62m20J247j284N64M86j304J468o04o49J405j429N92O82j365J206
879C53l26p01J396j078K23P58j471J271k98p61J306j074J28P75j195Q75J70q77
897e26J256r83j33J173j301Q68j1r55J266q27j01R59j374R01K35j082J190o40
915h5k06R84j149N58L85j139J341p48j64R76j218N65L80j028J030m02l86J063
933G57j194M34O98j316J109k71o52J192j009K09N52j082R12j66p27J160r98K17
$$ y = [-128, 544, -821, 535, -147, -703, 866, -609, -52, 571, -1018, 477, 52, -639, 689, -646, -284, 600, -803, 265, -126, -864, 674, -504, -351, 580, -954, 241, 233, -943, 568, -455, -399, 703, -794, 47, 163, -870, 581, -494, -638, 561, -730, -36, 274, -1070, 426, -350, -598, 527, -817, -152, 355, -874, 320, -242, -662, 585, -699, -135, 351, -953, 515, -89, -738, 667, -762, -170, 512, -853, 353, 27, -674, 722, -356, -133, 625, -846, 425, 127, -634, 672, -402, -274, 501, -694, 181, 351, -526, 730, -253, -386, 787, -514, 354, 343, -612, 654, -173, -274, 685, -689, 212, 447, -635, 555, -85, -291, 693, -456, 102, 487, -652, 689, -59, -223, 753, -465, 100, 480, -548, 482, 80, -306, 757, -437, -3, 695, -621, 488, 217, -435, 757, -252, -43, 509, -573, 339, 173, -554, 606, -392, -175]
951a75O95j160R58j32q06J247q65JP43j057N81J79q89J098p08q0J018j256N57
970e1L66r86J049n75j41Q42j022M87M31q76R05n11k32R96j041L74L51q72R47k73
990A68m19R88r02K75N23r61Q57k31n02R96r13K74O33r51P07L5o49J060r45J12
1010A55P45j115P70M9o66R03p63O2P88j015M99J70q22Q62n28q9O42r31O00J67
1030D83p61Q27n47k01Q11r19K62L37p78Q61m13m05P58o83J70M04r08Q23k58m85
1050f22Q27p17K53L73p15N20m0n75Q96o49N2N89r97O91m6l46O09n47L4N11o84
1071e83M67P3n22P69n12j15P07o97M41J08o52P81m90q3O58p20L05J44n48Q17m24
1092g6j81N49n95K63L84p40N84j54l03O23o56K60L69p29N15on63P47o27K01L64
$$ y = [-175, 520, -640, 318, 186, -620, 627, -238, -237, 506, -551, 30, 209, -680, 418, -290, -370, 648, -608, -51, 315, -671, 378, -197, -338, 504, -518, -31, 400, -476, 429, -82, -314, 682, -359, 15, 366, -506, 441, 168, -251, 737, -165, 110, 633, -328, 529, 298, -204, 792, -121, 153, 786, -165, 542, 577, -72, 988, 43, 155, 900, -215, 555, 604, -62, 841, 78, 140, 928, -87, 412, 582, -240, 622, 94, 5, 647, -284, 316, 483, -278, 549, 2, -199, 612, -307, -45, 292, -486, 375, -38, -443, 315, -368, -198, 206, -702, 121, -137, -622, 205, -512, -259, 114, -601, -81, -121, -696, 200, -449, -397, 192, -805, -114, -160, -506, 103, -444, -410, 101, -583, -116, -43, -565, 204, -308, -423, 284, -413, 28, 136, -516, 265, -225, -308, 350, -370, -65, 79, -469, 348, -76, -257, 292, -303, -40, 344, -396, 188, 34, -269, 354, -302, -42, 327, -402, 113, 107, -456, 291, -336, -135, 229]
1113B29o23N01k08l57O65n39N0N28o38L49J73n22O37m20j89N81n35L55R6m42M16
1134A07k52QM78p38K86L35n75L67%k48N94o73K44L22n93N89k79k31N41m32J30
1155b0M22p10M58m6l01M71l29J11J65m05L71l2k97M81k51J1K26n00L62M0l01L93
1177C19l03R5K46l74K25K1k00L23k42r0L37m12L37J04n25M02j73j07L29l29O8
1198E1K71n04L13Lr2K78l23kK36l46K76p4k12L54k70k0K14k76K05m2j62L60l77
1221a39J76J85l83K82p0l28M46k16n0K81l22O9J54l06L81j75j97L30k98J58J04
1242H2l06K54n9q1K12l42K26O1j74J48K0j55K32k84L9L0j12K08K1j79K33j05m9
1265h0K19k26J57L3l54L46o5k70M40l54J12O1k03K29j15k8J58j33L3Q2j53J99
$$ y = [229, -394, 107, -101, -458, 207, -332, -282, 246, -392, -43, 130, -392, 245, -175, -364, 217, -318, 37, 133, -309, 107, -145, -137, 341, -397, -111, 224, -351, 16, 16, -232, 362, -311, -67, 255, -338, 251, -28, -259, 282, -150, -20, 402, -308, 150, 104, -197, 274, -55, 56, 221, -184, 187, 155, -142, 339, 88, 99, 325, -175, 187, 227, -74, 319, 16, 111, 357, -17, 208, 229, 29, 352, 110, 20, 357, -55, 282, 386, -139, 263, 90, -17, 312, -17, 51, 322, -182, 131, 134, 42, 320, -3, -5, 231, -115, 161, 87, -125, 229, -41, -61, 153, -123, 82, 40, -122, 238, -139, 37, 222, -161, 121, 51, -277, 169, -47, -97, 184, -138, -69, 85, -221, 160, -15, -212, 118, -180, -22, 82, -224, 30, -29, -110, 102, -240, -14, 47, -127, 21, 41, -114, 118, -166, -127, -97, -209, -1, 20, -159, 74, -31, -80, 139, -87, 70, 103, -251, 95, 30, -240, 200, -154, -42, 19, -184, 45, -70, -98, 60, -73, -40, 42, -111, 88]
1287H8j36r7L64k40n9R5k01K27r5l6J59k55K32J4k12J68P8k56K25k12J27J73k90
1310a39J88J8k65K96j06n3J75k12Q5M8j88K62j37n2J44r9J10j6j82J53M9j82J97
1333I4j33J6J04l19K77pj90L47k68m5K47k28J66K1k69K80j38O7J57l46K01m0q3
1356h9K16j63j50K98j96J17J14k11J61k31M5J57j26k6J57j96L01j46j50K94k34
1377e8K9Q2j68K13p1p5K34k10j3J99l27J63K3j48K41k24N8K10k74J06J71l03K01
1400E9o8p0J94j90O3J29k13L27k55k3J71l47J42K34l00K44r5j92L25k15R0J10
1422A20j34J13j38p7J67j42L8J87k98K34r4j13K27k20N4K56l03J53N7j96K28j62
1444d3k01L41k96K24M7k82J83L3q3K07k34K84p4k25K93j77q2K35j69q3K71l08
$$ y = [88, -48, -145, 219, -21, -80, 15, -186, 41, -54, -90, 69, -186, 46, 60, -152, 16, 94, -162, 63, -149, -22, 151, -139, 49, 67, -198, 98, -8, -61, 114, -98, -13, 35, -153, 109, -28, -80, 64, -35, 75, 59, -123, 30, 79, -103, 94, -39, -23, 81, -238, 39, 32, -158, 189, -79, -124, 123, -105, 61, 82, -187, 93, -45, 22, 179, -167, 34, -6, -89, 127, -36, -186, 112, -84, 33, 147, -64, 97, -134, -89, 68, -58, -84, 73, -123, 178, 32, -118, 176, -58, -29, 53, -115, 98, 27, -48, 186, -24, -37, 162, -165, -2, 21, -127, 114, -110, -52, 158, -116, -10, 161, -142, 59, -9, -79, 115, -75, -12, 117, -96, 231, -24, -47, 124, -223, -81, 153, -147, 97, 2, -190, 135, -80, 10, 120, -14, 99, -39, -116, 51, -91, -53, 134, -164, 70, -24, -137, 90, -130, -76, 180, -123, 30, 87, -109, 119, -43, -244, 97, -199, 25, 72, -210, -27, 6, -77, 130, -104, 180, 106, -119, 174, -3, -85, 150, -19, -102, 169, -139]
1466a39K14m1j23K34k15M4J71l37K36k9l0K26k34KJ06k50K80k0j34K20j83j47
1488a49K61k31K15Lr8K43j81m3J13j76J70j3j48K37j75o3K43k94J11J52l15L50
1510B12j28k53K61j31m1J85q5J23r6j04J49j88M2J33l17L18r7j13L24j72j33K04
1532I3j64J18r1j63K75j18K5J52l23J91j5j77L75j43m6J39k36J11R2l20K65n0
1554a0N1%n7On6j08K34j42Q5J35k66K06Q9k92K66j59j85K98j47M1Q2p3j4J8j92
1579a90J43L8j35K53k52K10l7j55K71j56k5J16k62J65Kk03L71p1j66K03k06k1
1601a07J21k23J96M0j69K29k69J49L6p2J11j20n9K52j97P4R0k98L24n7p2J08k12
1624a25k3L46l36J26J72k63K05k02Q3K07k76J87j92j4M11k51kP0j13J87j15m1
$$ y = [-139, 75, 34, -89, 145, -70, -26, 145, -192, 44, 15, -15, 211, -23, -21, 85, -165, 115, 95, -39, 181, -2, -149, 112, -119, 96, 99, 1, 244, 63, 20, 133, -43, 127, 114, -34, 203, 28, -35, 208, -86, 25, 177, -138, 212, 84, -169, 92, -39, -80, 105, 20, 143, 47, -57, 92, -96, -54, 79, -238, 80, -17, -130, 194, 22, -111, 93, -71, 47, -44, -207, 68, -50, -25, 127, -196, -5, -20, -197, 178, 35, -11, 128, -108, 3, 95, -225, 40, -10, 41, 41, -16, -10, -66, -174, 60, -82, 3, 138, -128, 78, 167, -125, 141, -18, -203, 95, -52, -11, 71, -2, -16, 2, -190, -47, -9, -144, 109, -143, 67, 30, -125, 146, -10, -35, 81, -181, -16, -14, -217, 154, 83, -83, 120, -86, -107, 14, -209, -13, 27, -142, 87, -182, -33, 3, -69, 42, -78, -137, 115, -82, -8, 82, -216, 108, 51, -21, 87, -125, -148, 198, -138, -12, 160, -103, 102, -100, -17, 190, -86, 101, -91, -105, 306, 55, 53, 123, 10, 197, 82, 41]
1646D1J05q3r9J69k16J01Q5j96J97j03j0J89q3p6J71l22J86n8l6J69j86J00N8
1669A03j41Q2K1j69J30q1n1J97k74K31q3l1K11k37P7R9j90J83o0o0K15k47L5K15
1693A75k63R5N9k34L13j31o1J13k53K22oj03J50j92N8J72k69K14q7n0J85j77n7
1716a27K24j27J0J53k55K92j38p8J98j93O4O9k31K37l2k5Q9j93J41K3k12J55J7
1739F1k25K12J4n8N7o3J70k31M5J65k50O6K5m8J53n5k48L39j63l2K12k41K48j0
1763A43l99M05k16qK49k56P6O6j25R2K3k43L06k61J90q3n4J15J5j32K01k17J37
1786B4R1k08K44j57j9N0M5p1J22k29K01j45N2J43k29j1J53j74K11j64M1J32j24
1809b2l5M1l1P3J5m7J72j81j95K94l35K10J52k11J07K3r9J03k9L5o8j51J51J11
$$ y = [41, 146, 63, -36, 133, -83, 18, 103, -93, 104, 1, -9, 180, 97, 21, 192, -130, 56, -2, -38, 131, -55, 45, 103, -38, 44, 65, -104, 26, -55, -106, 91, -183, 48, -35, -66, 145, -92, -15, 84, -106, 77, 17, -43, 172, -75, -40, 175, -88, 7, 66, -168, 145, 14, -47, 66, -187, 35, 29, -74, 76, -116, -58, 114, -155, 59, -28, -78, 107, -70, -127, 97, -30, -20, 133, -122, 170, 32, -46, 152, -41, 23, 92, -139, 98, 66, 41, 130, -63, 78, 101, -111, 44, 61, -164, 48, 62, 4, 61, -2, 168, -63, -18, 147, -103, -37, -12, -60, 93, 38, -210, 129, -34, -66, 146, -95, 153, 143, -256, 149, -67, -75, 174, -82, -6, 60, -65, 27, 50, -193, 113, -148, 42, -41, -95, 20, 35, -97, 104, -113, 24, 115, -93, 151, -6, -25, 25, 70, -1, 121, -108, 93, -52, 0, 143, -86, -97, 56, -118, 93, -71, -30, 102, -22, -57, -16, -47, 26, 41, -6, 166, -15, -210, 84, -251, -41, 111, -100, 7, 30, -69, 34, 5, 40, -28, -179, -28, 83]
1833H3j34J06j50O6m4r9K70nj43O4k37J96m2r0K05o3M2m9L2r4K13j30j9j8o3K83
1859A80j64j9J81k76J10M5n1P3j94P5J56j32N7j3j01J13M6o5P4j06J23q1j7J56
1883A70k29P8J32k42J34J00j67J27j41L2J23k17J03Q4k34K28j50q2K94j45r4J90
1905I4k29K11l8j52K17k25Q6R1j97J37r5m0J53j17o6J56%l6J8j14K52k07J11M9
1929E9k28J99N6k31K64l1j39J25k12Q4J10n1M5m5QN5n0P7k3j25J39o6%M7r0R8
1955G5r2K4J53j06q8K22j59J5P5j51K55k27o3J16j09J05J7j04K30j80JJ09q8%
1979C0J24k71J81L4j22K1j16L7J28j09M4K4j15J99k28J9P1o1J72pj48Q6J2j21
2003a16K00j58L5J62k15k1J94o0K2j18J20P0k43K85m9p6J13j03J3J09j81K56j40
$$ y = [83, -51, 55, -95, -29, -73, -172, 98, 93, -50, 14, -223, -27, -69, -159, 46, -17, 25, -24, 8, -86, 127, -3, -22, -40, -103, 180, 16, -3, 178, -98, 12, 57, 6, 79, -115, -40, 116, -16, 41, 28, -73, 40, 86, 21, 95, -11, 112, 31, 14, 170, -59, 19, 151, -91, 43, 143, -24, 103, -38, -6, 117, -100, 3, 87, -147, 81, -69, -151, 143, -2, -96, 94, -135, 76, 38, -114, 103, -122, -36, 55, -142, -5, -100, -140, 13, -104, -170, -14, -14, -50, -32, -146, 106, -101, 10, 59, -169, 30, 86, -145, 119, 88, -51, 74, -138, -54, 56, 5, 50, 5, 13, 68, 18, 95, 72, -53, 86, 20, 20, 67, -23, 75, -17, 7, 160, 54, -34, 188, 29, 44, 119, -32, 223, -4, -67, 49, -60, 45, 62, -42, 188, 8, 9, 118, 30, 30, 154, -117, 64, 98, -24, -3, -119, -82, 46, -63, -19, 5, -110, 89, -139, -120, -49, -110, 62, 55, -93, -7, 5, -116, 84, -74, -39, 123, -92, -113, 81, 21, 43, -75, 45, 115, -128, 157, 108, 32, 145, 42, 55, 164, -17, 239, 99]
2026I9n7L6K2k2P5j35J1J79k85K35j14QJ61k12N5k7l7P9j88J60J3r6O9R3j16N0
2052E6n8j7J29j63N1l8k2K9N3NJ45j74o9K8J6O0k2j10L1Q1L6m5j29R8m5qL1J2
2080c9LN1n8J01j32j7P6j3m3J41n9N0j38M3Q7o3l4L5n1Q0kp7J18n9N1j18p0J71
2108C4N1j32J05j38L1J21j75J24o5j49J40l8rJ60o1N3q5r9Q9P3L0j21n6J02O0
2133D5j65J72j21j05K16p2R6J3j44K05o5j55K11j58K7K4j73J34N4j03P5n7N1K7
2157C2o1N1j8jJ07q9Mo6L2L7M4p8KM9j48K66j92L6M4j03N3K5K4j5k5o6J99k12
2185f9J74j06j31J60m6k4k2p1L18j29r5J79k06J2P8pN1l0j22Q3R7j70J57n0JJ11
2211A43k76K13j03p4J50j01R0j37N2M8k5j3J09j24J52k9l4j3j32L6J31m0o1J43
$$ y = [99, 42, 78, 100, 78, 153, 18, 29, 208, -77, 158, 44, 52, 213, 1, 56, 29, -8, 71, -117, 43, 56, -40, 29, 122, 6, 56, -2, -19, 110, -53, -2, -40, -62, -33, 20, 25, 170, -4, -73, -45, -29, 31, 9, -101, -70, 11, 47, 2, -127, -29, -74, -82, -51, -39, -36, 15, -43, 58, -74, -91, -15, -28, -71, 70, 11, 61, -77, -34, 53, -10, -44, -9, -60, 20, 18, -59, 59, 0, 51, -67, -137, 34, 85, -47, 58, -80, -49, 72, -103, 21, -44, -193, -53, -91, -100, 60, -1, 52, -33, -132, -43, 30, 60, -61, -117, -15, 45, -120, 52, -69, -174, 42, -30, 66, 79, -65, 140, 75, -80, 131, -27, 0, 24, -149, -15, 39, -64, 11, -46, 5, 32, -29, 22, 4, 3, 110, 21, 25, -41, -9, 28, 72, -6, -4, 45, -103, 163, -29, 7, 51, -52, 1, 26, 50, 35, 10, -56, 143, -69, 105, -1, -132, 28, -18, -42, -64, -135, 183, 54, -41, 138, -68, -56, 22, 15, 66, 36, -86, -3, 94, -76, 81, 31, 32, 143, -133, 80, -23, -97, 53, -48, 42, -95, -43, 5, -20, -33, 76, -48, 104, 75, 41, 28, -104, -68, 63, 23, -38, 105]
2235A05j11%q6n2K93j05j7J34j73l0J7J23Qj15O9P5j32M9J2j11J45p8N6j14j4
2260e2O5N8p1JJ10j93J37j68J03m9KJ77n2j40Q8l7n1J42r9K0j6k3nP6L9k4j12
2287g4J71p4n4J18j19N7lj06N7Rm6jp6pJ11l9MJ23j02K5N1J0n2r9M8M1j8J05r0
2316c0p2M7O4M0j46N3j5n7K8Q5p5l5J77q5O0r2P0P2j27R7P0k29J28p3J1M4L6j00
2344e4L02j98N0N7j95J11k9j10R8n9R1q3M5M1JmL5j65J19Op8J38n0l6J41j10K3
2371H7r6O0j02J49o6L3n6l7J10j13J15o3m7J1m9Q5O4p0k9O1j37J68r0L6Kn9J23
2398I0j70o8J78J8p7kL4Q9n2j13J85j71J76l2j85Q5L2Ln8O8jm5L3m3k3L5k9P8
2426C5l4P0m8R8r3J1r9Q5p2N2m2R5r3J0Q9k9o8l1L8L6Kj0o2J10j8R4j31P2o8K9
$$ y = [105, -6, -6, -92, -144, 149, 44, 27, 161, -12, -42, -25, 98, 106, -9, 60, 135, 3, 52, 64, -47, 98, 20, 76, -38, -52, 13, 71, 0, 1, 111, -82, 55, -113, -10, -59, -57, 120, 68, -72, 16, -21, -72, 70, -29, -9, -25, -48, -53, 23, 62, 38, -74, 97, 23, -31, 87, -32, 25, 22, -84, -27, -18, -64, -65, -141, -148, -37, -76, -72, 51, -51, -26, 25, 35, -17, -116, -68, -27, -45, 60, -30, -102, -55, 9, 49, -97, -44, -59, -116, -88, -3, -78, -113, 64, -21, 39, -53, 17, 89, -38, 59, 129, -100, 28, -45, -34, 10, 46, -54, 248, 50, 100, 157, -38, 73, 44, -66, 32, -27, 64, -19, 26, 67, 68, 64, 99, -66, 53, 59, -19, 119, 69, 33, 174, 64, 87, -9, 51, -51, 98, 32, 65, 9, -28, 82, -31, 84, 21, -26, -15, -64, 21, 85, 15, -14, 47, -90, 78, -12, 24, 26, -33, 90, -80, -148, 30, 48, -29, -31, 3, 92, 40, -73, 112, -59, 117, 85, -100, -15, 17, 20, -38, 30, 29, -16, 17, -26, -49, -14, -43, 35, 1, 71, 23, 121, 28, 39, -60, 25, -47, 5, -37, 58, -35, -25, 64, 35, -33, -64, -26, 10, 12, 2, -60, 50, 32, 126, -5, 67, -1, 28]
2456B8o8P7M2q7lL4K3r3k1J17p1P4l1j04J07J0m5N1p6P0o7N0N1k36M7J44M5r9
2484c1kP9P7j52k8Q2qMJ3r1MJJ04o0lMN0q3J21p3j9O3q0l5nJ12p5M1m6Q8q9M5
2516Hm8J61k12K10j45P9n1j20J77k9J2n9n2L1qMJ30l2M7o9j03R1k7K0R4q3l2L2
2544B6n3O2M3j59J73j86M8P2q3O7K9j12Q1o9J08l0r2PO4O4j36P9o1O3J9j1R8k23
2572a12J02O5j04pJ6K3j22l7J23ON2qN2o1n3R8p7j1l7J97k32J43o4K5J01q7N2
2599D3O1j47O5j49J45k6l0n9Q7r9R8J19j73J11q6J25q4q0P3k2mQ3NKj10O8n2Q4
2627D8N8r4N4j33k2J34pR2k07Q1l4N3o1j3J14Rq1j14Q3nN3k2PL5k8j7j38Q7R1
2656B3r7K2L4q1J76j31Q1M7m9n3j1O5L5j15j1OJ14j61O7O7j16Q1q7J24J3p1N3
$$ y = [28, -40, 37, 79, -8, -11, 23, 46, -47, -68, 49, -22, 52, 21, -83, 24, 34, -11, 40, -36, 34, -33, 17, 68, -168, -121, 23, 68, -31, -33, 46, 123, -29, -57, 25, 17, 21, 34, -57, -53, -52, 52, -8, -11, -7, 43, -40, 81, 8, -11, 52, -28, -63, -68, 44, -31, 10, -36, 52, -37, 8, -40, 121, -91, 119, -26, 53, 2, -118, 59, 30, 42, -17, -69, -38, -46, -42, 88, 56, 103, 34, -69, 22, -5, 15, 109, 26, -6, 26, -27, 35, 78, -81, 92, -94, -46, 26, -57, 10, 39, -73, 8, -61, 47, 17, -75, -68, -4, 60, -76, 3, -58, 5, 24, 13, 111, -112, -10, 55, -49, -56, -40, -17, -139, -176, -53, -47, 5, -3, 49, -12, -65, 33, -44, -55, -92, 105, -127, 16, -48, -23, 78, -9, 43, 104, -43, 22, -127, 18, -8, -38, -97, -10, -109, -11, 108, -65, 46, -40, 85, 1, -79, -6, -28, -32, 51, 56, 58, -52, 16, -36, 48, 106, 12, 66, -67, -89, 45, 38, 130, -77, 4, -30, 23, -38, -51, 63, 72, -9, -123, -40, -45, 8, -14, -7, 28, 0, -17, -155, -68, 23, -74, -52, -18, -99, 77, -54, 27, 74, 25, -28, -39, 26, 61, -54, -65, -59, 55, -106, -39, 28, -88, -7, -94, 30, 43, -28, 25]
2683B5K2Oq7n2J32n2N6p3qR5nq9j5J15j72Q9M1l7k6J9J34j36k1J02Pj13O2P2p4
2712A7N2l0o2K4N4Rj08j7K8p2K10l3j02Q0j70J17R5j73J00l9j4K6N3Qj01L7m5
2739e6J64j16L4q8K2K1J39p1r3K7%O2j3J3p9O0n5J36p5j24J39J2q8L5J9J6k4O6
2767H3j03R0l5l9M6j74K43r1R4l7q3J73j78R0m2Kj22J40k17L1K12j46O0j22R8
2792b7J51j27J53k26j09J62N5j47L1O9J73j51M4Q9j83R5j03l0O4N9J7L0j24N7
2816B2NJ33j38l1O5m7P4j17l7J15J3k5m1jN9j50J22Qj53J60j64K10p5J8K6mj83
2843a36K40n2M7jj40J34p9jR9j30n1J65j53N4R9j41O3K8q4J20q4N7n4M7J0l4o9
2870d6J40r7r7J64m5j3j8PM0qK7r8P8j9m3l1J00m7l0K3P8K3j62P7q3Q4L1n8j1
$$ y = [25, 47, 53, -34, -86, 46, -6, 50, -23, -31, 64, 59, -30, -45, 70, -102, -13, 28, -9, -35, -16, 118, -18, -39, 63, 70, -43, 19, 91, 17, 69, 39, -23, 1, 55, 64, -44, -61, -33, -105, 105, 72, -30, 50, -120, -3, 92, -81, 19, -20, -34, -8, 45, 53, -48, -11, -56, 108, -8, 26, -62, -40, -19, 120, 49, -44, -17, -17, 45, 32, 45, -34, 26, -29, 107, 32, -92, 47, 59, -29, 6, 25, 41, 17, 83, -20, 70, 35, -4, 42, -132, 111, 20, 114, 77, -6, 167, -11, 79, 37, 39, -83, 57, -160, -129, 83, -63, -3, -125, -27, 124, -3, 150, -76, -185, -23, 32, -115, -84, -15, 158, 7, 51, 140, -43, 52, -51, -81, -17, 42, 59, 89, -35, 22, 27, 160, 22, -9, 56, 9, 83, -34, -71, 44, 57, 32, -9, -10, 49, -101, 21, 29, -124, 36, -128, 82, 7, 25, 51, 47, -136, 104, 52, 99, 98, -42, 92, 13, 12, 111, -19, -70, 95, -58, -4, 95, -46, 17, 45, -39, 81, -3, 54, 0, 47, 57, 23, -46, 94, -3, -100, 64, 19, 6, -12, -5, 35, 27, 54, -44, 34, 15, -28, -59, 41, -6, -36, -13, 65, 88, -74, 3, -80, 4, 35, -23, -34]
2899c4O8p7J3J1O6pL4j14L6p5M5mj0K4R7m3n1P2j14O9p5R0P0l6r9K8J6K4JO5k4
2930F6%L2j45L7k1N7m0jn1J46Qj34J09m1r2P8p7O0k8M3J4j7K0rJ5p3K31j55j09
2959g7L3L4R0M9j13N7j49J09j6O5j19r9K5K28k10J07r9O4N5q5O4p2J16L6j09j15
2985a31J93n7l5n8J66j76J60o0p6N3L4j8o2J14r9K9l6PJ22l2p4L9R7j51m2J20
3011B7j00N7l9l4L4M2K6o4M4Q5j11O9qm0l5K2L0j31J54o8O0Lk9O9j31J33l3m2
3039a0m9k4Q2NL1j47K8n9K32r9o5J62j70L2O1o9M8m1R8j32J07Q1j15M8K7j1n4
3066cJ0n8m8Q6j5P6l3j10Q1K2pl9J16n7N3p0M0l5N1o4q1R6m9M3K9o4n2L7P4O5
3096I4r1n3L6QL2q6J10q6J1J24k35O2M2k9L2L3N5o3LJ9rP8j58J1J36l3k3m3M7
$$ y = [-34, 34, -43, -30, -19, 47, 40, 74, -40, -4, -79, -34, -38, -48, -24, 73, 30, -21, 51, -63, 6, -69, 21, 91, 55, -44, -16, 0, 24, 25, 90, 66, 66, 98, -47, -10, -31, 26, -14, -15, -66, 80, 88, -46, 63, 22, -70, 8, -69, -9, -37, 6, 20, 3, 23, 14, 29, -44, 187, 32, -77, -44, -10, 80, 129, 16, 73, -76, 33, 17, 82, -37, -136, -111, 117, -93, 14, -85, -21, 34, -51, 13, -59, 57, 93, -16, -131, 62, 5, -30, -88, 78, -98, 62, 2, -74, -21, 13, -5, -67, 47, -52, -23, -59, -52, 70, 38, -36, 3, 100, -51, -93, 27, -73, -16, -55, -89, -55, -13, 13, -51, -7, 78, -33, 36, 28, -12, -47, -25, 5, -126, 28, -40, 20, 23, -6, 63, -68, 65, 32, -10, -59, -83, -1, 4, 35, -112, -84, -143, 89, -10, -75, 87, -83, -51, 10, -59, -11, -52, 46, -86, 21, 102, -13, 35, 62, 51, -3, 7, -51, -99, -13, -28, 48, 15, -95, -14, 8, 1, -38, 78, 21, 74, 4, 44, 9, 60, -4, -85, 11, -38, 5, 34, -30, -82, -45, 29, 94, 3, -50, -14, -6, 26, -60, 50, -36, -25, 99, -136, -74, -32, -61, -29, 4, 59, -4, -1, 18, 9, 87, -71, -60, 76, 43, 20, -23, 24]
3125B4%J04j25L9q3J16j60J18j0Q9j17r1J25p6K7O6Kk18J03PQ2L9n7ko6Q9jM0
3153F4r9L0N9j18Q8Rn5M1n8P4j1nJ8l4J45k67J23P0n0LL1K9q8k6M9j02Q3Lp9Q1
3183Hq4O6M9op4p9Q1j17K01m0j01J20j67J51m0m8O1J4l7Q0l6j25Q8n6M6R3j01
3210e3O6K4L3j3p3pK3Q0q4J36k3p6K0j35P1p4J01Q8m7l4OPm3k8N1j57K25j36O1
3239IJ1r3L7P0j21P2j00J71o0KO8j03N1o3J14n2L8n3j27J49k9j7%KnJ41j87L4
3267d1k7P5j22R3M1J54k5j46N1j08J6J4J8j41J61l2mN9J30o5j64L2kQo5K2J12
3294D4q5jPJ7mJ0m3Q8p6O0n5KN2j2p0J17m1K2j0o4P6N6m8O6o5m5O2k6q1J40r0
3325Cq2J12J9r9j7kQ2l3M6j23J71j52K6Q4o0N4l7j0m5L5K1P1j61J54o0R8o6M1
$$ y = [24, 24, 128, 3, 42, -41, 75, -85, 33, 23, 112, -5, -96, 29, -47, -20, 46, 48, -170, -67, -60, 22, 61, 4, 2, -64, 25, 24, 64, -35, -5, 54, -64, 24, 33, -22, 19, -39, 35, 24, 19, 37, 3, 148, -119, 4, 74, 24, 27, 58, 87, -1, -27, 22, -80, 3, 6, -73, 8, -76, -10, 39, 33, -41, -120, -39, -156, 45, 5, -96, 24, -143, 8, -32, -80, -19, -5, -42, 38, 2, -123, -35, -91, -45, 48, -53, 13, 37, 70, 57, -16, -23, 0, 80, -4, 132, 109, 33, 53, -82, -11, -85, 16, 104, 57, 23, 29, 36, -7, -35, 16, -141, 84, -52, 9, 20, -73, -36, 34, -87, -15, -115, 56, -4, -2, 66, -37, 14, -49, 65, 13, 51, -2, -129, 20, -9, -26, -26, -24, -29, 112, -75, -41, -68, 7, -115, -22, 19, 173, 148, 2, 53, -55, -39, -25, -7, -148, 13, -19, -23, 36, 166, 101, -63, -31, -33, -25, -90, -68, 44, -41, -42, -35, -18, -22, -12, -55, 33, -43, 17, -38, -36, 16, 4, -66, 51, 10, 32, 22, -42, 34, 90, 42, 108, 43, -2, 60, 34, -47, 93, 3, -79, 33, 52, -47, -64, -66, 16, -17, 29, -94, 77, -75, -49, 35, -25, 29, -8, -18, -63, -28, -7, 64, -97, 57, -3, 95, 29, 70]
3353G0nj22K6p6M6P3kn3j5J13j04L5Q0j60J3R2M8p8mN2j4k5R2r3Q7mm7q7J08j04
3383e8O9J1n0R1q8Q5p0M8l1l5LQ8q7NN5m5mm6k7R8j21J11Q0j41J04O4q7M0Kj58
3413i4M9j6J23k0M9J0p2J20j66RM1kq3rP4M4m1l9K1o1P1K3m4L5rj24P3M3p3R9
3443C1l8J21r5l0j5L2N3j08p6N5J26Jp2nJ17q6j1J32o2j82J97n1l4o1J13n1j1
3470a0K9K0nkj07R4n7L7k5J2j19R0l7J47j29o0J48Lj5M7pq8L5N5j29Q3l2kP8o7
3500a3pJ24j42J4J25j27R7o9l7Ll4O2l8J4K1Q4l1j8p4N7J9j2M3o8j4L7K0N9j16
3529b1l8Q5PRn9O3j22P6M3m2l8J20o7M9l2j34O1Q0j6j44P8n2N4r0Q3P6o4J2l4
3558e7KJ03k0K0j3J02j34pj08J24n2P7m0m1J7oJ05m6j37R6K6n6Q3k4r0J01m0J6
$$ y = [70, 65, -57, -31, -107, -61, 12, 10, -43, -58, 55, -49, -14, 66, -94, -81, 11, 59, -19, -23, 29, 15, -10, 82, -11, 76, 72, 25, -62, 46, -58, 11, 22, -28, 63, -25, 60, -10, 38, 7, -28, -25, 63, -24, -19, 36, -9, -13, -59, -86, 12, -109, 2, 82, -59, 45, 109, 22, 62, 64, -94, -45, -61, 62, 42, 91, 101, 29, 149, -17, -8, 33, 31, -52, -61, 13, 57, 16, -23, -2, -63, 8, 31, -13, 22, 13, -111, -38, 5, -68, 31, -7, 114, 19, -11, -26, 6, 59, -49, -125, -70, 56, 57, -15, -20, 97, 11, 0, 132, 70, -112, 85, 34, 0, -61, 52, 1, -10, 19, 39, 34, 32, -75, 19, -38, -1, -26, -14, -133, -43, -80, 67, -62, -122, 26, 29, 14, 61, 54, -34, 1, 56, -73, 10, -22, -24, 54, -13, -20, 104, -38, -24, 101, -26, 71, 2, -35, -32, -66, -4, -42, -28, -7, 77, 46, 28, -46, 11, 30, 18, 61, -7, -21, 16, 36, 95, -21, -59, 26, 33, 42, -17, 46, -76, 0, 43, 1, -37, 83, 16, 65, 33, -101, -40, 40, 24, -120, -42, -94, -40, -130, -47, 29, -35, -23, -57, -55, 48, 28, 48, 35, 137, 3, -4, -112, 12, -40, 37, -3, -44, -27, -33, 72, 26, -111, -15, 11, -45, 38, 14, -76, 25, -15, 1]
3586AJ03p1M4q4n0M4o8O5P9M8j6n7j73K01o5j7n0P5p7J27r6J41o3l6PN7m8j06
3614h5P7P5m3lJ8K8r6r7J60n8J56j15P1j3r6MQ1j25M8J45l4Lj16l5L9J45j43O8
3642E9m2j09J03N2%o5l1J33m4j2Kq9L9rj3mNl7J0J3J7j2J7O3q4L2N4q1kJ6l0M9
3674@L0l9M7q0K0J8J6k4L9J8NL8j75O6n3R2p7p1J98r0nJ15n3p6K5M5k7o1N0pR2
3705G6j49P0J2j6j4Q8r0k8p9N0P7j9o3J83o6j2K4P1q5Jj11Q0J01q5nqNm2l0J39
3735G5k9p9K2n1K06j07j05J37j26L0O9j53R2n7J14j5j69P1P0j7P3k1j1j19O7R1
3761E8j34J05P2j40J36j15K3n7l7M9r2J38j7j5j18L7J7N4j8J02j4p1M0J7n5qJ00
3788E7p0N8l0k0P2j27J32p9j01K00m0j26J27r4o2J29N5oL3j4k37J18jJ18p1l4
$$ y = [1, 104, 33, 77, -7, -57, -13, -81, -16, 63, 111, 95, 38, -135, 66, 1, -16, -66, 9, -68, 59, -37, 104, 41, 5, 12, 69, 21, -85, -8, 67, 24, 21, 39, 67, -29, -126, 34, -24, 132, 17, 88, 75, -21, -17, 64, -61, -13, 132, 98, 101, -15, -50, -11, 134, -9, 59, 17, -92, 11, 63, 63, -2, -33, 100, 56, 44, 46, -43, -4, -13, -26, -30, -25, -62, -52, -39, -22, -34, -17, 46, -38, -6, 48, -33, -35, -19, -49, 0, 30, -9, 38, -42, -22, -4, 12, -12, 27, 45, 50, 88, -87, -21, -74, 18, -59, -130, 68, -22, -27, 88, 35, -41, -16, 29, 2, -59, -9, -16, 76, -73, -3, 9, -7, -21, 67, -23, -51, -130, -80, -3, -22, -85, 98, 32, 20, 44, 115, 30, 31, -80, 0, 101, 16, 11, 3, 8, -34, -64, 75, 46, -33, -11, -62, 144, 37, -68, 69, -57, -27, 42, -111, -19, -76, 38, 23, -146, -75, -5, -22, 51, 30, 19, -100, -33, 58, -76, 29, 101, -39, 97, -18, 5, -52, -89, -40, -132, 6, -11, -26, -144, -107, -90, -36, -54, 48, 34, -37, 3, 20, -35, -43, 57, -13, 45, 15, -5, 67, -60, 72, -7, -108, 92, 52, -74, 53, -41, -103, 26, 81, 75, 108, 94, -143, -25, -26, 92, 21, -13]
3814a3k8J27o4QJ2l6Mr0L7P8l3pJ5n9P3k6p3J41j24J67r3J3K9j25K4K9J5L6r0
3843e3KL8MQ1j23%j1l1Q3O2q4l3m8J23M8j55J95p6j00J02O3j3K9m5k8j23K50j04
3871E3j28rP3o6M7J35j52J06j39J62j1p5R5o6n8OQ0q2N5O2j85J41O2r3K1j40J23
3898A7j05R5MJ3kl8n7J18l3p3J35k45J61KK2m7M3j20J45J1o8Q3k29J52O6Rl0p5
3926d6l9O2J0J22k12J08k2p2J03m6j7O1J9r3J31J8j76K60k29J43o3O0l2RN7j51
3952c5J5j2P1j18J30LK4m5p6J08j08N3J05o3j33J38p0O4r4J08n4J6P6j24n9N4
3978b6o5P5M9j25R1j5Ll2K06j51j05M8M0O7q8n8J87j15J2N2j12Q6q0M9J6J1J9
4005C9m2l7N0J1lN2k7kJ1r8Q9k6L0n2oN1m1J03p6J4j11J38m8l1L6l1oK6M7o9M9
$$ y = [-13, -41, 86, 22, 30, 42, 6, 10, -80, -43, 35, 2, -5, 10, -49, 24, -2, -75, 66, -58, 109, 16, 29, 58, -67, -43, -14, 1, 37, -53, -51, -13, -9, 72, -51, -51, -62, -93, -10, 52, -32, -65, -113, 10, 58, -97, 98, 22, -78, 24, 87, 74, 103, 58, 30, -93, 157, 53, -75, -84, -11, -77, -30, 105, -47, 59, -80, 82, 71, -4, 91, 25, -33, -27, 53, -29, 26, 88, -97, 44, 106, 13, 34, -106, 17, -88, 7, 11, 24, 22, -16, -73, 45, 12, -61, 74, -171, -10, -8, 14, -33, 10, -110, 35, 46, -22, 61, -168, -16, 50, 59, 29, -46, -85, -23, -13, 109, -103, 5, -17, -89, 14, -32, -49, 12, 31, -62, 69, 87, -89, 171, -58, 85, 22, 82, 50, 59, 116, -35, -20, -32, 39, -79, 51, 54, 78, 33, -43, 65, -43, 10, 115, 52, -81, 57, -13, 51, -43, 65, 11, 27, 103, -21, -80, -26, -91, -16, 33, -92, -1, -16, -13, -45, 161, 10, -95, -47, -7, 60, -28, -86, 101, -14, -2, 50, -62, 24, -56, -7, 9, 20, 39, -3, -40, 10, 21, 18, 70, 43, 41, 52, -46, 43, 17, 47, -5, -11, 40, -1, 102, 26, 40, -71, 67, 19, -12, 24, -7, -13, 13, 60, -9, 40]
4036D0p6J90k07K00j13p8Q7j13J21o3JL4l4Q2j72J92j47Q0L7p2k3N7o5j0P7o4
4062c9j6N9L9n1O5k0n4J2K8n7M6k6l7J18j13J40k9q2O1p4Q1k5K3j29L1J6J8p0
4090h5oJ57j42M9l1J02r9Q5k9n0P6M5k1j27m6J24Kl8%NO1Lj21J14k9J1Pl1j6K0
4120a0L9Qp3P3n5J5l0L2P5j42Nk3P8knLJ2p2R3K7O7j94R7o2n5pJ30K3m2J05l49
4151b39K24K9k9j7J07l8op1j01N5O4l4O6k6NJ08q4Q1j88J63p8M9n1J32m6o6Rj05
4179h7J16j52J80j9j01P2p5M2J3l8kJ4j0J6N1K2O7p8N4m8n9J37j27K4M4m9J52
4206A59j41K2j3r6J0J36j09k8R7R3m8m4q9R8p5J6j16N9J19jq7n9M3j8K14n6j91
4233a05J80m7r2N2K4k8O7k6j04J51o9l1P9l4nk2L5J03q5o1j4oL9k0M9qj0L0KJ0
$$ y = [40, -36, 154, -53, 147, 34, -44, 43, -70, 51, -12, -11, 23, -11, 71, -101, 91, -56, 24, 61, -11, -34, 23, -42, -52, 25, -39, -55, 4, 43, -8, 57, 37, -17, -5, 23, -34, 12, -14, -51, 67, -46, 94, 65, -17, 44, -30, 51, 26, 49, -80, -49, -33, -15, -85, -91, 66, -76, -27, -58, 44, -55, 30, 1, -49, 27, 72, 51, -76, -122, 2, 4, -34, -34, -29, 32, 35, -86, 28, -1, 10, 17, -14, -30, -10, 29, 37, -36, 37, -18, -3, -33, -1, 74, -68, -63, -86, -8, -10, -15, -12, 0, -72, 21, 48, 115, -79, 18, -44, -99, -106, 24, 47, 5, 110, -239, -15, 14, -15, -32, 75, 37, 31, -40, -141, -86, -22, -56, 10, -16, -11, 97, 13, 94, -94, 69, -9, 40, -11, 121, 75, 9, 18, -87, 29, -123, 57, 38, -63, 9, -66, -24, -11, -49, -51, -37, -47, -31, 20, 42, 109, 31, 85, 37, -22, 115, -12, 12, 56, 7, 159, 18, 40, 27, -69, -59, 77, -32, -60, 37, 130, 82, 38, -51, 47, -28, -12, -128, -69, 50, 49, -38, -97, -54, -72, 142, 86, -105, 75, 28, -64, -12, 12, -16, 51, 25, -79, 72, 3, -28, 51, 17, 12, -10, 25, 128, 43, -18, -32, -38, 1, -19, 30, 22, 12, 42, 44, 54]
4263E4n4j6L2N8j25j13J43J33j07oj20J31L7%j22K12n4n9j01M5O9k9Kl5RJ09j21
4290b8J43k19Q7J12j74J36LJ2r3j05J02j3J2L3lj49J49m6j5L5K7j65J00J21n9
4315CJp1J33j32J30j4k38L22k59J02J13q4Lr1Q2q0kP7lMk8J35j37O6l6PO8mpo4
4345dk9L4m2Q0oQ6j63N7j05Q3o8J19m3j3k2L5O0J6m0L8K7j57k0M3kR5O8j09n8
4374d0L2N3r5M4M9j00J12j12N2K0l6P4p6m2M2P9j27J32j64Q3lP4j3j4j39J90r5
4401b0k8J27r0L7l5K5Q3p6L6n1O8P2j61J1qjol6L0Q4M5k30O1J40q0L6K4j02P4
4430B9k4J8j9K2M1j10Qj0p0R8K8j21J81o5j42M0J15Rq3MN8k3L5j28m1J74k6M5
4458D3j1Pn6P1q2r9J92j25M1J9qL9P5j00oJ08j83J74k4j27j9L8J40j82N5R0q5
$$ y = [54, 0, -16, 16, 74, -51, -164, -21, 112, 5, -1, -121, 10, 47, 47, -75, 137, 83, 24, -77, -32, 37, 8, 10, -25, -16, 93, -28, 115, -104, -17, 95, -79, 57, 60, 72, -21, -126, -24, -37, -25, 8, 5, -144, 5, -41, -56, -21, 6, -159, -59, 62, 3, 4, -67, 66, -66, 64, 50, -188, 134, -125, -23, 90, 6, 9, -82, 0, -80, -82, -5, -8, -4, -32, 103, -34, 32, -4, 3, 71, 67, 60, -4, -33, 1, -41, 39, 33, 119, -44, 13, -92, -9, -77, 42, -1, -14, -36, -1, 59, 75, 35, 73, 100, -57, -77, -34, -36, 59, 127, 18, -40, -8, 45, -50, -6, 43, -57, 55, -57, -5, 15, -21, 53, -23, -65, -23, 56, -71, 61, -103, -20, -23, 51, 38, 24, -115, 75, -20, -48, 79, -11, 26, -9, 16, 99, 23, 59, 8, 76, 148, -13, -2, -10, -11, -17, -53, -23, 61, 106, -124, -63, 77, -3, 33, 57, -45, 29, 5, 23, 4, 26, 67, -43, -35, -45, -115, -17, 11, -110, 71, 6, -136, -96, 19, 28, -55, -51, 7, -16, 19, -109, -150, 24, -2, 43, 32, 39, -17, 54, -28, -127, 65, -60, -19, 0, -8, 31, 106, 6, 0, 108, -75, 99, 75, -52, -71, -33, 107, -75, -20, 70, -15]
4485a5oJ09j07L9j4o6J28q1M2q7J44M7p1j51J38j59J77j8j10Q6p6j2n2O7j1J21
4511F2j64J86j5j24Q5n0k4K1J11k8j17O2j9j23J56l9L1k9J11j1q9n6rP3q7N7J
4538b8J50q6p5p6J40kL4n1K7Mq3R7q0R1j31J31j38P1n2P4k8J8N1m2k4j3J11r9
4566ij2J3O0r3J80n8m9r2KO0J7k8l4R0r2Nk2K0KL6nN9M8j24O6LN3o0m7K7pj16
4598a07J77o4p9L9r1J14L1j46J36J16j11N5O3p5kj27J28p0Q1n2j06L9Q7n1jK2
4624Fp7J04j08N7P3l6j1n5K2L6kQP4p6k6n5J19j34J17j36k1j8J22J13j33K5K4
4651A2n4K6o9J51k4q9j00J12o7K14k14J00o8L7M1J3l5O8k7k1NM7m5P6o9nk5J47
4679A37j04m3N5r3K2J31q3l7Mj02O1NM3j7L0O8o6p3K14j77oJ9j4m2J11m5K2n7
$$ y = [-15, -21, 88, -19, 20, 6, -60, 68, -13, 29, -58, 86, 133, 62, -89, 49, -110, 67, 49, -61, 25, -51, -63, -115, -48, -59, 62, -102, 84, 69, -55, 30, -20, -44, -23, 88, 60, -57, 5, -14, -137, 19, -20, 11, -18, 93, 82, -7, -63, -72, 1, -86, -29, -28, 122, 36, -39, -115, 25, 23, 57, 6, 33, 37, -46, 51, -29, 62, -69, 62, -76, -5, -57, 17, -11, 7, 58, 16, -8, -21, 90, -9, -21, -8, 52, -41, 139, 81, 32, -60, -58, 2, 19, -9, -43, 47, -45, -40, -62, -42, -40, -4, -9, 50, 98, -26, 40, 43, 96, 36, -11, 16, 9, -107, 70, 6, -73, -34, -125, -11, 20, -126, 10, 126, 15, 70, 133, 58, 56, -71, 57, -13, 68, 16, -90, -51, 36, -15, -16, 6, -71, 33, -75, -18, 55, 19, 8, -47, -25, 11, 9, 17, 91, 15, -11, -66, 53, -81, 36, -100, -121, -139, -17, 96, -37, -12, 12, -42, -16, -85, 66, 42, -47, -147, -35, -102, 112, -102, -2, -70, -33, 8, 21, -14, 54, 27, 6, 11, 58, 13, 89, 20, 15, -10, 137, 33, -10, 45, -48, -26, 105, 22, -15, -11, -113, -52, -47, -4, -21, 9, 77, 11, -62, 152, -25, -31, -12, -26, -68, 43, -2, 20, -37]
4707c7k5N0m9L0K0n0P3j10PR5P5p3L6o0J11j56K4M7J3k2k3j23P9J23j08J21p7
4734iP4p1j22J36j4k8Q7K9j79K7R9k0L3m4j3L0n5Nl8L4N1M3ko6J18q2n9M4o0R5
4764D3j20J14j9j4Kn2P0r1R1o6J3P0j7jK5j18J9K6K9j7J12j43R2j1r7O6k0J31
4792A17k48J54mjn1P9N1j35R7OK3k66K34Mq2l6J1k8K7O9M9l8Kl2q2P2N6q8j2o
4822e8R0j32O8O4j09M6m3J21j20N0j6k0O9O3l1m5j04J00K4M4j50N1QJ11p8o4J45
4849H4r5N2j41J52p6ON1l4M4nk0KM1q8N2N0j63LJ64j8O6k01J21L6n5J5p8K7Rl
4879bL3Q6j68J04O1j0j68J38p8M1Om4P7r0O5m6r2m2Q3L4J4j7M2j9J07j20R0m5
4907D0j59J09Lo7R4J3j69J46oo3O3q4J63j49M9j04J41m4N3qj22J15o2m1M1j1J07
$$ y = [-37, -62, -12, -61, -31, -11, -61, 12, -98, -91, 4, 79, 6, 42, -18, 93, -63, -39, 8, 21, -1, -24, -147, -68, 55, -53, 68, -9, 65, -6, -128, 8, -6, -34, 53, 82, -97, -70, 29, 9, 42, -2, -15, 15, -40, -35, -73, -39, 12, 55, 53, -13, 105, 23, -36, 8, -52, 43, -77, 37, 18, 4, 6, -46, 24, -67, 24, -42, -29, 41, 24, 23, 48, -70, -51, -25, 4, -13, 99, -44, 48, 37, -60, 6, -14, 117, -131, 23, 19, 18, -33, 46, 97, -38, 59, 65, 88, -178, 56, 60, -22, -58, -47, -75, -48, 21, 70, 32, 34, 2, -80, -8, 48, -40, -52, -58, 32, -100, -32, 32, -77, -31, -74, 47, -73, -23, -39, -59, 10, 73, 42, -3, -107, -7, 17, 61, -89, -38, -30, 81, 3, -61, 84, -11, 41, -100, 52, -24, -18, 33, -1, 43, 38, 18, 20, 61, -27, 25, 75, -88, -85, 79, 61, 127, -74, 47, 83, 28, 43, -35, -8, 1, -2, 31, 117, -51, 53, 114, 104, -64, 74, -4, 37, 43, -1, 76, -14, 51, 5, -87, -129, -46, -12, 2, -15, 27, 8, 115, -5, 85, 40, -119, -10, -7, -74, 20, 33, -136, 10, 4, -59, 4, -80, 83, -66, -17, -121, 20, -24, 29, 21, -101, 14, -48, -89, -48, -59, 48]
4934D8p0M1O6j35J02j03J63j63J3q0J54l1M6N2p8K9P4j72N4n2j6J35j29J71j32
4959a3N1j4p5O3j2J37j18p1J01j4M6j09o4K0O6K5oO6j67N4J5J0Qqm2R1o7Q8n5
4988Fkj16J67j71J09j8P4JK7k13J59P8j34l0l0L9J27q2K1L3K2j5j57O4o0K2P5
5015dM0r1Q4K3j5l6j04J82r0n2km0J23l1m0J09r3Q2j4j18k1M6J03L4l1pn6pl5
5044f1P5j91J98j0m2L5J04j18j17J29P6j33O1N2Q9j16r9O5O8n2K0M1Jp6j9O4j72
5071a28R6J7N2j15O9m5o1R5l7k1Q0J0NLl9K0kn6N8m3J03jq0Lml9J63q3Lp9J23
5102F7q5l0J35k20J81n5K5j08O7p0M7N4K7J5J8n3j13P5k2J14j20P2m0q9K16r4
5128A4L1j15OR9K5j21Q8m3j9J4kM3N0j4p8M0m6J35m3o1J7K7j83J08j5M6O9m0j33
$$ y = [48, -22, 19, 85, -50, 52, -51, 112, -51, -38, -118, 36, 5, 51, 103, 25, 54, 128, -44, 10, -42, -58, 77, -52, 119, -13, 38, 24, -51, 12, 0, 137, 19, -52, 49, 35, 81, -28, -92, -72, -6, 19, 13, 79, -88, -34, -19, -9, -1, -9, -51, 40, -27, 61, 6, 4, -112, 55, -116, -7, -25, 49, 50, 77, -136, 23, 101, -33, -63, -93, -54, 73, -9, 12, 45, 67, 52, -105, -41, -101, -79, -4, 36, -55, 29, 52, 37, 1, -103, 79, -11, -63, -65, -105, 18, -13, -53, 56, -37, 45, 31, -87, -108, -62, 41, 75, 44, 37, -19, -26, -61, 14, -177, 21, 11, -31, 4, 108, -10, -127, 2, 78, -55, 6, 58, 147, 31, -68, -3, 65, 13, 33, 74, 75, -1, -20, 44, -128, -32, -15, 37, -78, -9, -54, -115, -20, -57, -78, 2, 12, 17, 20, -19, 1, -1, -57, 1, -42, 61, 60, -20, -17, -21, -60, 103, 20, 23, -56, 67, -18, -48, 87, -133, 48, -7, 18, -90, -23, -93, -46, 8, 35, 50, 68, 15, -98, -23, -45, 69, -51, 21, -19, -108, 108, 14, 45, -70, -64, 35, 60, -61, 27, -16, -35, -21, -23, 20, 70, 56, -22, 18, -28, 107, 64, 3, 20, 47, -136, -28, -43, 3, 72, 32, -101]
5157a01M2J45j15PJ50j90J07J49k36M3N1k36J60P3r1m6J18j62K33k13J83j26J06
5180E1q1jP5n2m9Q5j5rMn1J4K7O3m6q5J02p5j9N2P4j10P4N3p0J0Kj33J20N0j45
5210h5P3j1O6j13J84r1l9O3J7l7L0j1q1M8j31R0k0n0M2P6j15Q4m0%J08m9J25j01
5238C2r2J17j29M4P9j08P9p0n3Q3K1n4Jj4J85l5j30J09k19K00j7kl8J9p2N4L9
5265B9m6M7m4m6J93j76N1j33J18N5j7l4M8j07K8J10p7K6o0rj1O2m2J35k4K9j16
5292a1J2Jo5O3J79q2j59J15L4r5J04n7j8K9o1Q3L6j38r3J34l1K4p4m0N8P7k5M1
5320D1p4K2O8p6M8qn6R5j64Q6J10q3l6%k2kJ32j40R1j21N0J8R9J4nj13k6PN4j29
5350a20M9J06n1J0qJ6K5Pj21J25k2K7j52J22j09O0K9Q1jj32J29j44O5%N3o8J07
$$ y = [-101, -59, 86, -29, -22, 128, -62, 45, 194, -42, 1, 52, -184, -24, 49, -42, -88, 30, -132, 101, -112, 71, -55, 51, -30, -31, 44, -8, -57, 28, 13, 4, 8, -43, -29, -2, 61, 15, -70, 32, -43, -62, -10, 64, -46, 28, 81, 11, 21, 23, -110, 10, 60, -85, -12, -23, 43, -70, 114, 23, -16, 47, 64, 27, 57, 46, -35, 13, -118, -28, -48, -98, -56, 20, -95, -11, -51, -51, 57, 8, 133, 32, -60, 57, -72, -28, 51, -57, 22, -48, -101, -18, 3, -51, -50, -64, 121, 86, -44, 65, -154, 46, 29, 27, -11, 8, -64, -10, 29, -17, 30, -14, -60, 133, -43, 8, -125, -7, 48, 31, -3, 45, -62, -34, 76, -1, 25, -35, -44, -55, 7, -35, 100, 76, 105, -11, 1, 2, -63, 0, 179, 97, -62, 53, 87, -8, 96, 39, 21, 50, -11, 72, 108, -30, -123, 11, -20, 4, -70, -110, -52, 25, 0, 41, -33, -11, 57, -19, 29, 21, -35, 60, -104, -18, 92, 9, -27, -27, -49, -51, 81, -59, 32, -89, -39, -21, 78, 92, 87, -26, -52, -45, 9, -120, -71, 35, -16, -6, -14, 2, 27, 34, -87, 38, 16, 43, -109, 13, -96, -36, -7, 74, 73, -59, 70, -74, -9, -9, 44, -24, 83]
5377H3l8L4j5L3m0m4NRj0l9J44j49J18k6m7l2J15p4q6P0j27P8N6J3Q0k19N6K6
5405b6J3J28j94O3p7J26N5j24M1O3j03N5o0M4j25R1M0j5j11J02J10j04J11j79
5429g6P0K1K8l6%m6j1Q5r7J44n4J9r7KJ39o2o4L1L7q7J45k47K20o9pJ9Q0o0nL1
5459E3oK7p5q0N8K9q2M7M2K4r3J69j67J58j51q0N3lN7k6O3kpN0m8O5j3n8j04J29
5489B9Q2o7O0j13K4K8n8O5m5n5J25j74M4J11j13O6L1K8p1k4N7Nr7R3j9%mLp2P6
5519A5N0k0J5m2p5J35o0pp5L8p9R2J44k43J10m9J22n6r9R2o8P1j35J90j20N1K3
5546B0K8k9n7L1O9L3j87J53j2j30J06n6L8P2l8o5L1O2Nj27n2K41j30k9n3J15r
5573C0r9J50j46J24j04R8M3p9ML8j8J3k9k2M6N9j70J47m1J7j70P8J1N4k3J3P6
$$ y = [83, 45, 79, 64, 97, 57, 13, 18, 27, 17, -22, 122, -27, 91, 65, 18, -14, 101, 27, -59, 11, -116, -38, 18, 31, 111, -108, -52, -26, -13, 115, -79, -16, -93, 33, 88, -36, 5, 68, -35, 20, -40, 4, -121, -30, 10, -5, -116, -14, 96, -8, 103, -76, -6, 15, 43, 7, 7, -39, -50, 35, -62, 82, 28, 47, -50, -48, 91, 29, -35, -4, 33, -54, 91, -156, 64, -5, -12, 7, 87, 27, 22, 53, 47, 74, -1, -81, -23, 6, -76, -29, 13, 37, -56, 113, -54, 104, -47, -127, -74, -77, -20, -46, 17, 15, 8, 58, 10, 75, 62, 4, -100, 29, 111, 44, 104, -9, 15, 43, -15, 50, 5, -50, 75, -99, -55, 56, -57, 9, 40, 68, -3, -27, 30, 35, -62, 31, 12, 12, 8, 11, -61, 15, 65, 45, 60, 18, -57, 78, 18, 11, -64, -26, -105, -13, 131, -112, -2, -51, 71, 15, -84, 8, -60, 11, -124, 66, -54, -3, 20, 48, 19, -38, -7, 62, 95, -92, 61, 49, -81, 25, -31, 7, 79, 41, -24, 7, 69, 74, -53, -105, 136, 6, -23, -76, 39, 30, -69, 81, -65, 59, -45, 53, 96, 17, 21, 59, 41, 54, 25, 3, 49, 108, -62, 85, 44, 61, -109, -31, -20, 34, 11, 24, 100]
5600A00n0Qj62J84r3Q6r8K7M6n7qL0L8j41J00J23k0k10O2L0Q7j50j2N7Q3r6pN9
5628A6R5m3K5q1j20J09J3M0R7k3j25k8L2J16q6p5jO0K9j7j22O9m5o2J37m3J9K3
5656IM4J9j5p5K9J4N6K6j25M7J0l9N2r6M9N9q1p9J29L7o9p2O8L7j7k2n0kQJ24
5686G5j64J42K1j08k2O6k4J25k10PJ33j1J9k8l1o3P6m3J19j11nj6J27j09l2J03
5712C6j49N1K0m0J50k5k7j13P6m8R5Qr2P8j63O2J61q0l9K6m8J31p4M3Nr1J02q3
5740b8J1qo1PJ41n2K3m8n7rJ35q9P7N8j67J95j39k1J01q6J74j50J2oKJ8j76O1
5768h2J3P2K9K1r0O6p3J40J4j57P5K5j29L7O4l1n1M6K6N6p1j9K8J5L1p2N9Mk0
5797B6l6P0k6p1PJ5J10r6j7O0n5OL9j29J09O9o4j20O7J55r3J11j88k0jJ35j00
$$ y = [100, 50, 58, -104, 80, -13, 73, -25, 2, 48, -9, -17, 13, 51, -90, 10, 133, 113, -97, -35, -5, 82, -68, -80, -23, 60, -36, -43, 16, 111, 68, 93, 12, -108, 1, 14, 54, 151, 128, 3, -25, 7, 123, 37, -38, -39, 21, 50, 33, -89, -20, -65, -127, 10, -33, -14, 9, 53, 72, 57, -18, 11, 25, 81, 107, -18, 29, 39, 0, 52, -44, 5, 64, -17, -96, 33, 70, 1, -71, -3, 34, 17, -5, -55, -57, -49, 75, -89, 53, 74, -34, -56, 10, -14, 111, -99, -92, 41, 30, 49, 21, -10, -73, 3, -40, 79, -32, -37, -53, 74, -35, -67, 36, -113, -62, -42, -82, 68, 43, 16, -97, -21, -69, 26, 34, -58, 20, -143, -81, 80, 0, -39, -13, -61, 70, -4, 39, 44, -47, 55, -28, -17, -25, -86, -79, 62, 10, 33, -15, -72, -81, 54, -35, 42, 100, -67, 128, -11, -32, 69, -17, 157, 7, 19, 13, 15, 33, -143, -82, -69, 3, 32, 53, -37, 29, -44, 96, 110, -47, 28, 53, -76, -39, 25, -6, -57, -11, 15, 71, 0, -19, 9, 24, 55, -17, 42, 46, 26, -10, 60, 34, -37, -30, -15, 95, -1, -18, 42, -13, -7, 32, -97, 12, 81, 17, -103, -36, 119, 26, 137, -51, -71, -72, 63, -37]
5824c7O0mJ2n1M9j3K9j18M4J14j76M9J8OO4J1l5ql5L3j27R8K2j5N5n8M9Rj33P8
5854a0j7O0pj23P7J2m4%L7k5lJ06j32R0l6N9P9j70J18r5P9m4j6q0R0q9P8J10p2
5883C2j9n7K16j07J8p0J12j76K1m9J15O3j43O7q2P6M2j18p8J41R3q7Q2j60O4j9
5909b3QQ0n5M3q3M1m7j4L8R1j89J00n7P1K7r3J04m3K7M7j19J35l5m3ok1J30j55
5937d1O4pj8j11J52K6n7m5P3r4N9L1j05J5j9N3J0q4O4J8m0j6R1K7p1p8J29J6j02
5966f0P1%n7O3M0j28R7j29J39k1o4M9J6j80J96p1O4J3n3p8J19l9m9N7J9Q2j47
5993e1J8lk8L7K4n2L0K9oK3mMj19J43k1K1Qk0j20R9N1J9j8j09l7k2J34rN4j82
6023a07J67n9K1K9p6L8n1j06P6Q5k1k4O0O1k25P1R3n3ql7K7K0l0j1O4J00j54O6
$$ y = [-37, 23, 19, 31, -20, 29, 16, 45, -73, -29, 85, -91, -42, -24, -18, 46, 57, 22, 14, -21, 12, -115, -17, 5, -10, 45, -13, 36, 45, -88, -10, -27, 33, 26, -97, -20, -8, -52, -52, -15, -40, -43, 63, -69, 21, -15, 44, 123, -47, 71, -24, 55, 11, -5, -85, 5, -84, -6, 104, 32, 13, -44, 172, 65, 83, 13, 125, -51, -30, -79, 36, 99, -44, 23, -59, 17, 59, -59, -137, 4, 97, 10, 92, -68, -4, -23, -15, 65, 10, 53, -30, 11, -36, -50, -12, 79, -110, -10, -67, 4, 31, -62, 42, -1, 26, 73, -46, 89, 54, 11, 5, -16, 114, -41, 23, 16, -2, -113, 39, 65, 8, -37, 36, -58, 1, 32, -73, -58, -77, -24, -14, -98, -34, -16, -56, -72, 19, 46, -25, -103, 26, 42, -60, 11, 11, -46, 17, 57, -71, 26, -103, 36, 15, -49, 0, 16, -164, 32, -39, 25, 38, -15, -93, 26, -13, -62, -5, 14, 96, -51, -33, -36, -64, -27, -3, -55, -25, 4, -2, 21, 17, 21, -98, 45, 24, 45, 53, 33, -87, 12, 63, 82, 64, -45, -82, -104, 30, 21, 75, -107, 60, 1, 22, 51, -25, 13, -38, -144, -68, 17, -4, -28, 32, 93, -132, -61, 32, -21, -29, -66, -39, -19, -49, -60, 4, 104, -50, 16]
6051A6Q8n6p9J25j7j10p8J68p1K3j0q1J60m4j21N3J24p0K9j3rJl5nJ7l1J15j07
6079a8J0k6k7L9OJ02j16k0m0m8Q4k5O6oj5l8J15M5j99N4k3J06J49k23l8Q6N7n4
6107CO6M4j40lj9M8k0J43j12q1N2L3K7Op0M6MQp8k8J55j41OP5on5j5L1J3J3j10
6138a05J44m4j6R5l9m5kK9Oo7lJ10n9K5k5Nk3l0oO1k6l4N8L4mn5N2m0p4J78N6
6169A56j12J3qNl3j8%NQ7o5O4nq9P9n9K4N1j22N1n2P2l2jJ2M8j04o0J07j2J7q6
6200f7P6m1k5N8J0m7J18j55J44r8NL2j2Kk9J4J0r8M4L6N9J9jm8j7O6N7n6j69J94
6230H1j03J22Rj50J13j8m1M7k7m6j7Q2qq2O5q1K8jJ2Mn2p0J30PR6k3j34K6o1J63
6260G1j04J85j43p6J81j34l5M8M9K5m0%k7k4J9JK6l0N2q7N4p9Q6q6N1J03n6l6
$$ y = [16, 104, 48, -31, 94, 77, -33, -111, 57, -14, 9, -1, -82, 78, 34, -87, -34, 90, 20, 49, 36, 27, 28, -7, -12, 5, -26, 89, -18, -8, -34, -61, -22, -16, 86, -30, -50, -90, -138, -54, -79, -13, -19, -34, -72, 43, 88, -111, -57, -80, 26, 175, -48, -86, 0, 57, 3, 69, 113, -27, -30, -49, -1, -21, 122, 10, -71, -19, 14, 41, 47, -23, 23, 27, 35, -43, -71, 84, -57, -51, 24, 18, -37, -52, -21, -8, 5, -105, 39, -5, -21, 74, 35, -10, -12, 17, 23, -44, -47, 63, 4, 29, 4, 9, -14, -44, -50, 11, -15, -49, 9, 43, 39, -16, 36, -4, -78, 100, 156, 44, 57, 49, 54, 21, 3, 3, 8, 95, 30, 94, 89, 0, 79, 20, 44, 95, -27, 24, -28, 44, 12, 11, 23, 71, -33, -93, 14, 2, 19, -67, 9, -32, -57, 1, 11, -36, 82, -73, 71, -27, -22, 10, -2, 0, -29, -15, -5, -103, -59, -23, 36, 55, 54, 6, -11, 55, 112, 56, -113, 81, -22, 100, 109, -41, 72, 54, 13, 60, 33, -13, -30, 52, 44, -38, 27, -54, -26, -27, -15, -11, -63, -133, -3, 4, 100, 77, -57, -31, -92, 71, -33, 152, 9, -67, 114, -20, -55, -7, 42, 67, 27, 27, 0, -24, -5, -4, 22, -8, 44, -43, 11, -68, 18, -68, -17, 86, 30, -6]
6288fJ9m2p6R4lK8M5m7o5Q3Q7j15qm2J67j10l0J03q7P6rr4R8kM8m3n2p3N7m3K
6319d0J08k6j5q6N8o1M8J80k24p5K43j76J73q8K2L2j07Q6q7L1j1pO9q0L1j53P2
6346h3M7M3j81J43P5k2m9O9Op7j3N9L5r4N5r2K3j9R7K0j8M2J6j10O5j21L7K7j6
6375c6J22j00j8J00O4n2j80M5L0Q3q5J34j22JJ8%Q4j88J86r1J23m7j25K6l4J27
6401F5j9j04ON2m6L5M0j9j23J04%L6l8n9O4J5L5k6P3l7M6n1P0r4j19J15q1K24
6429A64k43J59M0j61RO5j81O7Q4q9R7Or5O8k8O8Q6k01J31J4k3J5j00k7J2K4J0
6456b9N6lj20j1O1J02n8J9K1P6n0p0n9Q9j08l6M3J24l4J8k2Q1k02R2P8l3k3k2
6484b0M1j41N6Q2n2Q4p3K8J02o7qQm7p4k5R2o8N3P8q5j7O1O9j26R9l3m6P6r3j
$$ y = [-6, 13, -29, -105, -11, -14, 14, 59, 12, -53, 30, 117, 2, -6, -48, 119, 9, -21, 82, -5, 71, 62, -32, 66, 64, 112, 69, 17, -56, 1, -42, -40, 68, 42, 27, -59, -1, -62, -14, 166, -58, -133, 110, -66, 107, 19, 41, 73, -34, 52, -35, -4, -15, -22, 47, -33, -2, -155, -83, -36, 7, -174, -31, 44, 22, -27, 42, 48, -29, -42, 17, 52, -42, 13, -79, -56, -75, 22, 42, 24, 66, 82, -28, 37, -84, -47, -20, -36, 86, -14, -32, 68, 132, 80, -100, -55, -25, 58, -27, 107, -15, -14, 4, 4, 88, -100, 86, -5, 118, 71, -54, -28, -62, 65, 46, -58, -52, 0, -46, -11, 29, 10, -113, -9, -9, 27, -11, -70, -6, 9, 44, 18, 91, 54, 100, 49, 119, 25, -94, 21, -60, 164, -79, 80, 120, -41, -32, 33, -148, -81, 3, -86, 11, 17, -78, -10, -38, 30, 116, -85, 46, 60, 37, 52, -48, -75, -63, -39, -29, 27, 24, -96, -107, -46, 56, -2, 17, 38, 114, 64, -6, -65, 24, -84, -120, -77, 47, 13, 31, 9, 90, -112, -20, 58, 25, 2, -20, 21, -120, -64, 18, -34, 50, -23, 5, 107, 40, 32, 40, -7, -81, -106, -14, -82, -29, 49, -36, -53, 8, 77, -49, 50, 17, -29, 47, -46, -47]
6514d7J29r5q0J05j09R7J6r6J09k0J7np2K2J69o0m5Rp3O7Qo7M4o0O6K3O4j82q0
6543a46J03J31l5j22J33kL2j67JJ3J58j29O5l5J35r5l8o4j18K25o4lm5J36p2%
6569cJ17j45O6K2r7Q5r6J5L5Qjm8J08L8n0m5R5j49Q1J4M1j29N7q3RQ0J9k7p7R7
6599C7M8n2m2j7J11j8r3Q8J3k3q6K9K1l1R0j26P6J03k38Q1r0O8J08l4K5k3k4o3
6627f2J00j58K09q1r7J46l2J22n2j22J6N9j18J10q2J2Q7j3o0%m6M2Q2j21J28l4
6653C5L3r2N8l9k9L3L7o9O9m2J9p3Q9j38J34K3Jp7j7M2P5j93P3m2OJ55j21qJ43
6682H5r5j0L3K5kj59J15k3Q6n0k8j8M3l6pl6O1O4J18j84J72j54O2k1o2Q6r8O0
6710B7l8L3N2kj32K9P5k6M4j7j65R3pJ00q0J45j95O0R4j27Q0j6K4p0R5k9lO1n7
$$ y = [-47, 82, -13, -93, 12, -97, 0, 16, -80, 29, 9, 26, 21, -51, -29, 140, 80, 35, 44, -29, 38, 46, -21, 23, -37, 29, 52, 116, -66, -146, -43, 88, 53, -69, 64, 62, 94, -73, -72, -59, 99, -30, 35, 0, 135, 40, 2, -62, -180, 45, -19, -22, -67, 69, -3, -3, 114, -31, 35, 57, -40, 45, -51, -36, -1, 7, 6, -42, 66, 104, 54, 9, 104, -45, 36, 50, 91, -38, 19, -64, -55, 25, 44, 17, -60, 37, 85, 33, -9, -26, 85, 67, -26, 62, 75, 52, -34, -5, 16, -15, 75, -51, 25, 128, -110, -29, -119, -51, 57, 23, 48, 25, 1, -62, 38, -120, 89, 8, -89, 57, 25, 147, 95, -27, -11, 48, -70, 40, -42, -30, 57, 44, -16, -16, -62, -20, 62, -59, 69, 35, 68, -24, 34, -5, -34, -1, 36, -33, 36, -6, 13, -60, 29, -109, 25, 48, 49, -28, -45, -3, 72, -121, -48, -90, -84, 71, -50, -58, 85, -10, -20, 13, 38, 36, -123, -8, -31, 55, 5, -23, -41, 2, -34, -41, -77, -16, 48, 166, -18, 154, 0, 62, 41, -21, 65, -33, 27, -11, 22, 74, 72, -60, -31, 44, 18, 62, 45, -120, -27, -34, 66, -14, 131, -64, -4, 90, -37, 43, 27, 51, -19, 76, 47, 44, 105, 48]
6739D8n9q5J45q1J01q0K6m9K2J6j5L0r6J20n4KN1j1J1n4O6q4Q9L8o7q7Q6m8J58
6768A39j28q4Q5P9k2om1k1n1J01J1mj58J12n9J67j30K9m1l3M0R4k15K03N5n1j28
6795e7J18K7p1j5l2o4O8N5K8q1O1q0O0pk7l9l7J05j04K05q2j00J14L6j40JQ8K6
6823E6o0L5m5lOP7r3L8J5q4R8K1j87J34j10N1L5j01J56m2J2r2R5mj9N3p1P2j25
6852h2J34n3L0l2K4Qq7J12k5l9P6l3o9j8N4R3j72J16l1ok8N2L3K5m0j00K5J19
6880H6j1q4L9p6J1m7M1mP7j22P7N4N8p1o2J54k00L2M5J19r5K7o1R6o3r1Q1j28
6908a18J04k7J17j75jJ14k4l3Q1K6j15OQR0q2K0l3JN3p0K1j36K48j10K9m0L6N6
6936D6n2N6o5J34j02Pk8J5l4K9R4p2L6Q6k49P6Q8j06R6j28J61k9j02Pj21J42Q5
$$ y = [48, -11, -96, 49, -32, 69, -11, 15, -34, -12, 4, -11, 19, -77, 43, -11, -9, 42, 31, 42, -12, 54, -30, 59, 97, 30, -57, 29, -19, 139, 11, -73, 12, 91, 69, 63, 22, 1, -50, 51, 62, 58, -100, 12, -47, 120, -10, 19, -22, -55, -15, 79, -136, 67, 122, 71, -57, 61, 88, 17, 2, -30, -94, -26, 29, 57, -24, 37, -43, 17, 10, -17, -56, -93, 12, -92, 113, 31, -69, 45, 81, -59, -58, 30, 56, -4, 31, -14, -17, -11, 66, -27, 11, 26, -58, 40, 61, -126, 8, -102, -51, -16, -117, 39, -3, 9, -83, 12, 8, -11, 42, -29, 43, -82, 52, -1, 29, -3, 21, 29, -58, 54, 29, -10, 66, 33, -36, -54, 0, 93, -79, 37, 6, 0, -28, 24, 57, 82, 42, -58, -33, 86, 75, -9, 30, -46, -35, -82, -41, -45, 32, -90, -13, 41, 99, 28, -34, 120, -80, -48, -3, 116, 21, 48, -13, 83, 20, -71, 10, -118, -14, -41, 76, -99, -100, 14, -10, -43, 38, 64, -51, -45, -37, 53, -29, -9, -42, -41, 12, -58, -37, -173, 75, -35, -6, -46, -10, 46, -6, 50, -15, 119, 17, 24, -4, 11, -23, 6, 100, 28, 64, 150, -99, -23, 65, -41, 55, -73, 88, 59, -43, -36, -157, -15, 70]
6963G0k0r2l7R6L1l2j56P6R5k1j12J17qn1R7q4J30q7j2n8P9N4J6j27O7M7k0p0
6991a2j10J59j02O9k5n9R0J0L7J4pm5k6n7J45j23O1K1j06O6Nl5J03l6j06J42j54
7018h1M3P0p7J1K9J5J8o3K2o0Q0R4Rq0J5lN4p1J8j19R0O9q1l3k7K5L9r6J29m5
7048fl6J09o3m4oR8l0N7P8j81Ml3M4OON9o3O2j27J36j38O4J01j30P7j85J65j15
7076i1O5L7j0L7Q5q7Pp1nL1j4M9Pjj4k8k8Om7Q1k7JK5p5K5O5n5J08j26J28j04
7107b6K3O3o6k5Q0o7J3q7J14mm9m0J88j40K7Q2q7N0J8j95J60n4J5K2k5l2m5R3
7135Fjn5R3l7L2K6r8m2J19L2j65J7J04j2o1j7N6n8K1n3N5M3j9P7m2Q6j48%Q1r1
7165e1N5J01Ko4l2QQn5rP2j05J59j18JKQ1l0J00j92J21j05o2R7L9q3K8K9L5j00
$$ y = [70, 50, -42, -79, 17, 48, 16, -140, -64, 31, 10, -102, 15, 7, -44, 53, -31, 99, 12, 0, -58, 21, 75, 91, -36, 31, 78, 58, -12, -122, 37, -65, 4, -21, -80, 10, 20, 57, 71, 64, 19, -7, -64, 81, -42, 19, 40, -66, 0, 5, -30, 73, 37, -69, 73, -81, -38, 32, -45, -34, -5, 10, 28, -35, -13, -73, 7, 101, 110, 30, 45, 42, 96, 25, 43, -76, 14, 83, 2, -31, -58, -33, 6, -90, 39, -6, -42, 67, 4, -40, -46, 52, 22, 79, 157, -24, -20, -53, -9, -3, 3, 62, -1, 61, -66, 70, -68, -4, 97, -33, 44, -141, 24, -91, -26, 11, 1, 38, 123, 36, 43, -28, -33, -2, -16, 33, 40, 39, 25, -3, -31, -25, -72, 9, -18, -17, 8, -67, -42, 23, -32, 76, -50, 78, -26, -3, 60, -6, -31, 49, -18, -5, -92, 22, 18, -31, -71, 117, -23, 4, 86, -1, 49, 67, -128, 32, -22, -7, 15, -10, -42, -87, 6, 5, -50, 43, 6, 38, 64, -34, -76, 43, 75, -90, -73, 31, 19, -42, -59, -3, -61, -40, -93, -38, 5, -14, 63, 21, 107, -41, -41, 40, -51, 4, 105, 107, 43, 11, 19, 27, -28, -37, 35, -70, 89, -29, -28, -26, 55, 25, 125, -67, 54, -51, -113, -16, 23, -60, -32, -3, 32, -68]
7194f8N2m3R4M2j02j6LR2j43MJ10l1j2q5L7O8m2O3j5Q2j6l9j3lj4Om0J9J31r0
7224C1n3l0J7p8J32p4R3M0p3NPO2m2q4L8q9J25r8N8r2R1M2k1j5m8L8q6J12J10
7253A18j51r0J53J2j07K9J27m4q1K7j8k0J0K1RJ00l7j36N9LJ34p5p4J22nj29j4
7280e7Q7m8K4lR7j99J46j15Q3O5j9p8Q8p3L3j18J11q3P2p8J13j5k0o5J46l3j2
7307D9r1M5nr8M9J28q5L6L9l5j8j1N7l2Q3o2m6%Q7l6q3K3n8R7Q6j09rj13L8N1
7337b3%Q4Kj14J02l9r3J09k8N3o1k0R6q8K3j85K50n6N3j89J06L3M3p4l9M4q2j1
7365a04J33o0M0rj30J92j20m7J65m7N7qo5L3Rn2O2j72K20m1k9on7P4M0j02K2Q7
7393H5p0q9J93j67J03J6p2K8o4j6l8N3P4n8N8o4O5M4k4m3k4J89j52M6o3L7p1p3
$$ y = [-68, -16, -59, 35, 77, -25, -41, -38, 54, -89, -85, 25, -6, -18, -103, -66, 2, -40, 23, 8, 90, 74, 35, 22, 19, 5, 11, -29, -10, 121, 31, -22, -52, -35, -113, 19, -55, 38, 78, 5, 10, 17, 79, 37, -47, -9, -98, 27, -71, -13, -105, -14, 28, 7, -8, -56, -18, -104, 8, 118, -33, -123, 30, 42, -65, -36, 91, 47, -34, -7, -25, -45, -35, -14, -5, 95, 58, -78, -19, -16, 118, 43, -31, 91, 86, -43, -57, 30, -18, 6, 3, 100, -99, 47, -68, 15, 80, 61, -17, 71, -2, 31, -87, 24, -59, 13, -65, 48, 33, 13, -52, 94, 61, 49, -42, 3, -2, -100, -51, 77, -8, 28, 67, 32, 14, 3, 60, 28, 111, 49, 3, 3, 90, 54, -29, -6, -64, 33, 119, 10, 1, -112, -74, -23, -23, 61, 63, -51, 51, 12, -81, 28, 0, 53, -8, -28, 68, -20, 3, -182, 68, 12, 65, -124, -18, 15, 58, -16, -55, -11, -93, -104, 29, -31, 9, 0, -130, 62, -58, -105, 60, 13, 70, 62, -3, 30, 39, -13, 49, -123, 97, 56, 27, 21, -36, 38, 78, -24, -2, 85, 15, -74, 119, -48, 55, 71, -1, 27, -37, -53, -91, -38, 36, -22, 36, -28, 37, 81, 57, 14, -10, 179, 27, 73, 10, 47, -24, -97]
7421i7J21l3%p5K7J62j22J2N5k12J56j7n0J29n6QL7P3j91J26o2O5q8n5K9P1L3
7448D6r4N3RJ0P1r3L0J9K9l5j40J62j55pQ4Nl3J2J15m6Oj01J14j52L3J22nlp1
7477a5M1j23j8O4nJ06m0J6p6k4P9ll1j1Q9p4K9J05j25j9j9mn7K04Jo3p9L3L6l7
7507b0p1L4J18k6j65J99N1j70J3O1L3r2M3O9j49K6R3rk5K5k7J0PJ23n8n6n5p9
7535i7J64j6r5K9k0J9L6r0O9K2j9K8j8QJ22j74O8O5j12M0q4O0n2J4N7k6K5k2n1
7564e0NJ5l0L2Q8j46M4M8O7j39N4lMr9J29N7j21Q6j15Km2Q9J3r2J27RJ9j10j3
7593g2P1j2J7R2j04J16j70kJ46q6Q8j22J00m2j34R4N6j1M0m4n2L0N4j41n0J84
7619D6q0J7L8k5J8k2P1j05P5m8m6KQ3J6m6l4L2k4J03p7O4l4l5K3Jo0jq7J47j4
$$ y = [-97, 24, -9, -9, -84, -57, 105, -17, -5, 50, -162, -6, -23, -73, 56, 0, 8, 45, 118, -73, 53, -9, 56, -32, -87, -58, 13, 46, -48, 5, 14, 24, 95, 2, 32, 51, 80, 45, -95, 67, -88, -95, -11, -6, -39, -27, 88, 42, 48, -53, 61, -91, -58, 64, 59, 56, -15, 26, -97, -115, -51, -56, 50, 10, 26, -50, -74, 5, 2, -29, -40, 49, -25, 4, 109, -16, -35, -54, -58, -115, 89, 90, 27, -52, -19, 17, -20, -91, -57, 61, 35, -130, 69, 120, -50, -37, 24, 57, -35, 8, 77, -72, -46, 47, 38, 13, 38, 11, 21, 28, 151, 93, 37, -18, -97, 67, 51, -44, -15, -35, -16, 20, -70, -1, 21, 2, 30, 12, 20, 142, -32, 36, 101, -11, 29, -55, 5, -47, -33, 24, -2, 23, 1, -50, -45, -30, -60, -28, 60, -86, -42, 6, 73, -66, -12, -15, -11, -110, 19, 76, -45, 41, -74, -72, -114, -25, -12, -104, 23, 32, 51, -59, -72, -1, -13, 4, 96, -8, 108, -62, -64, 82, -4, 84, -38, 62, 20, -114, -20, 36, 25, 65, 21, -31, -1, 53, -88, -138, 46, -34, -17, 21, -4, 14, -8, 63, -42, 33, -15, -61, -59, 24, 40, -6, -40, -8, -32, 71, -6, 58, 24, -11, 12, 13, -47, -48, -135, 12, -2]
7649bm1Kj5j0M5q6J25rK6j14J36L8p5l6NK7n9N0k2L4j9Q8o4r8Q8o1Q7nj01P8J25
7680A37j14q8J09Qq2mq4K22j80J37j19J8J12j06q3K71j53p0kP2K4J06r2j57R5
7705b3N2j4n9J01Km4r8O8M6J8m2l5L1lj9J0L8j01L2j7j2J16j7k9J6K4jOQ0j74
7735d8k6N7J1L6m9J01m8p1J64j96L1J02M1l6r3O2j49O9J38r9N3j22J2n0J78j23
7761e5O7k9J00j29n5J59j01P6n1MKR5k5k4l3Q7q7l5J77j50M6J0p0J5K03k12Q4
7788F9k7rm7M2j46J09Q2J7j38L2J01o9m1J0M5K6l8M2p0l8O3l2L4j32Q8j0N8j19
7816i8J79j48O3m8P2QRl9J51j29j6j05J65p7M4%qoN8j21m6J92j07J34j33J05J
7843A00r7r2J57j98J09L1p7P3L8o7J17j30rK3K0K4n3Q3n3O0q3N1k7pM5M0q9O0
$$ y = [-2, -43, -41, -56, -66, -21, -107, 18, 9, 35, -79, 57, 95, 20, -16, -11, 16, -43, 7, -15, 19, 0, 88, 24, -74, 14, -47, 40, 35, -66, 12, 137, 23, -65, 44, 52, -30, -34, -118, 104, -76, 61, -58, -40, 72, -34, -117, 154, 1, -69, -71, 1, 25, 131, 39, -118, -23, 29, 15, -44, 57, 59, 15, -83, -15, 31, 49, 7, -28, 3, 0, -19, -9, 29, -72, -40, -57, -69, 47, 30, 1, 17, 41, 40, 46, 126, -48, -74, -17, -6, 30, -19, 82, 34, -37, 127, -69, -38, 64, 105, 69, -24, 38, -111, -42, 96, -3, 50, -72, -60, -110, 68, -55, 12, -17, 83, -46, -101, 58, -43, 33, -18, -14, -12, 83, 58, 34, 1, 88, 1, -34, 143, -7, 39, 49, -21, -6, 197, -15, 69, 42, 33, -14, 28, -118, -9, 73, 90, -48, -16, 85, 16, -25, -15, 30, 56, 18, 60, -10, -48, 15, -17, 17, -115, -27, -37, 21, -98, 81, -67, -4, -52, 20, 28, 37, -2, 149, 20, 4, -101, 64, -13, 31, 31, 23, 17, 75, -46, -92, 100, -7, 127, -6, 99, 100, 3, -89, 68, -130, -21, 10, -67, 6, 44, -23, 94, -36, -45, -22, -2, 22, -31, 52, -1, 59, -24, 27, 0, -7, 38, 78, -11, 49]
7871D9j49J76m1J0o0m1N0m3P0o8j05J94j2l8n7J4M2J9N5q8L3Qj6L7r3M0o0J53
7899G9j72P4N2k7J9n2O8r5Q7l9L4j3l0l1J24q5N3J1j55J71j38J13m9L1o8P3o0
7926b5Q2j38J78pj41LKj4O6R7j13o9Q8n9P1j17L7kJ02l2m0L2rJ16j83K01l4L4
7954A26j29M5q2kk7J62p7k9Mj7K5nj1qK8LM4m3J3r1J36k8o6nN5j1o4R9m2N5l9
7985A9Q1rk2o0n1M3r6J17J45k61J6J11jj08k6J9J20n9J00j12R9pj24P4o0N9o5
8012e8m6J80j07R3o6j38K97jj02j26M6m7J11o4L2J5k9J08p0J8j45J83n0q3M0J01
8038I2r7Q3o0l2m9J21RmP0p1o5k6j0jM4N9j7l4l7K3M3p1J4LN0m2J02r8n2J61j84
8069g6J21M6k1k3n9m2J22j2n8k4l6J21J9lj05O5m7jK3j5J6n4L4m7LJ63p3j41J72
$$ y = [49, -100, 76, 35, 45, -15, -56, -6, -49, 21, -47, -152, 42, 30, -8, -65, -51, -9, 10, 65, -23, 10, 18, 2, 39, -54, -14, -74, 79, -93, -19, 33, 6, 25, -27, 41, -54, 33, -6, 28, 15, -15, -46, 78, -7, 46, 57, -98, 73, -65, 48, -1, 30, -38, 35, -25, 57, -81, 97, 90, -51, -48, -46, -60, 6, 103, -10, -79, 9, -50, 21, -96, -59, -61, 41, 9, -31, 1, -8, 108, -75, 126, 92, 126, -3, 42, -40, -42, -69, 93, 16, -13, -9, -26, -1, -6, -17, -25, 3, 6, 50, 7, 20, -71, 65, 37, -29, -34, 21, 10, -54, 45, 3, 58, 19, 100, 91, 69, 9, -42, 1, -95, 22, 167, -94, -78, 33, 32, -76, -102, -83, 37, -22, 78, -34, 65, 58, -66, 8, -52, 7, -58, -104, 76, -31, 62, -4, -142, 155, 154, 52, -74, -28, -75, 36, -28, 4, 19, -10, 98, 28, 46, -99, 84, 34, -49, -9, 92, -5, 78, 18, -14, -63, 58, 67, 63, 133, 62, -3, -29, -39, -40, 4, 63, 46, 12, -25, -2, 41, -30, -16, -13, 37, -5, 97, -1, -53, 108, -76, 45, 91, 70, 47, -12, -54, 68, 56, -2, -26, -62, 59, 78, 75, -30, 35, -12, -13, 10, -5, 11, -43, -9, -56, -53, 110, 37, -104, 68]
8098F8j61J18k1o8J20l3j7lk1J8J3q2O2l3m2O6J9j9O4r4Q1k9nK5m3o4J19r4m1
8127i7P7P8r8Q4m8K5R4j17m5J37j36o5J08K8k6J5r1J69p9J2m0K7L1R2j24oM1n1
8155er0J38M4j08O4j04J14Jn8J4K2J8j01Q9M5j33J26lO3r5q6l2J0O0P5m9j2m7
8183d0Q2p8j7M1k2P0J3n1
$$ y = [68, -93, 25, 4, -64, 56, 23, 6, 3, -18, 0, 13, -69, -7, -40, -82, -16, 3, -16, 48, -46, 35, 6, 1, 26, -17, -81, 38, -56, -97, -20, 58, -40, 44, -4, 21, 115, -2, -47, 90, -46, -111, -3, 25, -1, 14, -77, 92, 13, 25, -15, 12, 43, 135, 11, 5, 46, -5, -95, 43, 87, -21, 43, -61, 53, 54, -4, 10, 32, 50, -51, 38, 83, -50, 76, 73, 136, 41, -45, -77, -67, -7, 68, 19, 7, -40, 42, -36, -53, -12, -34, 36, 49, -2]
8191b
$$ Imaginary data points
##PAGE= N=2
##DATA TABLE= (X++(I..I)), XYDATA
0@%%%%%%%%%%%%%%%%%%%%%%%%%%%JpJ3j4J5j6J6j6J6j7K3k9L0l0L3m0M5m7N1n7
47c0O3p0P5q3R2j01J15j27J38j53J73j93K17k51K90l39M07n01O38q60J273k253
69a480P087M585k1130K5958j812j5455J0163j5250J1508J2918k1538P265n777
82b958k51K0878j9696k568Q103r761K0264p719j6300J5994o667Q493O964k2979
96h203J2620M659l789J3940j8550O31J7217r177R633n953j1716K1494l790j754
110A7262N026j5618J5255P353j1692Q049j0381L744J6471j4426K436j03o799J8745
124C5322q369r048Q481q891J0896K792j7318Q566k464J42J0075j7341J022O826
138B0691p167R968j0128r025J3105o915K648j24j5050J1267R61o555N385j2962
$$ y = [0, 0, 0, 0, 0, 0, 0, 0, 0, 0, 0, 0, 0, 0, 0, 0, 0, 0, 0, 0, 0, 0, 0, 0, 0, 0, 0, 0, 1, -6, 7, -7, 8, -8, 8, -8, 8, -9, 14, -15, 15, -15, 18, -22, 23, -24, 27, -30, 33, -37, 38, -45, 47, -54, 61, -66, 72, -81, 92, -101, 116, -135, 155, -184, 223, -278, 360, -500, 773, -1480, 5607, 10192, -10938, 15020, 13208, -2247, 7916, -7334, 4174, 17092, -4446, 2819, -2958, -3209, 17669, -2027, -4595, 3508, -6253, 14011, 6292, -10008, 5986, -681, 7812, 14776, -8203, 4417, 9076, 5287, 19227, 677, 1308, 18525, 9348, 18981, 13028, 1312, 22806, 19016, 17262, 22288, 6670, 21925, 29278, 17586, 25635, 15254, 18998, 35469, 21043, 23479, 23376, 16577, 35322, 26953, 17905, 26386, 17495, 28391, 31183, 13865, 22431, 19967, 20109, 30184, 12843, 13865, 20691, 13524, 23492, 13364, 4339, 17444, 10529, 13177, 13053, -1997, 9270, 10231, 3676, 9061, -3901]
152c901L333R696j0785L518n148n240J4091q116l640L041q506J0919K44j0875
166a1369O430n167L372P863j2922L191K099l330J0330q689l993Q682n133O541
180b095r63j0094R851r41m26N143j1002N371O028o100N904o274j935J1114o187
195b606J302N67o862J0617j289n230M949o501N310N137r217M335j760j236R066
210F582q134p83M351n075P627k503o855P229l460K215L475r435N048K028l480
225a170N752o812m74P035n215L381j445n322Q345k475j568L064o419N296K625
240D598n812M412l890K71O729o450J376J298l938P117l046l365M603l864L540
255C579J783o810M528q20j135N046o416J016L633l990M234k498l568N998l260
$$ y = [-3901, -568, 9128, -1657, 1861, -3287, -8527, 5564, -2552, -6192, -3151, -11657, -738, -494, -11369, -4939, -10106, -6734, 1129, -11793, -8602, -6503, -9833, 497, -8192, -12185, -3503, -8636, -2095, -3058, -13152, -3301, -4242, -4668, 475, -10527, -5156, 872, -5228, 676, -5598, -7533, 3581, -2606, -1304, -737, -7599, 3018, 1729, -3501, 1448, -5053, 257, 5394, -3823, 512, -1248, -2484, 6582, -1552, -2335, 2016, -3059, 4568, 2065, -4790, 2439, -1021, 1194, 4669, -4766, 282, 2310, -1170, 4582, -2230, -2704, 4331, -884, 2497, 1052, -4270, 4075, 1600, 32, 3096, -3323, 1973, 4598, -1214, 3198, -692, -421, 6308, -142, 1234, 2532, -1406, 5711, 2665, -700, 3903, 39, 3579, 5362, -1448, 3080, 2260, 1125, 6171, -245, 771, 4404, 414, 4648, 2150, -1418, 4580, 1320]
270A320O68J703n785M580N14l363L941m633Q86M115m920K484q67k820N578l393
286Hj094K622m076L882M76m446L836k525K06L599m996J808J163k905M432k845
302h55j670L715l087K030P50m073L812r38j166L111m007J503K261l301K919j670
318f66j529M028k715L57J432l307L322k85k340L116k821R06K381l690K204j69
334B24j979L547k431m10K223k790K310J76k664K852j439l62K575l308J551J012
350A087k319K633j609r10K820k469J034Q73k603K642p65j112K412k455Q09J602
366A670k540J958n34j360K655j886Q0J254k252J954mj744K027j570nJ849k374
383h22J187K64j784K347j364o69J776k029J238N47k111J826p94o52J887k125N62
$$ y = [1320, 1988, 3691, -2094, 2486, 3000, -363, 3578, -1055, -169, 3946, -974, 1510, 643, -2177, 3401, 8, -1086, 1536, -2540, 1342, 1818, -2628, 1208, -1317, -1111, 2488, -2508, -700, 463, -2442, 1990, -855, -2525, 1190, -1897, 133, 883, -3190, 622, -316, -1482, 1629, -2378, -875, 1386, -1915, 1004, -666, -2195, 1833, -882, -525, 907, -2400, 922, 637, -1703, 1413, -1408, -502, 1879, -1811, 393, 224, -1755, 1792, -639, -1049, 1174, -1616, 694, 870, -1794, 1058, -381, -743, 1832, -1476, 75, 1087, -1232, 1401, -208, -1118, 1702, -767, 267, 1140, -1463, 1179, 414, -698, 1714, -741, 68, 1670, -870, 1088, 554, -806, 1849, -37, 43, 1297, -955, 999, 995, -749, 1278, -292, -297, 1552, -822, 365, 629, -1155, 1192, -172, -841, 935, -1094, 144, 691, -1420, 406, -388, -1040, 847, -1278, -716]
400g16R61j844J894p45j185K059j548M11R19k011J724o2j180J721j299l6J615
417F78j850J232J1j417K136j047m27J515j639J163N97j568J565p02m58J735j641
434a17M05Q31j377J726n45j140J667j192M09R53j867J356j11q84J466j415Q8J236
452A489j642J079k35j205J762j080k85J176j721R28L87j505J395r11l52J494j566
469g92M53N17j420J566p07r15J370r76L70P56j697J300o9q51J576j535K21J060
487B27j267J052r2j160J810r20j53J009j462J074L16j202J494r09k16J352j271
504c18M54M17j221J521n21p13J397j353P96N48j563J206k96o46J447j378K64Q63
522I04j328J160l74r76J608j109M9J066j593J092R0j191J518j068j50J363j610
$$ y = [-716, 245, -1599, 295, -450, -1635, 424, -1124, -713, 206, -1805, -81, -143, -1323, 398, -901, -937, 678, -1172, 60, 71, -1346, 790, -257, -684, 831, -808, 355, 952, -616, 949, 247, -211, 1524, -117, 288, 1119, -258, 1468, 923, -217, 1450, 258, 667, 1620, -247, 1109, 998, 114, 1580, 165, 253, 1489, -153, 926, 691, -514, 1248, 168, -117, 1059, -662, 266, 653, -852, 543, -368, -720, 774, -792, -339, 178, -1242, 324, -383, -1298, 72, -904, -534, 222, -1475, -175, -244, -1095, 481, -1054, -833, 227, -1040, 12, -80, -1240, 570, -350, -503, 506, -956, 118, 434, -768, 726, -183, -399, 953, -318, 136, 553, -668, 853, 332, -381, 1016, -337, 459, 1007, -556, 650, 354, -292, 1155, -223, 41, 904, -424, 736, 362, -614, 994, -115, -66, 1000, -593, 499, 589, -602, 916, -152, -302, 1061, -549]
539e49Q91K98j287J546o72n48J356j405P97N17j434J373n26m49J559j609N00R43
557A301j531J367m30q55J673j228L45Q11j761J535j51j170J649j269R3J129j517
574iR79N9j182J548r80k83J280j627J018J17j475J565q62k78J235j481O67L80
592F71j411J568p59o74J619j628O40O63j514J477m53q81J618j433N17R33j670
609g17J343j53r91J794j327K64J013j589J255jj032J658j131P4J156j641J205
626A180J55j141J572r88k96J522j621Q41K85j389J750r76m24J306j466P76M38
643A524j700J586o28o92J537j700N75N15j616J471n99r97J754j531K51Q03j685
660a132J357l16j033J602j480K16J055j711J103nj217J805j268p7J160j550J130
$$ y = [-549, 342, 640, -647, 899, 227, -321, 1035, -370, 427, 944, -490, 883, 357, -92, 1467, -142, 358, 1301, -230, 1137, 707, -148, 1525, 297, 642, 1453, -308, 1227, 1076, -94, 1555, 286, 379, 1508, -9, 970, 1029, -153, 1395, 415, 132, 1412, -215, 803, 920, -555, 1010, 148, -130, 1105, -376, 291, 671, -740, 828, 69, -605, 1014, -614, 26, 689, -825, 652, 199, -682, 936, -497, 20, 953, -717, 626, 473, -518, 1276, -51, 213, 1226, -363, 892, 891, -141, 1517, 386, 460, 1616, -25, 1180, 1335, 194, 1766, 778, 482, 2004, 383, 1224, 1509, 120, 1870, 894, 470, 1776, 310, 1086, 1524, -176, 1410, 782, 90, 1627, -73, 502, 1017, -599, 872, 273, -724, 1030, -501, -250, 553, -1132, 225, -91, -1124, 478, -1002, -786, 269, -1442, -339, -344, -1561, 244, -1024, -1101, 59, -1491, -361]
677c61M7j161J680j025j5J339j715R25M27j172J651q25m27J550j535Q08M70j470
695h09J846o53n45J520j572Q77P23j499J451o02n41J666j572L97Q83j693J722
712A599n00r38J616j268K11R94j802J191n1j161J652j353p0J137j673J154r8j355
730g15J753j284q6J093j795J059K66j496J577j115k21J424j636P12J81j265J600
747E2q25o19J473j569Q44N96j634J457o02l90J340j548N80Q10j498J596p25p40
765a402J621j273N90P15j490J297r9p69J436j337K75J087j485J135j17j104J843
782I23j287j8J130j463J140J18j419J538q99L2J090j631R20L86j390J652r05n40
800f23J448j474P58L49j421J379n20m44J256j611P24M78j235J309o86n53J418
$$ y = [-361, -314, -1475, 205, -820, -835, 504, -1211, -286, 141, -1031, 620, -205, -632, 918, -617, 191, 661, -809, 1037, 384, -161, 1359, -213, 664, 1387, -112, 1339, 737, 196, 1862, 290, 687, 1570, -123, 1599, 1099, 161, 1777, 509, 720, 1714, -88, 1103, 1052, -109, 1543, 190, 120, 1257, -416, 738, 640, -715, 1038, -246, -332, 761, -1034, 25, 291, -1205, 372, -743, -964, 460, -1176, -464, -283, -1548, 52, -773, -1392, 81, -1488, -644, -48, -1682, -225, -827, -1217, 123, -1425, -845, -35, -1533, 63, -662, -1402, 219, -1054, -464, 251, -1239, 58, -41, -810, 626, -711, -436, 651, -834, 301, 184, -920, 923, -364, -382, 748, -715, 425, 543, -876, 662, -237, -205, 885, -746, 174, 560, -830, 822, -83, -623, 825, -649, 109, 458, -963, 416, -104, -548, 708, -903, -179, 299, -936, 373, -313, -866, 552]
817E52j265L13O75j433J420l33q73J472j259K08J097j682J207k21q57J489j107
834e97R8R58j304J097j19j090J514j017j3J184j707J075J84j148J610j095j67
851e37J220j493R00L56j316J523p70k75J050j312P07O47j490J305n17n55J553
868I96j530P68L97j313J376n71o36J329j155L91P05j483J264k12q21J393j272
885c74L14O89j204J089k98p25J242r68M7R99j485R54O1q16J087q72J01Q35j221
904e45O54J25r18J277p83k69J047j133N90K77r86J062n44l20J081j210N13L53
922B71r56J164o00l81J135j121M82M36j104J098l87n64J096r94M19N69j191J017
940C89j75p19J152r67K47P80j147R62j99o94J113p51j0Q31j139Q48N1q09J024
$$ y = [552, -713, -400, 275, -1158, 262, -71, -944, 528, -731, -523, 574, -1108, 99, -122, -979, 510, -597, -499, 459, -845, 252, 133, -957, 557, -460, -473, 711, -996, 79, 263, -885, 725, -370, -537, 683, -810, 90, 446, -870, 653, -117, -392, 658, -654, 53, 700, -790, 515, -2, -557, 996, -534, 234, 631, -682, 694, 123, -513, 816, -339, 52, 757, -726, 538, 326, -495, 898, -374, -60, 629, -575, 514, 216, -509, 733, -235, -188, 811, -674, 280, 341, -475, 612, -260, -159, 676, -545, 109, 234, -684, 593, -190, -459, 588, -545, 45, 322, -664, 398, -146, -466, 615, -595, -82, 271, -685, 479, -121, -502, 633, -488, -6, 430, -674, 424, 37, -527, 569, -425, -6, 563, -628, 389, 214, -505, 647, -320, -73, 707, -440, 522, 323, -371, 742, -9, -19, 812, -327, 521, 572, -237, 787]
959G87p76m1R16j118O57P6q46J138p00j35O56q45N59J87q67R61o39l34R36r02
979c30L85M50j120R96l82m38R42j020K60N12j031Q82j56n86J033r84L16N37r97
998g31O89l3o98R96p96J26P11r92P73n9o70Q58o21J24O14r00O36P3p38Q79o09
1019c68l9Q40r41M40J72p40R87n17k00O72r08N38L35p72Q14l23m48P86q04M88
1039A2L17q27P36k67l88Q74p59J18M30p66O83j82m70P82p53L21M44q58O03j86
1059a36m93Q49o59K34M73p81N39r4m93P84p01J49M06o84M77Q8m90Q09o32r3O18
1080A70o80M56j7m91Q05n07j19O49o26L43J57n74P31l59k66O89o02K31K60o74
1100d24P22j76l76O89o93K72L74o19N19j63k51N84n37O1M29p25N21Q7n10O92m19
$$ y = [787, 11, -30, 886, -232, 425, 501, -345, 793, 93, -42, 614, -231, 328, 515, -352, 609, -30, -364, 572, -330, 55, 505, -615, 381, -1, -439, 503, -517, -257, 255, -776, 106, -50, -636, 397, -587, -271, 266, -731, -42, -75, -773, 223, -573, -447, 264, -728, 45, -14, -684, 174, -447, -323, 291, -609, 27, 100, -638, 241, -368, -407, 433, -508, -68, 104, -636, 351, -166, -366, 306, -602, -64, 271, -501, 313, -10, -458, 328, -476, 12, 329, -498, 238, -29, -417, 457, -302, -184, 246, -520, 163, -19, -489, 293, -460, -139, 305, -553, 50, -136, -629, 220, -439, -205, 268, -513, 26, -68, -561, 223, -478, -329, 77, -607, -130, -42, -532, 277, -355, -448, 170, -510, -54, -71, -562, 243, -264, -383, 266, -360, -17, 140, -434, 297, -62, -328, 361, -241, -10, 250, -424, 298, 122, -254, 435, -258, 14, 388, -231, 288, 125, -126, 458, -79, -18, 411, -314, 207, 294, -216, 476, 57]
1121E7j46M91o08L94J21l86M33l36j29N18n06L25J10n54N55k74k62O91o25L88
1141B57J46o68O17k90j46N32m81K37J14n01N07k21k03N53m06J08J99n06L19J2
1161A79l63M92l17l7L00m29L22K1k25L45k99q0K86m17K95J72m53N06k98n5K75
1182B20m28K98L8l78M53k32p6L29m66J23K38l53L48j38j65L39l71Q4K96m98M34
1203I5r8l88N09l12O4K81l60K99j59j14L33l85J61J20l12J37J38k10K09j86N1
1224a27J77k33J89k4j88K78o2j72J59k31J55Q7l48M46k41n0L39k22M4O0k97L63
1246A02k8k89K97k63J20R8k66K83j08r3L22k94P9J36l00L10o8k34K59n9j09K88
1268A83m38K28P8j98K73j05q5K73k95L5J63k01K60j02j10J43k91K70L0k62K90
$$ y = [57, -89, 402, -206, 188, 309, -77, 356, 20, -109, 409, -97, 228, 338, -216, 339, 65, -197, 494, -131, 257, 403, -265, 352, 62, -84, 448, -33, 204, 318, -183, 324, 103, -100, 453, 47, 155, 354, -152, 167, 179, -184, 308, -9, -46, 254, -175, 147, 168, -57, 288, -11, -91, 195, -222, 73, 245, -208, 298, 0, -55, 220, -208, 90, 128, -250, 203, -29, -105, 224, -242, -119, 119, -234, 114, -24, -189, 150, -221, -137, 159, -339, 95, -3, -391, 118, -194, -130, 151, -209, 90, -69, -183, 150, -235, -74, 46, -266, -129, 9, -201, 8, -178, -127, 50, -183, 6, -18, -206, 72, 10, -162, -3, -234, -79, 8, -340, 106, -135, -185, 154, -68, -24, 36, -261, 102, 74, -215, 82, -181, -61, 37, -229, 54, -54, -147, 175, -119, -40, 96, -204, 106, 38, -196, 63, 4, -105, 183, -255, -27, 51, -147, 126, 21, -64, 209, -86, -51, 112, -89, 171, 69, -41, 102, -189, 81, 111, -151, 139]
1289A39m3j01K08j64m3K04l18J70Q2k89L00j69Q4J36m73K96M6j82J92l5o4J12
1311H8p8n7J29q6J37o8k72L64l33J50J80k18Q2n8j8J48k58J66J75k24J09l0j69
1334a41K28j34L5K37l94K63m8j21K31k46J42J91l37J70P2l21L58r8r1K32l62J41
1356GO8k04K94l1k75M11m21J08J44j50J86k2k37L42k88L0K16j91N8m0j01K60k93
1379a29R7J82k23J53m2L7Q8k18o4K11k98J99J45k91K08j70O6J30j97R6J35j97
1401h2K88k66n4J78j85J01M9k10K61p3p7K33k09Q6J01l47K99o8k58L49j90P8J33
1424A37l31L44j56j08K15j00o6J62k70L18j4k62J90r0MJ65l03J05J66k50L17j04
1446F9l6J73k27R7K2k37K63j46j27K24j39L6J55l11K74j62J06J65k32j1J58j63
$$ y = [139, 96, -5, 203, 39, -4, 200, -118, 52, 134, -155, 145, -24, 60, 196, -277, 19, 65, -117, 75, 40, -24, 88, 10, -47, 82, -4, 133, 65, -207, 157, -176, -26, 154, -64, 18, -40, -58, 90, -168, -2, 173, -51, 58, 28, -141, 87, -47, -12, 225, -169, 94, 46, -75, 156, -90, 52, 243, -94, 76, 148, -173, 185, 87, -4, 228, -134, 7, 75, -129, 165, 134, -141, 270, -151, -43, 101, -49, 137, 115, -122, 220, -68, -38, 178, -13, 45, 5, -96, 164, -129, -32, 150, -73, 80, 38, 75, 163, -55, -119, 92, -206, -7, 138, -153, 55, -115, -49, 81, -116, -20, 115, -82, 206, -60, -114, 64, -121, -20, 29, -181, 80, 7, -70, 163, -46, 40, 141, -206, 93, 25, -233, 116, -74, 4, 137, -194, 150, -6, -114, 101, 1, -65, 97, -173, 145, 131, -131, 59, -31, -27, 138, -165, -60, 106, -144, 173, 69, 33, 206, -21, 76, 98, -139, 124, -22, -149, 75, -64, -28, 127, -184, 90, -72, 34, 199, -33, -44, 114, -49]
1468d9J72l3k07L82l48J07J99l26J54k0o1J01j14L7J21q8J9M8l05K89k01J49J21
1491A47j94J22n7r6M1O6j21K88m05K76j6j12J52r9k8J52j98M9J79l01K36n7p3
1514d9R7k80K81J48l72J85n0q3J09j27n3K63k67K33j24M4J40j29K9J55k90K77
1536A37l6l09L34k37P4J08k40P7J54j81K51k95L7J73j50K07l1l06L62j49rK41
1558B12k79NL0KJ35k8q4K24k42P6J9l4P1l5k6M5j75J86mk14J49ok09L38o7%J65
1585B54l25K71j28n0J13j93R4N7j03M7J00k91K52k05N4K22l15J46j0j84K89j57
1607f2M4K57m20M9K38k95K64j11j28K22j93R1J08k25K18p4l4P9n5l6K10j91J80
1630A36p7k02K42j69N2J8k33K44j1q5J68j56k1J20j13M0K62k67K09j81r4J86j44
$$ y = [-49, 123, 90, -117, 265, -83, 24, 223, -103, 51, 31, -30, 71, -43, -6, 115, 27, 46, 94, -211, 78, -123, 26, 147, -47, 75, 18, -78, -37, 29, -92, 196, -209, 67, 51, -61, 91, -8, -36, 116, -82, -33, 146, -155, 81, 24, -49, 48, -232, 49, 197, -175, 10, -40, -123, -14, -141, -194, 69, -198, 35, -89, -45, 95, -34, -5, 150, -140, 137, 101, -208, 126, -111, -37, 71, -169, -92, 62, -119, 132, -163, -126, 47, -103, 104, 73, -233, 129, -20, -29, 212, -67, -62, -32, -30, 105, 77, -7, 217, -25, 51, 70, 36, 107, 72, 46, 91, -84, 102, 98, -116, 33, 27, -182, 156, 89, 89, 254, -71, 200, 72, 22, 135, -58, 36, 93, -10, 37, 137, -154, 98, -107, -53, 169, -146, 0, -10, -194, 95, -62, -18, 239, -181, -132, 106, -189, 75, -36, -164, 58, -135, -44, 64, -161, 57, -17, -51, 28, -27, -63, 147, -44, 136, 59, -143, 99, -70, -18, 0, -233, 11, 0, -85, 83, -73, -94, 26, -87, -47, 215, -52, 157, -24, -118, 68, -76]
1653g6K27q8p3O1p5J00R1k42Q2J17j75K38q3j71K26j86O4L2j51K06n2j45K26r5
1677E8q0K23l78K87k43J7K33l06K41O3l20K70j17l2J43k56J28Q6k40L00j22j74
1699b19L71j59k58L52j46L0P9k85K75j25M9P5r2L7Q2j93K67l32J07K15l36O2J67
1722B3j64K14j22j06K54k48J77p0j19K59j33k6J04j42J24N0k12K39j03j32K15
1743H2j51K6J33j17P9o3J6O2n9j01J87k30J89lj73J78n3o5J52j93J31j2j26K11
1767A00n0l9N6j08J2Pj14J83r9j6Q5j65J70r3m4J48l4k1P0j63J52R3k69J07K8
1792dn1J44k11P8J16j52J43o2m7J15j10pR7j19K08j48j15K27k36O7P3o0L7k0J3
1817b4J05pj06J56j28J8n7j35K96j82m4K02j93J49l0k3J79k29JJ02q9J62l8k67
$$ y = [-76, 151, 63, -10, 51, -24, 76, 167, -75, 7, 124, -51, 187, 104, -67, 159, -27, 37, 69, -82, 124, 72, -73, 153, 58, -22, 201, -177, 110, -133, -116, 117, -189, 52, 115, -205, 65, -52, -84, 59, -197, -69, 17, -223, 77, -45, -219, 152, -7, -265, 87, -59, -29, 50, -235, 40, -85, -36, 39, -53, -16, 66, -127, 140, -192, -85, 130, -206, -144, 23, -141, 73, -49, -155, 99, -149, 28, -42, -161, 98, -35, -61, 43, -99, 25, 75, -137, 102, -1, -133, 82, -69, -43, 90, -27, 52, -11, 5, 67, 8, -93, 94, -136, 53, 50, -123, 55, 2, -63, 89, -104, 27, 15, -111, 100, 50, 11, 67, -41, -29, -22, -136, 47, -52, -68, 17, -148, 22, -71, -115, 33, -1, -22, 48, -115, 37, 130, -139, -32, -4, -55, 89, -122, -44, 72, -80, 63, 1, -46, 69, -41, -48, 49, -70, 138, -10, -125, 102, -134, -67, 6, -54, -17, -37, -24, 81, 74, -32, 124, -4, 14, -43, -178, 118, -64, -108, 94, -99, 50, 20, -3, 176, -53, -52, 50, -39, 123, 85, -182]
1841a82K24q6j0J94j52p2P3j19K53j51j8J62j33J10j01r0J22o0oJ30o7o5R9p3
1865a8J8N7j28J45j43O8J65j62R4n6j12K21j07Q2P7j77Q5n1o5J68k11j3K63l05
1889a05J59n9K1J50j13q9K01j66J05j19n3O5j4p4K08k45K32j43o7J53l3q7K01
1912A28k24J57J6q3K9q2k2J75q5j60J76j78J84p3q8J07r7J68q8p0P7J21j33J67
1936A22j01p8K06j20P3q4j47K20k11mJ77q6J46j08l0L1K5n4J73k02R2Q6j81K59
1960B04r5q6J50k59J98m1n6P9l8J3O0j14Q7Q6j75J86j14q8K21k43J04L3m5L3L6
1985A36j05J69j16p1K5k21J19J37q8K73k25n8J29j48M2l7J2O6o8m0J68j78O4j2
2009b7j74K02Mm9ln3R4Pk86K96j15M3R8k04J82j9j06J05M3r1O0jo9j1r2J40Q5
$$ y = [-182, 42, -44, -54, 140, -12, -84, -11, -130, 123, -28, -46, 116, -17, 93, -8, -98, 24, -36, -42, 88, 21, -44, 55, -18, 0, 57, -71, 74, -69, -1, 164, 2, 96, 40, -72, 149, 42, 124, 201, 24, 109, 58, -7, 161, -50, -63, 200, -105, 54, -5, 16, 166, 53, -36, 165, -1, 104, -15, -68, -3, -17, -91, 117, -128, 104, -39, -106, 47, 14, -73, 128, -96, 61, 77, -6, 23, -59, -81, 94, 9, -151, 25, -153, 31, -42, -130, -23, -120, 48, -40, -110, -33, 88, -45, 122, 21, -57, 149, 29, 102, 18, -129, 91, -120, -124, 53, -33, 113, 5, -25, 6, 31, -23, 150, -52, 40, 126, -55, 204, 109, 23, 173, -86, 112, 71, 15, 94, 56, 69, 129, 15, 102, 188, 13, 199, 85, -3, 218, -25, 79, 112, 67, 100, 136, 31, 200, 84, 13, 38, -183, -64, 73, -15, 258, 33, -25, 104, -44, -2, -39, -27, 39, -29, -69, 99, -79, -15, -27, -201, 1, 5, -44, -47, -100, -6, 1, -285, 11, -104, -61, 37, -167, 15, -4, -110, -5, 38, -53, 7, 6, -63, -74, -166, -26, 59]
2036E9p8j5J09k41K08j47J12M0n8K51j61m8M5q1P4N8k23K11k1k49K90j62O5P1
2060A09j10O2j31K0Oo6NK22k31J16Q9k23J23j9k2P5j26J63j48RP3j77J58n8J16
2085C5l9k1p4K15k45J48N4p7j9P6n9J8q9J3O0j08J86m0n0oQNM3l7P0j40j5R5l1
2114b4K2Q0j24m6K21j91J03m1MJ88m11J69M0l4J04K8r8R1n2m0nm4P1J01n6Q8j65
2141b1K1J30j82J18Qj25O8m3k0J11j73K26j88N8P7J4r0M0J0R4j40k2P9r6L2J09
2167I5j22J11o2k6J33n6r0O0j56J89O8k14J76q8j6K23j72N2M7j67Q2ln5M5q2k0
2193d8L0oR9O7j74j5L9rK20k83J27J2q6Q3q3j5J99j49j66L34k50O1K6p5J33j35
2219f4J4R1j10J54j06L0O4r8N1K7j49J82o1q1J53j31P9J7l3n1J19j41J02m1o6
$$ y = [59, -19, -34, 75, -166, 42, -105, 7, 47, -11, 240, 79, 31, 76, -5, 69, 127, -96, 115, 94, -155, 135, -27, 38, 109, -1, 61, -70, -50, -44, -110, -105, 117, -114, 2, 91, -132, -9, -28, -50, 25, -101, 62, -86, -77, -4, -181, -23, -81, 35, -4, -25, -99, 116, -129, 19, 73, -4, -23, 53, -6, 12, -77, -64, -4, -112, 74, 34, -16, -22, -14, -9, 34, -3, 67, -73, -88, 7, -24, -2, 78, -46, -92, 129, -62, 41, 0, 4, 192, -219, -50, -10, -44, 60, 88, -10, 81, 29, -11, -16, -60, 11, 112, 56, 144, -21, 0, 130, -52, 66, 74, -51, 17, -26, -46, 65, -108, 118, -70, -12, 65, 79, -11, 29, 39, 133, -7, -29, 50, -46, -14, 95, -27, 84, 22, -4, 129, 73, -17, 43, -113, 76, 144, -70, 106, 18, 2, 225, 53, 105, 152, -15, 67, 64, 9, 54, -28, -48, -18, -24, 75, 142, -32, -47, -8, -17, 203, -80, 47, 59, -27, 56, -27, -42, 157, 8, -158, 176, -74, -13, 13, -62, 71, -64, -50, 41, -69, 85, -21, 9, 73, -25, 26, 53, -96, 86, 25, -56, 97, -34, 45, 62, 29, -22, 97, -44, 58, 17, -49]
2244d9K9k3L1J21j44M8Q4j33Jm7J77j53J7Q2N8n1m5k5R9m2N9j27rN8J16k03J16
2271D5Rj02nJ26j48Q7l5J38%p6m9o2R4O0m0j35J77j42Q5l2j18Q9k1M6Mo4J37Q
2299G6o7k4J6k6j2O6L2rk4L1k8L6o2n4K6%l9J14j36L4J59j64L8pl4J30o6mJ34
2328A36j12j38M7o2J06l5qJ72j72J06o9J44l9q4N8k1K6j40J59j21J24j59R7QO5
2353H8j46J71j18j8L8K9k7L2k4R5j10J14n6r7O1M2Pl1j15J7P7R1j71P5r6N7j0
2380b5p5Q8n1R6p8k3N9j53k4K06j89Q0J04o8N0r0p5K28q0q6O4oJ2N5j00J01q1
2407f1J7L8K6oo5J02m9j89J93rj30J38l6O1p7KM2RK7%j10J47m7n8J22j25r1J82
2435E3j41J22P1j05J41p2j29MJ26m2M0l2K4o1j3j02J31j03J55j25M8J27n9j17
$$ y = [-49, -20, -43, -12, 109, -35, 13, 97, -36, -35, -82, 95, -58, -41, 41, 99, 48, 3, -22, 77, 35, 94, -33, -42, 16, 132, -71, 45, 54, -48, -53, 73, -75, 12, -23, 115, 115, 39, -10, -72, 22, 82, 42, -93, 84, -58, 27, -5, -123, -34, -55, -9, -5, -69, 68, 76, 9, -15, 1, -25, -37, 29, 61, 52, 28, 59, 31, 67, 5, -49, -23, -23, -62, 52, -84, -50, 109, -55, -17, -24, -58, 72, 6, 2, 136, 24, -114, -67, -129, -23, -58, -66, 106, -66, 40, -29, 115, 76, -8, 50, 29, 55, -85, 74, -47, 77, -82, 15, 23, 88, -58, 113, -5, -23, 15, 44, 17, 49, 25, 120, 10, 124, 68, -29, 32, 74, 81, 50, -65, -48, 29, 120, -51, 24, -72, -15, -25, -100, -12, -63, 33, -45, -68, -9, -162, -186, 20, -169, -89, 15, -53, -3, -93, -168, 60, -20, -106, -42, -48, -36, 19, -81, 20, -61, -44, -6, 20, 14, -51, 51, 2, -187, 6, -3, -133, 5, -31, 30, -47, -45, -3, 6, 33, 33, -77, 70, 23, -35, 87, -38, -129, 53, -88, 34, 105, 0, 141, 69, -60, -56, 70, 28, 68, 36, 60, -1, -14, -116, 15, -88, 67, -58, -10, 117, 58, -59]
2459e9J21r0J88j19q0P6q1O5o9M1oK7l1M4o8R8j29J8O3L7j04L2n5O7N5l9m7N6
2487A1j00J73k2j41K39r4n4O5q9O2r0pKJ37j35k5K2Q2m1N5Q2k89J28n6J1O2Jo5
2515g6R4m1l2J54rj72KKR4o8J1kJ7o8R1k07J69J0N9L0j09ML5J09j61K2Q9J6J6
2544G9K8j22n5K48k77J12K2m4l8M3P7K9l5p2O0m5l8N4q5J29m6L4r1q2J41q9J03
2571D0l2O2j18N8q9R4r0N1n1l6L2O4K3j2P4l9p5N1pJ0K9j8K7K9j09J24j1m0K3
2600F4j27K0o8J80n2n2K7K3k9J2j9J12o1L1m3j43J6Q6J67j32R4j59R4j3p1J09
2626F6j41J36j16L0rJ07o7N8j14Q3k0k7RM6n4L2p5J67o1r9J10n0K8O3j4j20J6
2653a6o8J21l4j09N8Q9k7l3O3q1L9r3J82j10j5P2j00oj04Q9M6m0J58o8l1%K8j81
$$ y = [-59, 62, -28, 160, 41, -39, 37, -44, 21, -48, -7, -13, 14, -17, 27, -41, 57, -72, -54, 9, 46, -58, -26, -81, -14, 41, 2, -45, 11, -89, 84, 62, -79, 160, 66, 12, 77, -12, 50, -40, -47, -45, 92, -43, -68, -46, 36, -5, 50, 132, -157, -29, -85, -74, -12, -11, -76, 18, -23, -55, 99, 90, -82, -80, -78, 16, -52, -41, -43, -26, -94, -3, -210, -41, -31, 28, 58, -51, -47, -12, 97, -64, -42, 47, 63, 79, 107, -15, -70, 178, -99, 13, 35, -9, -47, -4, 73, 102, 67, -5, 55, 10, -28, 26, -59, 70, 24, 58, -33, -115, 26, -63, 40, 8, 70, -48, 10, -79, 15, -75, -24, -75, -111, -79, -15, 8, -4, 70, 31, -44, 7, 0, 10, 39, 21, 48, 77, -32, 92, 81, 41, 64, -63, -43, -111, 69, 17, -35, -8, 15, -14, -2, -21, 91, 30, 61, 18, -125, -109, -23, 144, 12, 106, -53, 41, 28, -43, 66, -75, 61, -55, -25, -34, 73, 6, 64, -50, 33, 13, -14, -5, 41, -13, 19, -56, 111, 50, -49, 61, 11, 39, 102, 88, -32, -16, -84, 37, 3, -106, -48, 41, 14, -19, 44, -37, 2, -91, 91, -19, -34, 38, -62, -68, -172, -83, -37, -77, 81, 13, -18, -18, 10, -171]
2681a71J79k9j4R9j18N8k3j8J7N8j38R4o8J05J1k8J03j23mJ19j07J6O8j89Q4L0
2707A1j68K28o3j76K41p2J07q2k1N3j23Q4Nq4PJ17j18q9J79o3J13n3n1Q8m0p6
2733d6L4j02K21r3pkO1On0K3j09J07j1N4q2K4j23J27mnr6R7m2L3l7m6N3p3J5O8
2763en7L5k5mJ04j14J6L0j09J2J78j77J03n7M6P3p1j1M1m0Q0j00K7P4OK3R1q8
2791H1j4n4m4L1L9q1J67j52M3l2l5O7jN1q5nMp0mJ55p4Ol3l1J34o8n0O3l1Q0n4
2822Ck1n9M7P3j4j31L6R2r6M6N1q4njj33J94J15j22j8L5l4L0k7R2j21l1J32m5
2850Dr2M6k5Q8p3J17r9J0K4K6j8K2N1m0K9r2M6m5L4R1r9n3RO6J6K7j1j33J26P
2880E9J29k36M2Jo1J24o8p9J58o9k0Ql1Q2p5K0O4l1o6n1R4Q5r3o2J9R2q5O3j19
$$ y = [-171, 8, -21, -35, 64, -54, 4, -19, -37, -20, 38, -100, -6, -74, 31, 42, 14, 117, -6, -10, 109, 2, 18, 86, -103, -19, 11, -157, 71, 8, -168, 73, 1, 108, 26, 5, 58, -65, 19, 24, -60, -53, 64, -54, -143, 36, -27, 86, 33, -18, 70, 30, -46, -12, -114, 107, 14, 7, 5, 66, 72, 22, 45, -64, 43, 32, 86, 4, 28, -95, 32, 28, 23, -73, 24, -18, 15, -22, -68, -15, -88, -73, -5, -62, -27, -52, -56, 48, -66, -50, -20, -129, -117, 61, -116, -13, -70, -24, 49, -22, -33, 8, -32, 48, -52, -25, 49, 55, 78, 169, 81, 67, 13, -31, 0, 39, -42, 125, -27, 16, -16, -51, 16, 15, 66, -19, -24, -20, -90, -94, 61, -13, -7, -40, -71, 63, -5, -55, 8, -23, 57, 3, -18, -77, -30, 43, 29, -102, -66, 26, -70, -24, 27, -57, -62, -63, -196, -2, 113, -9, -27, 8, -26, 4, -23, 69, -52, -83, 49, 4, -88, -42, -67, 21, -52, 65, -34, -24, 0, 26, 8, 30, 81, 41, 70, -22, 24, -21, 13, 104, 5, -48, -39, 27, 43, 70, 59, -74, 52, 59, 188, -48, -6, -5, -66, 58, -10, -89, 69, 0, -20, -12, -43, 39, -36, -16, 48, 17, -49, -100, -6, 79, -14, -76, -57, 35, -50, 13, -106]
2909a06J51K3j09L2L9K4rr8N8J5m0J14j35jM0k8Q0J3r5R4n5j3m4n0J15J2j54K37
2937A10k31j9R7J40j39R2j05Q9m9K8p3L9Q7lq3M3Pn1J84j99J16j60L2N9M7j4m2
2964Bo6J7P9o2j5J92j5j56N4m9N0l6r5J86q0j0O2p8K6lL9Rm9M0N0j45R0o5Q6m6
2994A2J6Oj9M8r9l5P0L5k6L1Lk0n5R8p7oR4k3l2j02J91q4l4R2k7k1n3r2J62p0
3024a7mJ02r1Nj9J49j85J33m0R6j58j5M5J5j53J40KK4q9L4k5R3p9J45j92O0R5
3051G1q3J22j81J46j36J15l6O3j14J21K5j11O2j40m2J71j1p1m8L5J33j11MK9o2
3076d9N3k9M9r2K9Q3l4m7oj1N9j28K01p4l4j11J11K2M7J27o7j64N8j23K23j14
3102b1l9Q1j04m4N9J73j01o2J15m2QO4j32M6o1N7j6J9k1O6k3k7L9Nr8QM1k7R3
$$ y = [-106, 45, 68, -41, -9, 30, 54, 45, -53, 5, 20, -20, 94, -41, -42, -2, -30, 50, 63, -32, 62, 7, -6, -50, -100, 15, 27, -127, 110, -121, -140, -43, 97, -42, 50, -55, 34, -15, 13, -60, -21, 66, 63, -20, 23, 30, -21, 163, -36, 80, -80, -48, 11, 58, 44, 2, -64, -47, 32, -30, -45, 147, 132, -24, 30, -19, 31, -5, -100, 86, 6, -4, 58, -20, 6, 3, 42, 51, 2, 42, 92, -53, 37, -28, 58, 12, 28, 34, 15, 63, -36, -71, -1, 34, 8, 39, 42, 22, -33, 65, -12, -18, 76, 53, 21, -81, 110, 26, -8, 84, 57, 36, -17, -109, 53, -17, -21, 81, -10, -5, -24, 125, -60, 73, 33, 129, -29, -44, 1, 16, -137, 3, 5, 29, -60, -26, -51, 42, -37, 108, -84, -24, 71, -12, 110, -71, 75, -61, 54, 18, 81, -33, 88, 113, 2, 64, -76, -118, 53, 42, -29, -77, -42, 91, -20, -16, 13, -49, 4, -25, 24, -68, -39, 44, 10, -37, -43, -54, 5, -123, 78, 4, -30, -141, -30, -8, 39, 166, 99, -65, -7, -130, 93, -21, -60, 21, -83, -127, -68, 105, 4, -58, 57, 15, 23, 87, -45, 1, -60, -3, -19, 0, -21, 45, 22, -5, 34, 39, -59, -51, -10, -37, 56]
3131E6n3o3O8j4P0j72P9M0m0J11m6K1o1j32J44N6r2nO3J6L6k1K0p0mo3Q5o8J96
3160A57j27o6K1R4q0J24j14l8J4m7J51j23J8J3pm6k8J18Om0J0j06p6P4J41m6q
3187a1k1J50j80j58K83j27k9J11j9m1P5J5l9J5m3L2o5L0j7J6K7m4N4m1R7p0L1
3214C1k3m7N0m8N3P4kl5m7JQ2j02m0L3J40r9j9m5j8P1O8O6p8o7j7J02om1r5M1
3244a7l3O3j3o7J41n6J6r3jL2J16p7P7j20rJ8o3J44l6j4m0O3J9o0p5K0M7O7lj16
3274g0O9m0L4m3N9J4r6Q0p6J05j1m0J40n3n7K1q5j0QK7M2m9P0j76J80k6K8j25
3302h0j3K0O9O1j14N3m8M2P7L0j89oP0R4p6N6q1J2nL9k4j08J0J27qr9L2M7n5P5
3332HK3N1rj13J05j80J12M8j0M2j23J5O1J1J4r3k6M3N9k8J5n1L9q7P5pM0o2P4
$$ y = [56, 3, -60, 8, -6, 64, -108, -29, 11, -29, 82, 36, 57, -4, -136, 8, 64, -28, -33, 30, 46, 82, 61, 81, 11, 7, -56, 29, -39, 157, 30, -36, -15, 79, -1, 123, 9, -29, -15, -62, 89, -34, -16, -3, -10, -56, -84, 34, 40, 0, 10, -96, -172, -98, 43, -3, -11, -32, 118, -62, -220, 63, -64, -93, 18, -1, -42, 33, 48, 9, 24, -19, 13, -52, -22, -39, -23, 4, -40, 14, -27, 70, 0, 31, 8, -39, 11, -37, 16, 90, 88, 53, 6, 7, 89, -13, -53, -20, 120, 21, 2, -43, -61, 10, 78, 144, 66, -1, -18, 84, 78, 37, -58, -17, -50, 13, 0, -67, 74, 18, 34, -59, -60, -28, 88, 11, 88, -32, -41, -23, -86, 58, 22, 8, -32, 31, 50, -10, -85, -65, -18, 49, 46, -70, -1, -41, -7, -50, 9, 23, -73, 7, -69, 36, 25, -15, 125, 72, 15, 36, -49, -59, -51, -24, 18, -31, 39, -137, 43, 17, 45, -80, -93, -73, -4, 57, -57, -4, -52, -10, 67, 97, -92, -98, -28, 66, -10, 46, -35, -23, -28, 11, -13, -121, -111, 16, 8, -91, -59, -12, -67, 8, 31, 82, 73, -40, 65, -115, -3, 45, 35, 77, -46, -31, 30, 41, 55, -38, -64, -21, 38, 10, 25, -26, 13, -74, 1, -6, 34, -28, 46]
3361D6j39P1O6j03N2N9k4m0J2Q4k4o2J7K0j63Q8J02J6j8N6o3n1K2p3M8qK6Nk5
3390cL5m5Qk7J75j57J3J9o1k9L4M2P8j43J69q6n3J2KK9n3R9kj52R0Q2j63J36%
3419D9j12M6K4K3q4M2J40j85K0jo5N3N8m3J6Q0r8J30L4o3j44L8J10l1m6Q7j58
3446h0MJ43j15O6m7L0m1L1k7Q2m4l6P5j18P2Q0j10k6P6j24L9lJ18p0L2j3j5Jm
3475b4k0Q9l8n1L5j30O2J5J20n8k6M4p5L6J80k06k8J18j22J66Op8q4J23j8jm6
3502a1J9P1j34J03m8l2k7O8j02N9P4q0J55j8k31J16O5j5p7P0LK9n0K5p7R3j59
3529a11Q9N0M5q2J30l5r4R1l9j02L3R2Rj65N3J4P9r6L1Q7j19P9r5R4n2m4O3L8
3557D3L7q8o2Q7J0Pp4L6P6m3%mQQ3o1N1p2j01J31q4L8M6j04J24kj01n9o5Q0K15
$$ y = [46, -93, -22, 44, -59, -7, 52, 28, -12, 0, 84, 60, -2, 15, 35, -128, -40, 62, 78, 60, 116, 53, 2, 24, -49, -1, -9, 17, 22, -3, 32, -13, -5, -32, 143, -14, -1, 18, -43, -72, -38, 4, 82, -61, 108, 22, -31, -19, -17, 12, -41, 58, 56, -96, -6, 76, -87, 49, 49, -63, -17, 7, 30, -54, -12, 128, -57, -37, -38, -103, -50, 8, -35, -19, 61, -37, 93, 127, 64, -80, -42, 68, 37, -9, 78, -80, -76, 67, -48, 18, -29, 1, -40, -9, -36, 46, 2, -34, 41, -77, -5, 75, -35, -61, 15, -109, -70, -73, 45, -25, 7, -6, -21, -20, -24, -44, 45, 7, -44, -9, -139, -77, -62, 58, 0, -26, 18, -57, -21, 159, -47, -75, 43, -79, 87, 93, 15, -69, 54, 36, 35, -11, 8, 79, -55, 48, 0, -32, -59, 9, -93, -34, 40, -40, 115, 97, -134, -18, 47, 32, -45, 25, 28, 57, 7, 32, -45, 48, -111, -22, 28, 73, -9, 121, 86, -8, 83, 44, -58, -25, 67, 76, -89, -36, -22, 57, -39, -8, 79, -40, 39, -56, 38, -14, -58, 5, 43, 80, -8, -70, 17, 27, 34, -40, -4, 72, 29, 29, 25, 33, 116, 55, 106, 34, -67, 64, -20, 18, 64, -40, 84, 82, -19, -78, -143, -63, 152]
3587A52j42j11Q6P3n4k8J2l9O1j01J2J33p4N3p9K8j2L1Qj8M3m7r9M5K8L2K2lL4
3616D6j22R6J18j20J9j09K6K02n4j77P6p5j8L7L7l6P9LJq4jP5o6K6q9J11j8Q7
3644G0q3m5J28m8o6R5j08MJ60j39m4Q4L1J9r5j3L1k2Mq4P0J13Jk6m8n7J18L0l1
3673D9o9J2n7R4o7M8Oj7n6J05p6O0%l7K9P4j24L7n4O6q0o9J66M7j70J51j06p0
3701a08Q4N1m1o0r0J27K5Lkm4J02k32J65J27o9j37K7N9j2k4o1N4kN4k8J13q8j6
3729b3o1J04j8mm0m0J06Mn3M1k6j04J26J32r8k3n5n1Q1j9M4j21J12K6%L2j6J8
3757G4l3qM3j09p1J13M6j28J22q1J30j36O2k1J17j32m6R4o4P2j21J29K7l2j03
3782e6lJ59o1j14J69Kj08j09J08k9M8n3M0o5R8O0j81J09n6J6mM1K9m0p4O0J9L7
$$ y = [152, 10, -101, -15, 58, 4, -24, -12, -51, 10, -91, -79, 54, -20, 33, -46, -18, -30, 1, 9, -9, 34, -13, -112, -67, -39, -7, 15, 12, 46, -76, 20, 138, 18, 37, -72, -46, 156, 102, -75, 1, -74, -92, -55, -18, -54, 25, 28, 29, -55, -56, 19, -47, -21, -110, 1, -17, 70, -13, -58, 70, 22, -44, 51, -57, -53, 107, -32, -76, 8, 39, 58, -37, -50, -19, -41, -37, -121, -51, 62, 63, 37, -11, -68, 50, 80, 49, -20, -8, -65, 29, -38, 10, 16, -1, -57, 48, -28, 32, 32, -5, 24, 98, -26, 11, -43, 23, -57, -126, 40, 87, -83, 68, -38, -108, -24, 27, -14, -74, -164, -37, -12, -9, -11, -55, 47, -185, -20, 107, 38, -99, -72, -13, -25, -49, -110, -56, -58, -4, -32, 81, -7, -23, -84, 20, 2, -2, -42, -82, 24, 28, -25, 16, -10, -114, 12, 144, 46, 23, -32, -83, -2, -21, 23, -98, 14, 40, 40, 72, 56, 74, 41, 33, 76, -33, -104, 9, 55, -73, 49, -32, 98, -38, 24, 3, 120, -12, -58, 36, -28, 44, -77, 52, 79, 47, -56, -59, 100, 39, -75, 94, 96, -12, -121, -13, -42, 6, -47, -7, -72, 26, 86, -95, 14, -42, -26, -30, 11, 40, 0, -74, -14, 5, 42]
3810D2j3k1R9j24J5k4J8K1K6qjL5j41R2J5Jo3nJ83j15kP8q1m2M7j3p5L2O0o9P3
3841D0j14pM9R6ol7mJ18j60k8J21j17K0L0l4P2Mj05Q8J04j35j9l4P9o7n0J03r8
3869i1J63j29J8rL8p4J82j65K5J14q1J2L5p9p1J25M8l2k01J02J9J20Q3j83R8J9
3895H6m0j42J33j6n9J46j79R0p8J89q0r7R4j90K11r8RJ6J3j04Q6j6m2P4j9O5j67
3922a15k1J24Jl7N2r5L0Q5n1P8m7J33j40PQ6j28O9k2L2j00N8J3j3M9L7n7o5qJ23
3951G8ML9q3n7n7L6lJ01n5l6J1J09m7r0q1J27q0Q0n0l4J31l9K6nj3n1k6q6J08
3980d3R3j1r5P4q7m6O2JL5N2RJ9j6m6j7K1m2oP1p1K3k8J7M5K5r9j2O5j03P8P8
4011D6Q9m5j25kk1R1l1m5R1j32N4oK1m7O0o8J32n8j8n2O4nK0M8R8r3L4n6J2r8
$$ y = [42, 29, 8, 107, -17, -2, -26, -8, 13, 39, 31, 30, 65, -76, 16, 31, 32, -31, -36, 147, 32, 30, 108, 27, -15, 32, 19, -56, -24, 36, -33, 40, -74, -81, -32, 64, 58, 21, 17, 135, -25, -53, 68, -49, -29, 1, -33, 39, 43, -62, 26, 130, -5, -24, -58, 21, -46, -96, 7, -91, 72, -57, -39, -48, -10, -84, 98, -67, -42, 72, -9, 3, 38, -41, -112, 13, 61, 29, -172, -70, -51, 69, 152, -31, 67, 86, 46, -96, 37, 21, -38, 108, -71, 19, -59, 130, 50, -47, 47, -143, 68, -30, -21, -5, 8, -96, -10, -26, -68, 6, -13, 52, -115, -136, -12, -11, -48, 4, -91, -61, 24, -27, 51, 4, 137, -3, 4, 90, -38, 31, 9, 41, -59, -1, 12, -1, 48, 85, 28, -37, -45, 78, 82, 121, 38, -19, -76, -40, -43, 58, 3, -33, -22, 87, 40, -50, -131, -4, -84, -4, -54, -88, 43, 4, 30, 25, 12, -39, -65, -151, -43, 50, 39, -56, 18, -69, -115, -53, -52, -17, 35, 44, 63, 47, 1, -16, 5, -37, -43, 28, -43, -20, -48, -31, 14, 39, -60, -72, -7, -110, -32, 46, 135, 90, -35, -37, -58, 33, 2, -43, 48, -84, -30, -36, -15, -62, -2, -70, 62, 4, -14, -66, -2, -7, 13, 61, 159, 66, 100, 44, 56, -42]
4041d2J46l6r6o4J26L1q5J01m5j4k8M1n4OL7m6p1Q8K1m8MJ09q9oOJ00j67P9kK
4071DL7k8K2k7Q3K6j43N4J9p6Q2Jo2P8n7j08j7J19KK5k2kN1j9l6m0O7K5or7K5
4102b0P4q6O7n8N1jj1o3k8N0Q1q2q7J03M1jo6J8J14j15L1j9L0j5M7N8k11O8p0
4131a00M7J7j8m3J49j2j29N5M4k5po5oL5J02o9o3R8R2jk01J99l4k9o8l7Q4P4j49
4160f0L3n5N6r1J80r1N6j2J2q6R1J1p9P5J2m8K7n9J60j26rM9j15jj2J22n0M7K9
4189F6r0J00oj65J36k7m7OO5j11M5R2q3N4n8J31j78J01l4k6LN3m8N7l0%m2J06
4217G0l6J6j12J11l0k9Q4j36J20j42J76q4P8j04M1j78J70P5j5l4j2o1p2J61J5
4242G2K8j79J03Ql5j8K6o6Q5n5q5J35L3p3j7mn7J87p8j3k2P9p9O1J0o7J17p5Q4
$$ y = [-42, 104, 68, -28, -92, 34, 65, -20, 81, 36, 22, -6, 35, -19, -13, 24, -22, -93, -5, 16, -32, -28, 81, -8, -14, -8, 92, -75, 4, 2, 4, 41, 13, 35, 8, 91, 117, -26, 28, 47, -29, 53, 54, -8, 70, 13, -95, -112, 7, 9, 34, 12, 10, 61, 42, 6, -34, 33, 58, 52, -45, -20, 54, -32, 35, -23, 28, 27, 16, -47, -75, -25, 56, -26, -113, -10, 31, 30, -36, -18, 96, -19, 12, -7, 23, 8, 55, 113, -98, -30, -100, -53, -36, -54, -97, 52, 40, -89, -34, 10, -15, -22, -87, -93, -58, 44, -25, -88, 10, 102, 101, -100, 99, 65, 36, -32, -69, 15, 89, -60, -27, -82, -26, -117, 63, -28, 28, 16, 28, -58, 33, 44, -35, 40, 52, 4, 31, -28, 132, 6, -3, 46, -69, -70, -82, 40, -10, 37, 66, -24, 76, 70, -95, 41, 14, -33, -27, 38, -73, -28, 64, -19, 35, -23, 108, -70, 31, -3, -29, -26, 27, -21, 36, 6, 6, -36, 70, 34, 50, -62, 49, 19, -10, 74, -62, 58, -84, 92, 8, 86, -18, 23, -155, 15, 90, 75, 41, 29, -32, -104, 57, 72, 100, -79, 24, 32, -3, -21, 5, -61, 24, -31, -116, 19, 52, -21, -38, -42, -99, 88, 10, -3, -25, 54, -25, 36, 46, -21, 96, 21, 105]
4271A05j24r2J59n1j27R1O9K6l9q1K4J22n4rm1mO5L9Jo4p2J29j24l6M6M5l5L6
4299DM1o2K7j8j0O2j04M7J10o0L7p9Q9j41J31Nj21M5Pl8P9k02J56l2K0N5J3j41
4327h0J26m2j24K5M6J73j53R0j50Q5MoK8j28K01k9j84O7K6M1J2k6J2qj09M6K7
4354c0P8m1j08J48qqjO3m4m7PO0rpq7O3o9j7J04P8j06l9O8n8n9P6j5K1p8P7J6
4385B8J9L5q3K8N0j64L8PK5l4O6J4J3n4L7M3J2no7O8o3qN4m1j21J59q4L4j2Q6
4415H0J7r7J06r7l6Q7l4KO4j16P3p2O2K0j13R6l7j40J61J9lj39K8R3k7l3o7J55
4443E2j3p4P1p9N0j0K9J6N5o9L3k0n3L7l4k9M9j67K02j4M4j45J4J32j36P9O8n4
4471C4r7M3L1q2K6Q1J3rj7l9j1P3j4j7R7p7p7K5J9MO2j39N3P9j48J74j30N4NJ5
$$ y = [105, -19, -111, 48, -3, -130, -39, 30, 56, 17, -64, -40, 82, 28, 19, -22, -26, 39, 78, 79, 15, -57, 72, -52, -88, -42, 3, -32, 4, 45, -17, 10, -8, -18, 44, -60, -13, 97, 37, 74, -5, 84, -57, 74, 79, -42, 3, 10, -28, 51, -151, 5, -27, -7, 48, 61, -80, 46, 4, -120, -95, -49, 124, -29, 61, -89, -4, 0, -6, 22, -106, 95, 66, -118, -51, -25, 16, 28, 2, 14, 6, -103, -57, -30, 48, 7, -101, 47, 39, 31, 30, 93, 49, 2, 9, 69, 60, 53, -34, 29, -40, -57, 47, 125, 19, -20, 48, -10, -69, 7, -8, 13, -65, 12, 28, 47, 82, -1, 27, 77, -87, -49, -42, -17, -51, 15, 29, 42, -12, 25, 68, 80, 75, 8, 76, 13, 5, 59, 18, -103, 56, -28, 6, -6, 80, 97, 0, 106, 9, -27, 60, 26, 28, 92, -24, 49, -23, 39, 59, -54, 42, 5, -135, 26, 45, 42, -97, -69, 24, -3, -36, -103, 52, 39, -35, 36, -43, 7, -3, 26, 42, 97, 28, 61, 41, -12, 25, -9, -38, 11, -156, 46, 32, 76, -69, -55, 77, -59, 20, 88, 34, -63, -20, 11, -71, -45, 36, 49, 40, 23, -16, -27, 46, 32, 15, 112, 35, -42, -17, 2, 6, 68, -71, -18, 61, -87, 87, -43, 11, 16, 31]
4501C1J2j70J77k3L0N6o0nj80Q7J20Oj44M9O4m1r0J42r6P5j8j44J56k0j26J0J12
4528A0m4O5o7Q1p6R3j23Q9P7j23kL6Q5k7k2Mj14J29k9Jj0M8j66J19p5Q7o5r6R2
4557b3MO0J7o6j5J4j41O3J76j45%R4Ln8kQk6K3N0j03M8L2k6K4r1R9p3R5r8K9j5
4588d3M7O6m8o2J78m5n8p4O3J7m4l0J36j18N7J0j14M4p0J69J5l2o3l6m0MJ35j0
4616E4m7N2l7O2m9l3M4q0M2j52R0k9K1M9l5J48r4n2J10o6q3J44j04k0O1k3P1N
4644D9l1RLn5K9K8m8P9j55J26k8m3N3k9k1ol2J7J18r7R7j7k5j1J4p6%kP8QM3j23
4676d8J01K2J3k13J14J3qm7J9qO1M9m9K3m3P8o6j80K34q2J02r7k0Q3p2k1Q4l4
4704HM6j48N9L3j24J65q4K8n6J27j34J84j77K4J0J13o9J1o0J2L0J01n8o5M8oM9
$$ y = [31, 43, -127, 50, 27, 57, 113, 53, 48, -132, -45, 75, 81, -63, -14, 50, 9, -81, 61, -35, 40, 22, -122, 34, 14, -112, -102, 10, -34, 31, -36, 45, -31, 62, -61, 28, 105, -18, -20, 16, 101, 74, 52, 56, -58, 71, 42, 43, 33, 81, -85, 34, -41, 46, -19, -115, -23, -19, 41, 58, -8, -23, -9, -150, -87, 89, -56, -56, 38, 41, -17, -19, -11, -37, -14, 36, -67, -19, 13, -13, 11, -80, 19, -54, 41, -57, -28, -43, 4, 70, 22, -40, 138, 93, 35, -39, 24, 41, -3, -33, 103, -15, 42, 52, -62, -18, -88, 81, 96, 64, 1, -35, -75, -71, 64, 54, 7, 59, 22, 84, 35, 2, 46, -34, 8, -144, -54, -83, -62, -13, -48, 100, 6, -46, 64, -2, -85, 59, -45, -65, -4, -27, 44, 49, 18, 27, 30, -25, 4, 32, -16, 63, -92, 34, 6, -37, 16, -13, -34, -40, -72, -55, 63, -34, 63, 46, 21, 10, 24, -52, -52, -54, 24, 32, 75, -48, 53, 75, 88, -125, -11, 2, -6, -53, -34, -42, 19, 68, 19, 42, -1, 77, 11, -169, 65, -17, 85, -12, -32, 51, -21, -42, 42, 8, 54, -94, -35, -2, -126, 39, -45, -17, -73, 54, -80, 104, -73, -49, -39, 74, 5, 16, -44, -32, -2, 99, 41, -24, 24, 18, 67]
4731F7n5rl7P5L9r5J01q3p3J25j21K24j33Qo8J5MpK8k9J3J6o7J4k0k4P1J53k40
4760a08J55J01j30N7L0j07L9J0r0L4q1N6J38j29O1m2M6j12M0OL2j01J67K0j10
4785a8J4K4oL1J3n9j6K6N7lk7n0J18n1o4j1J12j02J3pn8J05j32Q3M9n3J7pJ0J29
4815A37j60K7m1N3k9P7o6l8N9L0J1j13k7J94j09P6j24l6J58o0n8J08k22J72O4
4840H3j57pJ08j8R1j13j0q0nP4kj5N7j11M9j1J12r6O2K4j25R5J2M8K6M3j65J08
4868G7q5M7M7j05lP3J8j39N3Q7L6j94J5J07m5L4N0j52M8J76j44p8OJ33r9O6m4
4895a5N1j08J51j69j9J21q9M6R8p7J7k7P7n0j3J5kJ9j3Ol6N5k12J67k5l9J8M7
4923fo4J23r9j05J49p0Q6pl9O3kJ4n1M7K7n4qn4j2RK1Q8p6L8L7j83K50o5m7O0
$$ y = [67, 12, 3, -34, 41, 80, -15, 86, 3, -70, 55, -66, 158, 25, 33, -35, -20, -16, -23, 5, -24, -11, 5, -62, -48, -68, -92, -21, 132, -108, 47, 148, 18, 75, 105, -2, 37, 47, -43, -9, -90, -34, 104, -25, 36, -6, 40, -72, -32, -26, 6, -95, 72, 92, -18, -4, 20, 14, 45, 58, -1, -17, 9, 66, 63, 36, -14, 104, 53, -11, -22, 90, -12, 1, -6, -64, 41, -91, -8, 41, -12, 5, -2, 8, 137, -23, 4, -37, 16, -13, 64, -2, -40, 19, 49, 60, -53, -80, 114, 5, 81, -43, -79, 79, 19, -39, 69, -153, 19, 83, -74, -81, 27, 9, 100, -13, -23, -103, -108, -34, -36, -51, 6, -105, -56, -67, 45, -51, 11, 35, -90, 5, 17, 65, 91, 134, -31, 77, -8, 39, 86, -19, -22, 51, 69, -70, -17, 70, 106, -88, -73, 34, -11, 23, 73, -79, -31, 145, 1, -77, -71, 62, -37, 29, -15, 36, -72, 79, -90, -109, 12, -77, -31, 67, -10, 7, -20, 57, 7, -6, 9, 7, 26, 13, 19, -17, 38, -174, -7, -32, -71, -53, -6, -70, 53, -46, -151, -2, -72, 14, 7, -32, 31, 29, 43, -8, 39, 66, 12, 4, -50, -62, -53, -32, 56, -20, 18, 55, -128, 122, 57, 10, 70]
4953G0o1P4j04o9J85j84O8J02j70J22j2n8lO2l7M5k3l5K9R1l9L4j17Q8j68K13
4979A03o2p9J06q9Q1p8K6L4l0k7Q2K2j29QO1K3q8J55j25j9R9j10o6N1J67j99J78
5006I5p6j9J00j73M3L2M4p1RJ5N1J9P2j82L4J0k3rJ15j57J25J6p9P2j72J82l5
5033C8r0J05l5J5r3J1O9K5l3k7Q5K7K3p2l2n6M7o4L4j04J84%n5n0mJ31j17L5L
5062@J02p1q5M7K8o1l2O6K3o6J03p8N8J1n2J2R1p8o9N3n4LlO3rL4Q7j41m8L5J44
5093A13j29L8k2Q3n4m9Rp9O9j1M4M5o5J20j93j6N1R5j1j6Oq7P2k9N6Kn5n6N0N7
5123C8l4j43J77o6j8J16m5j00J67n9j57L0k9J63j31P5L0J0n5p1L8K29j47j09Q8
5148ck4J13p8l5n0N8JQ7o6PJ14r6RK0m3K1o3ol2J3J60p2j8mJ9pk2P2n1K0m2m7
$$ y = [70, 9, 83, -21, -90, 95, -89, -21, 81, -89, 33, 21, -37, -40, 22, -15, 30, 7, -28, 1, 92, 53, 87, -30, 58, -110, 103, 41, -38, 68, -21, 60, -18, 8, 42, 12, -15, 67, 89, -40, -32, 29, 52, -36, 119, -6, -25, 74, -36, -102, -51, 116, -83, 95, 19, 0, 100, -73, -30, 2, 46, -25, -16, -1, 50, 69, 141, -41, -7, 3, -20, -29, 86, -71, 54, 70, -9, 63, -109, 73, 38, -52, 53, 18, 33, -60, -49, 20, 45, 12, -15, 70, 97, 120, 48, 16, -40, 7, -57, -23, -127, 57, 57, 2, -48, -52, 79, -38, -3, 0, 102, 31, -54, -7, 21, -40, -72, -6, 17, -49, 54, -24, 34, 45, -7, 5, 96, 18, -51, 2, -52, -49, -52, 11, 2, 36, 123, -18, -66, -31, 113, -16, 22, 0, 83, 29, -20, -11, -90, -21, -32, 12, 57, -8, 112, -81, -97, -46, 49, 38, 22, 28, -59, 13, -16, 40, 42, -13, -69, -19, 38, 4, -139, 38, -28, -46, 70, 25, -75, 92, 33, -124, -94, -123, 40, -91, -16, 14, 24, -31, -102, -64, 165, 18, -91, -3, -27, 86, 8, -27, -77, -19, -18, 69, 3, 10, 124, 28, 37, 57, 14, 35, -28, -34, -66, -53, 107, 35, 17, 13, 32, 25, 3, 75, 24, 44, 2, -45]
5180d5lLK9K6O1o2K9q0JR1n3K9q0J27j47K8O5P2j16L9mq4J45Mj03J6J3j7k3Q1
5210D2j15R3K0K7j51J6J8J28o0p0R2J7p7N3q6J4J8k3j7l2Q5j9j2J4m9O3L1J3m9
5239a6j8m4K1L8k5K8J1N1k0J4n4j34J85k5j06R1R7lq9j8J31j74L3O9J3o3K7ln0
5268c3M1oN2m6l0M8n1oQ4l9j6o0P1p9K5NJ25j03m7J15k4p4J0n3J75j12R4p8Q1
5297F9n8p9N8p9K8O3k4k2J1L3k3O2q7J4R5j6p1M4J6j60N7p1N2R3k4L7j70J09J28
5326H5j01p5j1J43m1m7P4Q2k32P1m2K09j03k7O5j91J60k6j7L3Q5j48N2L1K3j4
5352C8K8j39J22r2P4N6o0qJ4o8J2L4o3O6m1QK1p5Q5J3p7m8J46J3r0oJ09j00R1
5381F3j20P0m7J4j1P8m5o7J50m5q1M9j24R1M1j2P4j29R4P4j49L6j2m7K0J42j01
$$ y = [-45, -48, -45, -16, 10, 71, 9, 38, -42, -41, 50, -3, 26, -54, 73, -74, -46, 19, 91, -25, 14, 10, -74, 71, 75, -28, -12, 1, -16, -39, 42, -73, 20, 40, 67, -84, -68, -50, 78, 18, -52, 40, 57, -20, 33, -53, -39, -21, -44, -61, -93, -8, -27, -39, -25, -74, -11, 20, 33, -16, -34, -78, -57, -19, -44, -16, -5, 46, 26, 40, -14, -148, 37, 12, -94, -3, 94, 91, 2, -16, 115, -59, -26, 43, 56, -7, 20, 17, -33, 8, 2, 54, 8, -22, 26, -25, -31, 53, 14, -2, -62, 9, -70, -45, -40, 85, -18, -65, 50, 26, -48, -38, -91, 84, -28, 66, -12, 69, 11, -68, -10, -89, -61, 2, -22, -44, -33, 0, -23, 39, -48, -34, 61, 45, -26, 18, 34, -126, -69, -140, -88, 5, -19, 18, -152, -43, 85, -16, -91, -102, 41, 0, -47, 27, 109, -123, -52, -94, 115, 12, -15, 50, -141, 19, -7, -24, 9, 94, -54, -2, 29, 52, 38, 66, -73, 49, -43, 31, 87, 27, 19, 33, -35, -23, 11, -52, 14, -27, -19, 2, -73, 12, 25, -52, -100, 46, 59, -31, -37, 72, -28, 63, -57, 13, -34, -20, -31, 47, 2, -65, 85, 40, -41, 8, -116, -25, 16, 4, 78, -51, 43, 117, -32, 4, -8, -55, -35, 107, 6]
5408FK2mj18L7PP9L9%j16k3J04l3K2m2lK9j3J0J1n0J23o7Q5p7j21J20O9j05P7
5437F8j25J38o1n8J09j66J05p2M9N7j2L0l3j7o2M1M8l4o3M5J10j49N6n8L0NrJ9
5465in9J13j27m3J11j07K24m7j26J23K2o2j8j00J63N2J1k0k9pj07L4p4K12j62
5490c2PJ03m5j3n0J05j39M6ljo3N4L1r8P2M8m6M3k5j4m9R6o4Q1q4J09j10K6N1
5519C6O3r4O0J7q7p1J34j32M1l2N6P6p2nJ5m5N5N3K8r9mj7M0j01P6j4O5q3P0k9
5549@p6J76n5j13J18p8M2l3p2N7Kl4J14n4j31L5J49m5J4j0O5j44lJ73k24K10o8
5576A5M0n9p9J20L8m4K6r4j6N1K9L2q3m6O0j9j08J96o7n1N4q6J07M0j01J0L0p6
5604h1J42j83K35j13p6j6J20n4M1N8m2o1m2M4o2J21J9p1m3P9k8k3N8L2o8nl9l3
$$ y = [6, 28, 24, -94, -57, -50, 29, 68, 68, -48, -71, 33, 0, 22, -20, -23, 6, -7, 3, 14, -36, 87, 20, 105, 28, -93, 27, 96, -9, 68, -57, 81, 20, -38, 71, -95, 10, -62, -13, 44, 32, 62, 29, 12, -50, -9, 39, 5, -58, -13, 97, -52, 4, -54, -24, -19, -28, -9, -68, 45, -82, -125, -14, -121, 103, 56, -70, 53, 75, 13, -5, -105, 58, 110, 121, 101, 72, 65, -42, -8, -82, 130, -32, -25, 78, 33, 20, -30, 75, -64, -18, -21, -22, -85, -31, 0, -98, -26, 22, -24, 19, -6, -20, -69, 27, -37, 44, -40, 69, -41, -15, 36, 99, 5, 65, 82, -5, -76, 58, -74, -33, -65, -9, 67, -5, -10, 5, -40, 15, 68, 96, -3, -7, -24, 16, -85, -9, -23, 42, -41, 29, 0, -76, 100, 45, -68, 50, -28, 14, -19, -91, -34, -32, -66, 48, -6, -137, -102, 47, 2, 16, 6, 71, -73, -76, 97, -127, 83, 15, 55, -4, -83, 37, 75, 31, 57, -37, -53, -2, 27, 59, -24, -70, -10, -29, -137, 59, -8, -59, -5, -91, 16, 56, -45, -35, -5, -81, 61, -122, 113, 0, -76, -92, 28, -26, 15, 73, 31, -30, -72, -28, -90, 31, 50, -21, -64, 15, -13, -36, 22, 54, -14, -19, -58, -91]
5632i1R3P3j39Q0j80J10J75o8m5L9n2n3J10r5%J32j47L2l6R4p1J3j07J71j08p6
5658a46K47j62O9r9L5L4K2l8L2k3m0o8K05n6l3KN7p2P0n9NN7m2%L2j53Q3N0Rk8
$$ y = [-91, 2, 75, -64, 16, -164, -54, 121, 53, 8, 47, -5, -58, 52, -43, -43, 89, -58, -26, -62, 32, -39, -26, -133, 38, -70, -146, 101, -61, 8, -91, -56, -22, 0, -38, -6, -29, -69, -137, 68, 12, -21, -19, 38, -34, 36, -23, -18, 39, -3, -3, 29, -124, -41, 9, 18, -10]
$$ [...]
8191I0
##END NTUPLES=NMR FID
##END=
