##TITLE=1H_64-2023
 CDCl3
 8 sc, 
 4.9.2023
##JCAMPDX= 6.0         $$ Bruker NMR JCAMP-DX V2.0
##DATA TYPE= NMR FID
##DATA CLASS= NTUPLES
##ORIGIN= UXNMR, Bruker Analytische Messtechnik GmbH
##OWNER= root
$$ XWIN-NMR		Version 3.5
$$ Mon Sep  4 13:53:23 2023 Russian Standard Time (UT+4h)  she@DPX200
##.OBSERVE FREQUENCY= 200.13135
##.OBSERVE NUCLEUS= ^1H
##.DELAY= (6, 6)
##.ACQUISITION MODE= SIMULTANEOUS
##.ACQUISITION SCHEME= undefined
##.AVERAGES= 8
##.DIGITISER RES= 18
##SPECTROMETER/DATA SYSTEM= spect
##.PULSE SEQUENCE= zg30
##.SOLVENT NAME= CDCl3
##.SHIFT REFERENCE= (INTERNAL, CDCl3, 0, 15.7039)
##AUDIT TRAIL= $$ (NUMBER, WHEN, WHO, WHERE, WHAT)
$$ ##TITLE= Audit trail, XWIN-NMR		Version 3.5
$$ ##JCAMPDX= 5.01
$$ ##ORIGIN= Bruker BioSpin GmbH
$$ ##OWNER= she
$$ F:/spectra/data/she/nmr/H-F/1/audita.txt
$$ ##AUDIT TRAIL=  $$ (NUMBER, WHEN, WHO, WHERE, WHAT)
(   1,<2023-09-04 13:52:09.29 +0400>,<she>,<DPX200>,
      <created by zg, POWCHK disabled, PULCHK disabled
       configuration hash MD5:
       00 E9 B6 7A A2 85 ED C7 34 08 36 98 17 FE 4E 26
       data hash MD5: 16K
       18 0C A6 21 00 C9 FC AA AE F9 19 0F DD FD FF 57>)
$$ ##END=
$$ 
$$ hash MD5
$$ 04 BE 86 CE 9E 0F 1D 7C 05 05 E3 52 AA 51 FD C0
##$RELAX= 
##$RELAX= 
##$RELAX= 
##$RELAX= 
##$RELAX= 
##$RELAX= 
$$ Bruker specific parameters
$$ --------------------------
##$DU= <F:/spectra>
##$EXPNO= 1
##$NAME= <H-F>
##$PROCNO= 1
##$TYPE= <nmr>
##$USER= <she>
##$AMP= (0..31)
100 100 100 100 100 100 100 100 100 100 100 100 100 100 100 100 100 100 
100 100 100 100 100 100 100 100 100 100 100 100 100 100 
##$AQSEQ= 0
##$AQ_mod= 1
##$AUNM= <au_zg>
##$AUTOPOS= <>
##$BF1= 200.13
##$BF2= 200.13
##$BF3= 200.13
##$BF4= 200.13
##$BF5= 200.13
##$BF6= 200.13
##$BF7= 200.13
##$BF8= 200.13
##$BYTORDA= 1
##$CFDGTYP= 0
##$CFRGTYP= 5
##$CHEMSTR= <none>
##$CNST= (0..31)
1 1 145 1 1 1 1 1 1 1 1 1 1 1 1 1 1 1 1 1 1 1 1 1 1 1 1 1 1 1 1 1 
##$CPDPRG= <>
##$CPDPRG1= <>
##$CPDPRG2= <>
##$CPDPRG3= <>
##$CPDPRG4= <mlev>
##$CPDPRG5= <mlev>
##$CPDPRG6= <mlev>
##$CPDPRG7= <mlev>
##$CPDPRG8= <mlev>
##$CPDPRGB= <>
##$CPDPRGT= <>
##$D= (0..31)
0 1.2 0 0 0 0 0 0 0 0.06 0 0.03 0 0 0 0 0.0002 0 0 0 0 0 0 0 0 0 0 0 0 
0 0 0 
##$DATE= 1693821128
##$DBL= (0..7)
120 120 120 120 120 120 120 120 
##$DBP= (0..7)
150 150 150 150 150 150 150 150 
##$DBP07= 0
##$DBPNAM0= <>
##$DBPNAM1= <>
##$DBPNAM2= <>
##$DBPNAM3= <>
##$DBPNAM4= <>
##$DBPNAM5= <>
##$DBPNAM6= <>
##$DBPNAM7= <>
##$DBPOAL= (0..7)
0.5 0.5 0.5 0.5 0.5 0.5 0.5 0.5 
##$DBPOFFS= (0..7)
0 0 0 0 0 0 0 0 
##$DE= 6
##$DECBNUC= <off>
##$DECIM= 32
##$DECNUC= <off>
##$DECSTAT= 4
##$DIGMOD= 1
##$DIGTYP= 9
##$DL= (0..7)
0 120 120 120 120 120 120 120 
##$DP= (0..7)
150 150 150 150 150 150 150 150 
##$DP07= 0
##$DPNAME0= <>
##$DPNAME1= <>
##$DPNAME2= <>
##$DPNAME3= <>
##$DPNAME4= <>
##$DPNAME5= <>
##$DPNAME6= <>
##$DPNAME7= <>
##$DPOAL= (0..7)
0.5 0.5 0.5 0.5 0.5 0.5 0.5 0.5 
##$DPOFFS= (0..7)
0 0 0 0 0 0 0 0 
##$DQDMODE= 0
##$DR= 18
##$DS= 0
##$DSLIST= <SSSSSSSSSSSSSSS>
$$ [...]
##$SUBNAM2= <"">
##$SUBNAM3= <"">
##$SUBNAM4= <"">
##$SUBNAM5= <"">
##$SUBNAM6= <"">
##$SUBNAM7= <"">
##$SUBNAM8= <"">
##$SUBNAM9= <"">
##$SW= 18.05172834244
##$SWIBOX= (0..15)
0 0 2 0 0 0 0 0 0 0 0 0 0 0 0 0 
##$SW_h= 3612.71676300578
##$TD= 16384
##$TD0= 1
##$TE= 0
##$TE2= 300
##$TE3= 300
##$TEG= 300
##$TL= (0..7)
0 120 120 120 120 120 120 120 
##$TP= (0..7)
150 150 150 150 150 150 150 150 
##$TP07= 0
##$TPNAME0= <>
##$TPNAME1= <>
##$TPNAME2= <>
##$TPNAME3= <>
##$TPNAME4= <>
##$TPNAME5= <>
##$TPNAME6= <>
##$TPNAME7= <>
##$TPOAL= (0..7)
0.5 0.5 0.5 0.5 0.5 0.5 0.5 0.5 
##$TPOFFS= (0..7)
0 0 0 0 0 0 0 0 
##$TUNHIN= 0
##$TUNHOUT= 0
##$TUNXOUT= 0
##$USERA1= <user>
##$USERA2= <user>
##$USERA3= <user>
##$USERA4= <user>
##$USERA5= <user>
##$V9= 5
##$VALIST= <valist>
##$VCLIST= <CCCCCCCCCCCCCCC>
##$VD= 0
##$VDLIST= <DDDDDDDDDDDDDDD>
##$VPLIST= <PPPPPPPPPPPPPPP>
##$VTLIST= <TTTTTTTTTTTTTTT>
##$WBST= 1024
##$WBSW= 4
##$XGAIN= (0..3)
0 0 0 0 
##$XL= 0
##$YL= 0
##$YMAX_a= 247225
##$YMIN_a= -269862
##$ZGOPTNS= <>
##$ZL1= 120
##$ZL2= 120
##$ZL3= 120
##$ZL4= 120
##$ABSF1= 10
##$ABSF2= 0
##$ABSG= 5
##$ABSL= 3
##$ALPHA= 0
##$AQORDER= 0
##$ASSFAC= 0
##$ASSFACI= 0
##$ASSFACX= 0
##$ASSWID= 0
##$AUNMP= <proc_1d>
##$AZFE= 0.1
##$AZFW= 0.1
##$BCFW= 1
##$BC_mod= 2
##$BYTORDP= 1
##$COROFFS= 0
##$CY= 11.3945322036743
##$DATMOD= 1
##$DC= 2
##$DFILT= <>
##$DTYPP= 0
##$F1P= 15.7292609196834
##$F2P= 12.9074282941183
##$FCOR= 0.5
##$FTSIZE= 0
##$FT_mod= 4
##$GAMMA= 1
##$GB= 0.15
##$INTBC= 1
##$INTSCL= 1
##$ISEN= 128
##$LB= 0.24
##$LEV0= 0
##$LPBIN= 0
##$MAXI= 10000
##$MC2= 0
##$MEAN= 0
##$ME_mod= 0
##$MI= 1.114404
##$NCOEF= 0
##$NC_proc= 0
##$NLEV= 6
##$NOISF1= 3.799351
##$NOISF2= 2.8
##$NSP= 1
##$NTH_PI= 0
##$NZP= 0
##$OFFSET= 15.70392
##$PC= 1
##$PHC0= -21045.12
##$PHC1= 11.05272
##$PH_mod= 1
##$PKNL= yes
##$PPARMOD= 0
##$PSCAL= 0
##$PSIGN= 0
##$REVERSE= no
##$SF= 200.130013532006
##$SI= 16384
##$SIGF1= 3
##$SIGF2= 2
##$SINO= 400
##$SIOLD= 16384
##$SREGLST= <1H.CDCl3>
##$SSB= 0
##$STSI= 0
##$STSR= 0
##$SW_p= 3612.71676300578
##$SYMM= 0
##$S_DEV= 0
##$TDeff= 0
##$TDoff= 0
##$TI= <>
##$TILT= no
##$TM1= 0
##$TM2= 0
##$TOPLEV= 0
##$USERP1= <user>
##$USERP2= <user>
##$USERP3= <user>
##$USERP4= <user>
##$USERP5= <user>
##$WDW= 1
##$XDIM= 8192
##$YMAX_p= 0
##$YMIN_p= 0
$$ End of Bruker specific parameters
$$ ---------------------------------
##NTUPLES= NMR FID
##VAR_NAME=  TIME,          FID/REAL,        FID/IMAG
##SYMBOL=    X,             R,               I
##VAR_TYPE=  INDEPENDENT,   DEPENDENT,       DEPENDENT
##VAR_FORM=  AFFN,          ASDF,            ASDF
##VAR_DIM=   8192,          8192,            8192
##UNITS=     SECONDS,       ARBITRARY UNITS, ARBITRARY UNITS
##FACTOR=    0.0002768,     1,               1
##FIRST=     0,             0,               0
##LAST=      2.2672688,     0,               0
##MIN=       0,             -269862,         0
##MAX=       2.2672688,     247225,          0
$$ Real data points
##PAGE= N=1
##DATA TABLE= (X++(R..R)), XYDATA
$$ plain form
0 0 0 0 0 0 0 0 0 0 0 0 0 -8 8 -8 8 -16 16 -24 24 -32 35 -43 51 -63 72 -83 96 -112 128 -147 169 -192 219
33 219 -248 281 -315 355 -395 443 -492 548 -608 678 -750 827 -915 1009 -1113 1226 -1350
50 -1350 1487 -1638 1806 -1993 2204 -2440 2709 -3019 3381 -3807 4321 -4954 5753 -6804 8246
65 8246 -10361 13769 -20177 36454 -167185 -269862 72737 169329 177363 -66538 -154286 -49316
77 -49316 23516 157276 197793 3937 -103725 -158374 10999 233430 100060 -105008 -162274
88 -162274 -89049 143353 142579 -608 -54422 -132272 -55701 95420 100825 70160 -123302 -245659
100 -245659 -55529 103377 146083 31798 -181599 -127097 17062 107772 184859 55333 -68431
111 -68431 -64640 -36706 129230 159125 -13089 -90575 -120306 -22065 107798 27413 -36140 -80514
$$ packed form
0@%%%%%%%%%%%qJ6j6J6k4L2m0M8n6O7p8R4j14J35j55J79k08K40k75L16l61M11
33B19m67N29n96O70p50Q38r35J040j156J286j428J577j742J924k122K339k576
50a350K837l125L444l799M197m644N149n728O400p188Q128r275J0707j2557J5050
65H246j8607K4130l3946N6631k03639j02677L42599R6592Q034k43901q7748J04970
77d9316P2832J33760M0517j93856j07662n4649J69373K22431j33370k05068n7266
88a62274P3225K32402p74j43187n3814p7850P6571J51121N405l0665j93462j22357
100b45659J90130J58906M2706j14285k13397N4502J44159R0710P7087j29526j23764
111f8431L791K7934J65936K9895j72214p7486k9731R8241J29863q0385o3553m4374
$$ plain form
123 -80514 -102169 40577 86374 42573 -10844 -129250 -54513 83637 69989 39764 -74757
134 -74757 -119240 -6444 29181 83885 82228 -52591 -66427 -27436 57470 157421 38503 -65228
146 -65228 -45876 -26817 53228 30043 -41758 -13614 -61402 -60312 17175 13685 25275 -34603
158 -34603 -80892 45784 78163 23376 -20028 -66852 23044 64426 -4946 11974 -11220 -35233
170 -35233 -8859 -21691 58958 78444 -41565 -51032 -15050 40927 74578 -31637 -41254 11195
182 11195 -22242 -11234 -24582 -16282 34524 -36508 -41390 28170 15359 18241 -18453 -15875 76025
195 76025 31822 -23859 -9933 -15947 35559 15520 -35847 15072 -7969 -33602 -5165 -11006
207 -11006 38198 20635 -48207 -932 10837 5990 15788 -31628 4364 23149 -29357 -2772
$$ packed form
123h0514k1655J42746M5797m3801n3417j18406P4737J38150j3648l0225j14521
134g4757m4483J12796L5625N4704j657j34819j3836L8991Q4906R9951j18918j03731
146f5228J9352J9059Q0045k3185p1801K8144m7788J090P7487l490J1590n9878
158c4603m6289J26676L2379n4787m3404m6824Q9896M1382o9372J6920k3194k4013
170c5233K6374j2832Q0649J9486j20009r467L5982N5977L3651j06215r617N2449
182A1195l3437J1008j3348Q300N0806p1032m882O9560j2811K882l6694K578R1900
195G6025m4203n5681J3926o014N1506k0039n1367N0919k3041k5633K8437n841
207a1006M9204j7563o8842M7275J1769m847R798m7416L5992J8785n2506K6585
$$ plain form
219 -2772 -6702 -9250 23934 -11595 13082 29245 -24724 2385 10678 11786 39996 -17163 -19711
232 -19711 5908 -27243 6592 7355 -15531 4975 -34992 -15679 31668 -8643 1658 2327 -5876
245 -5876 33493 -10098 -17553 25967 -3420 5722 3066 -12903 26310 -16880 -32032 27464 16748
258 16748 14315 -14494 -42780 27539 20170 -17141 2802 -13332 6832 -1827 -40886 19751 22954
271 22954 -19579 -10055 -15587 29030 32334 -40665 -8596 26875 20084 17533 -33178 -7306 32750
284 32750 -15491 -3080 12566 1389 5753 -45284 -18172 51259 10069 -18221 -31527 -17518
296 -17518 43906 4279 -23586 11960 -6856 1661 -246 -8863 37876 -2376 -40288 4504 15225
309 15225 31952 325 -51729 4769 22495 6226 16061 -20053 -8347 2938 -21454 27326
$$ packed form
219b772l930k548L3184l5529K4677J6163n3969K7109Q293J108K8210n7159k548
232a9711K5619l3151L3835P63k2886K0506l9967J9313M7347m0311J0301O69q203
245e876L9369m3591p455M3520k9387R142k656j5969L9213m3190j5152N9496j0716
258A6748k433k8809k8286P0319p369l7311J9943j6134K0164q659l9059O0637L203
271B2954m2533R524n532M4617L304p2999L2069L5471o791k551n0711K5872M0056
284C2750m8241J2411J5646j1177M364n1037K7112O9431m1190k8290j3306J4009
296a7518O1424l9627k7865L5546j8816Q517j907q617M6739m0252l7912M4792J0721
309A5225J6727l1627n2054N6498J7726j6269R835l6114J1706J1285k4392M8780
$$ plain form
321 27326 25508 -18065 -18153 -33169 13099 45250 -11394 -13000 -15688 -15439 30008 10741 5608 8259
335 8259 -35845 -2089 25794 11287 14473 -33417 -29704 19801 2892 13441 2619 -32468 -3790
348 -3790 -3261 16612 44800 -14700 -27981 -6534 6487 45687 4108 -31940 -2869 -15694 3698
361 3698 20835 -3618 7773 -26195 -35209 32408 30243 8418 -20008 -45716 19974 31392 -8076
374 -8076 -1370 -21336 -10145 6107 -12934 28796 22904 -30255 -15045 2635 42186 45018 -33197
387 -33197 -25230 11340 11218 20907 -17023 -19202 5499 -31407 -11422 21236 6300 -298 -40831
400 -40831 -21610 49064 22799 -8260 -19046 -19469 28804 11532 -12435 14802 -8856 -12515 624
413 624 1365 40850 9807 -35273 1291 15720 28514 13836 -36416 -7364 4537 -13293 6006
$$ packed form
321B7326j818m3573q8j5016M6268L2151n6644j606k688K49M5447j9267n133K651
335H259m4104L3756K7883j4507L186m7890L713M9505j6909J0549j0822l5087K8678
348c790N29J9873K8188n9500j3281K1447J3021L9200m1579l6048K9071j2825J9392
361C698J7137k4453J1391l3968r014O7617k165k1825k8426k5708O5690J1418l9468
374h076O706j9966J1191J6252j9041M1730n892n3159J5210J7680L9551K832p8215
387c3197P967L6570j22R689l7930k179K4701l6906J9985L2658j4936o598m0533
400d0831J9221P0674k6265l1059j0786m23M8273j7272k3967K7237k3658l659J3139
413F24P41L9485l1043m5080L6564J4429J2794j4678n0252K9052J1901j7830J9299
$$ plain form
426 6006 -14577 -16755 -8523 -32515 9816 25902 -7606 -3794 -15534 9248 41701 2831 2004
439 2004 2878 -13602 16832 7048 1720 12435 -26639 -8847 18583 3823 13839 -12067 -17489
452 -17489 17481 -3092 844 5385 -25122 -9498 -13222 -9738 20612 -17476 -27249 -266 3657
465 3657 30220 9387 -14452 20260 9926 8908 22253 1628 12812 -7418 -28868 17244
477 17244 13278 -9084 -17211 -31719 14556 22812 -18507 -5354 -6129 -546 11211 -16839 6262
490 6262 12005 -29619 -14012 762 16761 21494 -32509 -16451 28096 20157 21458 -3829 -5297
503 -5297 27083 -2421 -1842 19288 -3946 -8230 -29733 -21269 29551 148 -29531 -20416 -12499
516 -12499 26603 12781 -19304 7208 -1070 -3603 12007 345 17172 -2833 -35584 4618
$$ packed form
426F006k0583k178Q232k3992M2331J6086l3508L812j1740K4782L2453l8870q27
439B004Q74j6480L0434r784n328J0715l9074J7792K7430j4760J0016k5906n422
452a7489L4970k0573L936M541l0507J5624l724L484L0350l8088r773K6983L923
465C657K6563k0833k3839L4712j0334j018J3345k0625J1184k0230k1450M6112
477A7244l966k2362q127j4508M6275Q256m1319J3153p75N583J1757k8050K3101
490F262N743m1624J5607J4774J5999M733n4003J6058M4547p939J301k5287j468
503e297L2380k9504N79K1130k3234m284k1503Q464N0820k9403k9679R115P917
516a2499L9102j3822l2085K6512q278k533J5610j1662J6827k0005l2751M0202
$$ plain form
528 4618 19923 16070 5333 -30235 1164 26999 6983 16297 -3013 -12852 3637 -12197 10013
541 10013 14922 -27394 -22654 -18467 -1059 26139 -10622 -16926 -1439 -7441 23657 20160 1388
554 1388 7567 -18929 -1421 29055 5333 462 -18528 -23154 17442 7197 1820 7100 -20820
567 -20820 -4736 7655 8445 27246 -13247 -32446 -1732 4049 19886 -833 -33774 -4847 -2238
580 -2238 376 21417 2576 3116 -5819 -17894 30027 31620 -1858 -13324 -26917 10350 26456
593 26456 -13116 -9872 -12042 -13591 7397 -4617 11366 15724 -26924 -13108 11632 22936 24762
606 24762 -27660 -28527 12812 9259 12975 -3208 -17461 5503 -10736 -2073 30684 9798 -3595
619 -3595 -19937 -15937 34523 18092 -16207 -14718 -19496 8059 9721 -14700 4684 -6641 -17899
$$ packed form
528D618J5305l853j0737l5568L1399K5835k0016R314j9310r839J6489j5834K2210
541A0013M909m2316M740M187J7408K7198l6761o304J5487o002L1098l497j8772
554A388O179k6496J7508L0476k3722m871j8990m626M0596j0245n377N280k7920
567b0820J6084J2391P90J8801m0493j9199L0714N781J5837k0719l2941K8927K609
580b238K614K1041j8841N40q935j2075M7921J593l3478j1466j3593L7267J6106
593B6456l9572L244k170j549K0988j2014J5983M358m2648J3816K4740J1304J826
606B4762n2422q67M1339l553L716j6183j4253K2964j6239Q663L2757k0886j3393
619c595j6342M000N0460j6431l4299J489m778K7555J662k4421J9384j1325j1258
$$ plain form
632 -17899 6160 6507 22182 8460 -30163 -610 19230 16844 14172 -22102 -13454 7428 -4671
645 -4671 14423 7656 -13306 -6149 -18190 6555 29766 -2817 -8758 -13791 -11233 19086 2340
658 2340 -5264 1059 -21081 -2427 10026 1874 12614 -12515 -12273 18146 7668 11762 3170 -15312
672 -15312 7052 1045 1314 18701 -9745 -15262 -9680 -8156 23213 5692 -19173 -4305 -9463
685 -9463 5144 11316 -6381 11172 -2499 -21163 3758 5984 13423 5377 -25041 1919 14217
698 14217 -311 6403 -6942 4302 13553 -13848 2739 13311 -3307 -2094 -16800 312 23499
711 23499 -10082 -14936 -5993 -4158 14459 -5212 -7016 14868 -8738 -10961 148 5290 26033
724 26033 -3585 -24273 3020 3382 10379 6847 -10667 9428 -2509 -16507 9712 8599 9091
$$ packed form
632a7899K4059L47J5675j3722l8623K9553J9840k386k672l6274Q648K0882j2099
645d671J9094o767k0962P157j2041K4745K3211l2583n941n033K558L0319j6746
658B340p604O323k2140J8654J2453q152J0740k5129K42L0419j0478M094q592j8482
672a5312K2364o007K69J7387k8446n517N582J524L1369j7521k4865J4868n158
685i463J4607O172j7697J7553j3671j8664K4921K226P439q046l0418K6960J2298
698A4217j4528O714j3345J1244R251k7401J6587J0572j6618J213j4706J7112K3187
711B3499l3581m854Q943J835J8617j9671j804K1884k3606k223J1109N142K0743
724B6033k9618k0688K7293L62O997l532j7514K0095j1937j3998K6219j113M92
$$ plain form
737 9091 -2270 -25301 6135 14741 -3000 686 -13282 -1768 10355 -10062 5999 5221 -14138
750 -14138 -2084 -4914 10775 20913 -15722 -13798 -1692 1972 23359 3297 -9307 -1488 -16992
763 -16992 4125 20855 5258 4247 -19909 -17889 16058 8803 8862 477 -21232 -1357 2418 5509
777 5509 19464 -11047 -17229 -1913 655 20690 1158 -22188 -3622 -4434 8244 17319 -6515
790 -6515 -3438 -12523 -13077 25704 20415 1021 -13193 -28349 9920 26242 4485 2829 -16660
803 -16660 -14796 5596 507 19418 11929 -24358 -15133 -2634 17825 24439 -19625 -20894 -110
816 -110 1942 15726 -2515 -12908 401 -14584 2325 24113 7152 -1894 -23016 -12520 33353
829 33353 21579 -708 -13351 -22820 8582 13477 2095 11681 -12867 -21337 -4739 2567 26704
$$ packed form
737I091j1361k3031L1436Q606j7741L686j3968J1514J2123k0417J6061p78j9359
750a4138J2054k830J5689J0138l6635J924J2106L664K1387k0062j2604P819j5504
763a6992K1117J6730j5597j011k4156K020L3947p255N9q385k1709J9875L775L091
777E509J3955l0511o182J5316K568K0035j9532k3346J8566q12J2678R075k3834
790f515L077r085n54L8781n289j9394j4214j5156L8269J6322k1757j656j9489
803a6660J864K0392n089J8911p489l6287R225J2499K0459O614m4064j269K0784
816a10K052J3784j8241j0393J3309j4985J6909K1788j6961r046k1122J0496M5873
829C3353j1774k2287j2643r469L1402M895j1382R586k4548q470J6598P306K4137
$$ plain form
842 26704 7587 -28784 -11672 792 15011 15670 -17567 -9694 -907 -6102 14679 5314 -5041
855 -5041 -3673 -17408 11507 28177 3351 -3728 -17425 -4695 25842 8780 1246 -6298 -23816
868 -23816 -1233 6012 6986 11956 -20600 -19948 2770 4973 18576 432 -18070 -117 -3138 7466
882 7466 16107 -8628 -6809 -7399 -3210 23236 4416 -10674 -3991 -7237 16818 16312 -4518 1686
896 1686 -12009 -9093 13282 5603 6513 -10748 -30293 1180 11424 6444 2522 -20444 -4607
909 -4607 9708 -671 13201 4251 -7913 -486 -8286 12005 19253 -12823 -11777 -5595 6654
922 6654 22094 -7247 -11605 2787 -3981 10034 7063 -1682 5302 -18011 -12712 14382 7255 3429
936 3429 -16646 -22919 11656 9859 1050 3338 -10273 3070 4510 -3035 17408 3997 -11315
$$ packed form
842B6704j9117l6371J7112J2464J4219O59l3237P873Q787n195K0781r365j0355
855e041J368j3735K8915J6670k4826p079j3697J2730L0537j7062p534p544j7518
868b3816K2583P245R74M970l2556O52K2718K203J3603j8144j8502J7953l021J0604
882G466Q641k4735J819n90M189K6446j8820j5090O683l246K4055n06k0830O204
896A686j3695K916K2375p679R10j7261j9545L1473J0244m980l922k2966J5837
909d607J4315j0379J3872q950j2164P427p800K0291P248l2076J046O182J2249
922F654J5440k9341m358J4392o768J4015k971q745O984k3313N299K7094p127l826
936C429k0075o273L4575j797q809K288j3611J3343J440p545K0443j3411j5312
$$ plain form
949 -11315 -3545 -5267 14590 9915 -18997 -6679 -919 4087 12612 -7931 -2646 3059 -10067 8521
963 8521 8799 67 1111 -18630 -4074 14656 -364 1146 -8464 -10769 10406 348 3651 9704
977 9704 -8928 189 1977 -8 13975 -5978 -10416 2933 -5392 5560 1350 -10953 4103
990 4103 -4887 -2245 12995 -2147 938 -576 -7265 13201 3023 -6173 3586 -7819 802 3195
1004 3195 -8241 8101 -338 -9568 4619 -1429 6385 5340 -12514 4542 4875 -4871 2558 -7944
1018 -7944 1925 7174 -12616 547 4899 -1587 5963 -7286 1871 14035 -6115 -310 3920 143
1032 143 8449 -10524 -7434 11391 -3164 -2878 -4743 -7729 10742 -2586 -7653 8397 -2398 371
1046 371 -1187 -6507 14124 1584 -12112 818 -1785 8267 4889 -13018 4158 3799 -2483 8230
$$ packed form
949a1315P770j722J9857m675k8912J2318N760N006Q525k0543N285N705j3126J8588
963H521K78q732J044j9741J4556J8730j5020J510r610k305K1175j0058L303O053
977I704j8632R117J788j985J3983j9953m438J3349q325J0952m210j2303J5056
990D103q990K642J5240j5142L085j514o689K0466j0178r196R759j1405Q621K393
1004C195j1436J6342q439r230J4187o048P814j045j7854J7056L33r746P429j0502
1018g944R869N249j9790J3163M352o486P550j3249R157J2164k0150N805M230l777
1032A43Q306j8973L090J8825j4555K86j865k986J8471j3328n067J6050j0795K769
1046C71j558n320K0631j2540j3696J2930k603J0052l378j7907J7176l59o282J0713
$$ plain form
1060 8230 -1933 3728 3745 -12886 5283 9093 -2134 -403 -14720 -3386 11294 -4837 -75
1073 -75 -3147 -9350 5627 -1837 2949 11071 -9276 -3846 2176 914 13450 -3732 -9509 4026
1087 4026 -3268 6965 6608 -7552 2552 -4932 -1660 14481 -1214 -3398 -4145 -10220 10260 4825
1101 4825 -5577 1139 -12575 -4135 7191 -329 8612 -5007 -14498 5626 4532 7878 5035 -12903
1115 -12903 1802 4343 -1529 10271 -2541 -4548 460 -8110 10413 10013 -9322 -4770 -7334 4941
1129 4941 15443 -7594 -5853 -2067 -6405 8190 1076 -378 4817 -14767 -5696 9456 5570 8455
1143 8455 -10811 -12797 10799 4570 3921 1878 -9052 4503 -346 -3433 11994 -1466 -6131 -3198
1157 -3198 -5232 14630 5604 -13480 -3424 -3463 6299 10079 -9180 -929 -1347 -8429 7805 3493
$$ packed form
1060H230j0163N661J7j6631J8169L810j1227J731j4317J1334J4680j6131M762
1073g5l072o203J4977p464M786Q122k0347N430O022j262J2536j7182n777J3535
1087D026p294J0233l57j4160J0104p484L272J6141j5695k184p47o075K0480n435
1101D825j0402O716j3714Q440J1326p520Q941j3619r491K0124j094L346k843j7938
1115a2903J4705K541n872J1800j2812k007N008q570J8523m00j9335M552k564J2275
1129D941J0502k3037J741L786m338J4595p114j454N195j9584R071J5152l886K885
1143H455j9266j986K3596o229o49k043j0930J3555m849l087J5427j3460m665K933
1157c198k034J9862r026j9084J0056l9R762L780j9259Q251m18p082J6234m312
$$ plain form
1171 3493 2406 1081 -16675 -220 11126 1814 4160 -9792 -6190 9789 -971 4030 3944 -7856
1185 -7856 2881 -956 1318 11288 -7157 -6025 1707 -1646 10189 -1614 -11036 1690 -4514 3481
1199 3481 8500 -6172 -533 -5561 -5698 12281 1544 -2596 -1072 -10008 5100 5138 -3215 5705 -5705
1214 -5705 -4092 6792 -586 7417 774 -10132 6747 4089 1602 3247 -11202 481 4787 -4723
1228 -4723 5138 -3101 -7069 1172 -6706 6694 9396 -8928 -3399 -3738 2200 12463 -5695 -4477
1242 -4477 2790 -4722 5216 813 -1767 7172 -7225 -2510 9927 1770 4003 -6036 -8087 12086
1256 12086 3450 -3352 -2185 -10273 3063 2167 -5643 6185 -4427 -8340 420 -1720 11740 5383
1270 5383 -12594 -550 1730 5240 8883 -8342 -1476 2615 -5099 7011 2102 -2103 2465 -8881
$$ packed form
1171C493j087j325j7756J6455J1346r312K346j3952L602J5979j0760N001q6j1800
1185g856J0737l837K274R970j8445J132P732l353J1835j1803r422J2726o204P995
1199C481N019j4672N639n028j37J7979j0737m140J524q936J5108L8q353Q920j1410
1214e705J613J0884p378Q003o643j0906J6879k658k487J645j4449J1683M306r510
1228d723R861q239l968Q241p878J3400K702j8324N529l39N938J0263j8158J218
1242d477P267p512R938m403k580Q939j4397M715J2437q157K233j0039k051K0173
1256A2086q636o802J167q088J3336q96p810J1828j0612l913Q760k140J3460o357
1270E383j7977J2044K280L510L643j7225O866M091p714J2110m909m205M568j1346
$$ plain form
1284 -8881 3360 11673 -2613 -562 -7392 -4073 11655 -1329 -3237 -2153 -11585 2032 2961 -216
1298 -216 6387 -9080 -6665 6076 2558 10261 627 -9811 3541 36 3747 8328 -7664 -3081
1312 -3081 -1861 -3255 11256 265 -6623 -191 -5037 7263 7288 -5944 740 -6009 -4485 8431
1326 8431 -563 55 -4317 -13181 5399 6974 1414 2665 -9620 28 8857 -10 7240 126 -7539
1341 -7539 1523 -3446 5466 8278 -10616 -5735 -1645 1907 11524 -4897 -6489 3227 -2774 6204
1355 6204 3972 -4157 2688 -7942 -4260 10182 796 -453 -7430 -9919 10332 6270 -1250 1067
1369 1067 -7298 2677 5522 -1833 7579 -1691 -9085 158 -1678 7429 4301 -12947 -2457 1831
1383 1831 3071 8880 -5482 -2460 3609 -3866 6413 4081 -4019 164 -8896 -338 10079 -2970
$$ packed form
1284h881J2241Q313j4286K051o830L319J5728j2984j908J084r432J3617R29l177
1298b16O603j5467K415J2741l518P703r634j0438J3352l505L711M581j5992M583
1312c081J220j394J4511j0991o888O432m846J2300K5j3232O684o749J524J2916
1326H431q994O18m372q864J8580J575n560J251j2285R648Q829q867P250p114p665
1341g539R062m969Q912K812j8894M881M090L552R617j6421j592R716o001Q978
1355F204k232q129O845j0630L682J4442r386j249o977k489K0251m062p520K317
1369A067q365R975K845p355R412r270p394R243j836R107l128j7248J0490M288
1383A831J240N809j4362L022O069p475J0279k332q100M183r060Q558J0417j3049
$$ plain form
1397 -2970 -2262 -5911 -5484 10193 2537 -708 2243 -7743 1587 5221 106 6376 -6391 -8368 3625
1412 3625 -335 5605 1785 -9336 1806 548 1842 9281 -3871 -2235 463 -3685 8130 878
1426 878 -7500 -518 -5851 1825 5703 -5394 748 -2925 -5157 8020 2436 2131 834 -9408 3576
1441 3576 6561 -230 3292 -6257 -2878 5047 -3345 3954 2966 -5278 1617 -2580 2001 8652 -5836
1456 -5836 -3298 403 -1977 5905 -4440 -6907 3213 -3701 689 2697 -3489 4362 -2801 -3986
1470 -3986 8739 2048 1322 -695 -6679 6662 3619 -3893 2687 -3690 222 2672 -5899 4233
1484 4233 2595 -4990 2202 -2423 1396 3921 -8041 448 3072 -2369 2434 -5839 -2928 5824 -3053
1499 -3053 2038 2441 -3960 4009 -1574 282 8336 -2432 -801 772 -3129 6211 -792 -4792 3088
$$ packed form
1397b970P08l649M27J5677p656l245K951r986R330L634n115O270j2767j977J1993
1412C625l960N940l820j1121J1142j258J294P439j3152J636K698m148J1815p252
1426H78q378O982n333P676L878j1097O142l673k232J3177n584l05j297j0242J2984
1441C576K985o791L522r549L379P925q392P299r88q244O895m197M581O651j4488
1456e836K538L701k380P882j0345k467J0120o914M390K008o186P851p163j185
1470c986J2725o691p26k017n984J3341l043p512O580o377L912K450q571J0132
1484D233j638p585P192m625L819K525j1962Q489K624n441M803q273K911Q752q877
1499c053N091M03o401P969n583J856Q054j0768J631J573l901R340p003m000P880
$$ plain form
1514 3088 -3389 1132 2668 -5419 2035 -1240 -3114 6132 -2339 -1615 320 -6147 4731 3027 -2766
1529 -2766 2396 -5633 -1824 5692 -588 4593 -499 -6910 4076 1321 2418 4424 -6239 384
1543 384 2032 -3057 5033 -1828 -3931 1374 -4480 4062 4302 -6559 -1233 -2613 1015 8229 -4244
1558 -4244 -3535 -15 -4131 5684 2482 -1155 2878 -7559 -2396 6709 2091 4631 -4489 -7497 6058
1573 6058 2176 1757 2198 -6106 1694 811 -2268 6431 -2229 -4821 -498 -2968 7021 2775 -8648
1588 -8648 -1673 -1953 3199 7371 -4725 -1580 -825 -4702 6387 3439 293 679 -9338 -95 7876
1603 7876 1360 2732 -5343 -5213 6359 763 2680 1970 -6604 901 427 225 6152 -5192 -5785 323
1619 323 -1631 6710 425 -8266 -699 -2425 3555 8049 -3337 -1189 -2935 -3260 8629 3052 -1130
$$ packed form
1514C088o477M521J536q087P454l275j874R246q471P24J935o467J0878j704n793
1529b766N162q029L809P516o280N181n092o411J0986k755J097K006j0663O623
1543C84J648n089Q090o861k103N305n854Q542K40j0861N326j380L628P214j2473
1558d244P09L520m116R815l202l637M033j0437N163R105m618K540r120l008J3555
1573F058l882m19M41q304P800q83l079Q699q660k592M323k470R989m246j1423
1588h648O975k80N152M172j2096L145P55l877J1089k948l146L86j0017R243P971
1603G876o516J372q075J30J1572n596J917p10q574P505m74k02N927j1344n93O108
1619C23j954Q341o285q691P567j726N980M494j1386K148j746l25J1889n577m182
$$ plain form
1634 -1130 -556 -7698 2214 5756 -40 3221 -4901 -4392 5152 897 4021 120 -8395 1687 1681 801
1650 801 3254 -7679 -3658 1179 -1908 5954 126 -5883 -362 -3191 5617 8935 -3540 -1986 -3092
1665 -3092 -696 9028 -56 -2116 -142 -6395 2317 3395 -173 3497 -6089 -4301 5640 1449 3186
1680 3186 -2919 -8053 3558 1697 -99 1789 -6988 -1695 740 -1680 7239 465 -4966 162 -1546
1695 -1546 7383 7023 -5056 -1191 -2040 -24 6649 -2342 -1367 -399 -6164 2718 2928 -222 2266 -6557
1711 -6557 -1587 6461 487 2005 -3516 -6343 4105 14 196 1997 -6884 -797 1152 195 7559
1726 7559 -1279 -3878 1800 -892 6439 4010 -5380 -149 -2822 -408 5542 -2932 -1541 -1550 -4804 5038
1742 5038 2093 -1446 1749 -4944 817 5258 -1043 2222 -3412 -5648 3435 -171 1479 912 -7269
$$ packed form
1634a130N74p142R912L542n796L261q122N09R544m255L124l901q515J0082oq80
1650H01K453j0933M021M837l087P862n828o009N521k829Q808L318j2475J554j106
1665c092K396R724r084k060J974o253Q712J078l568L670r586J788R941m191J737
1680C186o105n134J1611j861j796J888q777N293K435k420Q919o774n431N128j708
1695a546Q929l60j2079L865q49K016O673q991R75R68n765Q882K10l150K488q823
1711f557M970Q048n974J518n521k827J0448m091J82J801q881O087J949r57P364
1726G559q838k599N678k692P331k429r390N231k673K414N950q474J391rl254R842
1742E038k945l539L195o693N761M441o301L265n634k236R083l606J650n67q181
$$ plain form
1757 -7269 972 2322 413 5379 -2517 -1516 2964 -2328 4591 2323 -4732 -348 -3977 633 5526
1772 5526 -4159 -1741 -724 -2075 6206 17 -1486 3029 -3925 1230 3022 -1921 2563 -4479 -5198
1787 -5198 3909 -473 1251 -357 -5574 3973 2347 -500 4114 -2410 301 2503 -2925 4022 423
1802 423 -4799 741 -2654 1841 3696 -5217 -220 642 -648 5006 -1756 -1197 2323 -4037 1535 1661
1818 1661 -2783 1551 -4489 -2720 4543 -1889 727 202 -2911 5501 1018 -706 3437 -3120 1219
1833 1219 2635 -2565 3056 -2315 -4323 2662 -1822 1781 1712 -5374 1494 634 -422 4613 -3225 -1665
1849 -1665 1498 -3230 3128 37 -4381 1801 -2511 361 4198 -3038 1332 555 -1963 6312 1044
1864 1044 -860 1253 -4472 2488 3574 -2774 955 -4258 -2663 3682 -2007 1728 900 -5110 1725
$$ packed form
1757g269Q241J350j909M966p896J001M480n292O919k268p055M384l629M610M893
1772E526r685K418J017j351Q281o189j503M515o954N155J792m943M484p042p19
1787e198R107m382J724j608n217R547j626k847M614o524K711K202n428O947l599
1802D23n222N540l395M495J855q913M997Q62j290N654o762N59L520o360N572J26
1818A661m444M334o040J769P263o432K616n25l113Q412m483j724M143o557M339
1833A219J416n200N621n371k008O985m484L603o9p086O868q60j056N035p838J560
1849a665L163m728O358l091m418O182m312K872L837p236M370p77k518Q275n268
1864A044j904K113n725O960J086o348L729n213J595O345n689L735q28o010O835
$$ plain form
1879 1725 40 863 4376 -4895 -2387 1667 -1460 4053 -1630 -4297 2600 -1578 1840 3876 -2714
1894 -2714 2037 -711 -1356 6788 179 -1526 -1026 -4918 3708 2833 -3077 161 -4473 -1475 3768 -1869
1910 -1869 2434 69 -5218 2094 151 1753 3521 -5555 -1074 2028 -710 3896 -2298 -3292 3090
1925 3090 -1468 2853 3529 -3419 1288 -1538 -587 6279 -1197 -2184 -1469 -4531 3956 1560 -2705 939
1941 939 -4626 -667 3738 -1453 2554 -785 -4207 3330 -175 1210 2530 -5188 749 1956 -689
1956 -689 4215 -2796 -2737 3263 -992 3503 1823 -4619 1424 -1186 241 4791 -2849 -1231 -1014 -4047
1972 -4047 4388 885 -2196 821 -4750 1067 4020 -2286 1735 -1456 -2264 4308 -1089 508 1826
1987 1826 -4196 1818 1535 -121 3745 -4010 -2264 3302 -433 3459 -513 -4797 2153 -902 618
$$ packed form
1879A725j685Q23L513r271K508M054l127N513n683k667O897m178L418K036o590
1894b714M751k748o45Q144o609j705N00l892Q626q75n910L238m634K998N243n637
1910a869M303k365n287P312j943J602J768r076M481L102k738M606o194r94O382
1925C090m558M321O76o948M707k826R51O866p476r87P15l062Q487k396m265L644
1941I39n565L959M405n191M007l339l422P537l505J385J320p718N937J207k645
1956f89M904p011N9O000m255M495j680o442O043k610J427M550p640J618K17l033
1972d047Q435l503l081L017n571N817K953o306M021l191q08O572n397J597J318
1987A826o022O014k83j656L866p755J746N566l735L892l972m284O950l055J520
$$ plain form
2002 618 3435 -3640 -326 -1093 -3181 4705 62 -2605 165 -3927 2755 3142 -3327 1357 -1468 -762
2018 -762 4585 -1409 986 972 -4216 2931 1495 68 2614 -5047 -1346 3519 -524 3129 -1762 -4324
2034 -4324 2759 -1089 1145 2730 -4294 -69 -808 -1772 4955 -1525 -2432 553 -3040 3592 2476 -3080
2050 -3080 1531 -1944 211 4903 -1676 977 -126 -3650 3958 805 -677 1665 -5001 79 2765
2065 2765 -1017 2816 -2794 -3899 2880 -959 1872 1469 -4967 631 -369 -1026 3891 -2731 -1612
2080 -1612 876 -2651 4086 1804 -2743 1759 -2106 1669 4927 -2504 363 -893 -2351 4250 -555
2095 -555 -1102 960 -4757 790 2197 -1125 2501 -3430 -2988 3707 -291 2121 -26 -5114 2020 357
2111 357 -397 3108 -3326 -778 992 -1925 4848 882 -2700 1578 -1811 2997 4078 -3460 26
$$ packed form
2002F18K817p075L314p67k088P886m643k667K770m092O682L87o469M684k825P06
2018g62N347n994K395j4n188P147j436j427K546p661L701M865m043L653m891k562
2034d324P083l848K234J585p024M225p39r64O727o480r07K985l593O632j116n556
2050c080M611l475K155M692o579K653j103l524P608l153j482K342o666N080K686
2065B765l782L833n610j105O779l839K831m03o436N598j000o57M917o622J119
2080a612K488l527O737k282m547M502l865L775L258p431K867j256j458O601m805
2095e55n47K062n717N547J407l322L626n931M42O695l998K412k147n088P134j663
2111C57p54L505o434K548J770k917O773l966l582M278l389M808J081p538L486
$$ plain form
2126 26 -1173 -1564 4316 -1569 -1300 491 -4326 2214 2498 -748 1929 -4262 -1687 4194 -465 2111
2142 2111 -1247 -4877 2497 128 757 2807 -4080 -126 1268 -1076 5339 -307 -2582 1541 -2025
2157 -2025 3066 2773 -4137 -100 -1993 -1225 4387 -2131 -1014 -376 -3805 3442 1955 -797 1871 -4250
2173 -4250 -935 3737 -911 2375 -1508 -4601 2558 -247 1318 2515 -4019 781 1407 -738 4673
2188 4673 -1009 -1745 1550 -2451 2917 1706 -3982 402 -2455 -221 4128 -2823 -748 -158 -2744
2203 -2744 3971 886 -933 1993 -4168 -289 2820 -944 2697 -2060 -3797 2919 -475 1560 1937
2218 1937 -3290 2002 904 -804 3796 -1982 -928 1321 -2746 2383 338 -3973 773 -2199 449
2233 449 3605 -3279 -87 301 -1857 3802 -117 -886 1877 -3395 817 1949 -1756 2575 -1703 -2170
$$ packed form
2126B6j199l91N880n885K69J791m817O540K84l246K677o191K575N881m659K576
2142B111l358l630P374k369O29K050o887L954J394k344O415n646k275M123l566
2157b025N091k93o910M037j893P68N612o518J117O38l429P247j487k752K668o121
2173d250L315M672m648L286l883l093P159k805J565J197o534M800O26k145N411
2188D673n682p36L295m001N368j211n688M384k857K234M349o951K075N90k586
2203b744O715l085j819K926o161L879L109l764L641m757j737O716l394K035L77
2218A937n227N292j098j708M600n778J054K249m067N129k045m311M746k972K648
2233D49L156o884L192L88k158N659l919p69K763n272M212J132l705M331m278m67
$$ plain form
2249 -2170 3377 -1237 959 1324 -2670 3128 455 -1544 2529 -2739 97 1575 -2752 2030 -1036
2264 -1036 -3414 1703 -1481 1081 2692 -3485 694 101 -1016 3924 -1438 -1153 1668 -2791 1955
2279 1955 1180 -2276 2425 -1603 -209 3463 -1713 902 333 -2347 3696 -16 -1487 827 -3830
2294 -3830 743 2076 -2305 1610 -2298 -2851 2596 -880 1963 1979 -3653 901 75 -162 3942 -2300
2310 -2300 -1012 1462 -2001 2752 354 -2351 2283 -1743 327 3305 -2335 872 -488 -2313 4086
2325 4086 -396 -1427 108 -4167 1677 1972 -1754 1810 -2686 -1894 2611 -1194 2520 1518 -3527
2340 -3527 1443 -369 239 3517 -2778 -553 1339 -1726 2869 -601 -2136 2238 -1718 1174 2354
2355 2354 -2782 805 -1109 -1745 3838 -1207 -1345 -289 -3819 2247 1529 -1655 1684 -2528 -678 2758
$$ packed form
2249b170N547m614K196L65l994N798k673j999M073n268K836J478m327M782l066
2264a036k378N117l184K562J611o177M179n93j117M940n362K85K821m459M746
2279A955p75l456M701m028J394L672n176K615n69k680O043l712j471K314m657
2294c830M573J333m381L915l908n53N447l476K843J6n632M554q26k37M104o242
2310b300J288K474l463M753k398k705M634m026K070K978n640L207j360j825O399
2325D086m482j031J535m275N844K95l726L564m496P92M505l805L714j002n045
2340c527M970j812O08L278o295K225J892l065M595l470j535M374l956K892J180
2355B354n136L587j914o36N583n045j38J056l530O066p18l184L339m212J850L436
$$ plain form
2371 2758 -1485 2229 670 -3011 2267 -692 301 2415 -3040 460 1284 -1276 2802 -1716 -2118 2428
2387 2428 -1391 1683 1228 -3539 812 -1297 -708 3276 -2063 -907 -52 -2726 2913 728 -1490 1408
2403 1408 -2529 382 2877 -1919 1506 -339 -2013 3116 -615 99 1549 -3285 1094 1484 -844
2418 -844 2323 -2703 -1974 2465 -880 2077 327 -3871 1146 -1062 217 3257 -2458 -795 -324 -2182
2434 -2182 3877 581 -1746 947 -2509 1821 2998 -1796 1229 -1194 -1484 3447 -690 195 577 -3808
2450 -3808 1532 1447 -352 2124 -3730 -1887 1933 -519 2640 -685 -3986 1199 -1059 1023 3007
2465 3007 -2879 -373 -464 -1561 4096 162 -1527 541 -2708 2398 2673 -1909 1044 -1849 -896 3631
2481 3631 -783 525 -302 -3799 1884 736 -171 1796 -3841 -1484 1561 -773 2756 -928 -3469
$$ packed form
2371B758m243L714j559l681N278k959R93K114n455L500Q24k560M078m518m02M546
2387B428l819L074m55m767M351k109N89L984n339J156Q55k674N639k185k218K898
2403A408l937K911K495m796L425j845j674N129l731P14J450m834M379L90k328
2418h44L167n026P29M439l345K957j750m198N017k208J279L040n715J663M71j858
2434b182O059l296k327K693l456M330J177m794L025k423k90M931m137Q85L82m385
2450c808N340q5j799K476n854J843L820k452L159l325l301N185k258K082J984
2465C007n886K506r1j097N657l934j689K068l249N106K75m582K953k893R53M527
2481C631m414J308q27l497N683j148r07J967n637K357L045k334L529l684k541
$$ plain form
2496 -3469 1353 -1063 1307 2347 -2802 136 -410 -1020 3870 -488 -862 489 -2545 2630 2136 -1702
2512 -1702 1130 -2112 -451 3198 -1452 722 -463 -3136 2092 57 -424 1577 -3577 -373 1155
2527 1155 -818 2826 -1319 -2373 1869 -1061 1622 1660 -2603 1108 -181 -501 3124 -1248 -286 723
2543 723 -1977 2728 1117 -1926 1011 -2297 197 2559 -2268 811 -888 -2549 2102 -571 -356
2558 -356 1293 -3217 473 1365 -943 2392 -1702 -1619 2474 -742 1469 603 -2741 1415 -146 126
2574 126 2637 -1892 -222 623 -1585 2793 153 -1846 962 -2164 855 2108 -2325 501 -1072
2589 -1072 -1526 2497 -1178 -370 1001 -2387 1540 957 -938 2020 -2213 -774 2463 -870 1478 -85
2605 -85 -2548 2175 -261 153 1925 -2516 86 656 -1561 2663 -691 -1474 1018 -2040 1075 1373
$$ packed form
2496c469M822k416K370J040n149K938n46o10M890m358l74J351l034N175m94l838
2512a702K832l242J661L649m650K174j185k673N228k035m81K001n154L204J528
2527A155j973L644m145j054M242k930K683L8m263L711j289l20L625m372R62J009
2543G23k700M705j611l043K937l308K494K362m827L079j699j661M651k673K15
2558c56J649m510L690Q92k308L335m094Q3M093l216K211q66l344M156j561K72
2574A26K511m529J670Q45k208M378k640j999K808l126L019J253m433K826j573
2589a072m54M023l675Q08J371l388L927n83j895K958m233J439L237l333K348j563
2605h5k463M723k436M14J772m441K602N70k217M224l354p83K492l058L115K98
$$ plain form
2621 1373 -2442 712 -985 -657 2654 -1924 -56 808 -2027 2393 446 -904 2001 -1978 265
2636 265 2252 -990 1371 -782 -2205 2371 -226 172 1236 -2870 748 745 -1200 1988 -1439 -1208
2652 -1208 1186 -1798 1379 465 -2519 1130 -726 144 2360 -2109 -59 661 -1237 2841 -187 -1373
2668 -1373 1237 -1951 999 2198 -1350 1209 -1332 -1710 2698 -721 325 384 -2761 1292 738 -1000
2684 -1000 1589 -2301 -788 1656 -1287 1533 -414 -2366 1450 -482 1023 2262 -2740 58 379
2699 379 -359 3351 -542 -1271 807 -2033 1564 1938 -1639 890 -1984 -1087 2687 -640 365 -380
2715 -380 -2921 1825 579 -757 992 -2687 -430 1587 -1281 1888 -829 -2409 1599 -255 1618
2730 1618 2028 -2670 210 -37 -64 3385 -993 -1173 448 -1831 1879 1275 -1425 788 -2093 -671
$$ packed form
2621A373l815L154j697L28L311m578J868Q64k835M420j947j350K905l979K243
2636B65J987l242K361k153j423M576k597L98J064m106L618lj945L188l427K31
2652a208K394k984L177r14k984L649j856Q70K216m469K050P20j898M078l028j186
2668a373K610l188K950J199l548K559k541l78M408l419J046N9l145M053n54j738
2684a000K589l890J513K444k943K820j947j952L816j932J505J239n002K798L21
2699C79p38L710l893p29K078k840L597L74l577K529k874Q97L774l327J005p45
2715c80k541M746j246j336J749l679K257K017k868L169k717j580M008j854J873
2730A618M10m698K880k47k7L449m378j80J621k279L710o04k700K213k881J422
$$ plain form
2746 -671 2561 -793 672 -723 -2670 2064 340 -330 1159 -2735 202 1422 -900 2170 -1049
2761 -1049 -1747 1597 -512 1995 1614 -2548 414 -282 -112 2838 -1415 -817 509 -1702 1901 564
2777 564 -1616 1033 -1845 -173 1800 -1295 603 -755 -1784 1941 -357 -450 664 -2445 1148 1245
2793 1245 -955 1776 -1307 -988 1977 -651 1579 624 -2392 1209 -328 57 2161 -2032 -608 515
2809 515 -1222 2041 -634 -1703 1135 -1570 723 1458 -1773 580 -902 -1204 2551 -743 -304 284
2825 284 -1886 1926 1365 -799 1166 -1757 41 2172 -1027 1124 -71 -2178 1533 47 319 1312
2841 1312 -2612 -283 664 -740 2227 -1159 -1813 872 -1182 1548 1055 -2068 665 -897 -178 2662
2857 2662 -1083 -179 79 -1671 2638 1068 -811 766 -2266 354 2326 -837 1166 -965 -2074
$$ packed form
2746f71L232l354J465j395j947M734j724o70J489l894K937J220k322L070l219
2761a049o98L344k109K507l81m162K962o96J70K950m253N98J326k211L603j337
2777E64k180K649k878J672J973l095J898j358j029L725k298r3J114l109L593R7
2793A245k200K731l083L19K965k628K230r55l016L601j537L85K104m193J424J123
2809E15j737L263k675j069K838k705K293P35l231K353j482l02L755l294M39N88
2825B84k170L812n61k164J965k923J798K131l199K151j195k107L711j486K72R93
2841A312l924K329R47j404K967l386o54K685k054K730m93l123K733j562P19K840
2857B662l745R04K58j750M309j570j879J577l032K620J972l163K003k131j109
$$ plain form
2872 -2074 1765 -281 600 902 -2938 173 340 -374 2503 -1521 -1563 826 -1072 2027 813 -2090
2888 -2090 861 -886 -58 2700 -1249 -47 -92 -1588 2640 681 -553 764 -2349 730 1918 -1060
2904 -1060 1185 -1303 -1908 1937 -654 662 516 -2815 463 -24 -199 2288 -1724 -851 938 -1071
2920 -1071 1906 478 -1703 1350 -727 521 2167 -1487 473 -20 -1264 2532 -161 -536 604
2935 604 -2209 1238 1278 -1147 1095 -1600 -1200 1797 -1095 665 275 -2558 914 -108 -289 1695
2951 1695 -1820 -158 1148 -894 1893 -248 -1467 1677 -670 833 1295 -1635 832 -31 -846 2182
2967 2182 -851 -717 501 -1895 1537 927 -1417 907 -1504 -564 1775 -1101 666 16 -1990 1577
2983 1577 -396 17 1554 -1831 530 1225 -704 1841 -922 -1153 1937 -823 1185 491 -2241 1082
$$ packed form
2872b074L839k046Q81L02l840L111J67p14K877m024m2K389j898L099j214k903
2888b090K951j747Q28K758l949J202m5j496M228j959j234J317l113L079J188k978
2904a060K245k488o05L845k591J316j46l331L278m87j75K487m012Q73J789k009
2920a071K977j428k181L053k077J248J646l654J960m93j244L796k693l75J140
2935F04k813L447M0k425K242k695M00K997k892J760l90k833L472j022j81J984
2951A695l515J662J306k042K787k141j219L144k347J503M62k930K467q63q15L028
2967B182l033J34J218k396L432o10k344K324k411R40K339k876J767o50k006L567
2983A577j973M13J537l385K361O95j929K545k763k31L090k760K008o94k732L323
$$ plain form
2999 1082 -306 -155 2063 -1424 -777 380 -1608 1790 503 -1383 649 -1802 252 1602 -1391
3014 -1391 515 -197 -1431 2064 -475 -120 1127 -1556 1148 1230 -729 1575 -1253 -767 1835 -639
3030 -639 1195 181 -2174 876 -441 112 1658 -1747 -372 157 -1455 2018 -72 -1061 797 -1744
3046 -1744 240 1278 -1412 893 -451 -784 2123 -1078 120 1129 -1540 1442 357 -758 1380
3061 1380 -1449 -534 1440 -1036 1466 -324 -2075 1277 -415 119 1425 -1739 245 -58 -1405 1873
3077 1873 -475 -741 866 -1744 874 689 -1509 1305 -267 -139 1842 -1540 465 843 -1371 1664
3093 1664 68 -755 1267 -1685 43 1309 -1366 999 -589 -1435 1241 -899 -179 826 -1585 887
3109 887 -2 -1311 1418 -1048 -214 1569 -1375 948 146 -1538 1716 -122 158 1231 -1693 341
$$ packed form
2999A082j388J51K218l487O47J157j988L398j287j886K032k451K054J350k993
3014a391J906p12j234L495k539L55J247k683K704Q2j959K304k828M86K602k474
3030f39J834j014k355L050j317N53J546l405J375N29j612L473k090r89J858k541
3046a744J984J038k690K305j344l33K907l201J198J009k669K982j085j115K138
3061A380k829R15J974k476K502j790j751L352j692N34J306l164J984l03j347L278
3077A873k348k66J607k610K618j85k198K814j572J28J981l382K005L78k214L035
3093A664j596q23K022k952J728J266k675K365j588q46K676k140P20J005k411K472
3109H87q89j309K729k466Q34J783k944K323q02j684L254j838K80J073k924K034
$$ plain form
3125 341 510 -979 1667 -669 -1127 989 -1622 550 1062 -1532 901 -899 -835 1828 -1409 -9
3141 -9 552 -1713 1812 101 -1342 977 -1365 352 1570 -1087 1171 -536 -1668 2049 -281 470
3157 470 1311 -2168 327 514 -508 1983 -1247 -1104 656 -1331 1097 786 -1690 848 -1088 -467
3173 -467 2017 -1379 -6 124 -1510 2052 245 -792 597 -1693 950 1905 -699 1053 -973 -1368
3189 -1368 1913 -226 931 701 -2578 265 130 -74 1831 -1617 -1184 443 -1216 1566 283 -1784
3205 -1784 570 -1124 -62 2022 -1130 308 -153 -1389 2283 181 -444 547 -1899 1103 1520 -747
3221 -747 1080 -1302 -1196 1745 -547 883 325 -2510 587 -1 -57 1639 -1892 -827 373 -1198
3237 -1198 1726 -65 -1615 571 -1263 380 1760 -1205 517 -568 -1062 2450 -84 -342 341 -1802
$$ packed form
3125C41J69j489K646k336m58K116k611K172N12k594K433j800O4K663l237J400
3141iN61k265L525j711j443K319k342J717J218k657K258j707j132L717k330P51
3157D70Q41l479K495J87j022K491l230J43J760j987K428l11k476K538j936O21
3173d67K484l396J373J30j634L562j807j037J389k290K643R55k604J752k026l95
3189a368L281k139J157k30l279K843j35k04J905l448M33J627j659K782j283k067
3205a784K354j694J062K084l152J438m61j236L672k102o25R91k446L002M17k267
3221g47J827k382J06K941k292J430n58k835L097n88n6J696l531J065J200j571
3237a198K924j791j550K186j834J643J380k965J722j085m94L512k534k58O83k143
$$ plain form
3253 -1802 1170 1175 -731 1227 -1572 -738 1622 -563 1127 133 -2271 931 -329 -68 1506 -2026
3269 -2026 -454 492 -880 1650 -358 -1264 915 -1109 1112 1585 -1542 653 -514 -514 2208 -548
3285 -548 -150 149 -1707 1432 801 -619 880 -1622 -325 1516 -969 917 -394 -1848 1084 -355
3301 -355 161 1102 -2105 66 356 -665 1884 -945 -887 1130 -746 1315 888 -1524 770 -393 -122
3318 -122 2133 -877 -272 143 -1455 1635 412 -895 775 -1660 128 1336 -1026 1024 -704 -1551
3334 -1551 1204 -542 451 818 -2044 472 264 -436 1667 -960 -565 1182 -758 1347 634 -1434
3350 -1434 917 -789 85 1724 -1284 109 25 -1062 1654 -208 -647 718 -1795 353 1041 -1160
3366 -1160 726 -1090 -1070 1520 -801 298 424 -1892 959 231 -214 1621 -1152 14 1236 -755
$$ packed form
3253a802K972Nj906J958k799Q34K360k185J690r94k404L202j260K61J574l532
3269b026J572R46j372K530k008r06K179k024K221M73l127K195j167%K722k756
3285e48L98K99j856L139o31j420J499k502J297J841k485J886j311j454K932j439
3301c55N16R41l207K171K90j021K549k829N8K017j876K061m27k412K294j163K71
3318a22K255l010O05M15j598L090j223j307J670k435J788J208k362K050j728q47
3334a551K755j746R93L67k862K516k08p00K103k627L95J747j940K105p13k068
3350a434K351j706Q74J639l008J393q4j087K716j862m39J365k513K148O88k201
3366a160J886j816K0K590k321J099J26k316K851p28m45J835k773J166J222j991
$$ plain form
3382 -755 1460 -38 -1201 1113 -794 144 1189 -1442 334 42 -930 1571 -802 -712 591 -1555
3398 -1555 1142 867 -1320 720 -1127 -487 1620 -1028 523 278 -1100 1359 -39 -103 1397 -1520
3414 -1520 255 1168 -807 1246 -675 -1255 1110 -885 295 516 -1683 566 -14 -847 1563 -1011
3430 -1011 -573 607 -964 1381 495 -1338 724 -1045 -11 1476 -863 565 -1 -1079 1516 -181
3446 -181 -165 917 -1401 526 970 -703 986 -908 -954 1177 -714 605 331 -1723 603 -241 -134
3463 -134 1409 -1254 -269 364 -1163 1290 89 -1096 859 -904 443 1367 -771 634 -329 -708
3479 -708 1638 -325 -233 740 -1439 548 641 -755 976 -1202 -711 1133 -978 627 49 -1555 989
3496 989 -342 -322 1167 -1314 146 415 -668 1457 -422 -857 910 -1040 768 1009 -1269 830
$$ packed form
3382g55K215j498j163K314j907R38J045k631J776k92r72K501k373R0J303k146
3398a555K697k75k187K040j847O40K107k648J551k45j378K459j398o4J500k917
3414a520J775R13j975K053j921n80K365j995J180K21k199K249n80q33K410k574
3430a011M38J180j571K345q86j833K062j769J034J487k339J428n66j078K595j697
3446a81J6J082k318J927M44j673J689j894m6K131j891J319k74k054K326q44J07
3463a34J543k663R85O33j527K453j201j185J955j763J347R24k138J405r63l79
3479g08K346j963R2R73k179J987R3j396J731k178M91J844k111J605n78j604K544
3496I89j331K0J489k481J460K69j083K125j879m35J767j950J808K41k278K099
$$ plain form
3512 830 -217 -381 1642 -767 -282 413 -1274 959 302 -726 708 -1231 -348 974 -882 621
3528 621 -176 -1441 1212 -316 -7 996 -1250 510 549 -429 1166 -484 -621 913 -775 956 897
3545 897 -1423 707 -556 83 1505 -1081 1 304 -1119 1007 -144 -796 727 -1400 276 868
3561 868 -1134 493 -485 -964 1470 -364 207 559 -1559 853 689 -407 1085 -847 -571 807 -677
3578 -677 1214 256 -1364 679 -511 120 1323 -1070 -77 -112 -1164 1285 -246 -801 450 -1341 417
3595 417 801 -1055 840 -426 -702 1404 -156 534 295 -1541 983 365 -112 1117 -1092 -344 766
3612 766 -752 1106 203 -1266 757 -649 353 1029 -1105 276 -160 -651 1309 -769 -422 547 -1199
3629 -1199 501 625 -943 878 -789 -263 1350 -472 536 -21 -1141 1150 106 -346 937 -1042
$$ packed form
3512H30j047j64K023k409M85O95j687K233o57j028J434j939Q83J322j856J503
3528F21p97j265K653j528L09J003k246J760L9r78J595j650j37J534j688J731n9
3545H97k320K130j263O39J422k586J082L03j423K126j151o52J523k127J676N92
3561H68k002J627r78m79K434j834N71L52k118K412j64j096J492j932K76J378j484
3578f77J891r58j620K043j190O31J203k393R93l5j052K449j531n55J251j791J758
3595D17L84j856J895j266k76K106j560O90k39j836K524o18m77J229k209P48J110
3612G66j518J858r03j469K023j406J002O76k134J381m36m91J960k078L47R69j746
3629a199J700J24j568J821j667N26J613j822J008n57j120K291j044m52J283j979
$$ plain form
3645 -1042 164 490 -621 931 -447 -798 883 -977 527 692 -1099 360 17 -204 1111 -862
3661 -862 -261 809 -867 823 137 -919 686 -686 196 1312 -685 460 -93 -650 1500 -199
3677 -199 -219 655 -1140 526 432 -824 736 -909 -537 1094 -602 367 52 -1259 749 -159 -151 1059
3695 1059 -1123 -155 667 -580 1440 -132 -1030 882 -557 727 980 -1002 208 -247 -803 1420
3711 1420 -350 -273 227 -1517 699 553 -678 675 -1106 -474 1125 -606 586 -227 -1244 697
3727 697 -115 129 944 -1349 -92 590 -236 1313 -249 -779 671 -538 851 1070 -709 344 -650
3744 -650 -517 1385 -534 -173 -61 -1345 804 307 -866 450 -1132 -89 745 -610 812 -195
3760 -195 -1084 961 -95 244 758 -1356 349 368 -389 1616 -445 -689 313 -756 835 766 -875
$$ packed form
3645a042J206L26j111J552j378l51J681j860J504J65j791J459l43k21J315j973
3661h62O01J070j676J690o86j056J605j372Q82J116j997J145n53n57K150j699
3677a99k0Q74j795J666r4j256J560j645L72J631j696R69l15j311K008r08QJ210
3695A059k182R68Q22j247K020j572q98J912j439J284K53j982J210m55n56K223
3711A420j770P7N00j744K216j46j231J353j781O32J599j731J192q13j017J941
3727F97q12K44Q15k293J257O82q26J549j562n30J450j209J389K19j779J053r94
3744f50J33J902j919L61J12j284K149m97j173J316j582J043Q34j355J422j007
3760a95q89K045j056L39N14k114J705J9p57K005k061k44J002j069J591o9j641
$$ plain form
3777 -875 323 -877 -586 1186 -648 22 27 -1044 948 64 -512 367 -997 179 1023 -476 759
3794 759 -419 -966 1277 -161 514 595 -1307 526 147 -114 1453 -638 -447 404 -1028 809 217
3811 217 -1124 476 -603 -223 812 -781 126 -39 -927 1069 -108 -197 683 -1381 624 899 -613
3828 -613 783 -429 -536 1246 -199 582 625 -1124 538 145 -80 1285 -588 -309 355 -867 963
3845 963 2 -767 542 -708 -160 692 -707 495 40 -624 1120 -320 -305 407 -988 687 422 -716
3863 -716 710 -613 -365 1042 -630 481 322 -846 613 -63 -173 950 -986 112 368 -666
3879 -666 807 -243 -400 829 -754 302 669 -1105 452 67 -491 1142 -701 -280 487 -802 762
3896 762 296 -620 608 -764 -17 1018 -702 397 -62 -764 1046 -357 -226 357 -987 385 279
$$ packed form
3777h75J198j200K91J772j834O70Nj071J992q84n76Q79j364J176Q44j499J235
3794G59j178n47K243j438O75Q1j902J833l79k61J567k091J91Q51j432J837n92
3811B17j341J600j079L80J035j593R07j65q88J996j177q9Q80k064K005K75j512
3828f13J396j212j07J782j445P81M3j749J662l93k25J365j873K79O64j222J830
3845I63r61p69J309j250N48Q52j399J202m55o64J744j440J5P12j395J675k65j138
3863g16J426j323K48J407j672J111j59j168J459o76j10J123j936J098K56j034
3879f66J473j050j57J229j583J056L67j774J557l85n58J633j843M21P67j289J564
3896G62m66r16J228j372P47J035j720J099m59p02J810j403J31N83j344J372j06
$$ plain form
3913 279 -605 745 -471 -544 721 -496 387 100 -1219 592 100 -4 895 -835 -60 663 -777 993
3931 993 176 -476 421 -818 312 817 -749 312 -298 -615 1132 -632 -248 419 -959 511 384
3948 384 -596 563 -882 -353 875 -372 462 110 -1172 894 120 185 882 -1046 -118 408 -419 1141
3966 1141 -89 -662 549 -766 485 656 -709 345 -447 -309 980 -714 -62 296 -1004 569
3982 569 130 -473 414 -866 -78 1071 -339 606 -157 -768 845 -149 341 857 -1107 78 71 -514 1060
4001 1060 -310 -668 249 -793 428 368 -963 341 -339 -213 820 -760 31 74 -918 1102 157 -344
4019 -344 456 -958 296 822 -421 712 -229 -628 913 -174 332 420 -993 357 24 -279 867
4036 867 -528 -356 423 -671 523 281 -910 276 -616 42 919 -856 154 37 -597 920 35
$$ packed form
3913B79q84J350j216p3J265j217Q83k87j319J811m92j04Q99j730P75P23j440J770
3931I93q17o52Q97j239J130N05j566J061o10l17J747j764L84O67j378J470j27
3948C84r80J159j445N29J228j247Q34l52j282K066p74O5O97j928R28N26q27J560
3966A141j230n73J211j315J251J71j365J054p92J38J289j694O52L58j300J573
3982E69m39o03Q87j280P88J149j410R45p63o11J613r94M90N16j964J185pn85J574
4001A060j370l58R17j042J221o0j331J304o80J26J033j580P91M3r92K020r45n01
4019c44Q00j414J254N26j243J133r41l99J541j087N06Q8j413J350l33l03J146
4036H67j395J72P79j094J194k42j191J186q92O58Q77j775J010j17o34J517q85
$$ plain form
4053 35 -346 489 -826 424 668 -480 517 -417 -574 914 -137 439 82 -1106 409 -81 -87 717 -755
4072 -755 -307 321 -757 852 -115 -976 405 -448 262 640 -945 110 -56 -431 959 -99 -198 428
4090 428 -789 504 423 -523 532 -647 -508 767 -335 275 -166 -911 545 -284 -197 668 -1065 -186
4108 -186 317 -545 808 -293 -882 310 -388 349 937 -843 243 -96 -312 1058 -245 22 234 -729
4126 -729 794 360 -650 598 -905 -116 752 -480 583 -201 -920 470 -278 -65 631 -810 257
4143 257 104 -549 819 -202 -283 702 -543 546 666 -612 617 -5 -55 901 -447 100 259 -558
4161 -558 796 -210 -506 776 -712 161 572 -658 323 -338 -824 781 -401 -130 395 -845 327
4178 327 366 -350 839 -291 -381 637 -547 516 352 -650 702 -263 -25 711 -782 158 320 -691
$$ packed form
4053C5l81Q35j315J250K44j148R97r34j57J488j051N76l57j188J515m90oQ04j472
4072g55M48O28j078J609r67q61J381q53P10L78j585J055j66l75J390j058r9O26
4090D28j217J293q1r46J055j179J39J275j102O10m41p45J456q29Q7Q65j733Q79
4108a86N03q62J353j101n89J192o98P37N88j780J086l39k16J370j303K67K12r63
4126g29J523m34j010J248j503P89Q68j232J063p84p19J390p48K13O96j441J067
4143B57j53o53J368j021q1R85j245J089J20j278J229o22n0R56j348N47J59q17
4161e58J354j006k96J282j488Q73M11j230R81o61m86J605j182K71N25j240J172
4178C27L9p16J189j130r0J018j184J063j64j002J352r65K38P36j493R40J62j011
$$ plain form
4196 -691 640 -418 -430 443 -700 35 370 -815 501 -312 -577 729 -445 73 382 -511 666 130
4214 130 -348 620 -461 110 845 -387 367 119 -762 791 -387 -118 593 -852 440 42 -400 871
4232 871 -527 -262 562 -636 512 305 -793 496 -164 -248 711 -548 -3 330 -599 766 -112 -225
4250 -225 468 -526 365 757 -813 420 -169 -654 1028 -407 -24 168 -838 572 187 -356 723 -630
4268 -630 -315 419 -688 548 -50 -842 432 -360 -5 680 -780 18 -38 -406 1045 -129 -306 560
4286 560 -703 421 501 -737 589 -260 -293 817 -380 228 273 -985 402 -2 -336 454 -864 -86
4304 -86 486 -475 841 -10 -536 626 -375 79 627 -612 340 -78 -354 1039 -286 -165 608 -606
4322 -606 623 437 -630 491 -362 -324 755 -620 214 67 -652 534 -50 -173 448 -691 139 204
$$ packed form
4196f91J331j058j2Q73j143P35L35j185J316q13k65J306j174N18L09q93J177n36
4214A30m78R68j081N71P35j232P54k48q81J553j178K69P11j445J292l98m42J271
4232H71j398K65Q24j198J148k07j098J289o60q4R59j259N45L33r29J365q78j13
4250b25O93r94Q91L92j570J233n89m85J682j435L83J92j006J410l85n43J079j353
4268f30L15P34j107J236n98p92J274p92L55O85j460P98n6l68J451j174j77Q66
4286E60j263J124Q0j238J326q49l3J110j197O08M5j258J387m04l34P90j318P78
4304h6N72r61J316q51n26J162j001M54N48j239R52m18k76J393j325J21P73j214
4322f06J229j86j067J121q53L8J079j375Q34j47p19J186n84j23O21j139Q30O5
$$ plain form
4340 204 -434 455 -185 -509 650 -284 337 409 -930 409 21 -204 653 -601 -56 338 -753 309
4358 309 159 -559 342 -472 49 640 -827 297 -120 -781 507 -312 -185 442 -734 423 456 -366 778
4377 778 -122 -226 795 -356 218 359 -553 612 -81 -298 781 -757 148 467 -646 558 -155 -782
4395 -782 438 -372 -16 618 -728 405 -133 -276 882 -428 -159 246 -575 560 486 -344 533 -645
4413 -645 -255 773 -598 503 143 -722 662 -251 -45 607 -827 107 294 -496 542 -434 -686 359
4431 359 -466 368 525 -668 368 -343 -346 919 -392 144 204 -609 766 364 -450 546 -671 69 548
4450 548 -537 484 -128 -599 600 -57 99 408 -885 259 -43 -279 669 -574 -386 335 -544 403
4468 403 264 -464 399 -264 -205 781 -571 85 142 -439 643 -135 -473 518 -535 99 648 -577 433
$$ packed form
4340B04o38Q89o40l24J159r34O21P2j339J339l88k25Q57j254N45L94j091J062
4358C09j50p18R01q14N21N91j467J124m17o61J288q19J27O27j176J157L3q22J144
4377G78r00j04J021j151N74J41r12J165o93k17J079j538R05L19j113J204p13o27
4395g82J220q10L56O34j346J133n38j43J158j310K69M05q21J135p4q30Q77j178
4413f45L90J028j371J101l60q65J384r13K06O52j434R34J87p90J038r76k52J045
4431C59q25Q34J57j193J036p11lJ265j311N36O0q13J375m02q14R96j217P40M79
4450E48j085J021o12m71J199o57J56L09j293J144l02k36R48j243J88P21q79R47
4468D03j39p28Q63o63N9R86j352O56N7n81J082p78l38R91j053O34N49j225J010
$$ plain form
4487 433 -175 -449 603 -466 -44 292 -721 484 197 -327 598 -489 -227 465 -471 620 51 -970
4505 -970 437 22 135 771 -461 186 240 -366 801 -153 -327 546 -455 480 518 -574 245 -568 -274
4524 -274 654 -537 4 11 -741 410 49 -250 558 -502 -43 630 -245 731 -165 -680 698 -194 267
4543 267 465 -736 121 157 -311 836 -286 -258 203 -521 680 336 -474 291 -536 -109 801 -400 209
4562 209 -184 -791 509 -97 48 544 -909 65 638 -116 907 -342 -553 537 -234 542 446 -635
4580 -635 286 48 -199 732 -396 -285 -84 -778 613 132 -669 231 -554 -136 597 -584 449 -182 -519
4599 -519 864 -157 29 497 -733 225 348 -371 522 -171 -333 636 -431 384 331 -782 354 -136
4617 -136 -153 407 -624 -112 147 -572 470 -334 -257 302 -440 18 471 -504 424 45 -452 734 -182 94
$$ packed form
4487D33o08k74J052j069M22L36j013J205k87n24R25j087K62O92r36J091n69j021
4505i70J407m15J13O36j232O47N4o06J167r54j74Q73j001R35L8j092Q19q13K94
4524b74R28j191N41Pp52J151l61k99Q08j060M59O73q75R76q96n15J378q92M61
4543B67J98j201Q57L6m68J147j122K8M61p24J201l44q10P65q27M27R10j201O09
4562B09l93o07J300o06J45M96j453R74N73p54J023j249k11J090p71P76r6j081
4580f35R21k38k47R31j128J11K01o94J391m81q01R00p85M18P33j181J033o31l37
4599e19J383j021J86M68j230R58J23p19Q93o93j62R69j067Q15n3j113J136m90
4617a36j7N60j031N12K59p19J042q04P7N59p42M58M53r75R28l79m97J186r16K76
$$ plain form
4637 94 379 -417 277 -5 -93 500 -457 -98 587 -430 229 130 -775 630 -157 -46 481 -727 139 232
4657 232 -405 528 -40 -336 520 -485 217 144 -721 360 3 -65 664 -364 -113 491 -385 519 24 -267
4677 -267 498 -559 15 373 -604 86 -87 -349 450 -349 8 353 -658 116 205 -186 480 -326 -265 470
4697 470 -511 443 80 -508 488 -30 -147 561 -345 106 233 -361 607 5 -248 410 -452 -87 419 -335
4717 -335 146 -352 -281 488 -274 122 159 -402 298 -241 -319 408 -412 -199 457 -402 186 70 -334 192 -224
4738 -224 68 440 -559 217 123 -398 687 -320 -241 302 -635 304 331 -655 267 -166 -414 510 -272 -38
4758 -38 56 -607 463 125 -188 504 -561 249 409 -240 410 -168 -383 401 -302 109 186 -577 178 89 -194
4779 -194 640 -503 -393 201 -579 280 111 -495 327 -389 -118 580 -456 34 70 -525 535 52 -141
$$ packed form
4637I4K85p96O94k82q8N93r57L59O85j017O59r9r05J405p87J11N27j208Q66R3
4657B32o37R33n68k96Q56j005P02p3q65J081l57o8P29j028K51O04q76R04m95k91
4677b67P65j057N74L58r77O90j73k62P99p99L57L45j011P74Q9l91O66q06O1P35
4697D70r81R54l63n88R96n18j17P08r06M51J27n94R68o02k53O58q62L65N06p54
4717c35M81m98P1P69p62L96L7n61P00n39p8P27q20K13O56q59N88j16m04N26m16
4738b24K92L72r99P76r4n21J085j007P9N43r37R39K7r86R22m33k48R24p82K34
4758c8R4o63J070l38l13O92j065Q10J60o49O50n78k15P84p03M11P7p63P55q9k83
4779a94Q34j143J10N94p80Q59j69o06Q22p16K71O98j036M90L6n95J060m83j93
$$ plain form
4798 -141 286 -553 45 412 -332 525 -323 -386 378 -418 292 221 -511 254 -25 -169 421 -440 -49 81 -431
4819 -431 471 -65 -520 224 -526 56 467 -367 304 13 -229 518 25 -149 245 -591 340 350 -151 477
4839 477 -317 -217 340 -589 162 12 -512 252 -349 -58 480 -473 -111 71 -453 621 -70 -226 159 -235
4859 -235 202 450 -376 404 -34 -244 719 -170 61 -125 -518 291 340 -288 413 -355 -113 406 -438 339
4879 339 4 -642 256 -311 -44 379 -415 -45 -76 -287 587 -40 -114 209 -422 198 291 -317 341 61 -69
4900 -69 390 -326 112 -79 -329 355 9 -212 375 -524 43 154 -280 304 37 -435 349 -358 -151 414
4920 414 -572 236 111 -267 515 -219 -220 513 -76 594 326 -444 202 135 -145 436 -297 -89 231 -325 309
4941 309 37 -292 376 -527 -95 207 -533 315 -246 -307 434 -105 100 208 -232 569 104 -296 457 -460
$$ packed form
4798a41M27q39N98L67p44Q57q48o3P64p96P10p1p32P65k79j44N90q61L91J30n12
4819d31R02n36m55P44p50N82M11q34O71k91k42P47m93j74L94q36R31J0n01O28
4839D77p94J00N57r29P51j50n24P64o01K91N38r53L62J82n24J074o91j56L85l94
4859b35M37K48q26P80m38k10R63q89K31j86l93Q09M9o28P01p68K42N19q44P77
4879C39l35o46Q98n67K67M23p94L70l1k11Q74o27p4L23o31O20R3o08O58k80j30
4900f9M59p16M38j91k50O84l46k21N87q99N67J11m34N84k67m72P84p07K07N65
4920D14r86Q08j25l78P82p34jP33n89O70k68p70O46o7k80N81p33K08L20n56O34
4941C09k72l29O68r03M32L02p40Q48n61o1P41n39K05J08m40Q01m65m00P53r17
$$ plain form
4961 -460 -55 483 -204 414 51 -410 402 -271 -27 453 -544 -13 -42 -386 424 -353 -272 449 -337 271 205
4982 205 -264 177 -42 -165 609 -343 143 68 -297 560 194 -227 410 -454 -109 285 -220 331 -54 -446
5002 -446 300 -213 259 518 -486 -103 28 -103 715 -356 -163 57 -428 462 157 -53 380 -333 45
5021 45 685 -275 67 -124 -585 314 71 -21 321 -568 -12 -81 -249 395 -281 -620 108 -296 274 118 -350
5042 -350 78 -173 28 439 -405 -163 289 -364 403 190 -210 211 -430 30 401 -325 180 -73 -324 616
5062 616 -234 -144 398 -415 295 118 -238 302 -164 -94 205 -163 122 279 -586 361 13 -228 439 -414 225
5083 225 69 -175 427 -331 -239 226 -468 136 329 -347 226 -119 -388 548 -172 132 136 -572 311 -53 -274
5104 -274 251 -347 -136 390 -170 269 179 -536 596 -109 -120 289 -536 353 -27 -62 473 -31 -312 206 -500
$$ packed form
4961d60M05N38o87O18l63m61Q12o73K44M80r97N31k9l44Q10p77Q1P21p86O08o6
4982B05m69M41k19j23P74r52M86p5l65Q57l66m21O37q64L45L94n05N51l85l92
5002d46P46n13M72K59j004L83J31j31Q18j071J93K20m85Q90l05k10M33p13L78
5021D5O40r60L42j91m61Q99k43r2L42q89N56o9j68O44o76l39P28m04N70j56m68
5042c50M28k51K01M11q44K42M52o53P67k13m00M21o41M60L71p26N05k53k51R40
5062F16q50R0N42q13P10j77l56N40m66P0K99l68K85J57q65R47l48k41O67q53O39
5083B25j56k44O02p58R2M65o94O04J93o76N73l45k69R36p20L04Mp08Q83l64k21
5104b74N25n98K11N26n60M39r0p15J132p05j1M09q25Q89l80l5N35n04k81N18p06
$$ plain form
5125 -500 581 168 -328 305 76 -159 619 -219 97 78 -291 275 74 -95 196 -488 19 345 -507 253
5145 253 98 -364 391 -368 83 136 -609 248 90 -168 551 -119 -207 287 -174 540 156 -330 92 -235 10
5166 10 337 -289 -43 -189 -321 311 -282 -84 88 -558 43 176 -330 370 188 -382 369 -223 204 317
5186 317 -432 315 64 -2 572 -187 -183 293 -113 441 202 -426 261 -353 -99 269 -365 128 -103 -440 446
5207 446 -35 7 231 -275 382 32 -417 283 -6 -80 295 -196 180 263 -285 390 31 -230 364 -346 -47
5228 -47 175 -283 516 73 -357 150 -324 12 311 -235 387 -208 -360 506 -133 -126 318 -393 283 144 -275
5249 -275 180 -335 149 667 -356 351 98 -318 562 -16 -126 285 -232 -31 143 -328 471 -125 -57 292
5269 292 -181 233 289 -397 193 -130 -203 483 -327 11 -24 -350 465 -67 -287 548 -180 67 361 -257 195
$$ packed form
5125e00J081m13m96O33k29k35P78q38L16j9l69N66k01j69K91o84N07L26q52P60
5145B53j55m62P55p59M51N3p45Q57j58k58P19o70q8M94m61P14l84m86M22l27K45
5166A0L27o26K46j46j32O32n93J98J72o46O01J33n06P00j82n70P51n92M27J13
5186C17p49P47k51o6N74p59MM76m06N54k39o28O87o14K54L68o34M93k31l37Q86
5207D46m81M2K24n06O57l50m49P00k89p4L75m91L76Q3n48O75l59k61N94p10K99
5228d7K22m58P99m43m30N07m74L36K99n46O22n95j52Q66o39PM44p11O76j39m19
5249b75M55n15M84N18j023P07k53m16Q80n78j10M11n17K01J74m71P99n96O8L49
5269B92m73M14N6o86N90l23p3O86q10L38l5l26Q15n32k20Q35p28K47K94o18M52
$$ plain form
5290 195 155 -259 263 -156 -147 244 -448 343 347 -410 113 -339 -272 297 -286 68 168 -506 231 -99 50 321
5312 321 -294 -47 181 -108 386 -28 -222 128 -353 242 384 -275 367 -77 -274 293 -239 74 -46 -516
5332 -516 301 -137 -160 465 -586 -110 143 -399 222 -25 -522 459 -115 16 237 -442 95 29 -183 536
5352 536 -114 32 363 -401 237 375 -241 110 -244 -23 317 -341 -5 -96 -509 303 33 -298 324 -311
5372 -311 136 315 -175 374 -168 -372 376 -345 55 163 -605 151 23 -37 339 -256 -223 118 -661 188 141
5393 141 -449 387 -192 -84 450 -477 -99 -74 -248 430 -186 -56 291 -437 94 173 -261 258 -11 -230 417
5414 417 -211 271 261 -377 299 43 -175 303 -175 -8 340 -508 279 -104 -239 197 -263 70 382 -218
5434 -218 103 -130 -341 455 -274 -157 250 -251 258 260 -197 290 -349 -159 145 -250 239 315 -347 428 32
$$ packed form
5290A95m0m14N22m19RL91o92P91Mp57N23m52O7N69n83L54J00o74P37l30J49K71
5312C21o15K47K28k89M94m14j94L50m81N95J42o59O42m44j97N67n32L13j20m70
5332e16Q17m38k3O25j051M76K53n42O21k47m97R81n74J31K21o79N37o6k12P19
5352E36o50J46L31p64O38J38o16L51l54K21L40o58L36r1m13Q12k70l31O22o35
5372c11M47J79m90N49n42k04P48p21M00J08p68P56j28o0L76n95L3L41p79Q49m7
5393A41n90Q36n79J08N34r27L78K5j74O78o16J30L47p28N31P9m34N19k69k19O47
5414D17o28M82j0o38O76k56k18M78m78J67L48q48P87l83j35M36m60L33L12o00
5434b18L21k33k11P96p29J17M07n01N09Km57M87o39J90L04l95M89P6o62P75l96
$$ plain form
5455 32 -243 286 -609 -102 264 -426 244 56 -120 60 -406 272 224 -542 -99 -331 -223 382 -305 -106 -54
5476 -54 -355 432 279 -228 116 -418 -101 504 -239 246 203 -342 446 -87 -143 295 -271 -20 149 -275 529
5497 529 -222 -319 317 -404 79 -22 -415 115 4 -49 443 -253 -35 304 -296 216 151 -371 331 -255 -16
5518 -16 551 -326 227 -70 -392 325 -152 328 156 -470 39 179 -479 280 -174 -169 424 -313 239 94 -240
5539 -240 193 -44 70 275 -310 196 165 -224 290 91 -154 228 -255 187 207 -281 115 -203 -354 288 -337
5560 -337 -55 121 -615 224 1 -83 365 -341 -282 209 -271 318 137 -276 294 -3 50 268 -376 169 113
5581 113 -145 481 -80 -233 124 -437 313 62 -232 218 -286 -113 -30 -418 4 112 -390 4 4 -155 508
5602 508 -383 160 255 -49 308 -65 -351 157 -76 57 182 -323 46 -58 -290 228 -195 102 141 -466 432
$$ packed form
5455C2k75N29q95N07L66o90O70j88j76J80m66O78m8p66M43k32J08O05o87J99N2
5476e4l01P87j53n07L44n34L17O05p43M85m3n45P88n33n6M38n66K51J69m24Q04
5497E29p51r7O36p21M83j01l93N30j11n3M92o96K18L39o00N12o5n22P02n86K39
5518a6N67q77N53k97l22P17m77M80j72o26N09J40o58P59m54NN93p37N52j45l34
5539b40M33k37J14K05n85N06l1l89N14j99k45L82m83M42K0m88L96l18j51O42o25
5560c37K82J76p36Q39k23q4M48p06N9M91m80N89j81m13N70k97N3K18o44N45n6
5581A13k58O26n61j53L57n61P50k51k94M50n04J73Q3l88M22J08n02L94%j59O63
5602E08q91N43R5l04L57l73k86N08k33J33J25n05L69j04k32N18m23K97L9o07Q98
$$ plain form
5623 432 -82 -394 69 -196 1 256 -221 162 -12 -480 297 154 -5 399 -285 75 172 -235 308 -276
5643 -276 -138 329 -98 -98 144 -147 268 -24 -149 368 -301 -61 310 -241 334 27 -396 290 -201 89 305
5664 305 -343 226 -144 -390 503 -46 118 229 -368 -106 183 -171 291 -238 -253 313 -397 301 105 -445
5684 -445 276 -69 -321 104 -295 234 180 -248 288 -42 29 287 -230 -4 458 -174 394 34 -145 398 -167
5705 -167 27 312 -366 260 -67 -214 434 -248 65 142 -419 95 47 -195 217 -132 -133 264 -433 -13 81 -165
5727 -165 292 -281 -49 154 -491 4 160 -333 220 -146 -63 466 -253 59 153 -113 201 -27 -165 289 -209
5748 -209 -81 315 -267 120 -72 -113 412 -103 -74 242 -173 329 115 -221 59 -134 -190 351 -250 136 68
5769 68 -268 196 -145 -154 349 -401 -56 96 -160 148 -152 -270 62 -269 281 104 -279 157 -188 -186 178 -117
$$ packed form
5623D32n14l12M63k65J97K55m77L83j74m68P77j43j59M04o84L60R7m07N43n84
5643b76J38M67m27%K42k91M15k92j25N17o69K40L71n51N75l07m23O86m91K90K16
5664C05o48N69l70k46Q93n49J64J11n97K62K89l54M62n29j5N66p10O98j96n50
5684d45P21l45k52M25l99N29n4m28N36l30P1K58n17K26M62o32N68l60j79N43n65
5705a67J94K85o78O26l27j47O48o82L13P7n61N14m8k42M12l49jL97o97M20R4k46
5727a65M57n73K32K03o45M95J56m93N53l66Q3N29p19L12R4k66L14k28j38M54m98
5748b09J28L96n82L87j92m1N25n15K9L16m15N02k14l36K80j93n6N41o01L86o8
5769F8l36M64l41rN03p50L45J52k56L08l00j18L32l31N50j77l83M36l45KL64k95
$$ plain form
5791 -117 116 170 -239 290 51 -121 227 -275 28 182 -277 246 10 -334 452 2 -235 272 -490 91
5811 91 88 -273 262 -395 -363 133 -331 86 226 -187 339 -167 -215 414 -175 -53 200 -317 344 155 -89 150
5833 150 -215 108 406 -229 184 -82 -12 271 -286 -24 97 -383 225 23 -16 345 -215 -125 233 -393 290
5854 290 131 -251 429 13 -260 111 -292 107 80 -292 459 -108 -293 296 -394 -21 261 -346 326 -156
5874 -156 -66 227 -203 84 255 -165 249 -92 -266 121 -337 0 237 -275 227 -52 -245 211 -240 47
5894 47 233 -325 157 -47 -101 251 23 82 51 -228 86 263 -173 101 -133 -55 282 -395 38 -207 -200 193
5916 193 -126 -118 186 -331 68 -2 -138 161 -58 5 323 -126 217 181 -236 200 -279 -97 589 -433 149
5937 149 74 -195 234 60 -200 247 -231 -124 -50 -214 243 -223 -427 134 -249 26 218 -306 128 178 -152
$$ packed form
5791a17K33N4m09N29k39j72L48n02L03J54m59N23k36l44P86m50k37N07p62N81
5811I1ll61N35o57L2M96m64M17J40m13N26n06m8O29n89J22K53n17O61j89k44K39
5833A50l65L23K98o35M13k66P0K83n57K62J21m80O08k02l9L61n60R0L58o26O83
5854B90j59l82O80m16k73L71m03L99k7l72P51n67j85N89o90L73K82o07O72m82
5874a56R0K93m30K87J71m20M14l41j74L87m58L37K37n12N02k79j93M56m51K87
5894D7J86n58M82k04n4L52k28N9l1k79L14J77m36K74k34P8L37o77M33k45PL93
5916A93l19QL04n17L99p0j36K99k19O3L18m49L43l6m17M36m79J82O86j022N82
5937A49p5k69M29j74k60M47m78J07P4j64M57m66k04N61l83K75J92n24M34N0l30
$$ plain form
5958 -152 223 -202 -152 343 -196 135 229 -383 443 -128 21 213 -48 188 170 -241 109 -220 -168 143 -408
5979 -408 -11 139 -56 196 40 -321 91 -51 119 222 -223 202 -5 -88 317 -74 65 240 -321 310
5999 310 288 -33 264 -227 -214 178 -176 122 -55 -25 303 -250 -107 23 -335 45 173 -202 85 -118 -53
6020 -53 413 -140 -47 397 -357 67 -21 -40 269 -406 -140 261 -222 339 -126 -379 178 -206 72 99 -363 -11
6042 -11 -92 -131 292 -223 -81 190 -325 127 170 -149 278 -199 -165 304 -236 254 113 -140 251 39 -301 328
6064 328 -342 120 194 -148 308 338 29 58 -38 158 133 -428 -6 52 -383 260 -142 63 214 -297 55 11
6086 11 -274 192 58 56 264 -278 313 155 -204 297 -124 50 167 -167 352 93 -231 194 -233 -249 244
6107 244 -490 218 28 -245 278 57 51 189 -237 9 67 -221 214 13 -119 175 -245 156 484 -93 131
$$ packed form
5958a52L75m25N0M95n39L31R4o12Q26n71J49J92k61K36j8m11L50l29N2L11n51
5979d08L97J50j95K52j56l61M12j42J70J03m45M25k07q3M05l91J39J75n61O31
5999C10k2l21K97m91J3L92l54K98j77L0L28n53J43J30l58L80J28l75K87k03O5
6020e3M66n53R3M44p54M24q8j9L09o75K66M01m83N61m65k53N57l84K78K7m62L52
6042a1q1l9M23n15J42K71n15M52M3l19M27m77L4M69n40M90j41k53L91k12l40O29
6064C28o70M62P4l42M56L0l09K9r6J96k5n61M22N8m35O43m02K05J51n11L52m4
6086A1k85M66j34kK08n42N91j58l59N01m21J74J17l34N19k59l24M25m27j6M93
6107B44p34P08j90k73N23k21oJ38m26K46N8k88M35k01j32K94m20M01L28n77K24
$$ plain form
6128 131 76 -88 233 86 72 168 -99 174 -169 -207 142 -338 -182 107 -102 68 122 -286 241 -125 -98 268
6150 268 -242 55 222 -291 241 -271 -151 -28 -199 22 234 -438 92 113 -106 269 -152 -15 234 -227
6170 -227 162 87 -251 94 -179 -80 256 -156 5 -176 -213 204 -202 -194 300 -279 193 104 -314 153 -18 -214
6192 -214 183 -64 -28 -134 -307 70 -175 -113 373 -153 93 75 -367 381 -59 -244 275 -271 93 122 -339
6213 -339 19 -15 -294 520 -143 17 7 -501 83 -37 -29 159 -185 -96 297 -109 259 87 -363 195 206 -31
6235 -31 334 -204 -31 -115 -279 416 -189 -152 121 -330 153 180 -231 130 -297 -77 271 -122 -130 231 -262 254
6257 254 97 -43 415 -322 74 232 -234 240 7 -270 256 -259 -67 97 -369 -152 -94 -213 324 -64
6277 -64 -237 -109 -206 52 256 -424 180 -159 -62 401 -123 -14 20 -104 65 2 -78 345 -216 -12 269 -190
$$ packed form
6128A31n5j64L21j47j4R6k67K73l43l8L49m80J56K89k09J70N4m08N27l66K7L66
6150B68n10K97J67n13N32n12J20J23j71K21K12o72N30K1k19L75m21J37K49m61
6170b27L89p5l38L45k73R9L36m12J61j81l7M17m06QM94n79M72q9m18M67j71j96
6192b14L97k47L6j06j73L77k45O2M86n26K46j8m42P48m40j85N19n46L64K9m61
6213c39L58l4k79Q14o63J60j0n08N84j20QJ88l44Q9L93m06L68j72m50N58J1k37
6235c1L65n38J73q4j64O95o05L7K73m51M83K7m11L61m27K20L48l93qL61m93N16
6257B54j57j40M58p37L96J58m66M74k33k77N26n15J92J64m66K17N8j19N37l88
6277f4j73J28r7K58K04o80O04l39R7M63n24J09L4j24J69o3q0M23n61K04K81m59
$$ plain form
6299 -190 126 9 -151 111 -64 98 -25 -281 78 -96 -110 143 -150 53 367 -257 209 73 -216 185
6319 185 -150 37 365 -217 51 87 -242 307 -60 93 201 -292 152 33 -79 287 105 -75 162 -326
6339 -326 133 87 -345 358 -11 -188 243 -208 15 106 -377 248 -256 -300 -35 -145 63 163 -183 -78 15
6360 15 -183 365 -18 -131 59 -388 123 62 -44 202 -119 -33 313 -319 153 35 -240 209 6 44 377
6381 377 -315 154 78 -421 460 10 -56 319 -304 -56 144 -330 192 27 -147 300 -280 -48 135 -414 86
6402 86 -56 -116 351 -164 -252 140 -282 167 4 -289 173 -257 118 152 -241 120 -72 -272 340 -7 -80 234
6424 234 -365 128 -96 -325 126 -8 -129 261 -470 109 29 -273 375 -145 -158 315 -158 43 155 -393 174
6445 174 205 -233 205 -112 140 206 -338 331 -28 -247 154 -107 15 273 -218 67 67 -273 357 -96 -222
$$ packed form
6299a90L16j17j60K62j75J62j23k56L59j74j4K53k93K03L14o24M66j36k89M01
6319A85l35J87L28n82K68L6l29N49l67J53J08m93M44j19j12L66j82j80K37m88
6339c26M59m6m32P03l69j77M31m51K23R1m83O25n04m4K65j10K08J00l46J05R3
6360A5j98N48l83j13J90m47N11o1j06K46l21Q6L46o32M72j18k75M49k03L8L33
6381C77o92M69p6m99Q81m50o6L75o23K48K00m74N22j65j74M47n80K32J83n49N00
6402H6j42o0M67n15q8L92m22M49j63k93M62m30L75L4l93L61j92k00O12l47p3L14
6424B34n99M93k24k29M51j34j21L90p31N79q0l02O48n20j3M73m73K01J12n48N67
6445A74L1m38M38l17K52O6n44O69l59k19M01k61J22K58m91K85%l40O30m53j26
$$ plain form
6466 -222 176 -301 136 112 -247 231 52 -28 233 -61 113 -36 -182 153 -56 -10 336 -351 95 -21 -206
6487 -206 120 137 -243 89 -214 2 305 -423 162 -22 -250 197 -185 2 59 -227 -98 237 -237 234 -174
6508 -174 114 465 -207 263 108 -261 160 42 10 430 -30 98 44 -203 287 -195 37 73 -328 105 159
6529 159 -159 54 26 -377 248 -182 98 79 -185 372 30 14 400 -39 -92 71 -83 179 20 -169 225
6550 225 -193 -69 391 -315 42 313 -289 319 -82 -112 318 -281 -114 -249 -87 251 -144 -190 330 -386 67
6571 67 -59 -164 49 102 -63 206 -222 59 329 -305 365 -152 -109 283 -55 -188 271 -320 50 -92 -278
6592 -278 182 33 -186 164 -302 261 -5 -18 174 -273 -81 329 -127 311 191 -147 343 -163 51 245
6612 245 -269 101 59 -11 288 -228 -244 233 -399 74 361 -275 430 -95 -299 282 -400 169 410 -323 228
$$ packed form
6466b22L98m77M37k4l59M78j79q0K61k94J74j49j46L35k09M6L46o87M46j16j85
6487b06L26J7l80L32l03K16L03p28N85j84k28M47l82J87N7k86J29L35m74M71m08
6508a74K88L51o72M70j55l69M21j18l2M20m60J28n4k47M90m82K32L6m01M33N4
6529A59l18K13k8m03O25m30K80j9k64N57l42j6L86m39n3J63j54K62j59j89L94
6550B25m18J24M60p06L57K71o02O08m01l0M30n99J67j35J62L38l95m6N20p16M53
6571F7j26j05K13N3j65K69m28K81K70o34O70n17M3L92l38j33M59n91L70j42j86
6592b78M60j49k19L50m66N63k66j3J92m47J92M10m56M38j20l38M90n06K14J94
6612B45n14L70m2p0K99n16j6M77o32M73K87o36P05n25k04N81o82N69K41p33N51
$$ plain form
6633 228 -54 -300 268 -278 140 231 -98 263 19 -83 237 12 3 9 -281 60 45 -207 222 -259 -97 198
6655 198 -230 107 -7 -228 165 88 -104 339 -284 -53 25 -134 322 -48 -234 -11 -352 49 81 -209 262
6676 262 73 -218 250 -68 -144 283 -207 224 -27 -268 245 -152 -106 181 -206 278 39 -338 236 -173 -36
6697 -36 152 -289 196 -96 -37 335 -202 -230 106 -202 3 89 -43 263 -73 -342 417 -173 -2 43 -249 147
6719 147 -162 -194 181 -203 -141 94 -218 141 159 -152 179 -80 35 79 -277 190 323 -181 141 -96 -69 341
6741 341 -344 208 83 -213 299 -50 -92 232 -306 105 19 -172 176 -304 35 152 -364 -83 184 -302 338
6762 338 -157 -96 248 -219 250 234 -379 234 76 -257 257 -90 289 95 -158 249 92 -43 311 -261 -66
6783 -66 388 -265 -36 -110 -194 108 -78 17 135 -97 -85 -3 -398 83 -72 -172 140 -259 109 252 -112 336
$$ packed form
6633B28k82k46N68n46M18R1l29L61k44j02L20k25rOk90L41j5k52M29m81J62K95
6655A98m28L37j14k21L93p7j92M43o23K31P8j59M56l70j86K23l41M01L2k90M71
6676B62j89k91M68l18p6M27m90M31k51k41N13l97M6K87l87M84k39l77N74m09J37
6697c6J88m41M85k92N9L72n37k8L36l08K05Q6j32L06l36k69P59n90J71M5k92L96
6719A47l09l2L75l84O2K35l12L59J8l11L31k59J15M4l56M67J33n04L22k37K7M10
6741C41o85N52j25k96N12l49m2L24n38M11q6j91L48m80L39J17n16K81K67m86O40
6762C38m95O1L44m67M69j6o13O13j58l33N14l47L79j94k53M07j57j35L54n72J95
6783f6M54o53K29p4q4L02j86R5J18k32J2Q2l95M81j55j00L12l99L68J43l64M48
$$ plain form
6805 336 74 30 206 -209 58 215 -206 122 28 -148 298 3 -12 93 -454 129 71 -145 313 -318 -99
6826 -99 137 -276 131 23 -287 116 -129 82 198 -291 191 230 -314 260 -231 -79 157 -190 67 0 -246
6847 -246 381 -107 -39 259 -226 214 195 -191 22 158 -230 420 -263 67 287 -477 -13 113 -156 280 -170
6868 -170 -111 185 -281 -21 59 -164 83 -124 110 272 -10 98 -141 -199 162 -285 -365 380 -489 -61 146
6889 146 -373 143 102 25 337 -66 253 129 -223 203 58 16 231 -369 174 194 -376 218 -101 -150 407 -113
6911 -113 179 113 -241 193 189 -181 434 -182 -86 239 -248 102 103 -178 275 -8 157 292 -155 -146 117 -64 235
6934 235 -117 68 385 -230 119 82 -408 154 -90 -179 243 -171 -26 248 -244 241 102 -113 213 -28 61
6955 61 59 -160 115 -31 -242 208 38 163 274 -267 274 22 25 332 15 -109 155 -268 163 345 -386 295
$$ packed form
6805C36k62m4J76m15K67J57m21L28r4j76M46k95j5J05n47N83n8k16M58o31K19
6826i9K36m13M07j08l10M03k45K11J16m89M82L9n44N74m91J52K36l47K57o7k46
6847b46O27m88O8K98m85M40j9l86K13J36l88O50o83L30K20p64M64J26k69M36m50
6868a70N9K96m66K60Q0k23K47k07K34J62k82J08k39n8L61m47q0P45q69M28K07
6889A46n19N16m1p7L12m03L19j24l52M26j45m2K15o00N43K0n70N94l19m9N57n20
6911a13K92o6l54M34ml70O15o16R6L25m87L50Jk81M53k83J65J35m47RK63j81K99
6934B35l52J85L17o15L49l7m90N62k44q9M22m14J45K74m92M85j39k15L26k41Q9
6955F1kk19K75j46k11M50j70J25J11n41N41k52LL07l17j24K64m23M31J82p31O81
$$ plain form
6977 295 -152 -311 -22 -320 -45 -194 -281 177 171 -127 139 -344 92 50 -244 105 -21 28 392 -260 -12 126
6999 126 -308 259 9 -34 190 58 -78 112 -293 399 -123 -178 159 -187 146 156 -279 -87 112 -122 264
7020 264 -205 -254 71 -207 277 116 -159 89 -9 -95 356 -225 198 148 -216 287 -154 -258 355 -148 -233 30
7042 30 -219 120 59 -2 242 -259 202 -101 -414 182 126 -44 156 -276 161 -66 -190 76 -58 -93 122 -50
7064 -50 -69 365 -112 -19 25 -298 187 -276 -28 22 -106 15 84 -344 187 -183 -309 453 -138 171 127 -263
7086 -263 211 -60 -283 203 -42 6 79 -22 227 120 -189 215 -196 55 201 -142 205 15 -175 153 -288
7107 -288 -60 362 -257 78 -35 -301 264 -96 -217 252 -397 -52 248 -156 122 -169 18 416 -154 69
7127 69 149 -105 273 60 -189 189 -209 49 91 -352 66 -118 -188 92 -94 -19 167 -431 43 26 -107 321
$$ packed form
6977B95m47j59K89k98K75j49q7M58ok98K66m83M36m2k94L49j26M9L64o52K48J38
6999A26m34N67k50m3K24j32j36J90m05O92n22n5L37l46L33J0m35J92J99k34L86
7020B64m69m9L25k78M84j61k75K48r8q6M51n81M23n0l64N03m41j04O13n03q5K63
7042C0k49L39o1o1K44n01M61l03l13N96n6j70K00m32M37k27j24K66j34l5K15j72
7064e0j9M34m77R3M4l23M85m63K48N0j28J21O9m28N31l70j26P62n91L09m4l90
7086b63M74k71k23M86k45M8P3j01K49j07l09M04m11K51J46l43L47j90j90L28m41
7107b88K28M22o19L35j13k66N65l60j21M69o49L45L00m04K78k91J87L98n70K23
7127F9Q0k54L78k13k49L78l98K58M2m43M18j84p0K80j86P5J86n98M74j7j33M28
$$ plain form
7149 321 -173 -129 241 -388 374 169 -149 165 -44 -71 412 -21 303 203 -192 181 -66 104 159 -202 51
7170 51 -24 -114 236 -111 -314 182 -362 -218 -50 -283 111 110 -65 180 -172 58 252 -65 53 -89 -84 390
7192 390 239 -127 195 -429 -49 42 54 426 -244 9 35 -291 4 -44 -41 313 -141 -46 349 -66 101 113 -265
7215 -265 161 -34 -317 256 -342 -40 42 -54 35 -68 -310 209 -136 6 135 -339 -12 60 -135 70 -338
7236 -338 -231 179 -114 234 -8 -205 251 1 14 313 -215 36 111 -296 303 70 36 233 -245 59 37
7257 37 -19 355 42 -107 284 -213 133 213 -355 -32 -2 -140 274 -203 90 -36 -270 275 50 -152 94
7278 94 -58 62 217 -190 103 67 -119 166 -4 146 262 -123 121 83 -411 34 -50 -36 137 -228 170 125
7300 125 -374 130 -244 -26 270 -39 40 -173 7 317 -105 15 250 -105 -27 -24 -158 83 53 -106 372 -58
$$ packed form
7149C21m94M4L70o29P62k05l18L14k09k7M83m33L24j00l95L73k47J70N5l61K53
7170E1p5r0L50l47k03M96n44J44J68k33L94jj75K45l52K30J94l17J18j42NM74
7192C90j51l66L22o24L80R1J2L72o70K53K6l26K95m8LL54m54R5L95m15J67J2l78
7215b65M26j95k83N73n98L02Q2r6Q9j03k42N19l45J42J29m74L27P2j95K05m08
7236c38J07M10k93L48k42j97M56k50J3K99n28K51P5m07N99k33l4J97m78L04k2
7257C7n6L74l13j49L91m97L46Q0n68L23L0j38M14m77K93j26k34N45k25k02K46
7278I4j52J20J55m07K93l6j86K85j70J50J16l85K44l8m94M45q4J4J73l65L98m5
7300A25m99N04l74K18K96l09P9k13J80L10m22J20K35l55P8Lj34K41l0j59M78m30
$$ plain form
7322 -58 -117 208 -360 37 235 -109 263 -244 28 213 -131 81 -146 -263 167 -198 75 -114 -251 144 86
7343 86 -243 164 -157 18 81 -60 156 -50 -159 156 -144 -151 95 -229 46 97 -119 277 -40 -128 230 -230
7365 -230 78 178 -165 217 165 -118 282 -147 298 428 -202 199 51 53 386 -245 -61 295 -240 133 153
7386 153 -277 214 -129 -30 452 -47 193 -35 -144 412 -42 -105 421 -227 -242 -11 -214 120 -110 -110 190 -318
7408 -318 56 114 -151 226 -86 -74 505 -75 99 303 -66 193 143 -27 377 -113 63 87 -118 100 -163
7429 -163 -312 88 -46 -40 73 -280 16 121 -245 31 -58 -167 222 -260 -62 64 -93 31 86 -41 109
7450 109 -121 239 77 -148 324 -88 -199 334 -238 45 125 -174 202 -78 -168 300 -20 2 223 -151 104
7471 104 112 -131 320 8 48 23 -196 65 -36 -102 73 -289 -56 206 -89 119 170 -335 106 -88 -40 153
$$ packed form
7322e8n9L25n68L97J98l44L72n07K72J85l44K12k27j17M30l65K73j89j37L95n8
7343H6l29M07l21J75O3j41K16k06j09L15l00pK46l24K75N1k16L96l17q8L58m60
7365b30L08J00l43L82n2k83M00m29M45J30o30M01j48KL33o31J84L56n35L73K0
7386A53m30M91l43R9M82m99K40k28j09N56m54o3N26o48j5K31k03L34k30%L00n08
7408c18L74N8k65L77l12J2N79n80J74K04l69K59n0j70M04m90J76K4k05K18k63
7429a63j49M00j34OJ13l53K96J05l66K76q9j09L89m82J98J26j57J24N5j27J50
7450A09k30L60j62k25M72m12j11N33n72K83Q0k99L76k80r0M68l20K2K21l74K55
7471A04Qk43M51l12M0k5k19K61j01o6J75l62K33K62k95K08N1n05M41j94M8J93
$$ plain form
7493 153 -125 -26 164 -383 224 -69 -160 215 -323 13 292 -278 85 118 -82 318 -104 -196 208 -103 337
7514 337 158 -153 180 -74 63 187 -350 127 -6 -117 101 -123 17 189 -189 -6 -15 -270 261 -46 -71
7535 -71 206 -206 116 35 -76 338 58 93 214 -127 57 223 -206 144 -47 -4 217 -326 -65 230 -170
7556 -170 156 48 -432 89 -248 -80 184 -205 -273 -10 -241 340 -223 -42 187 -375 178 13 -40 231 -24
7577 -24 23 623 -164 68 54 -359 282 -39 -126 44 -103 112 96 -302 535 -105 -62 72 -126 110 216 -202
7599 -202 -74 90 -210 177 -226 -113 150 -107 109 165 -233 220 -157 38 204 -244 172 114 -79 19 -66
7620 -66 -81 213 -348 35 8 -142 74 -147 -154 353 -24 128 129 -176 73 90 -361 300 -63 156 251 -227 268
7643 268 -12 -122 232 -300 45 30 -258 263 119 -290 278 -294 -114 313 -94 235 7 -532 53 -279
$$ packed form
7493A53k78R9J90n47O07k93r1L75n38L36K79n70L63L3k00M00m22r2M04l11M40
7514C37j79l11L33k54J37J24n37M77j33j11K18k24J40J72l78J83rk55N31l07k5
7535g1K77m12L22q1j11M14k80L5J21l41J84J66m29L50j91M3K21n43K61K95m00
7556a70L26j08m80N21l37J68K64l89o8K63k31N81n63J81K29n62N53j65n3K71k55
7577b4M7O00p87K32j4m13O41l21q7J70j47K15j6l98Q37o40M3J34j98K36J06m18
7599b02J28J64l00L87m03J13K63k57K16N6l98M53l77J95J66m48M16n8j93R8q5
7620f6j5K94n61L83k7j50K16k21pN07l77J52Jl05K49J7m51O61l63K19R5m78M95
7643B68k80j10L54n32L45j5k88N21j44m09N68n72J80M27m07L29k28n39N85l32
$$ plain form
7663 -279 -226 134 -246 148 -70 -110 221 4 34 160 -369 7 318 -187 407 -68 -78 3 -377 94 13 -262
7685 -262 302 -112 -207 75 -175 -43 145 -187 19 -116 -249 97 -174 103 213 -165 91 54 -41 220 42
7706 42 -97 396 -344 135 41 -203 196 -251 -119 300 96 316 153 -138 122 -51 -135 396 -261 308 96
7727 96 -295 77 -112 -189 283 -7 25 238 -254 10 44 -279 201 -130 19 67 -267 91 -237 -141 326 -223
7749 -223 -107 194 -468 27 230 -113 130 14 -167 -1 -334 135 118 -161 28 23 -65 285 -450 152 287
7770 287 35 114 -2 -286 135 -230 99 129 -357 179 87 -278 59 -177 40 252 -305 240 31 -120 138
7791 138 -56 -145 240 -194 104 6 -259 161 -93 22 122 -168 105 147 -94 55 -161 -95 101 -157 282
7812 282 140 -182 205 -102 -243 243 -91 -16 161 -272 -27 -108 -113 245 -87 -116 278 -359 235 -63 -60 124
$$ packed form
7663b79N3L60l80L94k18m0L31k17L0J26n29L76L11n05N94m75j0Q1l80M71q1k75
7685b62N64m14r5K82k50J32J88l32K06j35j33L46k71K77J10l78K56l7r5K61j78
7706D2j39M93p40M79r4k44L99m47J32M19k04K20j63k91K60j73q4N31o57N69k12
7727I6l91L72j89p7M72k90L2K13m92K64L4l23M80l31J49M8l34L58l28R6M67n49
7749b23J16L01o62M95K03l43K43j16j81J66l33M69j7k79J89nq8L50p35O02J35
7770B87k52P9j16k84M21l65L29L0m86N36r2l65L37k36K17K12n57N45k09j51K58
7791A38j94q9L85m34K98r8k65M20k54J15J00k90K73M2k41J49k16O6J96k58M39
7812B82j42l22L87l07j41M86l34P5J77m33K45q1nL58l32k9L94o37N94k98LJ84
$$ plain form
7834 124 -241 31 171 -169 165 53 -102 306 -185 -181 75 -237 180 45 -53 145 -89 -66 382 33 10 91
7856 91 -399 125 -94 -182 101 -234 6 197 -296 -10 -97 31 2 -307 1 159 -164 106 158 46 326 -105
7878 -105 -149 99 -107 289 222 -179 64 -165 -117 4 -454 15 -45 -262 248 -37 -33 159 -321 110 110 -104 -78
7901 -78 -113 -163 233 -93 -23 216 -255 189 23 -139 -158 -251 38 6 -84 56 -196 -167 22 -133 72 -68 -279
7924 -279 146 25 -213 248 -130 -49 63 -95 74 47 -157 226 -68 -42 218 -324 14 0 -135 193 -31
7945 -31 -156 76 -175 88 124 -99 169 -171 -31 212 -160 -70 18 -239 94 26 -120 329 -118 20 352 110
7967 110 184 -28 -40 155 -239 8 86 -401 96 207 105 105 -52 -156 8 -259 151 -5 -185 2 -3 -176
7989 -176 301 -94 -181 7 -115 151 84 -38 275 -237 -229 114 -43 444 -78 75 259 -187 85 87 -182 110
$$ packed form
7834A24l65K72J40l40L34j12j55M08m91MK56l12M17j35r8J98k34K3M48l49k3Q1
7856I1m90N24k19q8K83l35K40J91m93K86q7J28k9l09L08J58l23K70N2j12K80m31
7878a05m4K48k06L96o7m01K43k29M8J21m58M69o0k17N10k85MJ92m80M31%k14K6
7901g8l5n0L96l26P0K39m71M44j66j62j9r3K89l2r0J40k52K9J89j55K05j40k11
7924b79M25j21k38M61l78Q1J12j58J69k7k04L83k94K6K60n42L38j4j35L28k24
7945c1j25K32k51K63L6k23K68l40J40K43l72R0Q8k57L33o8j46M49m47J38L32k42
7967A10P4k12j2J95l94K47P8m87M97J11j02%j57j04J64k67M10j56j80J87nj73
7989a76M77l95q7J88j22K66o7j22L13n12QL43j57M87n22J53J84m46K72Kk69K92
$$ plain form
8011 110 -15 -56 39 -184 -9 137 -217 124 154 -183 182 41 75 181 -267 238 24 -49 153 -154 16 127
8033 127 -229 120 125 -303 214 -183 -259 231 -151 -50 72 -317 123 -270 -258 79 -198 -73 -1 -180 119 -149
8055 -149 -349 409 -219 55 193 -306 296 124 -9 201 41 -136 165 -217 141 -4 -231 175 -334 -95
8075 -95 166 -161 36 -24 -271 -2 -109 -229 210 -246 -46 126 -257 299 -190 -154 215 -146 17 104 -115
8096 -115 -14 -123 -91 210 6 18 36 -116 40 95 -93 198 -104 -153 54 -388 117 -136 19 166 -82 20
8118 20 232 -292 93 77 -135 34 -32 -21 305 -222 141 131 -216 191 -115 85 94 -163 5 144 -220 189
8140 189 6 55 217 39 -186 166 -144 117 -123 -11 284 -175 211 -18 -289 228 -29 -64 -69 -142 -256 141
8162 141 -86 153 -9 -199 107 -265 125 139 -163 87 -11 -51 206 -213 -15 177 -152 -62 383 -267 108
$$ packed form
8011A10j25m1R5k23J75J46l54L41L0l37L65j41L4J06m48N05k14p3K02l07J70J11
8033A27l56L49Nm28N17l97p6M90l82J01J22l89M40l93J2L37k77J25P2j79K99k68
8055a49k00P58o28K74J38m99O02j72j33K10j60j77L01l82L58j45k27M06n09K39
8075i5K61l27J97o0k47K69j07j20M39m56K00J72l83N56m89L6L69l61J63Q7k19
8096a15J01j09L2L01k04J2J8j52J56N5j88K91l02m9K07m42N05k53J55J47k48J02
8118B0K12n24L85j6k12J69o6J1L26n27L63j0l47M07l06K00Rk57J68J39l64M09
8140A89j83M9J62j78k25L52l10K61k40J12K95m59L86k29k71N17k57l5np3j14L97
8162A41k27K39j62j90L06l72L90J4l02K50r8m0K57m19J98J92l29R0M45o50L75
$$ plain form
8183 108 -81 -4 385 -251 204 125 -111 196
$$ packed form
8183A08j89P7L89o36M55p9k36L07
8191A96
$$ Imaginary data points
##PAGE= N=2
##DATA TABLE= (X++(I..I)), XYDATA
$$ plain form
0 0 0 0 0 0 0 0 0 0 0 0 0 0 0 0 0 -8 8 -8 8 -16 16 -16 24 -24 29 -33 40 -48 55 -61 71 -82 92 -105 118 -133
36 -133 149 -170 189 -212 237 -263 291 -325 357 -396 438 -485 533 -586 646 -712 785 -866 955
55 955 -1056 1170 -1298 1446 -1618 1822 -2068 2370 -2751 3253 -3938 4951 -6601 9882 -31844
70 -31844 156932 191733 8086 -181200 -258534 -37412 66378 105773 102701 -86279 -154336
81 -154336 -58237 83954 247225 69432 -173255 -129050 5555 167842 138780 -81446 -101784
92 -101784 -65862 14406 163510 111446 3405 -103838 -168038 49184 190739 88120 -65814
103 -65814 -230332 -144804 65624 85180 64908 -53753 -166810 -64557 32197 135638 153457
114 153457 -42715 -96741 -21532 60193 154459 41774 -79583 -60498 -52785 56119 96939
$$ packed form
0@%%%%%%%%%%%%%%%qJ6j6J6k4L2l2M0m8N3o2P3q8J03j16J32j53J74j97K23k51
36a33K82l19L59m01M49n00N54o16O82p53Q34r23J018j119J232j358J497j651J821
55I55k011K226k468K744l064L440l890M438n121O004p191Q889j1552J6483m1726
70c1844J88776L4801j83647j89286p7334K21122J03790L9395l072j88980o8057
81a54336R6099J42191J63271j77793k42687M4205J34605J62287k9062k20226k0338
92a01784L5922Q0268J49104n2064j08041j07243o4200K17222J41555j02619j53934
103f5814j64518Q5528K10428J9556k0272j18661j13057J02253R6754J03441J7819
114A53457j96172n4026P5209Q1725R4266j12685j21357J9085P713J08904M0820
$$ plain form
125 96939 -16779 -58218 -98156 -26115 128381 69682 -21839 -79863 -104717 28513 70130
136 70130 28044 9146 -108489 -107670 4595 58339 109954 5227 -106463 -16246 47664 88658
148 88658 75067 -26669 -4869 -2239 -30260 41522 21838 -21762 -44535 -84915 23273 69636
160 69636 -29429 -52460 -49928 23221 84732 -8310 -20694 -959 -34730 5240 7350 28847
172 28847 51146 -64619 -71558 20922 51569 66560 -19311 -48987 41218 18736 602 12684
184 12684 -8380 26030 -22771 -61950 18039 3945 -26326 -26829 -33272 46239 26377 -52066 -6348
197 -6348 14903 37728 39228 -28502 8919 19324 -30237 6313 8143 14911 15772 -55317 -14342
210 -14342 32403 -99 11937 -15092 -5904 35394 -21593 -15111 10735 -15030 12412 -9594
$$ packed form
125I6939j13718m1439l9938P2041J54496n8699r1521n8024k4854J33230M1617
136G0130m2086j8898j17635Q19J12265N3744N1615j04727j11690R0217O3910M0994
148H8658j3591j01736K1800K630k8021P1782j9684m3600k2773m0380J08188M6363
160F9636r9065k3031K532P3149O1511r3042j2384J9735l3771L9970K110K1497
172B8847K2299j15765o939R2480L0647J4991q5871k9676R0205k2482j8134J2082
184A2684k1064L4410m8801l9179P9989j4094l0271n03o443P9511j9862p8443M5718
197f348K1251K2825J500o7730L7421J0405m9561L6550J830O768Q61p1089M0975
210a4342M6745l2502J2036k7029R188M1298n6987O482K5846k5765K7442k2006
$$ plain form
222 -9594 -19155 16553 -30228 -16211 25621 6519 27641 -4264 -25054 28111 4837 10323 29797
235 29797 -14997 -1684 -14670 -22795 30875 -7633 -25717 1989 -16056 13018 -2103 -30501
247 -30501 25424 8736 -8841 11778 -12512 13505 1311 -33237 28993 24678 -9853 -11151
259 -11151 -32201 24927 40441 -22113 -453 3810 -434 11734 -27552 9514 32455 -30527
271 -30527 -19807 -4141 9081 23115 -43451 -24407 37452 10148 -357 -24152 -13802 43267
283 43267 5 -12531 23527 -258 75 -19737 -13271 55872 12434 -39637 -19969 -6775 38599
296 38599 12768 -41177 4077 3247 -9907 7892 -9461 18727 4187 -45109 8493 29258
308 29258 11907 -3182 -47081 2470 42980 -1256 1421 -14589 -17034 17988 -5713 16181
$$ packed form
222i594r561L5708m6781J4017M1832j9102K1122l1905k0790N3165k3274N486J9474
235B9797m4794J3313j2986q125N3670l8508j8084K7706j8045K9074j5121k8398
247c0501N5925j6688j7577K0619k4290K6017j2194l4548O2230m315l4531j298
259a1151k1050N7128J5514o2554K1660M263m244J2168l9286L7066K2941o2982
271c0527J0720J5666J3222J4034o6566J9044O1859k7304j0505k3795J0350N7069
283D3267m3262j2536L6058k3785L33j9812O466O9143m3438n2071J9668J3194M5374
296C8599k5831n3945M5254q30j3154J7799j7353K8188j4540m9296N3602K0765
308B9258j7351j5089m3899M9551M0510m4236K677j6010k445L5022k3701K1894
$$ plain form
320 16181 29454 -28227 -20485 -6451 13992 45664 -16652 -35403 -3805 -9080 24736 14087
332 14087 -18487 76 -23817 -3953 40611 7752 -865 -19146 -24422 34055 17800 -5282
344 -5282 -277 -33701 -7942 13873 3855 24326 -21555 -42964 8987 18585 33235 6641 -40983
357 -40983 1952 11936 5436 26597 -7024 -10661 -12544 -28151 32421 33669 -16710 -23450 -30135
370 -30135 22686 47487 -14383 -13977 -7809 -11159 15858 -5909 4240 12868 -43705 -24731 15153
383 15153 24908 26648 -37584 -32762 35223 27223 19193 -1494 -17407 19296 -3652 -8068 29811
396 29811 -170 -19188 -30571 -22152 43886 18019 -36003 -21018 -10407 25656 21769 -22990
408 -22990 3191 -1233 -20000 6700 2291 16582 3194 -45422 -1221 32078 19178 12664 -24574
$$ packed form
320A6181J3273n7681P742J4034K0443L1672o2316j8751L1598n275L3816j0649
332A4087l2574J8563k3893J9864M4564l2859q617j8281n276N8477j6255k3082
344e282N005l3424K5759K1815j0018K0471m5881k1409N1951R598J4650k6594m7624
357d0983M2935R984o500K1161l3621l637j883j5607O0572J248n0379o740o685
370c0135N2821K4801o1870M06O168l350K7017k1767J0149Q628n6573J8974L9884
383A5153R755J740o4232M822O7985q000q030k0687j5913L6703k2948m416L7879
396B9811k9981j9018j1383Q419O6038k5867n4022J4985J0611L6063l887m4759
408b2990K6181m424j8767K6700m409J4291j3388m8616M4201L3299j2900o514l7238
$$ plain form
421 -24574 -697 36539 5643 12039 4983 -16120 1921 -16647 -1578 20914 -27506 -29003 -15053
434 -15053 -6012 27734 -6429 -22599 5171 -6627 15207 20312 -5400 9054 -12898 -11489 28475
447 28475 4856 -1214 -4869 -17205 22821 14859 -2684 15516 -9322 -2090 13187 -2689 15748
460 15748 -12276 -39399 -1552 -879 410 -8458 -38860 -1427 9919 -6363 16032 3458 4536
473 4536 10668 -11160 26800 33089 -10517 -9274 -11984 13937 29631 -22739 -16701 5311 -2094
486 -2094 13247 -6548 -3054 18147 -21991 -14239 14507 6018 3570 -36889 -33649 24075 8438
499 8438 -8791 -13048 -17128 22956 12147 -3452 29235 10648 -1782 1434 -477 37823 12369
512 12369 -37035 -14301 -1249 14873 7721 -34797 -9034 5453 -9899 11182 2728 1720 1169
$$ packed form
421b4574K3877L7236l0896O396p056k1103J8041j8568J5069K2492m8420j497J3950
434a5053R041L3746l4163j6170K7770j1798K1834N105k5712J4454k1952J409L9964
447B8475k3619o070l655j2336M0026p962j7543J8200k4838P232J5277j5876J8437
460A5748k8024k7123L7847O73J289q868l0402L7433J1346j6282K2395j2574J078
473D536O132k1828L7960O289m3606J243k710K5921J5694n2370O038K2012p405
486b094J5341j9795L494K1201m0138P752K8746q489k448m0459L240N7724j5637
499H438j7229m257m080M0084j0809j5599L2687j8587j2430L216j911L8300k5454
512A2369m9404K2734J3052J6122p152m2518K5763J4487j5352K1081q454j008n51
$$ plain form
525 1169 -30041 5173 28785 -562 -9971 -30285 -7978 31191 2307 -1560 1082 -11253 16048
538 16048 12167 13379 26585 -16047 -16266 7112 5779 19884 -14407 -37125 -4761 -7484 5206
551 5206 11360 -18698 -6808 -8161 -1833 35430 8683 -10381 -6311 -12621 22311 17662 -11988
564 -11988 -424 -16719 -8655 18570 6615 13933 -7235 -29967 13747 23398 13688 1141 -32947
577 -32947 -6725 12209 -5817 7627 -8387 -20041 -7678 -15237 20517 30650 -14614 -14996 -5546
590 -5546 18671 39444 -7305 -15909 2197 -6231 10082 1813 -5296 6763 -27285 -18264 21936
603 21936 16290 8935 -24668 -28803 25678 21271 1605 -4563 -22125 1223 1636 -7829 22859 2874
617 2874 -20857 -11851 -5089 35025 25520 -23007 -9918 1418 13462 20249 -14324 -5918 -683
$$ packed form
525A169l1210L5214K3612k9347r409k0314K2307L9169k8884l867K642j2335K7301
538A6048l881J212J3206m2632k19K3378j333J4105l4291k2718L2364k723J2690
551E206O154l0058J1890j353O328L7263k6747j9064M070o310L4932m649k9650
564a1988J1564j6295Q064K7225j1955P318k1168k2732M3714R651r710j2547l4088
577c2947K6222J8934j8026J3444j6014j1654J2363p559L5754J0133m5264l82R450
590e546K4217K0773m6749q604J8106q428J6313q269p109J2059l4048R021M0200
603B1936n646p355l3603m135N4481m407j9666o168j7562K3348M13r465L0688j9985
617B874k3731R006O762M0114r505m8527J3089J1336J2044O787l4573Q406N235
$$ plain form
630 -683 -20946 3144 7008 640 -1915 -32551 -5410 29164 9882 2711 -17229 -13224 21920
643 21920 7536 6770 9166 -18655 -7524 -2556 5031 28172 -6147 -20724 -2980 -2090 21237
656 21237 10797 -13894 707 -11316 -5145 15988 -4108 -3063 -12062 -19980 15046 8174 -5087
669 -5087 629 -14582 6020 15353 631 16544 -2479 -16633 5518 4302 18652 8591 -26862
682 -26862 -6052 2152 1699 13022 -8757 -2558 1782 -20501 4893 14366 2160 621 -23527
695 -23527 -5036 20328 -4990 -3631 -3395 -3913 13530 -8377 -3566 19271 -2494 -3357 -2030 2370
709 2370 25601 -5026 -20804 3491 2192 10445 -348 -16149 8676 -4844 -16757 6380 5923
722 5923 12669 -4500 -30053 4414 14394 3307 5524 -12888 349 5716 -15199 9825 14639
$$ packed form
630f83k0263K4090L864o368k555l0636K7141L4574j9282p171j9940M005L5144
643B1920j4384p66K396k7821J1131M968P587K3141l4319j4577J7744Q90K3327
656B1237j0440k4691J4601j2023O171K1133k0096J045q999p918L5026o872j3261
669e087N716j5211K0602R333j4722J5913j9023j4154K2151j216J4350j0061l5453
682b6862K0810Q204m53J1323k1779O199M340k2283K5394R473j2206j539k4148
695b3527J8491K5364k5318J359K36n18J7443k1907M811K2837k1765q63J327M400
709B370K3231l0627j5778K4295j299Q253j0793j5801K4825j3520j1913K3137m57
722E923O746j7169k5553L4467R980j1087K217j8412J3237N367k0915K5024M814
$$ plain form
735 14639 -1416 -2361 -18462 5311 24263 -5495 -4492 -4553 -3494 15110 -4903 -3331 8435 -14457
749 -14457 -3546 5268 3743 13990 -17024 -20998 8180 6085 14730 1544 -20884 -1666 -4244
762 -4244 3751 24317 -380 -8612 -12690 -13763 21777 15599 -4209 -2721 -18325 -1092 15052
775 15052 2744 11163 -8567 -20702 8235 9493 12651 2176 -25506 -2220 9238 3824 12381
788 12381 -12057 -15378 -3670 -7593 21553 17873 -16251 -16913 -16457 13388 33927 -2229 -10358 -10839
802 -10839 -11663 15398 9915 7274 7418 -26102 -13662 14015 17040 17857 -19123 -24823 12741 11146
816 11146 9589 -1272 -19961 -384 -3618 -2487 19691 -3249 -18102 -16791 -8411 31968 19965
829 19965 -18087 -15024 -10969 14884 26058 -988 2112 -7602 -19408 7219 12919 16147 3516
$$ packed form
735A4639j6055r45j6101K3773J8952k9758J003o1J059J8604k0013J572J1766k2892
749a4457J0911Q814j525J0247l1014l974K9178k095Q645j3186k2428J9218k578
762d244P995K0566k4697q232m078j073L5540o178j9808J488j5604J7233J6144
775A5052j2308Q419j9730j2135K8937J258L158j0475k7682K3286J1458n414Q557
788A2381k4438l321J1708l923K9146l680l4124o62M56K9845K0539l6156q129m81
802a0839q24K7061n483k641J44l3520J2440K7677L025Q17l6980n700L7564j595
816A1146j557j0861j8689J9577l234J131K2178k2940j4853J311Q380M0379j2003
829A9965l8052L063M055K5853J1174k7046L100r714j1806K6627N700L228j2631
$$ plain form
842 3516 -32575 -10174 16348 12992 10624 -17642 -15474 9521 -898 7863 4426 -16478 -6800
855 -6800 -10037 4709 24312 -8026 -17642 -9401 -30 29279 12152 -9933 -2629 -11562 6963
868 6963 21676 4723 4767 -16434 -21184 12145 10203 6143 -3100 -24364 -1197 7927 2714 12499
882 12499 -10172 -13492 1468 -987 15913 2473 -22195 -4735 31 10674 15480 -11853 -5506
895 -5506 12 -2724 21280 12379 -1402 -4924 -19732 7552 22672 -683 -6436 -19503 -10175
908 -10175 14365 -2041 407 1869 -14742 -878 1260 7004 17773 -13662 -15708 5801 7640
921 7640 15789 -7745 -20644 5847 3219 5652 9785 -6631 1838 -5561 -7500 22546 11725 -6139
935 -6139 -11796 -17712 13164 14776 -10570 -5557 -11369 -4475 8234 -4812 7907 5485 -15303 658
$$ packed form
842C516l6091K2401K6522l356k368k8266K168K4995j0419Q761l437k0904R678
855f800l237J4746J9603l2338r616Q241R371K9309j7127k2085P304q933J8525
868F963J4713j6953M4k1201m750L3329j942m060r243k1264K3167R124n213R785
882A2499k2671l320J4960k455J6900j3440k4668J7460M766J0643M806k7333O347
895e506N518k736K4004q901j3781l522j4808K7284J5120k3355n753j3067R328
908a0175K4540j6406K448J462j6611J3864K138N744J0769l1435k046K1509J839
921G640Q149k3534j2899K6491k628K433M133j6416Q469p399j939L0046j0821j7864
935f139n657n916L0876J612k5346N013n812O894J2709j3046J2719k422k0788J5961
$$ plain form
949 658 5760 11322 11972 -18064 -8076 10005 2800 7747 -8068 -11314 6154 -5504 4409 12433
963 12433 -5143 -1563 -8308 -2499 20788 1157 -7953 -4906 -11008 8683 4299 -7043 4861
976 4861 -9191 -5606 8648 316 9886 -51 -12185 8590 3260 1797 5606 -11872 -388 1644
990 1644 -7096 8939 -2900 -9049 1940 -5590 8903 8431 -9768 3702 215 -1271 8861 -5779
1004 -5779 2130 3796 -12643 2941 3043 -994 5316 -10812 342 11706 -5391 1684 -255 -1625
1018 -1625 9360 -9295 -5187 8506 -5330 -845 -4625 -5707 11751 -5223 -6666 8438 288
1031 288 5643 -1837 -6862 15591 3198 -7206 1077 -5071 7658 2115 -12822 5593 267 -6143
1045 -6143 2076 -5115 8387 5227 -15470 1326 4986 2068 4561 -13791 -2202 8755 -6293
$$ packed form
949F58N102N562O50l0036R988J8081p205M947j5815l246J7468j1658R913Q024
963A2433j7576L580o745N809K3287j9631r110L047o102J9691m384j1342J1904
976D861j4052L585J4254q332R570r937j2134K0775n330j463L809j7478J1484K032
990A644q740J6035j1839o149J0989p530J4493m72j8199J3470l487j486J0132j4640
1004e779P909J666j6439J5584J02m037O310j6128J1154J1364j7097P075j939j370
1018a625J0985j8655M108J3693j3836M485l780j082J7458j6974j443J5104q150
1031B88N355p480n025K2453j2393j0404Q283o148J2729n543j4937J8415n326o410
1045f143Q219p191J3502l160k0697J6796L660k918K493j8352J1589J0957j5048
$$ plain form
1058 -6293 3187 237 -3599 5957 -7610 3506 15591 -3138 -1603 -4464 -1602 16439 -1570
1071 -1570 -7173 657 -8946 3314 2756 -4722 6372 -9116 -9662 7645 968 6836 -1524 -13688
1085 -13688 5896 3016 1098 6993 -9469 -2139 2831 -2792 12919 975 -9539 1641 -3111
1098 -3111 9796 10567 -8977 -474 -4312 -4376 11778 -353 -1467 -3616 -16143 5105 9177 -1253
1112 -1253 1171 -12807 -2605 10984 -2152 4982 358 -8877 4021 -1655 5804 11618 -11725
1125 -11725 -6394 2399 4717 14338 -6474 -11791 4373 -1408 6813 5275 -6637 2235 -9311 -7143
1139 -7143 13953 3641 -1438 -9064 -14126 11761 8802 -4530 328 -8801 1457 6577 -4709
1152 -4709 8578 1405 -10244 1873 452 9977 7582 -16291 -3679 5805 4025 9248 -9031
$$ packed form
1058f293R480k950l836R556j3567J1116J2085j8729J535k861K862J8041j8009
1071a570n603P830r603J2260n58p478J1094j5488n46J7307o677N868q360j2164
1085a3688J9584k880j918N895j6462P330M970n623J5711j1944j0514J1180m752
1098c111J2907P71j9544Q503l838o4J6154j2131j114k149j2527K1248M072j0430
1112a253K424j3978J0202J3589j3136P134m624r235J2898n676P459N814k3343
1125a1725N331Q793K318R621k0812n317J6164n781Q221j538j1912Q872j1546K168
1139g143K1096j0312n079p626n062K5887k959j3332M858r129J0258N120j1286
1152d709J3287p173j1649J2117j421R525k395k3873J2612R484j780N223j8279
$$ plain form
1165 -9031 -6819 4722 -5343 6307 6790 -4977 -403 -11352 -1430 16011 -746 -3729 -6636
1178 -6636 -8309 10824 2039 -3865 3793 -8115 -22 5086 -1624 8484 -3853 -9394 7363 2453
1192 2453 5919 1842 -12488 2871 3420 342 8369 -6860 -5838 682 -4369 10610 3942 -9569
1206 -9569 -602 -5607 2672 9041 -6660 19 -2265 -7909 7181 514 -641 1993 -10383 4500
1220 4500 9127 -2299 2852 -5503 -476 11577 -2646 1715 1788 -8389 2863 -688 1403 8849
1234 8849 -11113 -7769 2766 1056 9658 -4574 -10342 5322 -2134 1208 3717 -6121 3215 -3780
1248 -3780 -6812 10170 1118 -2796 -1821 -6322 12276 8658 -6844 531 -2838 3894 8997 -5503
1262 -5503 2064 -946 -11050 2357 1270 3193 2970 -15649 -3682 7560 1980 5832 -7131 -6137
$$ packed form
1165i031K212J1541j0065J1650M83j1767M574j0949R922J7441j6757k983k907
1178f636j673J9133q785n904P658j1908Q093N108o710J0108j2337n541J6757m910
1192B453L466m077j4330J5359N49l078Q027j5229J022O520n051J4979o668j3511
1206i569Q967n005Q279O369j5701O679k284n644J5090o667j155K634j2376J4883
1220D500M627j1426N151q355N027J2053j4223M361P3j0177J1252l551K091P446
1234H849j9962L344J0535j710Q602j4232n768J5664p456L342K509r838R336o995
1248c780l032J6982r052l914R75m501J8598l618j5502P375l369O732N103j4500
1262e503P567l010j0104J3407j087J923k23j8619J1967J1242n580L852j2963R94
$$ plain form
1276 -6137 6946 -2755 3047 4472 -6786 669 -3683 134 12776 -3526 -5263 -173 -1059 13327
1290 13327 3651 -7485 1336 -5253 2007 7961 -4144 299 -7383 -10647 7401 2673 753 -749
1304 -749 -12568 2499 6711 707 7028 -5566 -5741 4929 -660 7924 1877 -11490 391 110
1318 110 3822 8546 -7255 -2303 1701 -2590 10435 2653 -5002 -1549 -9370 3949 9704 -5556
1332 -5556 -3856 -8380 -3940 10647 -450 5 1619 -8107 3532 4361 3003 8613 -8886 -7527
1346 -7527 5566 2053 6691 -4341 -11709 4534 1073 1777 5443 -5984 660 -492 -3486 11523
1360 11523 2294 -6675 -4082 -7366 8423 7720 -8956 -3016 -4667 -130 9251 -2003 2417 1735
1374 1735 -8830 3582 5081 3637 4215 -12518 -4788 7286 482 3573 -5480 -7699 5622 -557
$$ packed form
1276f137J3083r701N802J425j1258P455m352L817J2642j6302j737N090q86J4386
1290A3327r676j1136Q821o589P260N954j2105M443p682l264J8048m728j920j502
1304g49j1819J5067M212o004O321j2594j75J0670n589Q584o047j3367J1881k81
1318A10L712M724j5801M952M004m291J3025p782p655L453p821J3319N755j5260
1332e556J700m524M440J4587j1097M55J614r726J1639Q29j358N610j7499J359
1346g527J3093l513M638j1032p368J6243l461P04L666j1427O644j152k994J5009
1360A1523r229q969K593l284J5789p03j6676N940j651M537R381j1254M420o82
1374A735j0565J2412J499j444N78j6733P730J2074o804L091r053k219J3321o179
$$ plain form
1388 -557 2922 6628 -5441 -92 -855 355 11933 -2385 -7700 -1837 -4125 7710 3462 -8134
1402 -8134 -132 -5084 -239 9044 -938 1981 -2564 -8525 6984 4014 226 1316 -10244 -971
1416 -971 4840 -1606 5488 -3366 -6080 4825 107 6333 5003 -8227 1098 1410 542 6772 -5984
1431 -5984 -4280 395 -5921 5315 2998 -5106 -392 -6826 1746 10376 -2187 -351 -2735 -4337
1445 -4337 7393 -555 -893 3893 -6799 -287 1937 -319 7862 -3510 -5671 5856 860 4392
1459 4392 5 -7822 4826 627 -3016 2970 -5568 -1178 -631 -6727 6515 2665 -5037 91 -4339
1474 -4339 5047 7669 -5446 1202 648 -1808 5087 -3325 735 5099 -5782 882 1737 -980 5309
1489 5309 -4789 -1411 7062 -2499 14 -1992 -4665 6183 -1658 -3892 2086 -5668 96 997 -3183
$$ packed form
1388e57L479L706j2069N349p63J210J1578j4318n315N863k288J1835m248j1596
1402h134Q002m952M845R283r982K919m545n961J5509k970l788J090j1560R273
1416i71N811o446P094q854k714J0905m718O226j330j3230R325L12q68O230j2756
1431e984J704M675o316J1236k317q104M714o434Q572Q630j2563J836k384j602
1445d337J1730p948l38M786j0692O512K224k256Q181j1372k161J1527m996L532
1459D392m387p827J2648m199l643N986q538M390N47o096J3242l850p702N128m430
1474d339R386K622j3115O648n54k456O895q412M060M364j0881O664Q55k717O289
1489E309j0098L378Q473r561K513k006k673J0848p841k234N978p754N764R01m180
$$ plain form
1504 -3183 6255 -1284 -4588 3871 -1063 4276 3143 -5732 3563 1016 -1564 4459 -4271 -186 3060
1519 3060 -3672 4658 325 -4988 2191 -2829 2272 5590 -5719 -576 -2218 -3782 6666 -322
1533 -322 -1571 152 -7982 2792 5085 -1249 3422 -4509 -1756 6210 -1779 3014 1520 -5359 3026
1548 3026 -168 1172 5518 -7057 -2923 2534 -1 6376 -3617 -7367 2587 -1585 3061 4268 -5083
1563 -5083 223 -4336 -3651 8942 1422 -1493 -2923 -7671 6111 5383 -2567 1517 -4596 33 5140
$$ packed form
1504c183R438p539l304Q459m934N339j133q875R295k547k580O023q730M085L246
1519C060o732Q330m333n313P179n020N101L318j1309N143j642j564J0448o988
1533c22j249J723q134J0774K293o334M671p931K753P966p989M793j494o879Q385
1548C026l194J340M346j2575M134N457k535O377r993l750R954m172M646J207r351
1563e083N306m559O85J2593p520k915j430m748J3782p28p950M084o113M629N107
$$ [...]
8191B30
##END NTUPLES=NMR FID
##END=
