##TITLE=1H_64-2021
 CDCl3, 8 sc, 
 4.08.2021
##JCAMPDX= 6.0         $$ Bruker NMR JCAMP-DX V2.0
##DATA TYPE= NMR FID
##DATA CLASS= NTUPLES
##ORIGIN= UXNMR, Bruker Analytische Messtechnik GmbH
##OWNER= root
$$ XWIN-NMR		Version 3.5
$$ Wed Aug  4 10:45:13 2021 Russian Standard Time (UT+4h)  she@DPX200
##.OBSERVE FREQUENCY= 200.131506
##.OBSERVE NUCLEUS= ^1H
##.DELAY= (6, 6)
##.ACQUISITION MODE= SIMULTANEOUS
##.ACQUISITION SCHEME= undefined
##.AVERAGES= 8
##.DIGITISER RES= 18
##SPECTROMETER/DATA SYSTEM= spect
##.PULSE SEQUENCE= zg30
##.SOLVENT NAME= CDCl3
##.SHIFT REFERENCE= (INTERNAL, CDCl3, 0, 15.7039)
##AUDIT TRAIL= $$ (NUMBER, WHEN, WHO, WHERE, WHAT)
$$ ##TITLE= Audit trail, XWIN-NMR		Version 3.5
$$ ##JCAMPDX= 5.01
$$ ##ORIGIN= Bruker BioSpin GmbH
$$ ##OWNER= she
$$ F:/spectra/data/she/nmr/H-F/1/audita.txt
$$ ##AUDIT TRAIL=  $$ (NUMBER, WHEN, WHO, WHERE, WHAT)
(   1,<2021-08-04 10:43:57.92 +0400>,<she>,<DPX200>,
      <created by zg, POWCHK disabled, PULCHK disabled
       configuration hash MD5:
       00 E9 B6 7A A2 85 ED C7 34 08 36 98 17 FE 4E 26
       data hash MD5: 16K
       14 95 9D A4 1E AB 63 0F A8 5D 41 33 75 6D D7 22>)
$$ ##END=
$$ 
$$ hash MD5
$$ 29 5A E8 AC 08 6F 30 CE 7B 15 0D 9E 00 9A 21 4E
##$RELAX= 
##$RELAX= 
##$RELAX= 
##$RELAX= 
##$RELAX= 
##$RELAX= 
$$ Bruker specific parameters
$$ --------------------------
##$DU= <F:/spectra>
##$EXPNO= 1
##$NAME= <H-F>
##$PROCNO= 1
##$TYPE= <nmr>
##$USER= <she>
##$AMP= (0..31)
100 100 100 100 100 100 100 100 100 100 100 100 100 100 100 100 100 100 
100 100 100 100 100 100 100 100 100 100 100 100 100 100 
##$AQSEQ= 0
##$AQ_mod= 1
##$AUNM= <au_zg>
##$AUTOPOS= <>
##$BF1= 200.13
##$BF2= 200.13
##$BF3= 200.13
##$BF4= 200.13
##$BF5= 200.13
##$BF6= 200.13
##$BF7= 200.13
##$BF8= 200.13
##$BYTORDA= 1
##$CFDGTYP= 0
##$CFRGTYP= 5
##$CHEMSTR= <none>
##$CNST= (0..31)
1 1 145 1 1 1 1 1 1 1 1 1 1 1 1 1 1 1 1 1 1 1 1 1 1 1 1 1 1 1 1 1 
##$CPDPRG= <>
##$CPDPRG1= <>
##$CPDPRG2= <>
##$CPDPRG3= <>
##$CPDPRG4= <mlev>
##$CPDPRG5= <mlev>
##$CPDPRG6= <mlev>
##$CPDPRG7= <mlev>
##$CPDPRG8= <mlev>
##$CPDPRGB= <>
##$CPDPRGT= <>
##$D= (0..31)
0 1.2 0 0 0 0 0 0 0 0.06 0 0.03 0 0 0 0 0.0002 0 0 0 0 0 0 0 0 0 0 0 0 
0 0 0 
##$DATE= 1628059437
##$DBL= (0..7)
120 120 120 120 120 120 120 120 
##$DBP= (0..7)
150 150 150 150 150 150 150 150 
##$DBP07= 0
##$DBPNAM0= <>
##$DBPNAM1= <>
##$DBPNAM2= <>
##$DBPNAM3= <>
##$DBPNAM4= <>
##$DBPNAM5= <>
##$DBPNAM6= <>
##$DBPNAM7= <>
##$DBPOAL= (0..7)
0.5 0.5 0.5 0.5 0.5 0.5 0.5 0.5 
##$DBPOFFS= (0..7)
0 0 0 0 0 0 0 0 
##$DE= 6
##$DECBNUC= <off>
##$DECIM= 32
##$DECNUC= <off>
##$DECSTAT= 4
##$DIGMOD= 1
##$DIGTYP= 9
##$DL= (0..7)
0 120 120 120 120 120 120 120 
##$DP= (0..7)
150 150 150 150 150 150 150 150 
##$DP07= 0
##$DPNAME0= <>
##$DPNAME1= <>
##$DPNAME2= <>
##$DPNAME3= <>
##$DPNAME4= <>
##$DPNAME5= <>
##$DPNAME6= <>
##$DPNAME7= <>
##$DPOAL= (0..7)
0.5 0.5 0.5 0.5 0.5 0.5 0.5 0.5 
##$DPOFFS= (0..7)
0 0 0 0 0 0 0 0 
##$DQDMODE= 0
##$DR= 18
##$DS= 0
##$DSLIST= <SSSSSSSSSSSSSSS>
$$ [...]
##$SUBNAM2= <"">
##$SUBNAM3= <"">
##$SUBNAM4= <"">
##$SUBNAM5= <"">
##$SUBNAM6= <"">
##$SUBNAM7= <"">
##$SUBNAM8= <"">
##$SUBNAM9= <"">
##$SW= 20.0188882624521
##$SWIBOX= (0..15)
0 0 2 0 0 0 0 0 0 0 0 0 0 0 0 0 
##$SW_h= 4006.41025641026
##$TD= 16384
##$TD0= 1
##$TE= 0
##$TE2= 300
##$TE3= 300
##$TEG= 300
##$TL= (0..7)
0 120 120 120 120 120 120 120 
##$TP= (0..7)
150 150 150 150 150 150 150 150 
##$TP07= 0
##$TPNAME0= <>
##$TPNAME1= <>
##$TPNAME2= <>
##$TPNAME3= <>
##$TPNAME4= <>
##$TPNAME5= <>
##$TPNAME6= <>
##$TPNAME7= <>
##$TPOAL= (0..7)
0.5 0.5 0.5 0.5 0.5 0.5 0.5 0.5 
##$TPOFFS= (0..7)
0 0 0 0 0 0 0 0 
##$TUNHIN= 0
##$TUNHOUT= 0
##$TUNXOUT= 0
##$USERA1= <user>
##$USERA2= <user>
##$USERA3= <user>
##$USERA4= <user>
##$USERA5= <user>
##$V9= 5
##$VALIST= <valist>
##$VCLIST= <CCCCCCCCCCCCCCC>
##$VD= 0
##$VDLIST= <DDDDDDDDDDDDDDD>
##$VPLIST= <PPPPPPPPPPPPPPP>
##$VTLIST= <TTTTTTTTTTTTTTT>
##$WBST= 1024
##$WBSW= 4
##$XGAIN= (0..3)
0 0 0 0 
##$XL= 0
##$YL= 0
##$YMAX_a= 322599
##$YMIN_a= -570111
##$ZGOPTNS= <>
##$ZL1= 120
##$ZL2= 120
##$ZL3= 120
##$ZL4= 120
##$ABSF1= 10
##$ABSF2= 0
##$ABSG= 5
##$ABSL= 3
##$ALPHA= 0
##$AQORDER= 0
##$ASSFAC= 0
##$ASSFACI= 0
##$ASSFACX= 0
##$ASSWID= 0
##$AUNMP= <proc_1d>
##$AZFE= 0.1
##$AZFW= 0.1
##$BCFW= 1
##$BC_mod= 2
##$BYTORDP= 1
##$COROFFS= 0
##$CY= 11.3945322036743
##$DATMOD= 1
##$DC= 2
##$DFILT= <>
##$DTYPP= 0
##$F1P= 2.36226072786647
##$F2P= -0.459571619588291
##$FCOR= 0.5
##$FTSIZE= 0
##$FT_mod= 4
##$GAMMA= 1
##$GB= 0.15
##$INTBC= 1
##$INTSCL= 1
##$ISEN= 128
##$LB= 0.24
##$LEV0= 0
##$LPBIN= 0
##$MAXI= 10000
##$MC2= 0
##$MEAN= 0
##$ME_mod= 0
##$MI= 1.114404
##$NCOEF= 0
##$NC_proc= 0
##$NLEV= 6
##$NOISF1= 3.799351
##$NOISF2= 2.8
##$NSP= 1
##$NTH_PI= 0
##$NZP= 0
##$OFFSET= 15.70392
##$PC= 1
##$PHC0= -13362.7
##$PHC1= 21.20099
##$PH_mod= 1
##$PKNL= yes
##$PPARMOD= 0
##$PSCAL= 0
##$PSIGN= 0
##$REVERSE= no
##$SF= 200.130013532006
##$SI= 16384
##$SIGF1= 3
##$SIGF2= 2
##$SINO= 400
##$SIOLD= 16384
##$SREGLST= <1H.CDCl3>
##$SSB= 0
##$STSI= 0
##$STSR= 0
##$SW_p= 3612.71676300578
##$SYMM= 0
##$S_DEV= 0
##$TDeff= 0
##$TDoff= 0
##$TI= <>
##$TILT= no
##$TM1= 0
##$TM2= 0
##$TOPLEV= 0
##$USERP1= <user>
##$USERP2= <user>
##$USERP3= <user>
##$USERP4= <user>
##$USERP5= <user>
##$WDW= 1
##$XDIM= 8192
##$YMAX_p= 0
##$YMIN_p= 0
$$ End of Bruker specific parameters
$$ ---------------------------------
##NTUPLES= NMR FID
##VAR_NAME=  TIME,          FID/REAL,        FID/IMAG
##SYMBOL=    X,             R,               I
##VAR_TYPE=  INDEPENDENT,   DEPENDENT,       DEPENDENT
##VAR_FORM=  AFFN,          ASDF,            ASDF
##VAR_DIM=   8192,          8192,            8192
##UNITS=     SECONDS,       ARBITRARY UNITS, ARBITRARY UNITS
##FACTOR=    0.0002496,     1,               1
##FIRST=     0,             0,               0
##LAST=      2.0444736,     0,               0
##MIN=       0,             -570111,         0
##MAX=       2.0444736,     322599,          0
$$ Real data points
##PAGE= N=1
##DATA TABLE= (X++(R..R)), XYDATA
0 0 0 0 0 0 0 0 0 0 0 8 -8 8 -16 16 -23 24 -32 40 -48 56 -65 80 -96 112 -129 153 -177 209 -241 274 -313
31 -313 359 -407 463 -521 587 -661 739 -827 922 -1027 1142 -1266 1403 -1554 1714 -1893 2088
48 2088 -2299 2535 -2792 3077 -3391 3740 -4133 4575 -5077 5652 -6321 7107 -8049 9202
62 9202 -10651 12535 -15092 18794 -24639 35331 -61387 265337 196699 -164173 140390 155985
74 155985 171735 161035 121326 118464 188961 -54915 -276790 -39136 168849 -132024 -185673
85 -185673 42850 18832 -128082 -242018 -337253 -120951 145197 34417 -202721 -98679
95 -98679 14804 -186574 -194096 96693 156324 94620 16863 -118615 4517 211686 58376
106 58376 -102983 118603 322599 124090 -65364 -7550 14634 68589 126793 9421 59974
117 59974 173321 -84903 -298142 -87664 132810 45922 -100979 -106375 -105446 -88745 -97941 -231871
129 -231871 -142584 99026 -14861 -201283 -107281 -32192 -118798 -166916 -68392 60518 111579
140 111579 24771 -186746 -166042 89550 70231 -60872 48776 121114 28865 -64301 -87158
151 -87158 -13030 88697 80560 -42330 -28779 121447 11547 -192409 -93931 60190 79838
162 79838 38309 -58593 -77771 -12034 -39140 -117566 -39618 144213 88687 -121786 -103642 5707
174 5707 17883 2185 -45413 -1566 123800 64799 -110305 -115139 44340 85909 -22110 -5737
186 -5737 72483 36431 -33713 -111574 -73151 109465 116809 -41336 -67654 27357 35797 -69668
198 -69668 -71273 46979 93488 57246 -39612 -77099 43577 57245 -61289 -24328 111777
209 111777 126653 -4475 -96224 -25830 64466 73344 12985 -16310 85997 89958 -78508 -102084
221 -102084 31645 101093 49147 -37863 -20061 41522 11618 -76447 -93961 46216 128016
232 128016 -8398 -89808 -24169 12689 -12873 -59791 -21357 87995 78712 -43103 -106398
243 -106398 -15461 80469 7005 -43472 42090 84006 32621 -62425 -81522 40573 99045 19738
255 19738 -32572 20249 72691 -15217 -100833 -20225 74629 74355 -4181 -71936 -7128 40280
267 40280 -40831 -76144 5243 88516 38310 -78449 -68988 5850 22407 -15079 -49473 25110
279 25110 87096 -14295 -98322 -46040 43838 53642 -21217 -25734 39752 35127 -33523 -82801
291 -82801 -12431 92512 42928 -42736 -24082 20685 15814 -48480 -52533 44721 78972 10356
303 10356 -62225 -43691 35206 11540 -49682 -3704 60231 52413 -30110 -83975 -9879 51191
315 51191 13591 -24997 422 59744 23338 -74817 -56980 28852 62671 19012 -40432 -545
327 -545 45104 -15259 -64929 -25534 60501 70919 -22867 -51497 4027 23764 -9880 -46601
339 -46601 8935 84348 28592 -55125 -49859 12610 43850 -12601 -31465 38162 55537 -8583
351 -8583 -74965 -42256 54699 44050 -26623 -23871 20764 31947 -37367 -80106 3001 68066
363 68066 28300 -40280 -44313 23017 18909 -51756 -38827 33655 68875 10515 -69301 -30079
375 -30079 38701 17781 -26281 -15248 55522 61952 -34796 -66623 -1506 53910 34907 -28809
387 -28809 -7749 55646 19554 -52856 -55499 23369 75455 7924 -46109 -7223 26644 2305
399 2305 -55075 -34801 59338 58591 -23117 -57031 -12310 39420 -770 -43674 12517 62138 33474
412 33474 -41370 -60937 22535 57675 530 -21704 20726 58194 6386 -67224 -27073 49295
424 49295 56362 3388 -36899 11742 42946 -25725 -59036 -152 65814 45967 -36301 -44186
436 -44186 8584 19441 -14206 -39964 15843 73882 8170 -62842 -35011 18578 27098 -14293
448 -14293 -16604 34004 36619 -20631 -69845 -27051 56802 28561 -35617 -13492 19569 6088
460 6088 -42547 -57934 6363 50744 11401 -47791 -37577 22955 -1754 -62892 -23529 36518
472 36518 38023 -8986 -60968 -31433 26909 10823 -30052 -9574 50003 27474 -51963 -42135
484 -42135 12097 29864 18230 -20896 -9338 40532 5521 -61188 -41665 33118 44711 -15345
496 -15345 -28875 -5640 -8681 -19960 -46365 -25489 51425 30888 -55034 -54562 1894 12029 -26232
509 -26232 -27320 14985 33036 16574 -36101 -49290 27719 40355 -19769 -496 51004 36696
521 36696 -17697 -40482 -254 48760 51366 -1344 -29129 30512 37417 -39130 -30482 31042 37863
534 37863 10344 -22608 -20179 14747 12828 -34018 -39419 40055 63621 -24230 -50799 -5497 12037
547 12037 17844 3145 -5192 32972 33439 -25822 -38682 31799 63726 -299 -18955 26843 35049
560 35049 20866 -13947 -34880 29443 66469 4597 -30108 10805 27204 -21846 -32710 17978
572 17978 37138 22833 -22840 -61558 2347 53964 -9647 -43191 8783 38397 5913 -25231
584 -25231 -13668 9159 26780 13011 -18646 25445 60883 -15417 -51012 12741 54561 38619
596 38619 -323 -19349 -1088 22998 6424 -31983 2182 47257 -11278 -50151 -5698 10003
608 10003 -10433 -33308 -40121 462 33261 -9028 -71396 -43326 24853 1847 -31149 796
620 796 7911 -6378 -16708 -31084 6027 50363 12515 -39802 -6657 52443 22122 -28776 -8495
633 -8495 16917 27509 24206 -19172 -16965 25781 -987 -40688 -5511 37480 3953 -49598 -39615
646 -39615 -9759 6569 3048 -44524 -44442 15163 -945 -49868 -28373 7325 -2755 -24603 -14261
659 -14261 5001 10329 1709 -34357 -20606 53237 41459 -23251 -12249 21865 21273 9014 4753
672 4753 14360 27773 21812 -16075 -16568 41183 28094 -34899 -15792 24510 18893 -3233 -29960
685 -29960 -28134 8400 18215 -19336 -31124 13962 10036 -41768 -23221 16062 11500 768 -19361
698 -19361 -18487 23974 28825 -16974 -24591 26853 38775 -5692 -4603 21145 15058 12542 -454
711 -454 -5525 34896 35411 -19720 -26315 23775 36538 -7470 -21492 1860 9274 10393 -9859 -29374
725 -29374 10098 24526 -25119 -31993 11331 21724 -12958 -29372 -6435 13452 16199 -8566
737 -8566 -34047 6748 35442 -10403 -24719 12276 23529 1722 -15707 -4257 18099 22097
749 22097 -4178 -28990 8192 41039 -4555 -29542 2960 18401 7615 -11592 -15915 7345
761 7345 19015 -6141 -30617 -1288 32436 -3871 -32489 -3153 15398 10053 -9187 -24047
773 -24047 2114 24471 258 -26083 -4334 28636 5115 -25713 -5356 15010 14301 -1765
785 -1765 -21545 1348 28797 2927 -25540 -7409 25182 14427 -17141 -9727 10206 12902 227
798 227 -21197 -3162 29311 7445 -22757 -9836 16373 13367 -13709 -13958 8893 15690 2666
811 2666 -21083 -11550 21774 7506 -20523 -8781 13288 12990 -11633 -21149 2107 16331 4707
824 4707 -16720 -11898 18867 10467 -20290 -12218 11205 17350 -436 -17515 -298 16763 4966
837 4966 -14110 -9884 19648 18593 -13708 -14364 6441 14237 1923 -16312 -2375 18992 5680
850 5680 -16035 -15323 9370 16679 -10301 -16347 4143 11391 -334 -19631 -9706 17222 9480 -12339
864 -12339 -13026 6109 16013 -6699 -17127 5598 17823 7011 -12756 -10532 15526 13208 -9057
877 -9057 -9310 8555 19788 -208 -19666 -1164 15723 7007 -10144 -11758 12377 13760 -12815
890 -12815 -17676 838 16051 3721 -19155 -6741 12923 4437 -13186 -15428 7910 19027 -5481
903 -5481 -16997 -1196 13565 5966 -15214 -6434 18066 12076 -7972 -14052 3766 19574 -463
916 -463 -14848 1607 15659 7763 -15009 -14143 12364 13592 -6269 -14562 -765 16192 -115
929 -115 -20884 -6412 12733 10393 -10189 -17834 5703 13725 -5330 -14997 -2589 17036 8383
942 8383 -16383 -9395 10490 11929 -2874 -13533 5135 18672 -330 -14217 -5004 13675 12359
955 12359 -10362 -9504 9092 10389 -4068 -16185 -1520 17709 2615 -14458 -7464 7652 8469
968 8469 -10850 -13599 6647 12280 -1173 -14888 -6487 13896 4633 -12938 -5530 9250 11330
981 11330 -5617 -15169 2391 13260 2587 -9779 -5413 12897 6882 -13649 -8843 6106 10826
994 10826 -419 -13811 -2242 10427 -6 -12708 -8414 10172 10132 -10345 -10418 2154 5942 -325
1008 -325 -11324 -1863 14581 4446 -11933 -8841 7662 11535 -5113 -6914 6471 9001 1855
1021 1855 -10323 -5621 14347 8352 -8572 -5076 8343 9319 -7196 -12582 3248 11064 5343 -9020
1035 -9020 -10622 8944 7102 -11784 -7851 7073 10086 -2625 -12200 -1782 8278 4532 -7294
1048 -7294 -9009 11503 13960 -8948 -10287 4669 9976 4359 -4873 -43 10128 5664 -7216 -8949
1062 -8949 11220 17539 -5987 -10309 4670 7900 2139 -8048 -6237 10131 10595 -6592 -13103 2584
1076 2584 10935 -7777 -11763 5899 9691 2074 -10868 -14861 4940 13417 -3760 -12087 2156
1089 2156 11748 -4161 -13428 -319 6104 5239 -1887 -9831 4456 12608 -7655 -16029 2790 16392
1103 16392 5018 -9453 -4809 1775 4419 1293 -8235 3938 16248 -3599 -15007 1079 11576
1116 11576 3103 -7821 -3653 6259 8809 -72 -15494 -5418 15380 2703 -10613 957 5636
1129 5636 -2540 -9621 -6856 5138 10961 851 -15667 -8150 13518 2727 -13327 -1274 7080
1142 7080 4372 -342 -7457 -2746 6863 2948 -7277 710 17512 4254 -15720 -5084 7300
1155 7300 8893 7682 -3606 -4147 7501 3334 -8966 -2963 12947 6493 -8876 -1747 4688 -80
1169 -80 -2092 -9405 -4870 13804 7291 -13118 -12221 1778 1494 -6677 -642 5245 226 -2761 -11149
1184 -11149 -9603 10717 7968 -10238 -4566 8963 5640 -6512 -7380 509 6068 9307 559 -5707
1198 -5707 6874 3771 -12312 -1766 14151 9849 -1640 -7613 -3513 3590 5434 -2989 -6524 8866
1212 8866 9327 -10557 -8086 3123 793 -1329 -2186 687 6435 1399 -12256 -13557 6679 13886
1226 13886 -3666 -6295 2052 -944 -2589 -4051 -2621 8885 9141 -4979 -8799 4278 7941 -6787
1240 -6787 -6676 8095 10287 5477 -4080 -11261 1704 9537 -798 -2224 7968 8143 -6752 -11570
1254 -11570 399 6535 6104 -43 -7644 2404 7311 -8291 -11896 2014 9194 2561 -4819 -2994
1268 -2994 -1264 -2111 -4574 -6837 6478 13935 -4257 -13193 -2625 3809 1640 -2504 -360 5664
1282 5664 5220 -3293 -10831 -1276 11185 1166 -5128 4383 6252 -133 -7047 -7175 4678 11272 3542
1297 3542 -6675 -3103 5736 -2212 -8816 2002 7743 4491 -2124 -8860 -2057 4671 -1341 -5978
1311 -5978 1549 9924 1452 -10486 -5534 1468 3648 2877 -2425 1605 6876 -3057 -10290 -1739 9138
1326 9138 7080 -2377 -1684 2517 999 -1490 -6167 472 12133 4312 -6540 -3747 1736 855 -4234
1341 -4234 -1832 5634 5731 -506 -8913 -6704 5263 2767 -4941 280 5020 1898 -5830 -8017 274
1356 274 5906 3571 -2175 -2342 5204 942 -8703 -2588 6310 7101 1506 -4626 -1401 2984 -622 -4071
1372 -4071 -699 8114 6088 -6608 -6311 355 1566 201 -2975 695 6120 -654 -8320 -6418 3136
1387 3136 5702 -2232 -2978 3292 1990 -2482 -6720 -2224 8413 5906 -3035 -3068 2390 3662 -3386
1402 -3386 -4049 5236 7985 2985 -4446 -5116 3620 3768 -3460 -1230 5281 5713 -2782 -8556 -2070 4143
1418 4143 2174 -1956 -2740 3712 2697 -7788 -6973 1912 6233 1971 -4809 -1814 3155 -422 -5003
1433 -5003 -3389 5637 8505 -1640 -5712 -66 3302 1237 -3466 235 7864 4125 -4188 -6486 9
1448 9 5808 106 -3738 1740 3986 -330 -6858 -6351 3621 4946 -1629 -3829 -457 2725 -2819 -7683
1464 -7683 -371 5892 4034 -2498 -5364 1347 3324 -2639 -2714 3057 7558 2809 -5796 -2703 3488
1479 3488 3528 -1 -1500 4201 6128 -2432 -5939 -993 4710 4253 -2652 -2016 3238 838 -4280 -5781
1495 -5781 713 6545 356 -5130 -2448 1153 427 -4571 -3380 4783 5010 -1549 -5353 -2193 4106
1510 4106 1196 -3000 1353 5213 3536 -3145 -5194 2221 5303 1187 -1134 897 4506 459 -6093
1525 -6093 -2421 3876 4356 -385 -4239 92 2130 -3491 -5349 -1039 4438 2396 -5725 -5159 7
1540 7 137 -2632 -4377 686 5016 -1232 -6340 -3742 2079 3295 -2089 -1761 3758 2976 -1632 -4935
1556 -4935 -862 6416 3944 -1805 -430 2698 2559 -2830 -3187 3727 5759 1237 -3303 -2757 2821 1008
1572 1008 -4598 -1170 4157 3391 -2623 -6477 -1448 2438 -16 -2531 -1050 4054 1974 -6415 -4785
1587 -4785 2567 4401 970 -2638 423 3754 270 -3844 -1973 5485 6741 -919 -2874 2282 2285 -36
1603 -36 -2236 1373 7127 3755 -3516 -4573 1309 4566 -1071 -2393 3215 3365 -689 -4861 -4000 3058
1619 3058 3771 -2083 -2320 2138 3017 -3793 -6552 247 4680 3166 -1091 -3969 612 2179 -3548 -2933
1635 -2933 3879 5499 88 -4772 -1613 2058 926 -1366 -2202 3476 5871 -2942 -6337 -682 2779
1650 2779 1396 -1177 461 2564 173 -3986 -5060 1571 7011 192 -4165 273 1812 -232 -2691
1665 -2691 -1896 3183 4391 265 -3622 -1019 2895 -1733 -3732 3075 5048 1182 -3518 -5382 -533
1680 -533 3861 745 -2234 584 3476 -1916 -6081 -719 2654 1623 14 -2168 518 3056 -2811
1695 -2811 -5850 427 6244 3230 -2720 -1592 -100 -740 55 -891 2139 5707 -460 -5881 -1238 3052
1711 3052 769 -2336 189 2860 1751 -961 -5061 -2986 4012 1748 -2570 1127 2578 -2193 -5017
1726 -5017 -2335 2452 3932 1205 -3576 -3110 3239 345 -4761 469 4536 1917 -893 -2262 -562
1741 -562 1429 217 -1900 943 6435 1516 -6858 -3126 2725 2256 1442 -491 -474 1836 -514 -4439
1757 -4439 -1758 4737 2893 -3600 -1308 2694 -308 -1837 -2840 -757 5628 3782 -3373 -3569 1719
1772 1719 1393 -2492 600 4746 1825 -955 -3444 -2951 3913 3724 -2984 -1504 4144 2251 -3791 -3754
1788 -3754 424 1880 1665 -476 -2556 1647 906 -6135 -3254 4707 4378 -1457 -3823 -1399 707 760
1804 760 -1323 -2241 3549 4673 -3721 -4039 2017 1836 -524 -580 1325 2995 1556 -3339 -5021 1751
1820 1751 5708 -834 -2670 1945 490 -2013 -2451 -1300 2704 3163 -1704 -4027 395 3043 -2951
1835 -2951 -3755 2547 3244 652 -1528 -3381 327 2987 -355 -1413 3016 4208 -1668 -4580 861
1850 861 3204 2057 783 -1326 1283 3275 -1986 -4025 1780 4715 1168 -2144 -32 928 -655
1865 -655 -1611 -1961 1729 5055 -952 -4893 -564 1763 -543 -1958 410 2555 963 -1703 -3638 -955
1881 -955 3961 193 -2843 1737 2902 -683 -3275 -1950 2064 2918 350 -2183 -339 2934 -996
1896 -996 -4469 744 4121 1341 -1755 -2743 117 1577 -1157 -2867 449 4370 614 -4809 -1914
1911 -1914 1931 690 -814 -1575 724 2875 -1131 -4209 -1029 3450 1855 -2611 -952 2326 554
1926 554 -1910 -2632 550 4330 819 -3410 -1241 2329 1048 -2856 -1463 3198 2657 -698 -3131 -1232
1942 -1232 3337 1011 -2769 -57 3459 1894 -2557 -3516 1481 3159 553 -1737 -743 3081 1257
1957 1257 -3937 -1737 2948 3002 -498 -2988 497 2663 -354 -3025 -970 3457 2710 -3061 -3052 1276
1973 1276 1922 -565 -2716 236 3500 257 -3356 -2289 1910 2912 -1849 -2414 1730 2269 -906 -3269
1989 -3269 -1165 3294 1778 -2294 -1773 1290 2325 -1804 -3291 1374 3237 450 -2587 -2158 2136
2004 2136 1972 -2240 -1854 1665 3090 -591 -3897 -446 2686 1160 -1761 -1550 2070 2199 -2595 -3123
2020 -3123 813 2735 656 -2759 -755 2195 418 -2527 -1832 1564 3082 -1421 -2740 344 1831
2035 1831 455 -2457 -592 3260 1586 -2053 -2178 957 3205 -345 -2316 1160 3037 657 -2679
2050 -2679 -1807 2623 2750 -1079 -1688 411 2365 -546 -3582 -273 2776 1356 -1741 -2446 1012 1644
2066 1644 -2194 -2536 520 2729 419 -3547 -1324 1907 870 -1236 -1666 1866 3090 -1338 -2899
2081 -2899 188 2850 1713 -1957 -738 3079 1567 -1728 -2556 1139 4056 107 -2827 -206 2127
2096 2127 914 -2860 -2288 2408 2491 -1519 -3257 -884 2316 -105 -3464 -528 2466 1210 -2409 -3188
2112 -3188 1260 2695 -469 -1996 5 3293 1425 -3189 -988 3237 2997 56 -1709 1360 3306
2127 3306 -166 -2307 -97 3614 2598 -2628 -2210 1956 1243 -836 -2711 -165 3013 -82 -3977
2142 -3977 -2362 1396 1401 -2963 -2615 1900 1567 -1180 -3531 -1637 3139 1916 -2274 -1167 2023 2127
2158 2127 -1711 -2438 1880 3591 971 -1593 -1488 2735 2189 -2440 -1721 2351 2994 -573 -3242 -627
2174 -627 1578 41 -1716 -1890 1732 1631 -3784 -3569 681 1794 -442 -2900 -953 1699 300 -2400
2190 -2400 -2607 1583 3421 -1244 -2243 1743 2123 -174 -1748 -172 3731 2769 -1296 -2395 1087 3700
2206 3700 -182 -2137 1829 2105 304 -1827 -1750 1646 1961 -1626 -2480 799 2769 -1724 -4509 -366
2222 -366 2108 906 -979 -2413 -80 1653 -1823 -2579 1350 3166 -141 -3195 49 2804 650
2237 650 -705 -1524 1407 4281 -195 -3228 372 2683 312 -1801 476 2372 504 -1787 -2890
2252 -2890 346 4002 -292 -3968 -120 2307 22 -2648 -1790 1262 1459 -652 -2435 -584 2893
2267 2893 -480 -4586 483 3548 1162 -2021 -2502 449 2687 559 -2225 -680 3127 859 -3502
2282 -3502 -294 3043 947 -1181 -1949 572 3277 48 -3582 -1261 3486 2349 -3010 -1622 1911
2297 1911 674 -642 -1522 6 3508 651 -3837 -1495 3340 2441 -2643 -2269 1834 2190 504 -1931
2313 -1931 -1928 2508 1828 -2697 -1243 2589 1745 -2541 -2603 1364 2423 829 -2031 -2661 2474 2753 -2831
2330 -2831 -2035 1834 1746 -773 -1715 496 1974 605 -1992 -2173 2843 3559 -2690 -2812 1658 1777 36
2347 36 -1789 -1069 1657 1111 -1691 -2257 1739 2695 -2687 -3107 1763 1843 -73 -1889 -1940 1653 2146 -1545
2365 -1545 -2709 991 2972 -1335 -2526 1140 1718 215 -1048 -1719 1972 3025 -1455 -2837 703
2380 703 2887 -150 -2298 515 1627 482 -659 -2101 1086 3079 -1357 -2690 821 2154 -185
2395 -185 -2630 -416 1787 1148 -575 -2493 -11 3038 -1041 -2889 1164 2468 307 -2090 -1497 1626
2411 1626 1814 -191 -2090 86 3613 -339 -3455 251 2200 947 -816 -1324 918 1734 -861 -2519
2427 -2519 -160 3323 779 -3245 -409 1712 214 -1135 -1881 812 2799 -338 -2951 -1099 2526
2442 2526 772 -2677 -434 2266 722 -1081 -2621 -609 3039 503 -2533 -499 2541 937 -3013
2457 -3013 -1759 2085 1782 410 -1926 -1236 2608 613 -2974 -749 2832 2345 -1512 -2393 988 1620
2473 1620 21 -1516 -819 3309 1964 -2827 -1861 1514 1796 -497 -1639 931 2098 -163 -2369 -1845
2489 -1845 2320 2452 -2139 -1891 1206 1309 -650 -2462 -125 2791 1248 -1630 -2016 1233 2340 -1705
2505 -1705 -1607 1976 2497 395 -2281 -1537 2204 1729 -1221 -1306 1286 2458 -1290 -3098 510 1922 791
2522 791 -1171 -1653 1456 991 -2316 -2360 567 2726 -49 -2791 -271 1101 -27 -1308 -1426 1862
2538 1862 2360 -1337 -2246 148 1941 296 -1863 161 2388 859 -1464 -2120 845 3031 -316 -1768
2554 -1768 630 1888 164 -2604 -1215 2201 1614 -750 -2029 -221 1892 -957 -2633 202 2188
2569 2188 1180 -1940 -2253 1323 1338 -935 -1369 505 2964 297 -2683 -671 1876 1366 -607 -1528
2585 -1528 1652 1870 -1219 -2053 96 2629 1303 -2157 -840 1474 818 -1358 -2220 1006 2886 -492
2601 -492 -2203 -803 1259 1015 -2365 -1416 2133 1549 -976 -2566 -326 2695 194 -1844 -365 1921
2617 1921 1551 -2155 -2459 1560 2256 103 -1614 -736 2522 289 -2718 -1109 1652 2335 -669 -2626
2633 -2626 319 1668 -582 -1979 -756 2545 1708 -2329 -1645 969 1778 -274 -2040 714 2577 26
2649 26 -2225 -1398 1653 2320 -1416 -1381 1193 1687 -308 -2765 -622 2791 1131 -1542 -1662 809 1974
2666 1974 -1383 -2296 1095 2395 842 -2025 -1657 1867 1381 -1168 -1084 1291 2852 -443 -2674 157
2682 157 2147 1368 -889 -1125 1978 1791 -1860 -1811 543 2527 344 -2490 -556 1487 243 -1679
2698 -1679 -2176 1053 2082 -1363 -2641 -436 998 70 -2449 -893 1948 1117 -1259 -2500 200 2607
2714 2607 -108 -1535 688 1846 943 -1567 -1033 1819 2297 62 -1124 511 2686 61 -2293 83
2730 83 2027 1674 -884 -1974 449 1034 -1183 -1694 -137 1998 -31 -3247 -1366 585 513 -869 -1975
2747 -1975 438 1870 -998 -2332 -583 2159 1286 -1488 -1 1927 984 -404 -1832 870 3743
2762 3743 1005 -1597 -239 1975 1421 -1266 -577 2012 1814 141 -1977 -744 2223 162 -2332 -527
2778 -527 2011 1060 -1947 -2860 -25 1287 292 -1604 -1179 1648 111 -3160 -1039 1658 1682 -346 -1773
2795 -1773 130 1614 45 -1874 -1053 2729 2494 -1658 -1254 727 836 11 -1175 597 2681 573
2811 573 -2305 -1933 1407 2173 -1480 -1400 1151 1068 -75 -2118 -1793 1822 1524 -1238 -1446 1170 1608 -2201
2829 -2201 -2554 938 2104 1136 -1215 -2507 732 1491 -1491 -1405 1228 2109 -627 -2277 -250 822
2845 822 569 -755 -1406 1708 2418 -1828 -2970 67 2031 776 -938 -153 942 249 -1067 -1811 1271
2862 1271 3229 -645 -2303 270 1482 170 -1386 -589 1545 1946 -4 -2689 -870 2027 -474
2877 -474 -1623 1024 1729 56 -1935 -2440 258 1858 311 -1653 -266 1994 -361 -2768 -159 1527
2893 1527 1053 330 -1109 320 1097 -591 -1819 429 3079 1286 -1774 -697 679 442 223 -760
2909 -760 789 2659 -22 -2176 -980 1564 998 -1194 -67 1701 735 -621 -2397 -1130 2432 1258
2925 1258 -1457 -437 1084 150 -1612 -1022 1388 1695 527 -1276 -1350 1489 646 -2098 23 2313
2941 2313 1409 -822 -1849 19 1014 639 -554 -471 2220 992 -2757 -1534 1199 1448 459 -1043 7
2958 7 1133 -288 -2088 -1542 2237 2408 -1500 -1555 517 340 -470 -1366 -353 2568 1257 -1737 -2240 548
2976 548 1573 -1062 -1116 1259 1505 67 -1988 -2119 1178 1801 -723 -1081 854 1291 -1405 -2312 433
2993 433 1709 1166 -536 -1946 775 1134 -1524 -1604 1018 2281 394 -1894 -1058 697 342 -527 -1164
3010 -1164 1490 2265 -1337 -2437 -229 1491 1085 -982 -607 1327 1043 -1185 -2323 227 2624 345
3026 345 -1372 -36 800 257 -1384 -1090 1655 2238 37 -1855 -715 1375 -25 -1466 404 1337
3042 1337 1101 -833 -1936 97 1419 -82 -1153 73 1917 290 -2569 -1111 1026 1513 336
3057 336 -1332 74 1257 -766 -1934 -271 2008 1403 -1391 -1204 638 463 -190 -1596 178 2373
3073 2373 533 -1715 -1143 446 1160 -862 -799 1278 1218 -369 -1928 -1088 1673 1013 -991 -346 913
3090 913 765 -1036 -1842 544 1515 460 -866 -701 1024 335 -1793 -749 1380 1641 51 -1849 -463
3107 -463 1198 159 -741 -550 1698 1472 -1498 -1531 426 1130 396 -1287 -172 1715 245 -1571 -1398
3124 -1398 899 2159 -402 -1324 480 724 -144 -1739 -609 2246 1336 -897 -1282 233 1379 -269
3140 -269 -1273 616 1603 782 -1316 -1559 1039 1247 -650 -766 542 1495 -462 -2411 -388 1649 852
3157 852 -666 -1235 652 1090 -1437 -1798 50 1641 821 -1810 -1094 1088 475 -881 -1228 846 2349
3174 2349 -76 -1651 -341 1139 1003 -950 -755 1637 1330 -531 -1628 -258 2096 428 -1133 57
3190 57 1110 722 -1161 -1594 957 1604 -78 -1000 -697 1113 241 -1704 -631 1174 1172 -573 -1992 -65
3208 -65 1097 -266 -1050 -336 1346 1011 -1751 -1341 696 1085 318 -1239 227 1535 -34 -1349 -575
3225 -575 1382 1649 -513 -863 780 1146 60 -1214 -329 2229 1051 -878 -671 484 1033 -485 -1118
3242 -1118 820 1283 34 -1362 -1212 844 592 -1257 -627 492 720 -786 -2046 -217 1072 218
3258 218 -682 -849 721 511 -1795 -1172 701 1280 451 -1393 -219 1240 308 -721 -633 1468 1983 -638
3276 -638 -1036 485 1208 600 -604 -70 1847 939 -984 -1123 550 1725 -131 -1163 230 561 -21
3293 -21 -1318 -1250 1119 956 -1029 -1290 19 695 -674 -1950 -39 1286 709 -1173 -1829 638 1046
3310 1046 -932 -855 666 1596 427 -1666 -357 1218 1081 -223 -748 1113 1989 -524 -1531 280
3326 280 1531 1254 -650 -768 992 716 -701 -1366 361 2166 -199 -1716 -748 326 491 -932 -1458
3343 -1458 709 1086 -464 -1693 -842 1065 238 -1372 -186 978 545 -976 -1922 385 1940 479
3359 479 -929 -352 1236 564 -1367 -379 1135 1303 341 -1291 -3 1439 -344 -1250 -137 1545 1263
3376 1263 -1124 -1536 -19 747 491 -1091 -205 1623 -83 -1737 -742 650 1239 -477 -992 381 646
3393 646 21 -1546 -723 1661 897 -829 -559 231 379 -481 -1141 568 1362 330 -1266 -1268 1099 810
3411 810 -1113 -543 787 922 21 -1555 -618 1068 671 -664 -687 1145 830 -1612 -1221 407 1129 718
3429 718 -800 -1072 893 438 -1108 -930 748 1508 -465 -993 94 259 206 -836 -812 1471 1183 -1112
3447 -1112 -1451 0 1252 -304 -725 365 611 396 -1224 -1342 940 1505 -642 -885 287 1112 -123
3464 -123 -1541 -131 1351 1324 -243 -1364 549 1545 -677 -972 598 1456 565 -1384 -940 481 1075
3481 1075 -124 -1275 387 1803 -622 -1771 -309 852 842 -541 -986 578 878 -443 -1557 -50
3497 -50 1977 250 -1178 -347 457 457 -438 -1266 714 1556 82 -1344 -472 1038 205 -1176 -246 796
3515 796 1000 -84 -1667 -39 1649 -47 -1218 -278 1230 579 -1510 -1041 353 1065 402 -1081 -464
3532 -464 1343 -25 -1289 -458 1172 1290 -518 -1045 99 791 378 -1188 -572 1545 647 -1203 -637
3549 -637 421 887 -226 -919 222 1239 185 -1285 -1082 1344 1053 -1006 -573 294 849 -168 -1308
3566 -1308 -240 1221 571 -878 -1002 759 897 -949 -726 376 1213 460 -1312 -775 1006 785 -695
3583 -695 -758 532 1311 -577 -1020 320 743 601 -1068 -887 1098 776 -806 -868 283 1088 -37 -945
3601 -945 35 520 270 -809 -1085 999 1188 -779 -959 65 1138 170 -1241 -399 776 451 -655
3618 -655 -1268 505 1161 -498 -1160 85 1044 205 -1461 -554 943 890 -317 -1317 180 1338 -458
3635 -458 -1047 -5 986 786 -920 -882 760 1028 -282 -1164 70 1644 85 -1284 -253 698 889
3652 889 -504 -855 600 863 -385 -948 -198 1314 405 -1226 -436 704 758 -305 -1265 238 1411
3669 1411 -117 -1109 -290 1017 775 -1057 -736 709 898 -174 -1455 -76 1407 260 -948 -634
3685 -634 894 1119 -703 -931 490 1061 184 -986 -386 1446 419 -1023 -572 529 1047 -373 -1209
3702 -1209 248 945 28 -1031 -616 971 699 -886 -611 413 915 -175 -1453 20 1046 216 -730
3719 -730 -674 827 1101 -751 -999 260 915 140 -1109 -88 1173 511 -768 -830 484 1166 -714 -935
3737 -935 169 1103 519 -987 -482 1070 628 -446 -841 226 1191 -212 -1234 -1 909 502 -860
3754 -860 -1075 769 786 -558 -689 82 1087 -8 -1121 -219 709 246 -650 -768 627 936 -505 -975
3772 -975 -132 1015 113 -1150 -344 784 705 -620 -1075 298 1205 -468 -1107 -113 669 472 -1147 -743
3790 -743 593 396 -469 -982 -115 1036 -86 -1088 -283 442 570 -740 -1007 724 876 -334 -799 -211
3808 -211 1190 412 -1111 -249 786 888 -472 -1073 625 1167 -258 -633 -312 1215 591 -1066 -228
3825 -228 863 1067 -288 -957 288 1447 83 -807 -391 1110 892 -719 -800 479 1162 -8 -1003
3842 -1003 -110 1493 561 -798 -403 622 1063 -359 -981 503 1079 134 -678 -181 1054 718 -701
3859 -701 -338 605 1216 -48 -961 296 1168 287 -762 -766 1052 809 -710 -603 240 1024 -122 -1264
3877 -1264 -126 936 293 -663 -951 510 899 -677 -1020 52 809 487 -1109 -373 927 427 -609
3894 -609 -835 245 932 -277 -1142 -49 672 465 -720 -879 663 422 -546 -634 166 622 -241 -1142 -235
3913 -235 675 306 -617 -1135 428 813 -591 -885 -113 717 211 -979 -445 495 322 -538 -1137 382 1007
3932 1007 -485 -1003 -116 713 527 -886 -608 521 573 -286 -1272 126 932 -424 -913 -65 534 568 -679
3951 -679 -852 508 815 -106 -1057 -185 997 28 -922 -54 428 517 -457 -877 489 866 -101 -707 -177
3970 -177 980 265 -812 -266 563 609 -131 -1021 24 1181 -103 -772 -187 950 552 -858 -533 454
3988 454 618 -42 -1021 99 1232 38 -722 -230 495 720 -384 -433 650 781 94 -677 -148 1394
4006 1394 488 -773 -320 629 786 -222 -733 530 895 194 -985 -420 953 588 -795 -438 452 825
4024 825 -84 -1058 1 923 410 -662 -627 727 600 -655 -520 321 932 228 -826 -437 944 411
4042 411 -704 -498 564 1028 -718 -847 138 659 400 -835 -478 732 491 -778 -814 6 942 -143
4060 -143 -680 235 665 227 -793 -645 823 965 -306 -633 -70 643 59 -790 -5 871 370 -647 -765
4079 -765 540 723 -506 -770 151 790 440 -768 -430 390 551 -59 -662 336 836 -492 -968 -78 693
4098 693 564 -483 -751 489 405 -280 -564 13 1011 133 -605 99 536 223 -584 -639 888 735 -272
4117 -272 -638 -190 769 304 -694 -68 491 423 -429 -731 305 787 -227 -627 -1 625 147 -1062 -461
4136 -461 661 887 -182 -950 -221 620 -445 -614 52 747 529 -880 -671 307 564 63 -776 25 1006
4155 1006 134 -863 -420 618 559 -219 -821 513 562 -186 -951 -211 1099 463 -697 -376 248 509 -214
4174 -214 -942 334 816 174 -561 -464 786 433 -630 -388 654 689 -248 -930 -242 935 378 -646 -344
4193 -344 505 699 -634 -592 327 710 248 -783 -120 805 167 -680 -560 638 906 -48 -721 134 640
4212 640 255 -501 -205 849 391 -501 -661 69 739 2 -810 117 724 192 -618 -730 592 798 -371
4231 -371 -476 156 503 -139 -900 -73 823 516 -294 -780 115 533 -426 -497 -66 752 163 -949 -588 287
4251 287 359 -499 -569 174 819 -420 -1034 -277 232 490 -577 -461 435 103 -367 -603 84 886 296 -618
4271 -618 -165 420 210 -353 -343 547 682 -70 -628 -192 582 133 -588 -132 670 391 -286 -803 137 637
4291 637 -131 -612 -90 440 148 -854 -824 317 419 -148 -770 -15 471 -252 -816 -296 510 560 -475 -438
4311 -438 419 381 -170 -299 50 868 275 -691 -166 554 811 -85 -340 595 632 33 -538 -57 822 449 -373
4332 -373 -113 424 419 -407 -713 147 517 187 -480 -537 602 266 -696 -353 452 563 -124 -717 -44 819 167
4353 167 -360 -112 471 707 -415 -488 473 829 375 -300 85 809 451 -368 -26 594 957 -164 -684 297
4373 297 557 166 -455 -179 903 399 -369 -568 197 399 -196 -638 89 607 41 -569 -860 318 278 -411
4393 -411 -467 85 491 -139 -986 -363 397 371 -474 -718 227 451 -531 -790 -126 659 228 -733 -362 290 79
4414 79 -418 -366 120 581 -345 -779 -157 367 145 -448 -564 249 207 -549 -650 -164 528 -228 -781 -359 251
4435 251 162 -590 -784 205 430 -438 -816 -339 471 47 -483 -263 579 492 -295 -728 270 695 125 -405 143
4456 143 545 305 -543 -361 513 511 126 -372 177 776 -114 -480 10 409 603 -363 -339 447 307 -234 -535
4477 -535 183 828 26 -649 -129 451 387 -230 -461 529 609 -155 -797 -238 837 481 -377 -162 439 463 -152
4498 -152 -851 138 857 191 -212 -199 582 318 -452 -337 507 660 10 -606 -81 650 212 -459 -73 427
4518 427 522 -501 -746 356 545 3 -709 -189 748 139 -862 -332 459 679 -254 -582 119 326 131
4537 131 -637 -336 650 525 -442 -528 197 366 -87 -679 138 701 298 -689 -583 474 277 -208 -540 251
4557 251 561 -29 -855 -263 540 423 -168 -485 220 486 -300 -689 150 646 307 -692 -503 343 230 -381
4577 -381 -338 407 700 -135 -839 -225 351 57 -605 -408 519 386 -505 -747 2 625 132 -593 -80 462
4597 462 223 -421 -611 418 546 -276 -520 0 445 112 -686 -224 430 435 -183 -592 -157 337 -222 -398
4617 -398 150 532 305 -737 -459 479 346 -170 -455 129 598 -168 -505 0 414 365 -293 -298 422 126 -269
4638 -269 -562 216 676 148 -833 -379 136 230 -189 -373 251 559 -267 -334 -152 437 136 -597 10 476 308
4659 308 -271 -675 -78 726 20 -310 -94 299 -206 -732 -225 462 402 -129 -614 21 519 -224 -497 30
4679 30 336 619 -367 -659 185 257 69 -404 -53 674 -21 -690 -457 337 547 -112 -593 182 364 -99 -631
4700 -631 -151 695 340 -500 -315 281 361 -234 -757 127 650 128 -590 -659 265 443 -240 -126 259 512 -21
4721 -21 -498 -202 335 163 -251 -200 340 440 -273 -654 40 528 288 -336 -264 495 148 -350 -369 268 737
4742 737 -414 -711 97 501 150 -503 -441 510 410 -503 -442 -36 377 -10 -803 8 356 -79 -486 -513 317
4763 317 620 -281 -208 -85 378 121 -665 18 439 331 -258 -505 166 446 -307 -509 110 514 188 -432
4783 -432 -286 398 378 -352 -242 112 571 -82 -593 -112 359 236 -285 -413 554 370 -316 -474 77 601
4803 601 126 -344 -22 416 280 -134 -438 378 750 -55 -424 -136 665 250 -494 -104 468 271 -278 -330
4823 -330 404 742 -155 -183 137 575 393 -425 -216 708 547 -8 -470 83 592 21 -307 36 513 425 -623
4844 -623 -460 174 317 -242 -314 76 550 -86 -591 -223 156 450 -258 -551 140 582 -188 -571 -106 462
4864 462 381 -375 -155 426 293 -53 -567 276 619 -62 -402 -229 437 373 -378 -280 443 366 -181 -582 -8
4885 -8 458 68 -394 -305 340 171 -592 -564 34 261 -145 -521 -360 377 196 -685 -367 5 444 -318 -548
4906 -548 1 207 -61 -398 -282 372 472 -229 -410 187 408 -77 -494 -19 509 200 -494 -443 302 594
4926 594 -268 -450 103 153 -34 -732 -160 331 179 -362 -588 39 450 -289 -481 115 465 -11 -518 -432 349
4947 349 198 -362 -446 51 452 -72 -532 105 334 58 -469 -326 505 299 -209 -226 17 683 41 -433 -40
4968 -40 307 330 -193 -209 379 536 -187 -379 -55 432 165 -334 -213 547 217 -233 -364 151 545 -282 -252
4989 -252 59 492 234 -458 -174 414 172 -64 -336 102 551 7 -613 116 472 450 -318 -503 311 325 -132
5010 -132 -265 79 572 207 -554 -141 372 302 -179 -324 327 425 -280 -420 5 395 285 -541 -221 347 140
5031 140 -304 -613 131 522 -220 -506 -176 239 177 -316 -290 410 368 -92 -559 -175 422 -98 -446 -243 353
5052 353 410 -324 -474 47 400 -73 -439 -136 278 24 -644 -258 325 467 -70 -408 24 399 -50 -446
5072 -446 -282 558 276 -443 -144 52 413 -54 -517 62 590 -101 -333 -273 334 540 -150 -194 165 419 -15
5093 -15 -434 -15 412 495 -296 -204 256 537 -235 -478 226 212 92 -366 -208 338 342 -414 -318 -35 501 32
5115 32 -507 -170 366 207 -72 -323 287 275 -241 -178 -17 477 28 -418 -13 287 152 -296 -330 137 323
5136 323 -124 -309 -63 257 -76 -425 -25 480 265 -249 -233 4 432 -171 -273 48 324 189 -211 -332
5156 -332 244 203 -86 -84 74 365 -188 -570 -62 371 270 -299 -187 491 254 -174 -222 -112 411 17 -464
5177 -464 72 452 229 -225 -360 160 388 -44 -384 -54 418 277 -394 -32 284 123 -242 -258 164 518
5197 518 14 -508 -94 388 361 -191 -192 354 389 -157 -517 -124 415 138 -270 -50 272 205 -407 -318 270 494
5219 494 -60 -356 -148 463 243 -306 -208 73 347 -158 -297 95 506 -176 -531 -337 397 235 -452 -205
5239 -205 195 151 -73 -409 37 491 -22 -163 -189 327 338 -512 -662 194 500 203 -438 -121 400 199 -353
5260 -353 -170 167 347 -190 -357 70 284 72 -311 -222 184 307 -181 -166 205 383 65 -405 -43 241 -22
5281 -22 -197 -195 332 376 -238 -237 144 353 -7 -425 -146 360 140 -263 -405 239 223 -197 -320 104 335 230
5303 230 -343 -303 359 154 -307 -225 78 305 -175 -315 100 300 81 -212 -279 195 95 -133 -251 -88 407
5324 407 10 -296 -76 345 126 -146 -398 246 346 -207 -308 58 294 179 -426 -68 409 258 -128 -474
5344 -474 114 312 -182 -390 164 296 152 -393 -13 333 211 -342 -286 239 309 -156 -272 37 365 252 -277
5365 -277 -223 283 181 -119 -280 -17 206 -109 -364 -88 118 257 -254 -409 239 343 -127 -300 -179 228
5385 228 202 -351 -235 210 289 -322 -330 70 361 -154 -363 -33 420 184 -303 -272 67 265 82 -499 -92 528
5407 528 72 -393 -24 342 320 -167 -339 192 289 -146 -236 -67 175 34 -257 -210 101 276 59 -472 85
5428 85 359 61 -259 -442 313 257 -124 -319 159 295 99 -334 37 503 260 -136 -270 161 258 -71 -115
5449 -115 121 224 159 -349 -114 310 68 -142 -200 174 220 -190 -286 112 131 188 -296 -258 275 22 -236 -176 16
5472 16 423 -190 -240 64 114 132 -243 -134 237 82 -334 -301 19 259 35 -311 74 178 89 -163 -353 154
5494 154 126 -80 -345 98 350 -25 -512 -35 207 151 -251 -332 34 508 -55 -286 -45 289 363 -241 -301 198
5516 198 241 -34 -49 126 286 -69 -144 12 167 212 -199 -290 373 200 -65 -81 103 308 44 -255 12 207
5538 207 197 -179 -183 150 282 33 -343 -80 289 282 -258 -176 346 241 37 -290 84 262 -79 7 -104 314
5560 314 237 -494 -275 169 184 -84 -349 -22 423 -231 -200 -127 124 384 -368 -224 138 209 -42 -195 -334 233
5582 233 122 -204 -162 170 215 -198 -109 117 235 -29 -233 -267 200 307 -139 41 3 306 -24 -336 137 333
5604 333 55 -350 -195 157 387 -211 -136 122 268 61 -306 -59 383 86 -94 -55 229 350 -195 -310 213
5625 213 91 181 -97 -12 245 186 -118 1 125 237 37 -432 258 312 -83 -249 -3 172 118 -101 -253 -11
5647 -11 322 -17 -279 -53 252 31 -135 -182 157 183 25 -114 -147 5 26 -318 7 183 -11 -135 -63 94
5669 94 169 -60 -295 25 206 342 -334 -138 178 147 -138 -170 129 268 -129 -71 27 271 212 -247 -185 180 246
5692 246 -142 -324 -50 207 18 -354 -84 164 146 -121 -265 286 440 -98 -163 4 244 271 -191 -167 215
5713 215 199 66 -182 -105 219 -119 -270 -59 282 196 -335 -249 232 315 32 -329 -4 374 -119 -196 -2 117
5735 117 291 -254 -232 149 228 -156 -149 -111 251 168 -365 -248 142 134 -72 -218 103 157 -85 -157 -83 176 187 -300
5759 -300 -390 60 223 25 -541 -91 269 -19 -162 -170 144 141 -130 -188 274 221 -137 -393 -131 328 161 -185
5781 -185 -184 114 218 -235 -425 -59 333 94 -163 114 253 -11 -212 -176 57 232 43 -259 -40 174 94
5802 94 -200 83 471 165 -156 -105 -53 -4 -39 -308 -11 256 177 -137 -291 102 275 -95 -43 18 154 29 -255
5825 -255 -66 138 -71 -141 -303 -120 238 -2 -66 -82 2 60 -188 -155 146 146 -158 -158 -50 195 50 -241 -181 37
5849 37 64 -85 -122 346 83 -149 -177 -35 118 154 -210 -66 225 112 10 -277 102 267 -31 -201 -67 227
5871 227 75 -108 38 358 185 -54 -215 185 359 -55 -269 38 153 245 -35 -289 53 173 -80 -52 -45
5892 -45 402 -86 -59 -87 46 262 -160 -190 223 158 -70 -111 48 375 47 -267 -120 4 3 -149 -166 139 635
5915 635 -120 79 -55 93 206 -180 -18 82 93 -85 -159 9 191 5 -222 -162 189 136 -191 -179 234 177
5937 177 -205 -250 -229 104 70 -139 -145 -59 129 -105 -248 -113 235 10 -156 -102 346 26 -160 -50 50 314
5959 314 78 -208 148 279 -166 -74 -188 140 139 -119 -213 12 111 270 -228 59 255 220 2 -59 112 135 -105
5982 -105 -168 -6 15 83 -341 -197 238 -147 -32 -42 90 259 -177 -57 107 70 138 -350 -15 200 -148 -135
6004 -135 -237 -18 235 191 -218 54 173 30 -7 -263 354 54 -284 52 -4 134 12 -297 -33 344 171
6025 171 -31 -214 66 143 -125 114 42 5 128 -87 -2 58 213 -179 -124 -10 236 -23 -186 26 109 231
6047 231 -65 -140 75 145 -213 -155 75 388 50 92 108 67 167 -98 22 167 370 -255 -179 -44 236 216 -134
6070 -134 -177 294 197 -39 -226 160 221 89 -122 -5 306 109 -176 -117 383 78 28 -158 88 192 17 -206
6092 -206 -98 108 329 -235 -156 146 -19 23 -194 104 156 -22 -211 -86 97 498 -253 -227 50 184 37
6113 37 -250 29 165 132 -400 -98 32 10 -145 -148 -36 300 4 -66 -135 24 129 -282 24 99 95 12 -111 97
6137 97 241 -54 -147 -134 154 223 -131 -236 100 280 3 -211 -224 275 151 -147 31 87 191 -158 -304 164
6159 164 26 96 62 -10 193 45 -9 -122 23 131 -162 -235 -55 173 53 -168 -114 107 46 -86 -155 -48 37
6182 37 -26 -304 -38 32 -6 -115 -61 -44 36 -156 -241 -99 123 65 -252 -79 216 88 -170 -151 -69 145 -113 -227
6206 -227 69 132 23 -301 -198 211 102 -196 3 106 357 -57 -282 59 168 -54 -32 45 131 111 -288 -158
6228 -158 -34 115 289 -278 -52 174 102 -57 -96 43 222 47 -150 106 96 11 8 10 181 -60 -140 -270 -135
6251 -135 225 -59 -42 122 100 173 -235 -136 236 275 -238 -78 -67 341 15 -52 -188 204 331 -107 -63 -69 207
6274 207 -267 -81 -192 317 -28 -294 -125 81 153 -136 -201 153 145 -145 -184 -32 40 -30 -181 -153 39 37 -22 -306
6298 -306 181 268 63 49 -69 -50 371 110 -163 108 234 78 -89 96 253 -50 -208 23 26 26 51 -152 -64
6321 -64 120 -64 -223 -143 118 -49 -67 -110 -251 37 206 -236 -10 102 -95 -221 -120 201 211 -117 -146 -100
6343 -100 278 42 -362 54 280 36 -83 -182 219 242 -57 -115 108 52 225 -180 41 158 -88 -87 -36 -2 28
6366 28 -50 -299 5 44 26 -79 -150 -5 -6 -68 -62 -138 171 78 -121 -114 137 12 -274 -84 141 -11 -25 -74 -110 -22
6392 -22 172 -178 -36 -13 102 -138 -91 -10 95 -203 -209 -71 295 84 -197 -87 249 139 -147 -185 110 -4
6414 -4 -150 -145 91 -18 95 -155 -135 143 74 -228 -81 -81 145 -17 -118 91 -31 211 -128 131 20 161 -47
6437 -47 -42 93 173 35 -237 -81 -87 -101 220 -241 91 163 103 0 -42 64 -53 -132 25 207 43 -106 -173 -11
6461 -11 58 -64 -166 27 70 53 -219 -57 148 28 -31 -107 8 358 13 -35 -154 62 84 -159 -64 82 107
6484 107 -29 -20 -37 130 106 42 -240 40 45 -85 -50 26 186 71 -39 43 -67 159 54 -37 51 41 102 -29 31
6509 31 175 37 8 -135 42 68 -257 -122 57 121 129 -231 -136 12 22 41 -6 40 90 -186 -133 -43 24 91 -104
6534 -104 80 127 143 -255 -80 94 39 207 6 22 85 201 -144 -77 -46 -134 -94 72 -17 12 -20 -108 -124 62 -27
6559 -27 -165 -79 75 68 76 -53 -140 4 0 -156 -129 326 103 -29 -169 104 161 -89 -155 39 127 -105 -144 -76 -17
6584 -17 43 -277 -187 -188 329 -73 -83 -14 168 200 -145 -76 142 152 56 35 143 159 129 -47 89 283 53 -46 -27
6609 -27 -3 218 -21 -41 -38 52 29 -145 75 145 62 -166 -155 72 144 122 -292 68 83 65 -151 -169 175 108 69 55
6635 55 153 195 125 -136 -39 24 109 -215 -213 7 -35 201 -66 34 84 6 -169 -124 36 111 -148 -287 45 94 -115
6660 -115 -27 -48 298 30 -42 -3 -47 148 -121 -225 -84 180 98 -152 44 52 -16 15 -115 51 102 -13 -237 -85
6684 -85 232 77 17 -86 72 122 56 -62 -8 215 -57 -220 -290 127 8 -233 -145 74 -12 40 -147 31 175
6707 175 -91 -161 -247 25 76 -35 -76 179 -7 -67 -108 -4 13 68 -102 0 66 187 -67 -96 -162 133 62 -266
6731 -266 -75 -25 185 -281 -51 78 226 91 -193 5 159 95 38 -15 0 81 -112 -101 38 -11 111 -59 5
6754 5 85 184 -232 -69 238 -154 -149 -59 -59 -37 -48 -131 -25 176 125 17 -144 98 51 -18 -224 46 155 162 -316 36
6780 36 223 6 -39 -34 19 70 -26 -10 14 238 124 -174 153 290 116 64 -209 4 50 -36 -193 -36 89 56
6804 56 20 -304 -66 99 28 -94 -64 77 42 -334 3 61 137 -185 -143 220 70 -208 18 -3 220 120 -111
6827 -111 -100 85 153 -60 -238 79 125 -118 -13 -61 48 27 13 -60 -16 -11 144 28 -32 117 71 -137 -156 -97 59
6852 59 30 -154 19 261 -23 32 -132 35 179 -187 -48 109 -39 14 -94 -58 207 -5 -187 197 93 183
6874 183 -267 -89 40 121 60 -121 -58 -41 -108 -70 74 -23 266 -11 -208 25 6 44 -149 -67 155 0 -87 -169
6898 -169 -40 189 19 -232 -78 46 70 -291 -198 199 229 -229 -34 185 241 35 -163 28 202 -23 -155
6919 -155 -146 -27 -43 -176 -196 67 -4 -40 -283 -222 173 68 -105 -168 -47 85 -232 -44 40 83 1 -266 -42 186
6943 186 227 -236 -252 169 157 -72 -218 52 54 190 25 9 119 -201 -48 82 -78 -115 8 -34 15 78 133 -13
6967 -13 103 104 186 -46 5 -105 94 6 -100 -23 254 202 -224 -266 36 18 -35 -63 -69 83 70 -159 -191 112 76 -123
6993 -123 -98 113 207 -139 -108 -142 99 240 -225 -94 89 114 -142 22 21 44 40 39 -125 210 109 -124 -5 44
7017 44 65 21 -265 -48 -2 153 -204 -142 181 163 -19 -116 20 72 -130 -7 2 62 144 -116 -50 117 104 2 -212
7042 -212 84 234 66 -37 -60 77 36 -8 -95 -106 31 -157 29 157 -41 -85 -221 -139 143 153 -80 -271 194
7065 194 158 29 3 -67 69 -50 -7 -234 160 117 -5 -41 -37 105 46 -222 -100 82 -8 -167 -184 -14 87 2
7089 2 -275 10 183 -126 -127 -47 139 166 -205 -127 226 243 -210 -240 -13 0 32 -257 -44 -43 155 -196 -120 85 153
7114 153 -6 -161 -92 73 70 -213 -79 59 204 15 19 173 53 86 -197 -126 60 89 -68 -304 95 181 110
7137 110 -97 -10 289 228 1 -80 161 70 -56 -178 -34 423 75 -99 -205 16 57 25 -155 223 120 -62
7159 -62 -52 -223 84 -42 -46 -113 -15 82 -16 -250 -34 265 -18 -134 -160 64 223 23 -168 104 167 -36 -95 -24
7183 -24 174 204 -422 11 270 138 -171 -298 -119 184 88 -115 2 100 236 -237 -101 -63 283 24 30 -162
7205 -162 145 -44 42 20 30 95 105 -96 49 155 -26 -224 -63 159 123 -106 182 123 153 -202 -238 60 -42
7228 -42 55 -228 -50 321 129 -244 -121 77 72 -112 -44 29 125 -18 -359 -147 335 186 51 -160 240 276 -40
7251 -40 -157 -48 110 157 -38 -15 174 314 -50 -148 35 167 -42 -383 -189 253 -101 44 -59 -40 224 -112
7273 -112 -65 -45 62 8 -51 -134 135 170 -125 -216 96 299 -2 -71 -86 120 147 -331 -83 -67 156 -40 -298 -32
7297 -32 472 109 -57 -15 118 246 -43 -25 94 222 6 -88 -31 177 315 -164 -126 128 1 -15 -186 60
7319 60 -7 19 -156 -191 64 -47 -1 -104 94 173 -80 -8 81 205 95 -182 -135 100 116 -35 -26 -36 244 15
7343 15 14 19 261 239 -59 -71 127 263 0 -219 -32 92 97 -69 30 124 204 -129 -53 39 141 -31 -254 58 152
7368 152 107 -143 -99 138 121 -51 -95 40 -39 -143 22 18 208 -2 -216 -111 206 272 7 -351 -25 227 76
7391 76 -277 -49 69 123 -22 -200 9 160 137 -233 -107 70 56 -46 -216 84 251 -5 -109 -63 -90 140
7413 140 -88 -75 333 100 -54 -186 76 160 82 -172 -108 -44 -33 -183 83 237 71 -235 -45 159 282 -146
7435 -146 -157 -42 247 63 -325 -75 243 354 -98 -119 -270 156 -72 -180 -62 62 255 -364 -188 -70 217
7456 217 49 -167 -132 264 147 -122 -78 -82 20 44 -211 117 146 -174 -249 -47 142 94 -219 -95 117 139 -13
7479 -13 -218 39 133 108 -216 -170 58 272 -167 -78 147 206 -137 -93 -21 129 -90 -195 -94 74 82 -119 -361
7502 -361 108 222 -16 -151 -156 124 168 6 -37 150 110 119 -130 173 167 -43 -123 -199 19 134 175 -216 90 110
7526 110 95 -98 104 76 -132 -224 -96 -102 51 -18 -19 78 199 -59 -448 6 250 93 -200 -100 5 151 95
7549 95 -317 18 25 -70 -84 -140 38 180 -212 -234 118 140 161 -299 -1 301 -58 -304 -15 75 85 -108 -27 61
7573 61 22 205 -130 10 325 -80 71 -160 58 162 -13 -56 -32 105 52 -81 0 233 106 -120 -188 25
7595 25 203 -20 -200 154 265 36 -150 -83 5 -13 -115 -98 199 53 198 -181 -111 205 -17 -18 -115 110 52
7618 52 24 92 -27 122 203 -104 -111 191 249 14 -183 9 352 32 -242 60 91 179 -112 -86 175 175 -113 -255
7642 -255 -66 238 20 -190 -91 8 280 156 -324 130 180 -178 -64 -54 165 97 -179 -165 30 150 -48 -96
7664 -96 86 125 46 -232 -146 155 292 -85 -176 173 184 74 -14 132 134 -59 -160 121 -3 346 -115 -142 155
7687 155 122 -14 -179 70 334 -16 -174 -21 81 271 -25 -146 -113 263 -59 -180 -35 295 86 -114 -7
7708 -7 121 203 -1 -139 175 223 -6 -323 -217 130 115 -181 -214 -4 118 41 -218 -18 107 6 -265 -147
7730 -147 176 178 -205 -151 -47 218 175 -120 -124 248 48 -260 -120 25 170 -80 -231 151 127 -46 -188 -205 384
7753 384 72 -153 -171 10 342 156 -143 -139 231 -154 -76 -47 244 116 -124 -159 -10 204 78 -263 -151 389
7775 389 -149 -107 12 121 146 -217 -98 -45 90 -12 -142 -212 242 243 -120 -157 -35 282 14 -178 -148 -30 -74
7798 -74 -172 -151 160 259 -60 -138 88 111 165 -215 -97 261 222 -191 -216 103 148 -123 -220 -41 151 134 -222 -217 433
7823 433 250 -39 -172 82 129 138 -138 -178 153 212 67 -6 127 144 -20 -115 41 332 52 -15 -212 53 228
7846 228 8 -201 -15 242 -31 -266 -163 149 60 -52 72 100 312 -161 -180 71 229 100 -54 -102 94
7867 94 195 -96 -104 -14 151 47 33 28 191 20 -128 -168 143 232 -8 -47 -90 96 -61 -274 76 135 -77 -90
7891 -90 -147 40 36 -124 -148 32 346 19 -165 -191 152 -35 -96 -93 0 62 6 -316 60 149 214 50 -229 139 265
7916 265 -158 -150 -140 53 57 -231 12 149 227 62 -177 -105 262 -106 -42 -137 295 101 -306 -67 335 -151 -106
7939 -106 -175 72 197 -26 -143 -32 30 66 25 -64 219 94 -116 -53 -55 134 111 -195 -224 38 97 -91 -200 205
7963 205 296 31 -183 -79 169 87 -186 -202 148 166 -118 -247 101 206 -269 -193 -114 81 104 -220 -228 314 137
7986 137 -126 -195 75 -50 -99 -25 -105 148 120 -150 -184 82 298 77 -162 -73 244 -43 -165 -132 -79 204 -69
8009 -69 -435 110 12 -13 -98 -35 260 74 0 -171 -28 101 45 -259 -225 15 -121 -22 -167 56 189 -290 -88
8032 -88 -93 21 -5 -210 -122 93 122 -66 -93 126 158 36 -65 -82 424 79 -258 -45 221 131 147 -70 -219 -27
8056 -27 -128 -180 -33 169 101 109 -265 114 84 -47 -46 -31 318 4 -228 -66 157 86 -54 -91 -13 178 -75 -234
8080 -234 -191 261 -20 -82 16 183 88 -345 -135 51 207 40 -49 -35 63 122 -212 -122 206 -222 -90 -127 25
8103 25 257 30 -273 -144 198 206 56 -123 173 82 -185 -221 105 165 23 -239 104 115 175 -103 26 144 122
8126 122 -26 -103 -123 48 85 -204 -134 75 287 51 -274 76 123 -55 -92 34 45 205 -46 -161 139 26
8148 26 36 -56 60 134 147 -249 12 -99 112 -77 -246 164 278 -189 -83 -102 174 86 36 -75 9 56 57 -217
8172 -217 -27 154 15 -103 -169 229 186 -49 -19 -63 58 -30 -32 57 74 -46 -27 -87 259
8191B59
$$ Imaginary data points
##PAGE= N=2
##DATA TABLE= (X++(I..I)), XYDATA
0 0 0 0 0 0 0 0 0 0 0 0 6 -8 8 -8 8 -14 16 -22 24 -30 32 -40 48 -56 68 -79 89 -105 120 -137 157 -179 203
33 203 -229 257 -290 326 -362 405 -453 502 -556 618 -681 753 -830 918 -1012 1117 -1228 1352
51 1352 -1492 1644 -1814 2009 -2227 2476 -2767 3105 -3507 3997 -4607 5388 -6428 7886 -10082
66 -10082 13736 -20925 40332 -202366 -570111 -121757 20698 -72602 -86848 -109191 -131982
77 -131982 -73042 -203603 -336479 -80954 182309 -81839 -204911 66748 61077 -139377 -156931
88 -156931 -118532 77705 275413 100456 -177667 -89068 87757 -55274 -107923 162536 181828
99 181828 -20781 -97100 -154742 -61700 127062 -10161 -190942 -2329 171561 -58143 -274962
110 -274962 -138157 -19381 -10753 33097 -61937 -89665 23752 -140638 -296212 -30083 202662
121 202662 56100 -138590 -108192 -39083 -30831 -15504 -77732 -26698 177436 65778 -168281
132 -168281 -63563 63354 -19035 -60121 44159 135331 94941 -27469 -164677 -112746 147342
143 147342 144187 -54993 13000 101894 -15311 -92318 -51944 44040 119048 81699 -31801
154 -31801 -35893 95459 34035 -147377 -22320 172030 126485 26136 -48657 -53049 32928
165 32928 36322 -23783 33539 158960 82624 -135374 -102432 65853 61723 10935 -15586 3122
177 3122 86847 24063 -133796 -100335 75910 113135 -19336 -37402 52706 12620 -59827 -66575
189 -66575 -5976 139098 125948 -57823 -78449 43640 64384 -26807 -26022 95156 113891 26833
201 26833 -47852 -59954 52279 88334 -32548 -15288 108629 83236 -58670 -120012 -14167
212 -14167 86243 56829 -15476 -45719 23893 38728 -104421 -111589 52298 98432 6569 -79313
224 -79313 -54498 18958 -6545 -72990 -57471 59023 113609 -35179 -126613 -21821 37303
235 37303 1729 -28910 2863 82066 50170 -73421 -98566 10723 101907 25910 -50771 30357
247 30357 66682 -10001 -74810 -58511 59243 104742 -1609 -60813 -4127 42625 -25688 -94692
259 -94692 -378 93139 45740 -43745 -88501 -20989 43485 -28672 -62861 22193 76143 7120
271 7120 -101832 -72379 30703 37088 -10227 -34433 15723 64292 -30669 -104233 -17784 73123
283 73123 59246 -22816 -36891 32474 27653 -37674 -52510 19337 103579 41051 -63459 -30278
295 -30278 30140 20484 -26628 -25292 59490 75096 -16820 -73062 -33993 46173 32086 -38719
307 -38719 -59 57742 22133 -52383 -78653 4469 70198 14362 -33851 -7266 35200 4298
319 4298 -77314 -43665 56309 63791 785 -52228 -16636 38094 -13446 -55596 1321 68207
331 68207 54245 -42672 -67865 9731 33740 -4852 -27771 14293 71145 8408 -76831 -42722
343 -42722 31316 50918 -4572 -33241 29542 41303 -29922 -67873 -18451 70322 51410 -37989
355 -37989 -32205 19765 21105 -31678 -58281 24145 80177 12867 -56226 -44020 23117 28157 -40176
368 -40176 -26371 46654 52411 -14366 -77561 -27990 53316 24523 -26766 -10262 42237 39482
380 39482 -49028 -66440 21995 67675 30115 -31065 -17072 46585 14080 -52796 -29490 47306
392 47306 77914 1193 -59626 -7056 33268 3305 -37204 -15608 62212 47151 -48578 -66354
404 -66354 -5211 40950 3608 -45267 4592 47209 -1475 -63064 -59290 25249 59408 -12106
416 -12106 -39394 7376 33090 -12178 -67482 -14965 66799 48743 -15571 -44052 2141 41116
428 41116 -17825 -45815 23000 69722 28188 -53044 -52148 17452 26436 -13048 -29768 10068 50191
441 50191 -17881 -88234 -38257 25032 19494 -25908 -35422 8643 6074 -49717 -70763 -17896 56100
454 56100 23320 -55395 -29107 17295 -804 -34929 -32139 30518 63327 8242 -44542 -22848
466 -22848 39057 26663 -33637 4028 65516 39948 -15665 -46506 -9146 51634 29420 -19472
478 -19472 -4090 40365 16318 -58327 -40678 30878 33619 2524 -28183 -23459 20778 -4162
490 -4162 -61469 -28239 45464 43934 -26562 -43288 -752 3644 -8000 -11573 5214 59774 37329
503 37329 -49633 -37146 36817 45757 3562 -1279 40224 45910 12759 -21807 -22308 46826 65061
516 65061 -6720 -4073 48383 24387 -29500 -33142 17430 55874 34676 -18387 -40373 12873
528 12873 32900 -37225 -33020 40018 34865 -10769 -32528 -21284 14589 13744 -23727 -23173 39556
541 39556 54222 -35657 -62839 8929 32177 16696 3959 -7969 16574 19474 -29750 -32979
553 -32979 33980 59282 -9407 -37872 18762 28274 -3467 -20933 -25660 26479 57821 -11017
565 -11017 -49685 -797 24102 -18529 -30986 21933 33551 -5127 -37573 -52548 3584 54246
577 54246 -12114 -55937 2383 30999 -11785 -43180 -19941 8956 12386 -2215 -28732 -3533
589 -3533 31511 -31630 -65775 11812 51111 10449 -31894 -37243 -8043 15493 1855 -27961
601 -27961 -5029 38528 -10353 -55660 -522 25374 -7516 -23339 -17363 14722 33166 -11796
613 -11796 -60653 -25496 44517 21128 -32261 -4447 11853 -14550 -18660 -17599 7044 38638
625 38638 -1389 -50776 -14932 41843 11236 -45519 -17034 23163 16722 5279 -23934 -24359 22443
638 22443 9246 -30665 2756 42462 6418 -44196 -20678 24341 26857 11779 -21053 -23097
650 -23097 33065 25297 -30730 -9696 32469 16528 -11797 -1958 18814 13534 336 -17607 -7037
663 -7037 51121 38131 -36451 -23868 26505 20942 657 -1423 8655 16027 7077 -17201 -16021
676 -16021 33185 28527 -35411 -17371 35622 19347 -11723 -23144 -11778 22468 27092 -10350
688 -10350 -23534 16108 21132 -29079 -15711 32856 17822 -6980 -14294 -10774 22276 24929 -20068
701 -20068 -25717 23129 34624 -14810 -21111 15472 9365 -3467 -4252 -7577 19606 22423 -27895
714 -27895 -30263 23050 33135 -14616 -30035 5254 14603 3025 -8562 -21945 7708 26658
726 26658 -20545 -30235 17245 24255 -14765 -28679 1310 19744 8358 -12652 -28376 4156
738 4156 34519 -10472 -32015 11152 22090 -6757 -20199 -3275 17491 12682 -10648 -25301
750 -25301 5828 37347 -5826 -35976 5783 24616 2830 -13078 -11501 10003 18062 -6449
762 -6449 -24009 2120 32491 -1135 -33957 1468 23998 5685 -11995 -18247 4736 24705
774 24705 -1545 -25184 -3017 26966 4763 -28719 -4747 21349 9342 -7162 -17952 1079
786 1079 26297 567 -27324 -4320 26115 12353 -21407 -12205 14202 10253 -4594 -16465 -2377
799 -2377 26271 4655 -27825 -9265 18196 11034 -15753 -14738 11146 13198 -4671 -19337 -9222
812 -9222 21109 9660 -22372 -7826 16482 9916 -12766 -17857 7869 19775 1958 -14768 -8579
825 -8579 18287 12564 -19660 -9551 17787 15838 -4477 -17554 143 17800 2299 -14658 -7007
838 -7007 16669 14770 -18266 -18065 9312 12463 -2716 -16027 -3766 17125 2014 -19501 -11484
851 -11484 11437 16200 -10134 -17498 7423 13139 -2283 -14694 -4430 20304 11091 -14018 -9529
864 -9529 10148 16138 -4438 -15416 8814 19259 1802 -13861 -8670 14942 13164 -12303 -10262
877 -10262 8675 13810 -5164 -22301 -1784 16900 2230 -14073 -11620 8599 10979 -15713 -17714
890 -17714 5814 15443 842 -19163 -6922 15462 4128 -12828 -9110 11126 19134 -6028 -17479
903 -17479 3952 16172 5570 -11875 -4478 19202 10412 -12288 -11878 6235 18326 -793 -17160
916 -17160 1797 14531 2043 -16442 -13121 12727 12953 -11444 -15476 235 13027 -1672 -21473
929 -21473 -4496 15602 6791 -12362 -15722 6837 15786 -5926 -13662 2283 16782 7239 -16314
942 -16314 -7786 15737 12181 -4141 -10610 5615 18374 -1844 -15303 -742 14918 10098 -11398
955 -11398 -11350 9879 8581 -7764 -13896 -297 16338 526 -18343 -6842 8214 5939 -10744
968 -10744 -13310 7924 11503 -5746 -14700 -4368 14077 5884 -13849 -4459 11467 8547 -6459
981 -6459 -13205 5109 16023 1428 -9701 -3165 12470 7967 -12974 -6658 11790 10554 -1926
994 -1926 -12028 -906 12667 662 -11383 -4028 11311 9938 -11122 -11340 5965 7105 -893
1007 -893 -8077 -1249 13541 2589 -13881 -6613 9807 11458 -5306 -8544 7172 8189 -1808 -8612
1021 -8612 -3380 14214 8800 -10760 -5292 9133 7590 -6959 -10583 6844 13122 1479 -9369
1034 -9369 -8816 8829 9845 -10481 -6796 10229 9070 -4588 -11905 354 10734 3137 -6786 -6296
1048 -6296 9546 12210 -10967 -12189 7874 10296 955 -6722 -2455 7575 2006 -8891 -7044 9252
1062 9252 13860 -9333 -15440 4575 7575 -2166 -8401 -5351 8574 7089 -9933 -13382 2625 11087
1076 11087 -5811 -12176 6989 9661 -3656 -11423 -10218 7768 14946 -4678 -12835 2413 11407
1089 11407 -3349 -13370 2678 10817 3111 -2617 -7560 3180 12024 -6609 -13535 6980 17716
1102 17716 2354 -13098 -5314 5690 4645 1127 -5233 1175 12596 -4682 -16631 2409 13026
1115 13026 908 -9954 -3998 6713 4799 -4415 -13314 -4204 15975 4276 -14053 -1279 6555
1128 6555 -3354 -7754 -1997 8392 9418 -2276 -13643 -5325 15617 6914 -13065 -346 11528
1141 11528 3294 -2490 -5570 -738 8557 4384 -5117 25 12964 1949 -17945 -4605 12761
1154 12761 7575 1380 -6731 -7906 4327 2307 -9215 -3684 10000 3941 -12819 -6283 5247
1167 5247 -2034 -4984 -5340 -2438 11514 5268 -15791 -11726 5973 7142 -3301 120 7078 23
1181 23 -4411 -4936 -2727 13202 11362 -9044 -4503 11045 5812 -6917 -5397 5443 8611 6004
1195 6004 -1223 -8293 2315 4731 -10069 -1918 14509 5404 -9031 -10661 -2975 4656 3975 -3231
1209 -3231 -6654 5003 7282 -11587 -10446 6402 4074 -1818 -731 921 3972 -722 -9846 -6948
1223 -6948 10710 16212 -3974 -10125 3276 2265 -2015 355 1437 8268 6953 -6898 -9115 4433
1237 4433 8670 -4921 -6614 8875 8882 -2000 -8027 -10104 2112 11109 -874 -5748 3730 3347 -9243
1252 -9243 -11611 3214 9128 2820 -3059 -8309 -646 6608 -6767 -10174 6078 11096 535 -7646
1266 -7646 -3977 839 -372 -723 -1012 6460 11252 -5913 -14763 535 8511 3220 -1462 39 4886
1281 4886 2451 -5122 -8211 1292 12414 2615 -7600 2421 5435 -3161 -6625 -3525 7104 10566
1295 10566 -227 -9260 -4556 5411 333 -7225 3404 8808 682 -5296 -7989 -874 7015 802
1309 802 -4578 2169 7972 -369 -11267 -3668 6537 5151 2173 -2127 -939 4441 -3182 -8961 1313
1324 1313 10687 5390 -5530 -5024 1791 188 -2179 -2989 1490 9856 1864 -10528 -5289 2961 1849
1339 1849 -2592 -945 5517 3232 -4220 -8281 -4118 7341 5648 -4612 -475 4796 -196 -5908
1353 -5908 -5295 3649 8320 2447 -3333 -3165 3236 1353 -7271 -925 8643 5276 -2146 -6677 -2780
1368 -2780 3280 107 -3279 76 5938 2880 -8860 -7330 2980 3436 431 -1674 -67 4199 -1311
1383 -1311 -7821 -2613 6357 7374 -1663 -3785 3366 2270 -2810 -3243 1280 9145 5406 -5031 -4259
1398 -4259 2589 3470 -2217 -3277 5308 6431 -1654 -6781 -5261 3229 4326 -3783 -2589 3951 2242
1413 2242 -5077 -8769 -603 6276 1672 -3066 -2791 1806 2150 -6412 -5081 5631 7328 974 -5278
1428 -5278 -2107 4098 496 -3306 -286 6310 6945 -3517 -7788 641 4086 951 -2638 -543 5831
1443 5831 1403 -7193 -6327 1360 6020 363 -5228 563 2992 -2124 -6172 -3268 5757 6269 -2509
1458 -2509 -4245 18 2986 -786 -4990 2179 8012 2973 -3605 -4843 1703 4723 -1579 -2099 3857
1473 3857 5179 -170 -7313 -3474 4805 3265 -1487 -2493 1613 3202 -4284 -7058 347 5103 2997
1488 2997 -3905 -3722 2475 879 -4093 -3034 2940 7029 303 -6037 -1268 2610 1793 -2098 -1491 5548
1504 5548 4373 -3541 -5391 -803 4505 1984 -3580 238 3762 -6 -5303 -5751 1893 5178 -975
1519 -975 -3500 -960 1535 -944 -6429 -1646 5444 3160 -1992 -4683 -216 3017 -1691 -3258 2197
1534 2197 5589 2416 -5093 -4161 3184 3065 -405 -1481 2088 5035 -1050 -6130 -1486 4135 4083 -1456
1550 -1456 -2801 2798 1896 -3395 -4073 357 6214 2872 -4019 -2018 2150 1517 -2202 -1944 4726 5639
1566 5639 -517 -3749 -1451 3700 3013 -2590 403 5723 3324 -2873 -4925 1023 5097 1252 -1727
1581 -1727 -344 2730 1087 -6209 -3938 4499 4178 -951 -4025 -1387 2426 -1140 -4321 -915 4478
1596 4478 4706 -3243 -5454 1599 2483 -808 -1336 1767 5752 2125 -5115 -3560 2986 5520 197 -2546
1612 -2546 2679 3039 -2350 -4155 -1897 3904 4107 -2684 -3643 896 1159 -4397 -6238 1494 4864 240
1628 240 -3936 -5434 -1099 1806 -3032 -2949 3729 3791 -2362 -5943 -1225 3448 1643 -735 -864 3033
1644 3033 4900 -2922 -6021 1952 5558 2451 -680 199 2135 -288 -3151 -2168 3172 6955 -419
1659 -419 -6320 -722 2000 -1065 -2585 -1110 2445 2538 -2479 -5298 -2025 2409 -932 -3650 2476 4121
1675 4121 -1886 -4893 -3941 1312 5255 1291 -2424 65 2759 -1131 -4836 1418 5356 1738 -226
1690 -226 -1345 63 2661 -1615 -4251 2482 6861 1981 -4656 -2990 749 148 329 525 977 3315
1706 3315 -1853 -7028 -892 4106 1184 -2672 -509 2411 220 -2594 -4047 -1573 4986 2925 -3287
1721 -3287 -315 2028 -2356 -4006 -17 4351 3740 -171 -3843 -2697 3375 2143 -3679 638 5335
1736 5335 1027 -2385 -1655 352 2298 1138 -451 1283 4682 661 -6936 -2205 5400 3401 24
1751 24 -1075 -1378 833 -501 -3424 -512 4689 2431 -4810 -2880 2596 -300 -3003 -1595 290 4195
1767 4195 2016 -5476 -4586 1863 2543 -1817 -29 4062 384 -3129 -2522 -1023 4315 4586 -2586 -1773
1783 -1773 3854 2078 -3548 -2661 2988 3744 1381 -415 -2300 637 1635 -4315 -2008 5981 3586 -3584
1799 -3584 -4883 -1032 1551 467 -1038 -1767 1747 3041 -4455 -5444 2524 2722 -1161 -1015 1039 2099
1815 2099 11 -3308 -3063 3174 6438 -348 -3741 2013 1978 -1553 -587 1231 3486 3131 -1717 -3457
1831 -3457 1151 3777 -1247 -3095 3264 3791 -1200 -2849 -2619 543 3360 -312 -2425 1438 2335 -2786
1847 -2786 -5083 1266 3895 740 -864 -1636 -268 2397 -2090 -3742 2482 4895 31 -3657 -725
1862 -725 1498 -325 -998 -226 1629 3871 -1252 -5379 -188 3094 253 -1683 280 2096 -52 -2776
1878 -2776 -2780 -50 3994 608 -3572 551 2440 -1993 -3481 -920 2580 2600 -884 -2749 -875 2058
1894 2058 -557 -3891 1220 4621 122 -2897 -2400 480 2196 -511 -2037 1030 3597 36 -4897
1909 -4897 -1442 3679 1581 -1073 -918 917 2333 -1179 -3466 273 4056 1991 -2741 -1521 2419
1924 2419 588 -2055 -1227 1601 3898 478 -3996 -1099 2502 1115 -2398 -1225 3309 1935 -2181
1939 -2181 -3255 -522 3150 1432 -3080 -510 3396 944 -3192 -3008 2124 3888 51 -2234 -474
1954 -474 2355 1037 -3756 -1210 4013 2603 -1597 -2901 314 2726 -570 -2672 3 3091 1952
1969 1952 -3600 -3408 1933 1990 -1017 -2279 119 2775 -442 -4085 -1674 2378 2489 -1781 -2890 1597
1985 1597 2266 -1360 -2730 -346 3523 1769 -2795 -1704 1734 2019 -1226 -2888 1881 3611 -308
2000 -308 -2804 -1358 2426 2361 -1948 -1592 2155 2460 -928 -3647 -39 3625 833 -1986 -1168 1830
2016 1830 1935 -2340 -2618 1910 2986 105 -2735 -924 2667 268 -2107 -993 2091 2701 -1459 -3269
2032 -3269 778 2227 -33 -1896 -570 2973 797 -2893 -2001 1239 2498 -470 -2822 752 2512
2047 2512 -440 -2685 -1180 3062 2712 -1666 -1788 879 2269 -250 -2732 734 3949 980 -1997
2062 -1997 -2019 1282 2279 -1633 -1691 1376 2563 -361 -3462 -1431 2501 803 -1939 -1558 1167 1955 -2201
2079 -2201 -3624 456 2401 719 -2542 -1229 2460 813 -2304 -1551 1797 3813 -63 -3012 464
2094 464 2937 1143 -1734 -928 3325 2779 -1712 -2322 468 3067 560 -2868 -214 3060 531 -2753
2110 -2753 -3012 1447 2535 -1459 -2940 -525 1814 -163 -4231 -1698 2994 1393 -1658 -2669 335
2125 335 2488 -707 -2540 590 3511 2063 -2687 -2061 2676 2336 -492 -1110 1168 3350 372 -3328
2141 -3328 -621 2726 2016 -1985 -2307 1932 1431 -2299 -3315 -987 2685 1060 -3829 -2529 1063 743
2157 743 -2731 -3204 1520 2664 -853 -2615 -1597 2016 2180 -2264 -1425 3157 2958 -828 -2262 603
2173 603 3497 1369 -450 -100 2119 2388 -2403 -2318 2757 3009 -464 -2378 -502 2102 -53 -2687
2189 -2687 -1882 1317 2483 -2032 -3706 1069 1372 -1640 -2161 -276 2876 1439 -2644 -2663 1228 3494
2205 3494 120 -2382 1625 2820 -350 -1236 -317 2287 2648 -849 -1743 1843 2888 -1193 -3591 719
2221 719 3323 454 -1703 -2006 -315 1531 -1466 -2511 1179 2215 -1396 -4146 -772 2248 -300
2236 -300 -1977 -1509 724 2938 -981 -4071 385 2872 510 -1673 389 2558 231 -1922 -1243 1359
2252 1359 4056 308 -3966 258 3466 187 -2324 -796 2103 1720 -971 -2088 -572 2238 -189
2267 -189 -4189 277 3953 32 -3191 -2384 879 2594 -80 -2322 -497 2522 892 -3709 -275
2282 -275 3662 692 -1823 -1161 882 2891 -130 -3389 -473 3786 2380 -3187 -1932 2612 1012
2297 1012 -904 -644 290 2616 403 -3759 -850 3602 2119 -2923 -2480 2419 1999 -989 -2000 -1339
2313 -1339 2129 2303 -2639 -1359 2840 1186 -2753 -2125 1991 2578 -447 -2337 -1996 2010 2714 -2964
2329 -2964 -2713 2334 1684 -1319 -1854 497 1695 -103 -1914 -1313 2323 3161 -2799 -3231 2357 2283 -606
2346 -606 -1643 -512 1846 1204 -1446 -1428 1763 2679 -2192 -2960 2392 2491 -766 -1784 -1343 1604 2175
2363 2175 -1994 -2536 1148 2694 -1196 -3141 1135 1878 -782 -1312 -1005 1417 2673 -1679 -3017 1286
2379 1286 2956 -183 -2497 529 2106 54 -652 -1235 906 3084 -1069 -2824 1337 2627 -610
2394 -610 -2332 -195 2524 688 -1300 -1792 -14 2815 -725 -3426 1268 2403 -864 -2618 -1141
2409 -1141 1766 1347 -1029 -1874 -135 2703 -285 -3960 432 3031 349 -1371 -1156 893 1682 -1059
2425 -1059 -2003 309 3077 435 -3522 -352 2393 -3 -1213 -790 1014 2474 -534 -2908 -540
2440 -540 2725 981 -2473 -627 2787 517 -1617 -1767 66 2998 604 -2677 -265 2432 702
2455 702 -2707 -1531 2858 1940 -781 -1870 -1005 2097 885 -2719 -417 3002 1563 -2229 -2590 1157
2471 1157 1999 -401 -1329 -445 2461 1427 -3222 -1875 2264 2132 -710 -1811 733 1913 -654 -1899
2487 -1899 -811 2616 2594 -2294 -2453 1723 1238 -1129 -1942 -99 2523 345 -2493 -1823 1032 1972 -1698
2504 -1698 -2158 2089 2038 -1172 -2583 -1385 2228 1732 -1581 -1362 1043 1993 -1416 -2874 1383 2755
2520 2755 569 -1138 -1012 1420 1551 -1941 -1537 1926 2756 -110 -2939 -254 1886 -134 -1201 -572
2536 -572 1770 1947 -2018 -2813 637 1798 175 -2118 -145 2193 121 -2095 -1624 918 2755 -442
2552 -442 -2380 802 1638 -178 -2220 -722 2864 1776 -1261 -1710 243 2373 -64 -2211 916 2555
2568 2555 515 -1751 -1785 1613 1841 -883 -1003 583 2040 -223 -3112 -323 2479 1025 -1244 -1521
2584 -1521 784 1640 -1594 -2231 611 2145 856 -2520 -1142 1591 516 -1485 -1387 1057 2685 -902
2600 -902 -2843 -454 1598 1026 -1736 -1136 2361 1262 -1591 -2084 229 2752 482 -2159 -64 1909
2616 1909 908 -1829 -2144 1999 2658 -551 -1771 -517 1991 605 -2481 -692 2262 1662 -1030 -2932
2632 -2932 385 1951 -786 -1690 -152 2044 991 -2919 -1848 1501 1625 -427 -1973 501 2349
2647 2349 -456 -2498 -644 2181 2352 -1163 -1591 1658 1743 -472 -2014 197 3417 1197 -2005 -1271
2663 -1271 1155 1852 -1076 -2119 1354 2221 -354 -2542 -1571 1581 1118 -2085 -1323 954 1363 -1177
2679 -1177 -3204 -76 2226 158 -1540 -1442 1148 1476 -1992 -1795 1338 2654 173 -2359 -330 2238
2695 2238 753 -1149 -777 1746 2520 -951 -2330 738 1864 310 -1698 -498 2333 579 -1847
2710 -1847 -1996 479 2378 -214 -2332 478 1224 -136 -2050 -1554 1788 1624 -1195 -1694 -118 1876
2726 1876 -41 -2563 780 2514 1130 -1089 -1728 873 1850 -335 -1046 878 2436 299 -2552 -422
2742 -422 2181 951 -689 -1166 477 1673 -1006 -2345 54 1885 870 -1778 -1113 1464 129 -1575
2758 -1575 -1433 393 2975 77 -2987 -527 1723 1014 -1358 -748 2085 1398 -719 -1383 -562 2327
2774 2327 902 -2211 45 2225 622 -2057 -2169 773 2171 -59 -1534 -1207 1071 333 -2960 -970
2790 -970 2280 843 -1275 -2136 -85 1564 -400 -1783 -751 2311 1984 -2213 -2019 1371 1117 26
2806 26 -398 716 2276 309 -2459 -1128 2114 2655 -1076 -2003 1537 1239 -579 -1605 -1000 2066 1700
2823 1700 -1540 -1663 600 832 -1984 -2161 1510 2299 -283 -2024 -2396 553 1894 -1393 -1297 1350 1722
2840 1722 -1007 -2245 230 1913 529 -323 -638 1280 2446 -1783 -2449 1501 2800 964 -1043 -249
2856 -249 1031 -91 -842 -905 1229 2964 -888 -3154 183 1425 -326 -1549 -420 1696 1207 -1205
2872 -1205 -2476 -880 2131 233 -1903 911 1665 -649 -1962 -1380 1296 2453 284 -1303 -252
2887 -252 1773 -78 -2339 537 2569 807 -79 -943 -60 1382 -438 -1268 1046 2936 768 -2624
2903 -2624 -1096 1251 527 113 -241 117 1835 -300 -2961 -541 1769 1123 -1279 -501 1302 152
2919 152 -1158 -1536 -485 2620 1212 -1963 -947 929 80 -1393 -670 1743 1555 -359 -1368 -1356 1242
2936 1242 984 -1744 -114 2302 527 -1579 -1943 133 1496 289 -681 -474 1231 540 -2921 -1358
2952 -1358 2090 1419 -385 -1434 -424 960 -324 -1701 -565 2182 2095 -1943 -2182 747 681 -341
2968 -341 -762 212 2053 571 -2448 -1893 622 1771 -675 -1199 1594 1111 -840 -1996 -1270 1690 2092
2985 2092 -778 -1336 702 961 -1323 -1908 1014 2264 637 -942 -1534 625 1511 -980 -1194 1820
3001 1820 2338 -128 -2264 -786 1516 684 -347 -676 1117 1922 -1448 -2622 510 2122 714 -1006
3017 -1006 -768 1143 443 -1353 -1518 508 2469 208 -2085 -243 706 -8 -1002 -749 1876 1910 -900
3034 -900 -2118 -707 1598 565 -1296 464 1531 151 -1334 -1674 577 2041 -225 -862 115 1277
3050 1277 -109 -2432 -740 1826 1464 -79 -1329 -332 1158 -542 -1526 421 1848 1039 -1714 -1638
3066 -1638 724 806 -342 -759 262 2165 265 -2155 -708 932 1138 -211 -638 1303 846 -735
3082 -735 -1449 -381 2073 1206 -1248 -520 814 395 -999 -1409 893 1795 30 -1043 -945 801 492
3099 492 -1600 -239 1646 1056 -661 -2034 -314 1711 126 -778 -144 1014 990 -1583 -1647 1190 1532
3116 1532 215 -1045 -187 1618 88 -1616 -489 1479 2058 -477 -1639 509 1170 -278 -1126 -221
3132 -221 1996 938 -1695 -1504 293 1281 -348 -1335 668 1459 -456 -1656 -1383 966 1303 -1068 -1006
3149 -1006 550 952 -526 -2246 -215 1877 697 -887 -1105 675 1403 -1192 -1478 878 1925 476
3165 476 -1570 -906 1507 986 -815 -750 1185 1929 -271 -1887 32 1407 876 -706 -759 1440 927
3182 927 -1257 -1278 80 1824 363 -1763 -361 888 289 -1118 -1375 1048 1542 -730 -1618 -453 902
3199 902 328 -1647 -435 1428 669 -916 -1693 89 1617 -103 -803 194 1293 833 -1630 -829 1354
3216 1354 1476 -8 -808 202 1457 -47 -1452 -169 1593 1380 -840 -1240 610 826 -623 -1150
3232 -1150 -238 1698 371 -1843 -1166 510 809 -701 -1378 493 981 -693 -1541 -901 1051 792 -1063
3249 -1063 -697 863 534 -795 -1514 448 1886 354 -693 -385 901 779 -1030 -623 1524 1540 85
3266 85 -1310 -317 1587 420 -711 -118 1311 1375 -814 -1469 493 1046 184 -745 -314 1168 183 -1791
3284 -1791 -1260 620 1416 -354 -1685 40 468 -450 -1395 -845 1174 963 -1326 -978 181 1041 -149
3301 -149 -1376 630 1688 376 -1038 -1171 842 1848 -308 -538 1112 1176 24 -1548 -384 1651
3317 1651 808 -601 -912 296 1254 -1053 -1882 337 1398 559 -1297 -1118 457 259 -880 -1196 494
3334 494 1747 -439 -2333 -437 969 470 -794 -917 867 1370 -821 -1339 -387 1487 741 -1092 254
3351 254 1283 318 -666 -1254 801 2243 211 -1251 -310 1128 500 -1395 -442 1417 944 -563 -1486
3368 -1486 -9 1226 -394 -1560 -67 1368 881 -1761 -1734 453 998 230 -828 -508 1245 -81
3384 -81 -1794 -447 1150 1207 -527 -1222 392 718 -175 -964 -532 1554 1091 -1296 -851 392 317 -320
3402 -320 -667 695 1422 -227 -1444 -957 1057 1249 -963 -519 890 660 -597 -1261 -322 1342 723
3419 723 -698 -743 881 810 -1365 -1092 1164 1369 362 -958 -972 852 504 -991 -470 1021 1248 -742
3437 -742 -1506 381 513 92 -453 -653 1263 994 -1432 -1270 483 1374 10 -766 478 653 -131 -998
3455 -998 -953 1274 1792 -691 -1050 529 836 -135 -880 301 1582 652 -647 -1352 344 1453 -811
3472 -811 -1041 827 1056 -69 -1514 -991 987 1228 -624 -1101 143 1293 -623 -1851 334 1321 672
3489 672 -692 -991 383 886 -752 -1118 449 1778 114 -1665 -202 726 86 -338 -738 676 1414
3506 1414 -515 -1476 -461 1339 430 -1061 -80 1211 350 -682 -1389 -117 1614 41 -1360 -330
3522 -330 1093 381 -1370 -862 932 1122 187 -1163 -614 1493 240 -1293 0 1241 915 -686 -1298
3539 -1298 376 904 183 -792 -480 1417 568 -1614 -620 910 902 -268 -1007 269 789 -298 -1002 -615
3557 -615 1213 1251 -1349 -842 659 518 -74 -1156 -88 1215 505 -1119 -886 941 1029 -1010 -995 800
3575 800 923 95 -1191 -775 1009 805 -797 -679 392 1034 -676 -1152 527 762 373 -805 -666 902
3593 902 629 -941 -883 470 1211 -191 -1276 206 816 29 -634 -701 1000 898 -1037 -1032 479 1029 64
3612 64 -1022 -152 1022 379 -800 -786 637 1418 -620 -851 486 840 98 -1148 -442 1110 635 -453
3630 -453 -898 93 1342 -147 -1258 404 861 387 -905 -804 970 836 -718 -755 134 1279 122
3647 122 -1495 -73 994 556 -444 -1008 710 958 -516 -906 103 1365 293 -1376 -381 1021
3663 1021 596 -547 -1205 242 1440 -399 -991 -228 1017 501 -1267 -725 1001 751 -390 -1214 -42
3680 -42 1391 105 -1276 -360 895 884 -704 -878 762 901 -49 -1104 -247 1454 433 -1185 -381
3697 -381 634 1016 -327 -1177 414 1118 -44 -1076 -509 1010 617 -1129 -747 728 679 -288 -1268 81
3715 81 1185 2 -829 -539 734 1038 -997 -936 664 901 102 -1135 -207 1288 497 -797 -445 442
3733 442 1108 -488 -1066 485 927 232 -980 -580 1149 681 -813 -678 258 991 -320 -1174 184 920
3751 920 93 -717 -665 702 516 -829 -830 249 925 114 -1225 -56 1031 232 -630 -805 563 1234 -675
3770 -675 -850 254 822 338 -996 -419 1087 611 -563 -604 524 1213 -299 -1088 307 863 696 -974
3788 -974 -473 894 666 -680 -676 256 1204 137 -1061 48 1111 387 -595 -804 785 812 -414 -657
3806 -657 141 1067 420 -1160 -137 951 666 -530 -849 678 1160 -314 -720 68 1054 310 -922 -323
3824 -323 932 539 -411 -880 283 1411 -53 -1012 -147 866 821 -901 -977 792 852 -383 -867 -265
3842 -265 1181 319 -1152 -308 518 660 -542 -1237 331 814 -296 -950 -541 1044 334 -1159 -638 615
3860 615 434 -469 -1106 -199 788 -12 -906 -579 634 525 -1103 -787 427 489 -485 -1176 -218 1122 120
3879 120 -987 -737 501 919 -768 -1064 255 671 27 -1112 -763 843 580 -1004 -608 149 801 -389
3897 -389 -1137 235 683 117 -674 -872 769 629 -592 -547 163 772 -107 -1049 -157 850 416 -586 -605
3916 -605 607 972 -526 -909 334 799 26 -842 -234 902 536 -442 -820 341 1046 -543 -926 142
3934 142 681 347 -1022 -421 825 538 -185 -784 215 1200 -57 -955 281 854 316 -623 -707 621 851
3953 851 -180 -465 104 1080 181 -868 189 746 445 -423 -856 553 1181 -284 -718 16 906 330
3971 330 -1024 -74 814 425 -392 -812 388 1091 -73 -820 173 1011 513 -876 -364 768 771 -44 -749
3990 -749 -4 1112 189 -795 31 758 631 -437 -601 499 764 -253 -752 -168 1183 256 -1009 -362
4008 -362 634 450 -517 -866 460 685 -244 -945 -456 782 260 -895 -382 561 379 -429 -1015 35 1033
4027 1033 161 -1032 -617 691 424 -801 -766 588 857 -11 -916 -452 763 204 -833 -546 730 752
4045 752 -719 -843 340 804 119 -543 -551 914 548 -709 -605 452 677 -79 -813 99 775 163 -774
4064 -774 -536 793 945 -492 -808 129 490 80 -733 42 894 255 -615 -747 425 787 -534 -688 392
4083 392 657 167 -833 -459 949 621 -349 -460 248 925 -329 -741 240 806 307 -622 -593 565 483
4102 483 -368 -493 216 897 74 -754 25 513 61 -430 -434 672 594 -558 -909 -104 754 274 -833 -226
4122 -226 489 201 -656 -670 442 998 -368 -805 -27 691 66 -962 -312 695 657 -413 -888 -256 665
4141 665 12 -548 68 545 324 -697 -657 813 445 -166 -585 2 666 -22 -898 -6 695 621 -202 -581
4161 -581 325 449 -369 -548 151 1106 239 -850 -353 431 538 -121 -611 327 950 -80 -840 -374 648
4180 648 477 -618 -237 648 520 -263 -771 -81 985 139 -704 -584 434 403 -855 -865 561 639 53
4199 53 -677 -343 830 -4 -767 -465 787 822 -254 -944 -32 637 161 -425 -298 729 378 -802 -469
4218 -469 360 747 -43 -796 103 650 -8 -630 -584 629 771 -337 -537 174 192 -243 -870 -196 928 164
4238 164 -563 -812 194 583 -288 -580 77 625 127 -884 -470 638 517 -178 -387 322 672 13 -800
4257 -800 303 588 361 -229 -388 632 555 -394 -185 430 598 104 -646 -65 492 181 -434 -570 608
4276 608 755 -457 -694 -126 563 229 -721 -77 392 167 -560 -686 19 634 -110 -443 -69 552 155 -689
4296 -689 -254 793 666 -5 -453 271 859 67 -456 225 727 475 -369 -245 595 455 43 -322 261 852
4316 852 273 -807 -162 698 567 -230 -677 311 365 -267 -756 69 720 201 -602 -261 245 85 -446 -697
4336 -697 243 684 -62 -758 -328 239 344 -371 -430 544 578 -276 -641 -41 832 24 -439 -69 628 415 -588
4357 -588 -497 333 557 56 -568 -227 604 26 -574 -271 408 483 -471 -773 163 86 -369 -766 -354 415 97
4378 97 -864 -688 -12 228 -111 -1042 -76 286 -250 -865 -571 336 392 -637 -718 99 348 -58 -899 -166 906
4399 906 318 -517 -627 327 542 -389 -546 164 565 -13 -664 -186 522 345 -273 -334 275 491 -179 -747
4419 -747 -40 586 89 -438 -325 469 406 -671 -478 237 544 85 -575 51 642 289 -178 -160 796 661
4439 661 -177 -443 291 577 399 -324 131 1076 573 -17 -365 384 869 25 -347 302 665 193 -421 -160
4459 -160 901 608 -187 -318 171 532 -52 -652 1 630 246 -363 -413 498 441 -318 -544 85 789 185
4479 185 -682 14 452 199 -104 -348 265 545 -351 -563 -58 676 59 -409 -211 389 465 -356 -572 337
4499 337 618 -130 -502 -150 346 245 -555 -121 684 435 -79 -620 -179 396 -24 -646 -72 286 244 -536
4519 -536 -716 308 705 -3 -505 1 583 119 -895 -361 528 351 -527 -636 91 527 4 -580 -240
4538 -240 573 379 -811 -613 252 259 -99 -657 55 628 -56 -595 -210 318 479 -376 -564 263 340 -135 -702
4559 -702 -185 719 358 -425 -194 383 380 -478 -609 251 582 -57 -693 -435 695 494 -349 -393 285 508 -304
4580 -304 -726 3 528 -101 -312 -66 372 447 -645 -518 163 769 -91 -422 -56 407 233 -276 -264 545
4600 545 604 -391 -489 -75 558 77 -512 -18 801 472 -175 -590 212 418 -151 -340 277 320 2 -516 -400
4621 -400 531 296 -215 -362 128 414 -113 -558 21 426 236 -252 -384 308 387 -472 -229 451 584 -48
4641 -48 -519 -208 284 466 -307 -507 277 480 -397 -518 -41 593 334 -525 -159 434 64 -408 -554 152
4661 152 679 158 -532 -218 -53 190 -252 -236 688 387 -414 -498 29 701 76 -672 66 346 462 -439 -554
4682 -554 254 337 -141 -366 55 605 27 -619 -91 510 450 -84 -413 138 397 -225 -442 -69 497 274 -475
4703 -475 -281 287 265 -137 -578 220 928 -108 -680 -314 397 591 -297 -396 482 244 -121 -591 2 592
4723 592 250 -385 -179 192 592 -389 -702 374 487 150 -430 -104 515 261 -494 -231 265 384 -274 -679
4743 -679 74 576 127 -454 -369 528 425 -668 -574 184 233 -47 -511 -88 459 -25 -622 -213 483 694 -177
4764 -177 -447 103 292 99 -457 -115 789 230 -257 -334 245 562 -76 -386 262 418 114 -410 -333 572 434
4785 434 -198 -159 111 401 3 -552 139 676 254 -148 -248 505 278 -312 -333 67 507 139 -519 160 554
4806 554 250 -208 -94 519 504 -176 -375 57 509 201 -247 -115 503 197 -335 -257 245 630 -131 -623 97
4827 97 408 41 -438 -288 473 145 -311 -614 -83 446 -191 -615 -280 202 185 -624 -564 95 235 -456 -482
4848 -482 -74 476 37 -795 -241 359 358 -343 -341 245 537 -187 -352 64 582 250 -497 -236 446 205 -292
4869 -292 -380 -24 620 -86 -340 -149 265 152 -551 -518 267 91 -484 -671 -94 529 24 -564 -238 286 261
4890 261 -444 -448 300 543 -138 -398 -246 570 198 -628 -103 465 714 -81 -559 118 371 92 -383 -85 323
4911 323 458 -445 -368 344 390 54 -506 -65 585 20 -421 -133 468 646 -159 -421 201 403 53 -579 -130
4932 -130 505 113 -443 -333 197 500 -259 -415 314 675 200 -374 -153 525 304 -309 -188 235 559 76
4952 76 -580 186 632 44 -228 -225 451 497 -232 -195 293 605 46 -404 147 531 84 -162 -281 428 505 -217
4974 -217 -353 -91 429 127 -400 -281 430 97 -394 -279 213 547 -271 -373 -3 300 115 -513 -151 572
4994 572 173 -343 -289 44 391 -147 -484 67 471 75 -345 -426 206 434 -163 -345 63 346 -38 -650 -438
5015 -438 294 280 -431 -360 113 355 -339 -565 22 235 103 -561 -170 412 94 -314 -301 130 636 -183 -335
5036 -335 -43 236 251 -531 -322 475 404 -336 -432 42 617 -60 -490 -106 285 369 -432 -568 319 406 -113 -361
5058 -361 -90 447 204 -450 -143 274 396 -13 -729 122 391 -99 -396 -30 384 184 -490 -264 302 149
5078 149 -36 -294 27 450 26 -439 -161 403 381 -322 -374 362 325 -32 -402 -93 590 49 -486 -181 158
5099 158 499 -308 -432 250 406 44 -458 -268 338 214 -545 -330 236 409 -157 -505 -3 384 34 -219
5119 -219 -248 324 272 -210 -233 213 467 47 -439 26 367 109 -404 -55 319 347 -264 -432 131 292 -85
5140 -85 -351 -55 388 -42 -371 -225 136 494 -157 -485 210 456 243 -230 -150 270 265 -285 -138 280 318 -73
5162 -73 -375 147 449 193 -208 -228 412 196 -170 -399 47 409 163 -363 46 475 147 -321 -211 417 268
5183 268 -399 -324 -56 327 80 -245 -189 396 158 -215 -445 137 390 -123 -502 -75 331 104 -306 -381 375
5204 375 285 -397 -338 42 325 18 -391 -143 384 178 -200 -418 320 548 -225 -416 -82 485 10 -485 -107
5225 -107 289 331 43 -246 113 471 -55 -330 -175 341 299 -299 -464 351 254 4 -427 104 473 -81 -302
5246 -302 -36 390 309 -344 -460 181 399 -41 -379 -143 387 181 -353 -141 52 193 -128 -342 329 372 -129
5267 -129 -365 -307 507 364 -392 -178 130 411 56 -449 84 269 -93 -216 -224 238 216 -464 -371 182 453 97
5289 97 -473 -105 202 41 -171 -60 216 180 -64 -300 -77 411 51 -468 -55 392 79 -209 -172 136 420
5310 420 85 -378 117 336 42 -213 -284 308 132 -240 -50 93 466 170 -445 165 423 -30 -112 -190 216
5331 216 353 -87 -344 313 372 -27 -241 67 517 96 -256 -213 277 293 -236 -143 -76 307 -68 -367 -258 466
5353 466 144 -220 -226 110 505 -269 -419 -115 253 230 -274 -124 290 116 -236 -321 231 243 3 -571 -100 423
5375 423 20 -378 -306 126 377 -132 -358 -129 207 -4 -244 -114 325 261 -180 -366 101 491 -45 -360 -124
5396 -124 400 307 -325 -391 398 271 -96 -237 -119 393 -4 -387 79 226 254 -244 -367 248 271 -131 -304
5417 -304 -194 395 342 -327 -20 254 278 -89 -180 -40 383 -17 -338 -129 173 70 -408 -214 103 226 -117
5438 -117 -415 213 488 202 -323 -44 240 311 -351 -89 214 296 14 -397 -124 326 58 -152 -84 59 177
5459 177 -340 -277 73 304 -35 -344 12 241 239 -55 -321 240 125 12 -463 -35 195 -232 -287 -298 385 273
5481 273 -238 -187 -12 260 -96 -294 166 256 74 -196 -38 374 233 -174 -297 78 268 159 -276 26 418
5502 418 -81 -254 -275 95 385 39 -212 -111 289 131 -238 -206 296 233 33 -72 87 274 -163 -287 -36
5523 -36 272 211 -266 -315 208 168 -201 -376 -1 197 -114 -291 31 344 52 -99 -453 257 165 -127 -281 -60
5545 -60 312 -29 -288 -43 315 61 -334 -245 110 302 -83 -402 -133 89 209 -321 -335 319 242 -209 -428
5566 -428 55 467 -124 -516 -114 147 178 27 -355 163 389 -16 -259 -41 266 47 -345 -36 269 315 17
5587 17 -356 162 344 -137 -222 7 463 116 -293 -284 347 223 -138 -276 215 445 -100 -253 -48 300 170
5608 170 -88 -297 109 206 59 -227 -173 491 160 -239 60 211 333 -177 -113 125 216 21 -298 -89 240
5629 240 -131 -30 -158 306 146 -66 -197 181 402 36 -203 -125 236 117 -186 -92 123 286 9 -216 -238
5650 -238 273 -5 -278 -366 -25 255 -290 -206 78 91 -16 -405 -161 312 62 -17 -113 79 221 -13 -333 160
5672 160 266 102 -332 -83 472 72 -271 -115 -7 310 -56 -316 98 321 124 -290 -134 272 129 -180
5692 -180 -236 20 398 122 -179 -40 25 -42 -67 -132 147 433 -155 -276 -63 254 194 -286 -142 398 160 -292
5714 -292 -137 12 321 -41 -217 -1 232 8 -196 -405 13 379 -56 -302 -107 363 -65 -289 -207 243
5734 243 178 -172 -238 128 119 -191 -339 -102 319 24 -253 -9 108 194 14 -218 209 190 -207 -89 -127 199
5756 199 100 -310 -82 205 229 -228 -458 60 185 -1 -136 -121 223 38 -118 -89 256 252 -107 -388 -228 505
5778 505 110 -300 -14 253 289 -183 -306 189 334 55 -323 -163 299 155 -350 -206 119 220 38 -389
5798 -389 -207 142 -78 -33 -66 333 198 -328 -18 12 201 -82 -96 -58 250 6 -189 -388 53 194 -28 -238
5820 -238 205 43 -132 -272 56 427 57 -161 60 122 239 -86 -176 99 43 78 -188 -164 202 2 -156 -13
5842 -13 92 333 -117 -456 -118 208 -17 -16 -85 246 173 -166 12 48 211 156 -164 181 273 3 -367 -36 177
5865 177 379 -118 -69 -5 -10 -57 -133 -9 277 134 -128 -177 -127 294 -208 -187 119 199 94 -248 -49 248 352
5888 352 -55 -219 -17 111 -88 -326 4 362 194 -73 -305 128 161 -68 -43 -20 409 179 -146 53 32
5909 32 99 -251 -500 311 156 -182 -397 4 226 193 -327 -82 199 -22 18 -204 -8 82 -155 -177 -41 95
5931 95 74 -121 -79 59 175 -24 -216 -76 424 -7 -195 42 197 208 95 -182 126 69 -36 -91 -7 180
5953 180 75 -171 -122 292 122 168 -157 28 231 -138 -158 19 176 83 -117 -209 43 75 97 -269 71 196
5975 196 60 -108 -240 -119 146 22 -106 231 118 90 -167 -122 411 261 -198 -117 75 -8 -199 -285 106 186
5997 186 23 43 -263 296 106 -133 -64 22 141 110 -213 -116 126 99 -107 -216 58 167 -259 -167 138 244
6019 244 9 -204 113 222 -188 -307 -109 39 64 -97 -163 48 87 -105 -291 95 328 112 -199 -159 79
6040 79 256 -11 -211 66 174 260 -122 -160 156 158 -211 -127 7 268 170 -515 215 217 20 -9 -137 38 145
6063 145 -182 -245 -58 103 -28 -37 -217 21 -46 -153 -145 195 205 -19 -98 90 124 95 -214 -145 130 114 -34 -160
6087 -160 -56 159 182 -161 3 76 132 -52 -75 109 165 -53 -140 -57 -150 147 -336 -228 174 69 -70 -115 -29
6110 -29 212 -36 -185 -51 167 118 -211 -47 291 -16 -29 -147 8 352 -101 -242 -28 100 102 -195 -220 126
6132 126 118 -91 -170 74 95 -110 -144 -83 95 132 -112 -201 135 -26 22 -183 -270 288 43 -172 -6 93 -26 -99
6156 -99 -39 39 153 89 -199 -35 43 -151 -91 70 -56 -75 -6 -164 57 129 46 -112 -249 120 84 -526 -77 -78
6180 -78 168 323 -99 -105 134 0 -184 -31 144 230 -208 -94 40 83 -21 -188 -175 342 31 -62 -85 118 97
6203 97 -49 -26 -4 182 39 -136 -169 266 200 -63 -13 35 176 64 -225 5 190 170 -135 -65 299 119 -272
6226 -272 -77 251 66 210 -201 9 214 40 -112 -319 102 159 -149 -45 -49 113 305 -207 31 273 86
6247 86 -68 -295 44 336 -149 -5 -155 0 71 -26 -86 167 204 -126 45 -93 131 -41 -228 -72 -50 56
6269 56 57 -159 114 308 -138 -45 -30 -103 -63 -207 -74 210 229 -84 -208 71 225 83 -184 103 -8 -49 129
6292 129 -8 1 107 -23 -222 96 219 -42 -84 176 -23 -82 191 -100 48 305 -50 -50 127 191 24 -134
6314 -134 88 86 218 64 92 61 243 163 51 101 23 21 -108 69 -23 112 -85 -212 -104 46 -67 -144 -202 255
6338 255 31 -13 -193 65 102 117 -31 -153 58 70 -295 -137 12 95 11 -235 -99 85 -45 -176 -62 67
6360 67 152 -48 -22 98 14 -17 -64 80 218 48 -81 -85 143 19 -217 -149 32 -31 25 -234 -125 238 -68 15
6384 15 -180 189 189 66 40 72 189 46 -164 -116 177 42 0 -20 110 16 -71 -54 177 74 -23 -79 -128 265 151
6409 151 -20 121 4 -47 22 -100 77 128 172 39 -193 157 -40 -160 -84 -41 178 30 -156 -173 167 19
6431 19 -4 -167 12 163 -216 -75 90 209 -55 -1 58 72 178 -99 -116 -114 190 -11 -55 -50 -15 9 -89 -141 55
6456 55 110 -153 -143 -58 281 50 -96 -8 124 217 -47 -107 25 52 48 -319 -67 120 92 -108 28 79 182 10
6480 10 -72 18 140 -94 -72 101 146 264 -170 -126 115 65 -243 -58 210 286 22 -76 -108 122 169 -212 66 -11
6504 -11 -74 30 -211 81 167 -310 -210 -112 158 34 -154 -62 153 98 -139 -176 41 177 -12 -114 -86 119 241
6527 241 3 -55 71 39 27 -205 -97 132 174 -118 -105 63 83 21 -162 67 -2 7 -165 -89 -56 152 -179 -43
6551 -43 10 102 32 -73 58 244 32 -62 70 89 52 -61 36 137 6 -28 -217 -154 23 50 -65 -99 17 -13
6575 -13 -97 -279 -7 176 -56 21 -147 -2 44 -103 -90 153 61 -142 -227 33 193 -17 -68 -107 -104 117 -6 -210
6599 -210 120 48 -76 -187 93 174 64 -24 -162 209 211 -89 -149 -55 -92 78 -25 -104 211 163 -162 -189 31 97
6623 97 11 -192 169 137 -68 12 -202 -96 147 -62 -233 176 -8 65 -8 11 -27 0 -157 -171 141 231 -59 -46
6647 -46 90 43 198 -37 -127 196 -36 -80 -36 -86 250 -108 18 37 -18 93 -37 -129 105 180 7 -26 -56 206
6671 206 11 -190 -14 84 190 -49 -180 184 26 -164 -253 -95 134 -27 -159 130 -99 97 -82 -79 -10 68
6693 68 -96 -118 89 87 68 -5 59 139 -38 64 115 -17 91 -116 -234 -34 210 82 154 -59 126 73 -218 -115
6717 -115 24 128 61 -51 -134 100 193 -30 -33 76 -69 67 -46 43 30 -49 -122 58 204 170 -121 -69 133 184
6741 184 -49 -169 -32 78 -78 -111 31 18 161 57 -67 44 41 -56 17 39 33 95 -54 -91 17 51 75 -191
6765 -191 213 119 18 -180 -84 123 273 8 -136 -36 252 128 -44 -164 109 117 -129 -269 43 -25 20 -58
6787 -58 85 194 -13 61 -158 76 132 -61 -108 56 133 -138 -173 -62 -47 -31 -58 -164 92 156 14 -133 -94 47
6811 47 95 -201 -109 55 124 -102 23 73 -14 -205 -34 5 18 4 -102 -129 -35 157 -201 -173 72 156 -169 -191 60
6836 60 41 30 70 -122 204 235 78 11 -37 104 136 -86 102 239 126 -69 -150 211 -18 -5 -88 -70 62 -96
6860 -96 -116 -8 20 122 62 -115 23 201 -13 -167 -20 114 12 -110 -25 178 256 -24 -120 102 128 -48 -124
6883 -124 1 110 116 7 7 72 236 -129 73 -1 182 6 -184 -152 -8 33 -29 66 -55 116 18 -85 -234 118
6907 118 -199 49 0 -63 -47 97 -110 -36 249 -28 -37 -228 6 -22 -127 -61 75 183 97 -95 30 255 87
6930 87 -196 -97 185 208 57 -32 156 149 79 -155 -131 191 64 -311 -109 52 64 -158 32 -31 46 317 -154 -65
6954 -65 62 13 -164 -89 -12 152 122 163 90 347 164 -57 -83 -61 53 -106 -38 -54 144 -12 -191 -9 231 -38
6978 -38 -116 -118 156 116 -41 -218 1 153 -160 -109 -106 166 87 -100 -34 88 164 -167 -66 206 -8 28 -124 -115 179
7003 179 279 -36 -354 -161 209 37 -169 -74 83 185 -126 -64 200 142 22 17 39 182 164 -117 -107 -48 213
7026 213 10 -31 -95 169 -99 -254 -61 218 239 -176 -39 178 233 -79 -140 151 231 -57 -146 20 50 151 -41
7049 -41 -105 192 28 -36 -294 -77 41 11 -200 -170 10 43 30 -263 -4 285 -20 -160 20 1 103 -85 -8
7072 -8 -15 89 -28 -120 -9 87 172 -210 -89 150 -53 -63 -207 204 65 -8 -210 38 105 135 -199 -53 125 177
7096 177 -189 -184 35 65 -23 -88 15 284 151 -38 -72 44 264 -9 -136 -142 247 -43 61 -57 -13 37 -162
7119 -162 -156 125 315 -52 -192 85 283 10 -128 -8 91 197 -264 -119 -25 53 104 -118 37 172 49 -31
7141 -31 -23 -83 207 -8 -148 128 49 -3 -82 -89 369 23 -12 -44 27 235 -53 -55 195 19 115 -77 -138 24 15 30
7167 30 -55 -175 174 -69 -106 -142 89 12 -2 -40 103 281 93 -195 45 14 132 -121 -107 113 47 -61 -129 69
7191 69 237 57 -328 116 196 171 -176 -239 16 130 46 -252 118 101 24 -42 60 192 69 28 -175 56 10
7214 10 19 69 -75 194 56 -221 -110 2 200 -223 28 -22 175 31 -243 -106 164 123 -17 -67 141 259
7236 259 -39 -118 -75 218 36 -47 71 56 101 -165 -202 56 128 -32 -198 -81 257 72 -83 -212 241 68
7258 68 -11 -22 -89 207 -16 -61 80 206 88 -11 -45 -94 118 -200 -193 44 280 123 -16 -32 186 213 -122 -165
7282 -165 229 336 99 15 35 75 43 -117 -108 124 98 -212 -122 40 179 34 -36 -136 137 162 0 49 104 218
7306 218 -385 -147 99 97 230 -313 -78 303 147 -178 -157 193 128 -63 -329 -56 138 87 -148 -213 122 394
7328 394 -95 19 99 121 111 -172 10 179 -65 -86 -276 51 225 -57 -231 -9 -2 161 -296 -124 125 165
7350 165 -2 -67 105 99 -7 -131 -37 -41 18 -42 -168 -34 12 69 -31 5 241 154 -32 25 116 175 -9 -130 -3
7375 -3 123 -20 -48 196 24 -165 -323 -53 242 79 -13 -95 102 210 -109 -188 91 42 -67 -147 -63 -45 72
7398 72 -69 -230 51 41 26 -283 -148 221 78 123 -255 24 136 0 -247 33 297 -25 -40 19 185 118
7420 118 -106 -221 81 224 -108 -126 -232 69 -1 -307 -25 81 71 -121 -141 -65 76 77 -30 -91 84 134 -166
7443 -166 -115 -92 9 176 -122 12 140 -14 -111 -20 122 128 -120 -168 105 99 73 -190 23 296 170 -154 -58 43
7467 43 151 49 -230 118 139 101 -15 -170 274 170 -47 -58 115 241 68 -127 -54 142 177 -78 -244 162
7489 162 237 -169 -367 78 265 98 -54 -151 27 235 -41 -135 174 159 8 -146 -131 181 116 -62 -88 218
7511 218 25 -135 -247 -78 197 -101 -306 56 82 -2 -218 -90 84 148 -4 -120 -32 263 50 -282 -15
7532 -15 -34 -27 -156 -201 149 267 74 -122 -128 244 165 -168 43 19 9 -36 -150 138 319 45 -63 -22 63 135 -227
7557 -227 -65 74 194 -60 -108 45 263 110 -92 -107 94 156 -333 -143 114 72 113 -283 -45 311 -60 -195
7579 -195 -171 224 141 -13 -317 74 118 153 -265 -88 196 59 -156 -147 160 195 -97 -181 -26 246 51 -263 -128
7602 -128 63 310 -212 -89 -72 241 125 -50 -19 98 106 -180 -196 140 190 6 -25 -6 212 57 -297 -130 192
7625 192 70 -138 -25 107 58 43 -256 51 153 117 -168 -314 284 141 -166 -67 -15 252 71 -185 16 -36
7647 -36 138 -198 -150 52 81 -166 -207 122 77 72 -303 -99 220 145 -166 -416 -4 94 -167 -216 18 218 236 -138
7671 -138 -199 169 217 -260 -312 -51 281 -187 -86 -193 98 147 -81 14 67 192 -195 -80 -53 170 100 -138 24
7694 24 43 265 72 -295 8 62 -169 -322 -36 191 111 -244 -179 84 79 -83 -237 15 160 120 -161 -107 76
7717 76 214 -134 -31 103 142 119 -185 -110 237 -36 -207 87 -68 87 -168 116 -2 242 -20 -34 -152 181
7739 181 195 -194 194 167 -7 -7 -90 199 105 199 -283 -178 -13 220 -161 -41 0 186 229 -135 -146 197 154 -287
7763 -287 -118 228 177 -198 -182 82 232 202 -149 -15 228 109 -157 -262 -28 209 50 -298 -77 -51 -147 -217
7785 -217 -134 288 69 -294 -82 -77 176 -158 -126 12 113 206 -176 -232 -51 124 -112 -76 85 117 76 -237 -23
7808 -23 334 89 -97 -183 161 340 -122 -209 -26 78 192 -185 -164 207 99 -84 -162 -132 230 66 -163 42
7830 42 145 149 -151 -96 160 5 -173 -183 -11 343 -21 -9 78 151 37 -54 -145 0 198 -123 -185 -61 253 31
7854 31 -237 -43 41 51 7 -315 -12 255 123 -158 2 -25 46 -77 -23 76 156 -10 56 -40 235 -104 -183 -324
7878 -324 130 112 -63 -49 93 82 -141 -129 -120 196 -46 -99 -155 146 46 -8 -59 -24 -17 56 -92 -249 206 115 -119
7903 -119 -111 172 22 25 -39 120 200 78 -264 -147 303 158 -337 -203 55 10 96 -84 -61 21 -25 -48 -70 218
7927 218 145 -15 -177 82 324 171 -198 87 217 189 -136 -112 138 274 33 -264 -32 97 142 -296 -142
7948 -142 220 -31 -4 -154 -57 -48 92 -249 30 220 71 -50 -163 226 275 12 -80 4 8 204 -124 -108 1
7971 1 -20 -53 -54 88 82 -31 -203 103 83 -59 -110 -122 152 213 -137 -182 46 -4 -63 -140 -102 155 135 -214 -229 237
7997 237 237 -162 -261 -103 170 177 19 -192 58 192 53 -202 122 267 -84 -66 97 352 71 -107 -182 231
8019 231 232 -26 -26 84 71 0 -135 40 121 25 -10 -199 127 212 114 -149 -32 103 42 -98 -31 -53 175 -26 -22
8044 -22 -10 99 181 -237 -62 217 -28 -231 -113 -114 46 53 -286 -132 208 188 -68 -104 73 29 -15 3 53 133 -37
8069 -37 -237 62 158 87 -113 56 270 207 -133 -228 87 199 77 -205 -76 200 221 -342 -157 75 204 -111
8091 -111 -24 152 114 83 -217 -54 250 -1 -231 -63 48 302 115 -257 -92 189 26 82 -33 221 188 -132
8113 -132 -44 50 -42 -52 -166 6 187 -39 -310 -191 27 103 -232 -83 75 118 42 -262 -410 187 38 -241
8135 -241 -175 37 264 -60 -289 152 124 273 -257 -174 170 116 -37 -106 -64 235 18 -169 -132 181 32 -66 -265
8158 -265 48 208 174 -173 -12 73 -54 -114 -101 89 162 47 -164 -19 55 -39 -291 -76 110 169 -149 -103 12
8181 12 8 -73 -182 -9 117 -102 -183 24 69 72
8191G2
##END NTUPLES=NMR FID
##END=
