##TITLE=1H_63-2023
 CDCl3
 8 sc, 
 31.8.2023
##JCAMPDX= 6.0         $$ Bruker NMR JCAMP-DX V2.0
##DATA TYPE= NMR FID
##DATA CLASS= NTUPLES
##ORIGIN= UXNMR, Bruker Analytische Messtechnik GmbH
##OWNER= root
$$ XWIN-NMR		Version 3.5
$$ Thu Aug 31 14:24:17 2023 Russian Standard Time (UT+4h)  she@DPX200
##.OBSERVE FREQUENCY= 200.13135
##.OBSERVE NUCLEUS= ^1H
##.DELAY= (6, 6)
##.ACQUISITION MODE= SIMULTANEOUS
##.ACQUISITION SCHEME= undefined
##.AVERAGES= 8
##.DIGITISER RES= 18
##SPECTROMETER/DATA SYSTEM= spect
##.PULSE SEQUENCE= zg30
##.SOLVENT NAME= CDCl3
##.SHIFT REFERENCE= (INTERNAL, CDCl3, 0, 15.7039)
##AUDIT TRAIL= $$ (NUMBER, WHEN, WHO, WHERE, WHAT)
$$ ##TITLE= Audit trail, XWIN-NMR		Version 3.5
$$ ##JCAMPDX= 5.01
$$ ##ORIGIN= Bruker BioSpin GmbH
$$ ##OWNER= she
$$ F:/spectra/data/she/nmr/H-F/1/audita.txt
$$ ##AUDIT TRAIL=  $$ (NUMBER, WHEN, WHO, WHERE, WHAT)
(   1,<2023-08-31 14:23:17.90 +0400>,<she>,<DPX200>,
      <created by zg, POWCHK disabled, PULCHK disabled
       configuration hash MD5:
       00 E9 B6 7A A2 85 ED C7 34 08 36 98 17 FE 4E 26
       data hash MD5: 16K
       99 0D 91 D1 22 1E D0 08 DC 9B 94 A6 D0 A8 B0 91>)
$$ ##END=
$$ 
$$ hash MD5
$$ FA 03 85 98 72 67 65 CA BC 23 91 FC 4F 55 A5 C2
##$RELAX= 
##$RELAX= 
##$RELAX= 
##$RELAX= 
##$RELAX= 
##$RELAX= 
$$ Bruker specific parameters
$$ --------------------------
##$DU= <F:/spectra>
##$EXPNO= 1
##$NAME= <H-F>
##$PROCNO= 1
##$TYPE= <nmr>
##$USER= <she>
##$AMP= (0..31)
100 100 100 100 100 100 100 100 100 100 100 100 100 100 100 100 100 100 
100 100 100 100 100 100 100 100 100 100 100 100 100 100 
##$AQSEQ= 0
##$AQ_mod= 1
##$AUNM= <au_zg>
##$AUTOPOS= <>
##$BF1= 200.13
##$BF2= 200.13
##$BF3= 200.13
##$BF4= 200.13
##$BF5= 200.13
##$BF6= 200.13
##$BF7= 200.13
##$BF8= 200.13
##$BYTORDA= 1
##$CFDGTYP= 0
##$CFRGTYP= 5
##$CHEMSTR= <none>
##$CNST= (0..31)
1 1 145 1 1 1 1 1 1 1 1 1 1 1 1 1 1 1 1 1 1 1 1 1 1 1 1 1 1 1 1 1 
##$CPDPRG= <>
##$CPDPRG1= <>
##$CPDPRG2= <>
##$CPDPRG3= <>
##$CPDPRG4= <mlev>
##$CPDPRG5= <mlev>
##$CPDPRG6= <mlev>
##$CPDPRG7= <mlev>
##$CPDPRG8= <mlev>
##$CPDPRGB= <>
##$CPDPRGT= <>
##$D= (0..31)
0 1.2 0 0 0 0 0 0 0 0.06 0 0.03 0 0 0 0 0.0002 0 0 0 0 0 0 0 0 0 0 0 0 
0 0 0 
##$DATE= 1693477397
##$DBL= (0..7)
120 120 120 120 120 120 120 120 
##$DBP= (0..7)
150 150 150 150 150 150 150 150 
##$DBP07= 0
##$DBPNAM0= <>
##$DBPNAM1= <>
##$DBPNAM2= <>
##$DBPNAM3= <>
##$DBPNAM4= <>
##$DBPNAM5= <>
##$DBPNAM6= <>
##$DBPNAM7= <>
##$DBPOAL= (0..7)
0.5 0.5 0.5 0.5 0.5 0.5 0.5 0.5 
##$DBPOFFS= (0..7)
0 0 0 0 0 0 0 0 
##$DE= 6
##$DECBNUC= <off>
##$DECIM= 32
##$DECNUC= <off>
##$DECSTAT= 4
##$DIGMOD= 1
##$DIGTYP= 9
##$DL= (0..7)
0 120 120 120 120 120 120 120 
##$DP= (0..7)
150 150 150 150 150 150 150 150 
##$DP07= 0
##$DPNAME0= <>
##$DPNAME1= <>
##$DPNAME2= <>
##$DPNAME3= <>
##$DPNAME4= <>
##$DPNAME5= <>
##$DPNAME6= <>
##$DPNAME7= <>
##$DPOAL= (0..7)
0.5 0.5 0.5 0.5 0.5 0.5 0.5 0.5 
##$DPOFFS= (0..7)
0 0 0 0 0 0 0 0 
##$DQDMODE= 0
##$DR= 18
##$DS= 0
##$DSLIST= <SSSSSSSSSSSSSSS>
$$ [...]
##$SUBNAM2= <"">
##$SUBNAM3= <"">
##$SUBNAM4= <"">
##$SUBNAM5= <"">
##$SUBNAM6= <"">
##$SUBNAM7= <"">
##$SUBNAM8= <"">
##$SUBNAM9= <"">
##$SW= 18.05172834244
##$SWIBOX= (0..15)
0 0 2 0 0 0 0 0 0 0 0 0 0 0 0 0 
##$SW_h= 3612.71676300578
##$TD= 16384
##$TD0= 1
##$TE= 0
##$TE2= 300
##$TE3= 300
##$TEG= 300
##$TL= (0..7)
0 120 120 120 120 120 120 120 
##$TP= (0..7)
150 150 150 150 150 150 150 150 
##$TP07= 0
##$TPNAME0= <>
##$TPNAME1= <>
##$TPNAME2= <>
##$TPNAME3= <>
##$TPNAME4= <>
##$TPNAME5= <>
##$TPNAME6= <>
##$TPNAME7= <>
##$TPOAL= (0..7)
0.5 0.5 0.5 0.5 0.5 0.5 0.5 0.5 
##$TPOFFS= (0..7)
0 0 0 0 0 0 0 0 
##$TUNHIN= 0
##$TUNHOUT= 0
##$TUNXOUT= 0
##$USERA1= <user>
##$USERA2= <user>
##$USERA3= <user>
##$USERA4= <user>
##$USERA5= <user>
##$V9= 5
##$VALIST= <valist>
##$VCLIST= <CCCCCCCCCCCCCCC>
##$VD= 0
##$VDLIST= <DDDDDDDDDDDDDDD>
##$VPLIST= <PPPPPPPPPPPPPPP>
##$VTLIST= <TTTTTTTTTTTTTTT>
##$WBST= 1024
##$WBSW= 4
##$XGAIN= (0..3)
0 0 0 0 
##$XL= 0
##$YL= 0
##$YMAX_a= 169887
##$YMIN_a= -204897
##$ZGOPTNS= <>
##$ZL1= 120
##$ZL2= 120
##$ZL3= 120
##$ZL4= 120
##$ABSF1= 10
##$ABSF2= 0
##$ABSG= 5
##$ABSL= 3
##$ALPHA= 0
##$AQORDER= 0
##$ASSFAC= 0
##$ASSFACI= 0
##$ASSFACX= 0
##$ASSWID= 0
##$AUNMP= <proc_1d>
##$AZFE= 0.1
##$AZFW= 0.1
##$BCFW= 1
##$BC_mod= 2
##$BYTORDP= 1
##$COROFFS= 0
##$CY= 11.3945322036743
##$DATMOD= 1
##$DC= 2
##$DFILT= <>
##$DTYPP= 0
##$F1P= 15.7292609196834
##$F2P= 12.9074282941183
##$FCOR= 0.5
##$FTSIZE= 0
##$FT_mod= 4
##$GAMMA= 1
##$GB= 0.15
##$INTBC= 1
##$INTSCL= 1
##$ISEN= 128
##$LB= 0.24
##$LEV0= 0
##$LPBIN= 0
##$MAXI= 10000
##$MC2= 0
##$MEAN= 0
##$ME_mod= 0
##$MI= 1.114404
##$NCOEF= 0
##$NC_proc= 0
##$NLEV= 6
##$NOISF1= 3.799351
##$NOISF2= 2.8
##$NSP= 1
##$NTH_PI= 0
##$NZP= 0
##$OFFSET= 15.70392
##$PC= 1
##$PHC0= -21048.28
##$PHC1= 12.05272
##$PH_mod= 1
##$PKNL= yes
##$PPARMOD= 0
##$PSCAL= 0
##$PSIGN= 0
##$REVERSE= no
##$SF= 200.130013532006
##$SI= 16384
##$SIGF1= 3
##$SIGF2= 2
##$SINO= 400
##$SIOLD= 16384
##$SREGLST= <1H.CDCl3>
##$SSB= 0
##$STSI= 0
##$STSR= 0
##$SW_p= 3612.71676300578
##$SYMM= 0
##$S_DEV= 0
##$TDeff= 0
##$TDoff= 0
##$TI= <>
##$TILT= no
##$TM1= 0
##$TM2= 0
##$TOPLEV= 0
##$USERP1= <user>
##$USERP2= <user>
##$USERP3= <user>
##$USERP4= <user>
##$USERP5= <user>
##$WDW= 1
##$XDIM= 8192
##$YMAX_p= 0
##$YMIN_p= 0
$$ End of Bruker specific parameters
$$ ---------------------------------
##NTUPLES= NMR FID
##VAR_NAME=  TIME,          FID/REAL,        FID/IMAG
##SYMBOL=    X,             R,               I
##VAR_TYPE=  INDEPENDENT,   DEPENDENT,       DEPENDENT
##VAR_FORM=  AFFN,          ASDF,            ASDF
##VAR_DIM=   8192,          8192,            8192
##UNITS=     SECONDS,       ARBITRARY UNITS, ARBITRARY UNITS
##FACTOR=    0.0002768,     1,               1
##FIRST=     0,             0,               0
##LAST=      2.2672688,     0,               0
##MIN=       0,             -204897,         0
##MAX=       2.2672688,     169887,          0
$$ Real data points
##PAGE= N=1
##DATA TABLE= (X++(R..R)), XYDATA
$$ [...]
$$ plain form
2487 -1942 2201 2367 -2919 -261 -1675 -851 4144 -489 -750 -668 -3156 2666 1836 -685 1132 -3406
2503 -3406 -447 3085 -50 1832 -936 -3165 2211 704 1199 1665 -3743 -263 1050 -154 3077
2518 3077 -1922 -2928 697 -1217 2728 1560 -3301 -540 -1486 209 3842 -1318 -981 -699 -2185 3263
2534 3263 1555 -1025 393 -2966 401 3258 -411 1174 -1710 -2390 2766 724 1160 628 -3985 256
2550 256 1138 43 2478 -2656 -2675 856 -859 2718 757 -3400 211 -939 886 3500 -2001 -994
2566 -994 -362 -1362 3624 769 -1553 280 -2399 1264 3071 -1345 506 -1778 -1622 3345 403 412
2582 412 7 -3755 961 1308 -16 1734 -3082 -1897 1497 -541 2574 -142 -3097 766 -498 1110
2598 1110 2699 -2290 -600 -24 -894 3659 32 -1875 384 -1967 2083 2365 -1872 265 -1935 -939
$$ packed form
2487a942M143J66n286K658j414Q24M995m633k61Q2k488N822q30k521J817m538
2503c406K959L532l135J882k768k229N376j507M95M66n408L480J313j204L231
2518C077m999j006L625j914L945j168m861K761r46J695L633n160L37K82j486N448
2534C263j708k580J418l359L367K857l669J585k884o80N156k042M36n32m613M241
2550B56Q82j095K435n134j9L531j715L577j961m157L611j150J825K614n501J007
2566i94O32j000M986k855k322J833k679L663J807m416J851k284J56M967k942R
2582D12m05l762M716L47j324J750m816J185L394k038L115k716k955L863j264J608
2598A110J589m989J690N76q70M553l627j907K259k351M050K82m237K137k200R96
$$ plain form
2614 -939 3597 -55 -145 -708 -3393 1753 1449 -309 1099 -3152 -1189 2001 -201 2008 -511 -2715
2630 -2715 1545 11 1411 1926 -2891 -114 605 43 3133 -777 -1996 518 -1248 2599 2059 -2540
2646 -2540 5 -1504 -123 3351 -974 -828 -1104 -2694 2101 1074 -777 522 -3005 0 2281
2661 2281 -247 1698 -1054 -2383 2169 472 1294 1194 -3281 324 1079 128 2701 -1922 -2036 623
2677 623 -859 2932 1366 -2766 -145 -1367 269 2851 -1486 -850 -865 -2240 2440 633 -761 233
2693 233 -2736 877 2520 -618 1294 -1252 -1714 2757 389 898 307 -3122 697 1285 195 2211
2709 2211 -2404 -1782 768 -536 2446 522 -2794 74 -1347 583 2471 -1846 -611 -696 -1407 2646
2725 2646 317 -805 732 -2277 1364 2199 -1014 867 -1354 -1197 2695 -94 680 -79 -2971 1277
$$ packed form
2614i39M536l652r0n63k685N146l04j758J408m251J963L190k202K209k519k204
2630b715M260j534J400N15m817K777P19n62L090l910j219K514j766L847n40m599
2646b540K545j509J381L474m325J46k76j590M795j027j851J299l527L005K281
2661B281k528J945k752j329M552j697Q22j00m475L605P55r51K573m623j14K659
2677F23j482L791j566m132K621j222J636K582m337O36j5j375M680j807j394R94
2693B33k969L613J643l138J912k546m62M471k368N09n91l429L819N88j090K016
2709B211m615O22K550j304K982j924l316K868j421J930J888m317J235q5p11M053
2725B646k329j122J537l009L641Q35l213J881k221J57L892k789P74p59k892M248
$$ plain form
2741 1277 1071 96 1680 -2455 -1044 1299 -626 2234 -324 -2694 515 -957 880 2116 -2086
2756 -2086 4 -367 -1041 2637 -313 -840 622 -1498 1807 1693 -1229 884 -1379 -445 2804 -508
2772 -508 169 -379 -2326 1888 745 -327 1004 -2415 -586 1338 -786 1442 -933 -2055 1340 -794
2788 -794 622 1262 -2261 451 174 -380 2642 -989 -923 1075 -1126 1774 1004 -1912 736 -1097 161
2805 161 2581 -1200 -253 -650 -1694 1976 220 -837 649 -2431 339 1493 -992 1170 -954 -1678
2821 -1678 1752 -538 721 843 -2150 847 478 -186 1963 -1538 -790 1331 -870 1797 351 -2049
2837 -2049 923 -906 290 2064 -1734 -114 -370 -1456 2017 -214 -996 560 -2088 623 1173 -1205
2853 -1205 911 -1222 -1151 1813 -620 623 454 -2181 1397 469 -189 1590 -1792 -391 1126 -764
$$ packed form
2741A277k06r75J584m135J411K343j925K860k558k370L209j472J837J236m202
2756b086K090l71o74L678k950n27J462k120L305j14k922K113k263R34L249l312
2772e08O77n48j947M214j143j072J331l419J829J924k124K228k375j122L395k134
2788g94J416O40l523K712k77n54L022l631O6J998k201K900p70k916K648j833J258
2805A61K420l781R47l97j044L670j756j057J486l080K770J154k485K162k124p24
2821a678L430k290J259J22k993K997l69o64K149l501P48K121k201K667j446k400
2837b049K972j829J196J774l798J620k56j086L473k231p82J556k648K711N50k378
2853a205K116k133P1K964k433J243j69k635L578r28o58J779l382J401J517j890
$$ plain form
2869 -764 1684 -164 -1900 1178 -775 555 1332 -2042 -5 -292 -1045 1930 -538 -619 786 -2050
2885 -2050 940 1034 -1292 1361 -1028 -651 1985 -1012 486 330 -1578 1581 49 -584 1449 -1652
2901 -1652 230 1251 -1070 1349 -639 -1541 1239 -1038 280 742 -2019 598 -143 -932 1779 -1163
2917 -1163 -646 1117 -1304 1287 529 -1353 1349 -754 103 1746 -1509 643 641 -1294 1891 -287
2933 -287 -920 874 -1461 712 1254 -1409 796 -1035 -964 1983 -692 218 373 -1996 1047 217 -587
2950 -587 1489 -1516 -147 1066 -906 1309 107 -1115 1448 -486 239 1516 -1753 349 520 -664
2966 -664 1951 -829 -1108 786 -1174 1117 927 -1632 578 -1224 -541 2071 -1120 114 229 -2095
2982 -2095 1288 209 -446 1238 -1583 113 1521 -1107 1362 -284 -1125 1833 -671 445 1150 -2015
$$ packed form
2869g64K448j848j736L078j953J330P77l374K037k87p53K975k468q1J405k836
2885b050K990R4k326K653k389L77K636k997J498j56j908L159j532o33K033l101
2901a652J882J021k321K419j988r02K780k277J318M62k761K617p41p89K711k942
2917a163N17J763k421K591p58j882K702k103Q57J643l255K152kj935L185k178
2933b87o33J794k335K173N42k663K205j831P1K947k675R10J55k369L043q30q04
2950e87K076l005J369J213j972K215j202j222K563j934P25J277l269K102J71j184
2966f64K615k780k79J894j960K291j90k559K210j802O83K612l191J234J15k324
2982b095L383j079o55J684k821J696J408k628K469j646q41K958k504J116P05l165
$$ plain form
2998 -2015 681 349 -533 1661 -1170 -1030 609 -1048 1383 795 -1780 437 -1277 -280 1839 -1082
3014 -1082 455 100 -1710 1691 -166 -488 1293 -1190 697 1197 -1129 1175 -621 -1002 1869 -548
3030 -548 167 556 -2100 1057 199 -744 1694 -1378 -545 791 -1293 1268 130 -1630 1120 -1104
3046 -1104 -181 1254 -1485 295 416 -1065 1627 -634 -636 1260 -977 962 1031 -1587 635 -617 -235
3063 -235 2000 -1056 -78 316 -1964 1442 292 -761 1122 -1827 -391 1190 -984 1066 -340 -1570
3079 -1570 1250 -696 103 921 -1768 574 718 -599 1682 -1154 -796 1219 -753 1638 479 -1787
3095 -1787 413 -849 157 2188 -1266 -448 -215 -1683 1623 336 -664 666 -2105 161 1266
3110 1266 -1021 976 -1007 -1283 1614 -462 411 640 -1821 964 690 -55 1447 -1385 -985 1056
$$ packed form
2998b015K696l32q82K194k831J40J639j657K431n88k575K217j714R97K119k921
3014a082J537l55j810L401j857l22J781k483J887N00k326K304j796l81K871k417
3030e48P15L89k656L157q58r43K438l072Q33J336k084K561j138j760K750k224
3046a104R23J435k739J780J21j481K692k261kJ896k237J939O9k618K222j252L82
3063b35K235l056R78L94k280L406j150j053J883k949J436J581k174K050j406j230
3079a570K820j946P99Q18k689K342J44j317K281k836L58K015j972K391j159k266
3095a787K200j262J006K031l454Q18K33j468L306j287j000J330k771K266J105
3110A266k287J997j983k76K897k076Q73K29k461K785k74p45J502k832M00K041
$$ plain form
3126 1056 -299 1836 407 -2028 226 -853 263 2060 -1381 -385 -577 -1360 1835 158 -756 471
3142 471 -1812 467 1382 -998 832 -1059 -918 1949 -403 311 268 -2101 1213 748 149 1495 -1993
3159 -1993 -826 889 -539 1661 11 -2314 328 -835 634 1800 -1519 -213 -369 -1190 2046
3174 2046 -176 -827 343 -1588 864 1330 -837 652 -989 -331 2035 -474 183 60 -1897 1236
3190 1236 634 24 897 -1790 -676 1193 -333 1322 -612 -1998 837 -504 710 1485 -1853 47
3206 47 108 -694 1791 -840 -608 660 -1020 1510 1205 -1380 667 -1010 197 2248 -736 -44 -229
3223 -229 -1617 1607 737 -325 708 -2175 -296 1240 -578 1245 -982 -1839 1172 -492 745 784
3239 784 -2159 273 333 -289 1990 -1132 -953 728 -764 1702 745 -1578 435 -963 594 1974
$$ packed form
3126A056j355K135j429k435K254j079J116J797l441R96j92p83L195j677r14J227
3142D71k283K279R15k380J830j891J41K867k352P14m3k369L314m65n99J346l488
3159a993J167J715j428K200j650k325K642j163J469J166l319J306j56q21L236
3174B046k222o51J170j931K452M66k167J489j641O58K366k509O57j23j957L133
3190A236o02o10Q73k687J114J869j526J655j934j386K835j341J214P75l338J900
3206D7O1q02K485k631K32J268j680K530l05k585K047j677J207K051k984O92j85
3223b29j388L224q70j062J033k883J879J536j818J823k227q57L011j664J237L9
3239G84k943K432O0o22K279l122J79J681j492K466r57k323K013j398J557J380
$$ plain form
3255 1974 -1120 -202 -397 -1389 2067 385 -506 146 -2017 343 1288 -663 889 -1249 -1317 1600 -302
3272 -302 415 380 -2115 825 610 50 1724 -1435 -645 1024 -293 1873 340 -1777 477 -572 809
3289 809 1849 -1456 -330 -502 -1272 2182 -122 -821 82 -2089 929 1336 -739 538 -1370 -1030 1687
3306 1687 -113 694 -315 -2054 879 694 416 1492 -1707 -456 1080 -128 1583 -130 -1878 672
3322 672 -690 830 1485 -1600 -367 -439 -459 1849 -402 -1062 -34 -1519 1158 1038 -924 434 -1608
3339 -1608 -547 1952 72 537 -370 -1681 1556 791 285 1092 -1822 82 1209 -260 1645 -617
3355 -617 -1641 950 -587 743 724 -2098 -30 -379 -45 1920 -994 -1069 86 -1164 1451 805 -1232
3372 -1232 244 -1207 25 1956 -542 188 -371 -1384 1671 406 87 630 -1872 137 1190 -357
$$ packed form
3255A974l094R18j95r92L456j682q91O52k163K360R45j951J552k138o8K917j902
3272c02P17l5k495K940k15n60J674l159P90J669j317K166j533k117K254j049J381
3289H09J040l305J126j72p70L454k304o99R03k171L018M07k075J277j908L40K717
3306A687j800Q07j009j739K933j85k78J076l199J251J536j208J711j713j748K550
3322F72j362J520O55l085J233p2k0K308k251o60J028j485K677j20j962J358k042
3339a608J061K499j880M65r07j311L237p65n06Q07k914J904J127j469J905k262
3355f17j024K591j537J330j9k822K068l49L34J965k914p5J155j250K615o46k037
3372a232J476j451J232J931k498P30n59j013L055j265l19N43k502K009J053j547
$$ plain form
3388 -357 970 -1061 -1390 1054 -343 945 338 -2127 280 196 -78 1390 -1235 -950 130 -640 1719
3405 1719 350 -1332 286 -1087 460 1601 -751 194 -463 -1087 1782 350 -331 326 -1772 581
3421 581 1029 -478 716 -1363 -1037 1346 -344 664 20 -2053 796 216 255 1186 -1663 -680 508
3438 508 -333 1599 172 -1497 510 -517 922 1570 -1126 -7 -411 -668 1891 -131 -275 11 -1590
3455 -1590 911 1008 -689 435 -1396 -525 1318 -328 826 -184 -1871 893 264 252 1233 -1638 -336
3472 -336 640 -304 1448 -290 -1271 695 -485 943 1217 -1077 85 -270 -360 1732 -610 -810 26
3489 26 -1285 1115 488 -862 462 -1303 -371 1270 -662 460 -326 -1560 1182 71 -8 937 -1540
3506 -1540 81 862 -222 1447 -356 -924 978 -254 975 861 -1512 269 -176 -134 1574 -908
$$ packed form
3388c57J327k031l29K444j397J288o07k465K407q4k74J468k625K85J080p70K359
3405A719j369j682J618j373J547J141k352R45o57o24K869j432o81O57k098K353
3421E81M48j507J194k079L26K383j690J008o44k073K849n80L9R31k849R83J188
3438E08q41J932j427j669K007j027J439O48k696J119m04k57K559k022j44K86j601
3455a590K501R7j697J124j831Q71J843j646J154j010j687K764o29j2R81k871J302
3472c36R76r44J752j738r81J966j180J428K74k294J162l55r0K092k342k00Q36
3489B6j311K400o27j350J324j765R32J641j932J122p86j234K742j111p9R45k477
3506a540J621P81j084J669j803n68J902j232J229j14k373J781m45M2J708k482
$$ plain form
3522 -908 -463 177 -854 1304 263 -873 276 -1058 -9 1324 -600 414 -394 -972 1413 -63
3538 -63 -140 631 -1195 605 802 -312 1173 -847 -959 889 -272 798 284 -1655 454 -230 -202 1375
3556 1375 -1384 -343 135 -604 1240 27 -963 428 -958 384 1219 -789 254 -435 -483 1552 -69
3573 -69 -323 277 -1322 893 862 -169 1079 -944 -649 1076 -321 662 -7 -1458 546 -429 -44 1017
3591 1017 -1368 -131 289 -649 1257 -187 -1091 761 -744 397 911 -956 548 -328 -321 1382 -361
3608 -361 -34 386 -1174 966 524 -482 739 -913 -363 1037 -739 438 -124 -1117 795 -254 -67
3625 -67 661 -1363 139 583 -582 971 -443 -522 864 -388 603 699 -976 464 -89 -168 1267 -834
3643 -834 -188 396 -728 1101 215 -620 476 -831 -199 681 -988 436 -130 -778 1028 -350 -319 307
$$ packed form
3522i08M45O40j031K158j041j136J149j334J049J333j924J014q08n78K385j476
3538f3p7P71j826J800J97j114J485k020j12J848j161J070n14j939K109o84K8J577
3556A375k759J041M78p39J844j213r90J391j386J342Q35k008J043o89m8K035j621
3573f9k54O00j599K215l1j031J248k023K95J725j397R83o69j451K004r75L85J061
3591A017k385J237M20r38J906j444r04J852j505J141N14j867J504q76PJ703j743
3608c61L27M20j560K140m42j006J221j652N50J400j776J177n62r93J912j049J87
3625f7P28k024J502M44j165J553j414p9J386j252R91R6j675J440n53p9J435k101
3643h34O46N84j124J829q86q35J096j307O32Q80j669J424n66o48J806j378L1O26
$$ plain form
3661 307 -1254 544 448 -595 849 -637 -562 1178 -306 635 331 -982 805 7 46 1062 -931
3678 -931 -462 195 -811 985 -3 -799 694 -808 110 558 -922 439 -182 -452 1085 -363 -75
3695 -75 97 -972 769 463 -317 843 -687 -327 960 -316 657 189 -1169 611 -92 135 884 -1158
3713 -1158 -99 112 -787 902 -315 -803 514 -719 367 447 -1003 335 -209 -289 1024 -590 -188
3730 -188 237 -611 904 327 -531 561 -883 -34 831 -441 580 47 -1112 652 -277 -17 678 -1112
3748 -1112 343 149 -749 758 -379 -380 883 -684 370 324 -992 602 -118 -176 921 -638 -113 571
3766 571 -760 1022 121 -538 702 -760 113 739 -535 572 -202 -742 689 -638 -146 569 -823
3783 -823 479 139 -684 813 -700 5 1077 -686 266 -100 -952 760 114 -13 742 -697 188 404
$$ packed form
3661C07j561J798r6j043J444j486P5J740j484R41l04j313J787p98L9J016j993
3678i31M69O57j006J796r88p96J493j502R18M48j480J361o21k70J537j448K88
3695g5J72j069J741l06p80J160j530L60J287j276R73m68j358J780p03K27P49k042
3713a158J059K11q99J689j217m88J317j233J086Q0j450J338n44q0J313j614M02
3730a88M25q48J515n77q58J092j444Q49Q65j272J021n33j159J764r29K60O95j790
3748a112J455j94q98J507j137jJ263j567J054m6j316J594p20n8J097j559N25O84
3766E71j331J782r01o59J240j462Q73O26j274J107p74n40J431j327M92P15j392
3783h23J302l40q23J497j513P05J072j763R52l66q52J712o46j27P55j439Q85K16
$$ plain form
3801 404 -456 892 -246 -523 544 -598 183 552 -906 257 -3 -385 863 -788 -399 314 -742
3818 -742 753 380 -664 336 -756 202 995 -714 204 -248 -703 1010 48 158 688 -992 -21 653
3836 653 -288 904 -273 -499 800 -355 435 310 -1162 409 -176 -383 797 -952 -369 129 -491
3853 -491 858 199 -724 340 -768 105 1082 -653 92 -308 -846 875 40 -105 305 -1038 322 496
3871 496 -447 534 -484 -497 843 -413 349 -69 -1250 518 -38 -161 747 -1008 -485 347 -486 1095
3889 1095 -82 -647 271 -585 351 986 -719 289 -327 -570 1050 -155 40 414 -721 459 217
3906 217 -417 496 -686 -355 680 -590 177 -220 -1016 391 -165 -131 459 -909 227 543 -229 993
3924 993 -88 -492 530 -338 551 905 -551 259 -80 -427 938 -299 -164 362 -708 605 246 -657
$$ packed form
3801D04q60J348j138k77J067j142P81L69j458J163k60l82J248j651L89P13j056
3818g42J495l73j044J000j092R58P93j709R18m52m55J713r62J10N30j680R71O74
3836F53r41J192j177k26J299j155P90j25j472J571n85k07J180j749N83M98o20
3853d91J349o59r23J064j108Q73R77j735P45m00n38J721q35j45M10j343J360J74
3871D96r43R81j018j3J340j256P62m18j181J768n56j23R08j755N23Q32q33J581
3889A095j177n65R18q56R36O35j705J008o16k43J620j205J95L74j135J180k42
3906B17o34R13j182L31J035j270P67l97p96J407n56L4N90j368J136L16p72J222
3924I93j081m04J022q68Q89L54j456Q10l39l47J365j237J35N26j070J313l59r03
$$ plain form
3942 -657 522 -550 -86 757 -513 193 6 -808 798 93 -282 457 -823 385 461 -367 854 -426
3960 -426 -467 517 -91 525 203 -846 439 -130 -50 771 -732 -251 151 -666 970 25 -548 404 -845
3979 -845 60 767 -586 293 -341 -440 1045 84 -11 230 -949 247 742 -358 705 -548 -518 554
3997 554 -201 435 78 -1114 334 3 1 767 -796 -172 401 -620 1005 -188 -785 342 -479 369
4015 369 676 -730 37 -451 -454 1189 -51 -29 234 -836 607 665 -385 244 -696 -433 854 -159 510
4034 510 -95 -887 610 -29 128 729 -1060 -151 191 -131 1126 -432 -1032 218 -431 348 711 -867
4052 -867 24 -319 -217 1312 -99 -150 235 -613 910 395 -395 370 -538 -231 909 -355 348 -375 -697
4071 -697 639 29 -62 316 -1064 99 175 -283 621 -449 -692 307 -91 602 492 -826 121 -475 -3
$$ packed form
3942f57J179j072M64Q43j270P06j87q14J606p05l75P39j280J208P6q28J221j280
3960d26m1R84o08O16l22j049J285n69Q0Q21j503M81M02q17J636r45n73R52j249
3979h45R05P07j353Q79o34r9J485r61r5K41j179J196M95j100J063j253L0J072
3997E54p55O36l57j192J448l31kP66j563O24N73j021J625j193n97J127q21Q48
4015C69L07j406P67m88lJ643j240K2K63j070J443N8j050O29r40K63J287j013O69
4034E10o05p92J497o39J57O01j789R09L42l22J257j558o00J250o49P79L63j578
4052h67Q91l43J02J529j411n1L85q48J523n15p90P65r08L07J140j264P03p23l22
4071f97J336o10r1L78j380J163P6m58R04j070k43R99l98O93j10j318R47n96M72
$$ plain form
4090 -3 940 -365 -256 -31 -429 869 271 -428 322 -724 137 796 -510 73 -374 -751 713 38 -75
4109 -75 197 -1008 209 383 -32 494 -716 -523 583 -277 733 271 -942 328 -110 229 1029 -772
4127 -772 -246 312 -557 883 7 -692 216 -544 343 699 -627 174 -363 -455 844 -32 -93 -81 -1002 593
4147 593 611 -263 851 -742 -363 695 -151 735 -73 -792 517 -117 171 705 -954 -131 164 -291 782
4166 782 -130 -723 117 -749 411 675 -730 63 -247 -75 911 -321 -84 8 -627 492 439 -248 466
4185 466 -674 -179 703 -31 525 -332 -855 389 190 245 350 -774 -46 247 -204 773 -111 -584 324
4204 324 -645 483 193 -786 -14 -465 -5 929 -351 -164 63 -726 940 486 -205 491 -875 82 772
4223 772 -183 343 -204 -737 748 -80 53 328 -988 28 385 -3 737 -711 -563 371 -358 380 77
$$ packed form
4090cR43j305J09K25l98J298n98o99P50j046Q61O59j306N83m47l77J464o75j13
4109g5K72j205J217J74m15N26j210J93J106q60J010m62j213J270m38L39Q00j801
4127g72N26N58q69J440q76o99R08p60Q87L56j326Q01n37r2J299q76o1J2r21J595
4147E93J8q74J114j593L79J058q46Q86q08p19J309o34K88N34j659Q23K95m55J073
4166G82r12n93Q40q66J160K64j405P93l10J72R86j232K37R2o35J119n3o87P14
4185D66j140M95Q82p34N56q57n23J244j99N5J05j124P28K93m51R77q84m73R08
4204C24r69J128k90r79P72m51M60R34j280J87K27p89J666m54o91O96j366R57O90
4223G72r55N26n47n33J485q28J33K75j316J016L57l88P40j448J48R34p29P38l03
$$ plain form
4242 77 -712 166 -480 16 803 -442 -14 -72 -348 984 149 -468 467 -598 250 553 -377 524 -393 -513
4262 -513 819 -195 185 156 -1014 119 162 -72 404 -738 -366 452 -221 763 -40 -989 275 -172 196
4281 196 835 -645 -38 95 -156 740 -42 -286 288 -705 281 682 -503 214 -610 -549 806 -255 44
4300 44 44 -949 263 271 -247 237 -781 -385 502 -125 559 -28 -828 373 14 487 679 -619 174 70
4320 70 -207 840 -260 -364 173 -507 569 557 -516 141 -548 -212 947 -419 -187 -65 -958 429
4338 429 124 -201 217 -504 118 681 -70 504 -86 -579 653 -367 370 527 -648 78 43 -163 800
4357 800 -574 -207 253 -487 523 536 -565 243 -209 -113 726 -517 -24 -35 -487 813 -25 -17 265 -733
4377 -733 319 490 -330 493 -318 -598 648 -57 108 244 -669 339 131 -200 544 -606 -406 297 -427
$$ packed form
4242G7p89Q78o46M96P87j245M28n8k76J332q35o17R35j065Q48L03r30R01r17j20
4262e13J332j014L80k9j170J133M3k34M76j142L72Q18o73R84q03r49J264m47L68
4281A96O39j480O07J33k51Q96p82k44N74r93R86M01j185P17q24O1J355j061K99
4300D4%r93J212Qn18M84j018L96Q87o27O84n87q00J201l59M73J92j298P93j04
4320G0k77J047j100j04N37o80J076j2j073O57o89L36J159j366K32J22q93J387
4338D29l05l25M18p21O22N63p51N74n90m93J232j020P37J57j175P26l5k06R63
4357H00j374L67M60p40J010J3j101Q08m52R6Q39j243M93j1m52J300q38QK82r98
4377g33J052J71q20Q23q11k80J246p05J65J36r13J008k08l31P44j150K00P03p24
$$ plain form
4396 -427 377 -29 -604 243 -340 32 614 -737 -26 -171 -395 806 -86 -190 247 -526 380 558 -328
4415 -328 463 -416 -345 565 -276 145 14 -897 414 120 -75 471 -750 -66 486 -346 380 -51 -714 213
4435 213 -323 199 449 -399 184 -14 -171 598 -187 -253 126 -471 665 428 -376 251 -462 -125 526 -297
4455 -297 174 -25 -759 535 -17 -243 384 -627 -107 255 -271 266 -206 -485 367 -406 328 350 -593 157
4475 157 257 9 728 -38 -328 431 -636 462 394 -621 396 -340 -54 637 -445 2 30 -597 337
4494 337 109 -190 431 -744 118 232 -289 425 -152 -548 523 -123 75 417 -612 425 21 -312 559
4513 559 -420 -112 218 -554 475 35 -385 330 -326 8 439 -601 172 -37 -542 379 -39 -174 219
4532 219 -585 296 376 -343 525 -99 -292 708 -247 119 327 -494 418 34 -121 447 -255 -49 433 -540
$$ packed form
4396d27Q04m06n75Q47n83L72N82j351P11j45k24J201q92j04M37p73R06J78q86
4415c28P91q79P1R10q41M21j31r11J311k94j95N46j221O84N52q32P26m31o63R27
4435B13n36N22K50q48N83j98j57P69p85o6L79n97J136k37q04O27p13L37O51q23
4455b97M71j99p34J294n52k26O27j011N20L62n26N37m72k79Q52p73P34K2r43P50
4475A57J00k48P19p66k90P59j067J098o8j015J017p36K86O91j082M47K8o27R34
4494C37k28k99O21j175Q62J14n21P14n77l96J071o46J98L42j029J037m04l33Q71
4513E59r79L08L30p72J029m40m20P15o56L34M31j040P73k09n05R21m18j35L93
4532B19q04Q81Q0p19Q68o24j93J000r55L66K08q21R12l84j55N68p02K06M82r73
$$ plain form
4552 -540 387 -110 -467 350 -260 15 272 -559 234 87 -331 533 -41 -69 424 -552 443 -36 -502 222
4572 222 -161 37 388 -207 64 164 -541 440 51 -70 586 -403 200 558 -380 376 -199 -318 272 -350
4592 -350 49 185 -535 154 104 -117 361 -284 -287 505 -338 222 38 -579 405 42 85 716 -246 15 194
4613 194 -358 593 -55 -280 304 -539 159 231 -302 227 -456 -57 285 -401 88 122 -600 180 11 -424 324
4634 324 -423 71 501 -315 295 -45 -321 491 -138 196 321 -437 159 62 -85 471 -121 -235 115 -484
4654 -484 308 138 -454 95 -391 -298 399 -507 113 147 -258 405 71 -221 159 -328 35 304 -331 415 -88
4675 -88 -113 336 -112 110 201 -400 327 52 -195 225 -139 -329 317 -380 301 222 -474 306 -67 15 441 -508
4697 -508 15 124 -414 599 -112 -8 292 -380 87 246 -293 257 -89 -261 726 -152 31 254 -842
$$ packed form
4552e40R27m97l57Q17o10K75K57q31P93j47m18Q64n74k8M93r76R95m79m66P24
4572B22l83J98L51n95K71J00p05R81l89j21O56r89O03L58r38P56n75j19N90o22
4592c50L99J36p20O89n0k21M78o45lP92q43N60j84o17R84l63M3O31r62K61J79
4613A94n52R51o48k25N84q43O98P2n33N29o83L99L42o86M89L4p22P80j69m35P48
4634C24p47M94M30q16O10l40k76Q12o29L34J25p58N96r7j47N56n92j14L50n99
4654d84P92j70n92N49m86R3O97r06O20L4m05O63l34k92L80m87L63K69o35P46n03
4675h8k5M49m48K22R1o01P27k75k47M20l64j90O46o97O81p9o96P80l73Q2M26r49
4697e08N23J09n38J013p11J04L00o72M67J59n39N50l46j72R87q78J83K23j096
$$ plain form
4716 -842 153 124 -280 420 -345 -120 180 -392 275 -167 -486 320 -21 -101 473 -543 -43 33 11 638 50
4737 50 -84 52 -254 432 271 -432 175 -322 -136 469 -367 118 23 -459 314 -46 -280 299 -462 225 412
4758 412 -348 110 -261 -311 451 8 109 189 -591 125 177 -103 614 0 -218 126 -353 369 334 -444 254
4779 254 -179 -215 477 -248 60 154 -653 534 -114 -200 408 -366 -64 376 -27 223 -290 -486 223 -135 -75
4800 -75 97 -416 45 198 21 365 -455 -304 202 -293 405 51 -516 117 -296 62 460 -421 -60 -108 -407
4821 -407 612 -104 -246 74 -526 285 609 -75 298 -170 -154 471 40 114 309 -441 365 176 -31 262
4841 262 -438 -267 259 -61 425 -180 -376 192 -347 0 521 -580 -170 43 -187 510 -243 -127 194 -181
4861 -181 358 271 -148 137 -480 -72 545 -34 201 51 -446 269 -142 58 448 -388 -184 219 -240 271
$$ packed form
4716h42R95k9m04P00p65K25L00n72O67m42l19Q06l41q0N74j016N00P6k2O27n88
4737E0j34J36l06O86j61p03O07m97J86O05q36M85r5m82P73l60k34N79p61O87J87
4758D12p60M58l71n0P62m43J01Q0p80P16N2k80P17o14k18L44m79P22l5p78O98
4779B54m33l6O92p25L08R4q07J187o48q6O08p74L02M40m03K50n13j96P09l58O0
4800g5J72n13M61J53j77L44q20J51N06m95O98l54n67O33m13L58L98q81L61m8k99
4821d07J019p16j42L20o00Q11L24o84L73m68J6O25m31P4J95p50Q06j89k07K93
4841B62p00J71N26l20M86o05j96N68n39L47N21j101M10K13k30O97p53J16L21l75
4861a81N39q7m19K85o17M08O17n79K35j50m97P15m11K00L90q36K04M03m59N11
$$ plain form
4881 271 -121 -495 258 -358 130 142 -418 -21 -119 -169 641 -92 -201 276 -257 348 341 -266 232 -284 -166 352
4903 352 15 139 -191 -364 323 -181 -266 283 -391 198 214 -302 313 -138 -308 170 -204 240 204 -432 39
4924 39 -214 -184 552 -43 180 -199 -202 342 124 -194 101 -318 -141 428 -314 162 -62 -439 418 50 -204
4945 -204 -48 -362 113 315 -304 152 -297 -436 501 -81 220 -62 -323 179 312 -89 406 -298 -272 261
4965 261 -336 359 -44 -207 172 -253 64 441 -278 -47 -228 -121 315 -50 -52 152 -469 -73 220 -86 -1
4986 -1 -416 -182 287 -40 117 -151 -535 188 -48 -169 341 -314 30 157 -125 287 -302 -396 324 -93 152
5007 152 345 -463 -56 113 -260 399 -136 -175 78 -442 224 383 -294 85 -362 -611 431 -19 36 -38 -300
5028 -300 412 51 -5 294 -389 253 281 -55 344 43 -358 173 -235 464 262 -477 110 -208 16 532 -400
$$ packed form
4881B71l92l74P53o16M88J2n60L97r8n0Q10p33j09M77n33O05po07M98n16J18N18
4903C52l37J24l30j73O87n04q5N49o74N89J6n16O15m51j70M78l74M44l6o36M71
4924C9k53L0P36n95K23l79lN44k18l18K95m19J77N69p42M76k24l77Q57l68k54
4945b04J56l14M75K02o19M56m49j39R37n82L01k82k61N02J33m01M95p04K6N33
4965B61n97O95m03j63L79m25L17L77p19K31j81J07M36l65kK04o21L96K93l06Q5
4986am15K34M69l27J57k68l84P23k36j21N10o55L44J27k82M12n89r4P20m17K45
5007A52J93q08M07J69l73O59n35l9K53n20O66J59o77L79m47k49J042m50N5p4k62
5028c00P12l61n6K99o83O42K8l36L99l01m01N31m08O99k02p39N87l18K24N16r32
$$ plain form
5049 -400 -401 -68 -400 258 42 -120 343 -387 -39 338 -4 -65 93 -218 387 -128 67 169 -438 91 39
5070 39 -305 279 -330 -347 125 -276 2 119 -412 220 -1 -20 679 -210 -166 71 -415 379 39 -211 66
5091 66 -260 23 389 -87 102 -46 -216 472 -166 -114 148 -267 55 165 -51 143 -183 -279 251 -155 308
5112 308 233 -388 251 -152 114 160 -237 42 226 -220 339 158 -220 543 -205 249 351 -286 44 -65 -378
5133 -378 189 -135 -245 -25 -317 126 40 -216 178 -269 -252 416 -108 -96 -97 -373 538 -63 163 305 -432 -111
5155 -111 108 -234 257 189 -290 336 -233 211 55 -320 84 67 -66 298 -254 -196 78 -349 262 97 -201
5176 -201 -154 -340 70 272 -89 51 -127 -162 405 -35 -15 281 -333 -53 137 -100 284 -256 -214 274 49
5197 49 190 226 -246 -27 -140 -92 560 -69 -158 169 -202 243 300 -196 107 -195 -49 433 -268 59 -298 -270
$$ packed form
5049d00jL33l32O58k16j62M63p30L48L77l42o1J58l11O05n15J95J02o07N29n2
5070C9l44N84o09j7M72m01K78J17n31O32k21j9O99q89M4K37m86P94l40k50K77
5091F6l26K83L66m76J89j48j70O88o38N2K62m15L22J10k16J94l26r6N30m06M63
5112C08p5o21O39m03K66M6l97K79J84m46N59j81l78P63p48M54J02o37L30j09l13
5133c78N67l24j10K20k92M43q6k56L94m47J7O68n24J2jk76R11o01K26J42p37L21
5155a11K19l42M91o8m79O26n69M44j56l75M04j7j33L64n52N8K74m27O11j65k98
5176b01M7j86M10K02l61J40j78l5N67m40K0K96o14K80J90k37L84n40M2M88k25
5197D9J41L6m72K19j13M8O52o29q9L27l71M45N7m96L03l02J46M82p01L27l57K8
$$ plain form
5219 -270 303 -309 86 126 -312 -57 245 -112 354 -29 -189 149 -244 201 -174 -316 54 -157 8 225
5239 225 -206 112 64 -108 208 -94 -276 202 -341 216 345 -95 220 -17 -269 481 -97 74 231 -309
5259 -309 149 -98 -169 444 -208 -161 226 -175 220 29 -344 71 -53 -32 190 -110 -45 259 -139 262 -147
5280 -147 -344 -10 -297 157 299 -249 76 57 -177 377 -70 -158 221 -307 243 166 -151 238 -186 74 244
5301 244 -201 261 -63 -179 196 -35 -51 172 -417 53 -19 -201 419 44 -151 88 -25 276 190 -305 213
5322 213 -87 -141 310 -339 -46 -22 -193 403 -198 -153 241 -232 212 144 -194 182 -161 -218 436 -246 -176 330
5344 330 -427 250 108 -290 298 -171 -85 340 -180 138 -218 -362 36 66 -84 168 -474 5 51 -208 292
5365 292 -31 -203 208 -175 33 17 -281 188 -70 -271 275 -175 58 120 -258 93 240 -61 425 -145 75
$$ packed form
5219b70N73o12L95M0m38K55L02l57M66l83j60L38l93M45l75j42L70k11J65K17
5239B25m31L18m8j72L16l02j82M78n43N57J29m40L15k37k52P50n78J71J57n40
5259c09M58k47p1O13o52M7L87m01L95j91l73M15j24K1K22l00O5L04l98M01m09
5280a47j97L34k87M54J42n48L25j9k34N54m47q8L79n28N50p7l17L89m24K60J70
5301B44m45M62l24j16L75k31j6K23n89M70p2j82O20l75j95K39j13L01q6m95N18
5322B13l00n4M51o49K93K4j71N96o01M5L94m73M44o8l38L76l43n7O54o82P0N06
5344C30p57O77j42l98N88m69Q6M25n20L18l56j44L98L0j50K52o42M79M6k59N00
5365B92l23j72M11l83K08j6k98M69k58k01N46m50K33O2l78L51J47l01M86n70K20
$$ plain form
5386 75 359 22 28 99 -191 402 -331 0 251 -179 63 41 -198 326 -99 -97 142 -368 -25 185 -356 125
5408 125 -308 -204 325 -166 25 192 -64 136 55 -218 213 -216 78 147 -247 264 44 -339 57 -14 -22 5
5430 5 -330 -78 -142 -260 221 -195 -220 175 -323 168 60 -151 211 -60 -129 261 -221 203 93 -150 287 -173
5452 -173 -84 312 -269 55 89 -245 225 91 -47 201 -196 -229 81 -394 327 151 -344 288 -134 -145 281
5473 281 -318 29 -9 -169 465 42 182 335 -146 -52 63 -228 293 -123 -220 241 -211 90 158 -390 49
5494 49 -119 -292 127 -390 215 133 -184 279 123 -297 401 -87 144 250 -204 14 44 -224 504 -22 200
5515 200 349 -438 19 -17 -248 376 -120 -22 231 -145 233 117 -286 160 202 71 560 -120 108 143 -280
5536 -280 278 -150 -450 159 0 132 125 -158 -12 -201 -64 276 81 -159 -126 -265 13 120 -180 220 -321
$$ packed form
5386G5K84l37OP1k90N93p33L31K51m30K42k2k39N24m25KK39n10L43K10n41M81
5408A25m33J04N29m91J91J67k56K00q1k73M31m29K94O9l94N11k20l83L96p1qK7
5430El35K52o4j18M81m16k5L95m98M91j08k11L62k71o9L90m82M24j10k43M37m60
5452a73Q9L96n81L24L4l34M70j34j38K48l97l3L10m75P21j76m95O32m22j1M26
5473B81n99L47l8j60O34m23J40J53m81R4J15k91N21m16r7M61m52L01O8n48M39
5494D9j68j73M19n17O05q2l17M63j56m20O98m88K31J06m54K18L0k68P28n26K22
5515B00J49p87M57l6k31O24m96R8K53l76L78j16m03M46M2j31M89o80K28L5m23
5536b80N58m28l00O09j59J32pk83J46j89J37L40j95k40L3j39K78J07l00M00n41
$$ plain form
5557 -321 -13 121 -332 273 -32 -64 154 -154 -173 134 -153 -83 177 -321 173 97 -262 112 -166 105 311
5578 311 -291 71 -76 -230 147 -277 -35 167 -149 429 168 -80 248 -224 -59 140 -142 235 -32 -252
5598 -252 172 -230 18 352 -274 25 112 -38 337 -168 -125 186 -101 183 62 -170 264 -55 6 487 -104
5619 -104 -5 13 -361 271 119 -338 72 -356 -66 238 -103 1 -158 -136 171 -266 127 54 -127 -98 113 -197
5641 -197 63 -130 -54 264 -50 -18 64 -182 39 -362 47 330 -105 24 94 -73 334 -115 -82 142 -197 -105
5663 -105 98 -167 75 -28 -67 229 -260 39 60 -244 212 38 -154 192 -134 31 147 -75 260 139 -346
5684 -346 131 -123 95 198 -399 101 155 -167 170 -156 -116 201 -45 149 44 -157 91 101 9 316 -101
5705 -101 131 248 -363 187 76 -22 99 -353 -40 331 -49 442 -85 -289 85 -167 -22 325 -90 60
$$ packed form
5557c21L08J34m53O05l05l2K18l08j9L07k87P0K60m98M94p6l59L74k78K71K06
5578C11o02L62j47j54L77m24K42K02l16N78k61k48L28m72J65J99k82L77k67k20
5598b52M24m02K48L34o26K99Q7j50L75n05M3L11k87K84j21k32M34l19O1M81n91
5619a04R9J8l74O32j52m57M10m28K90L04l41J04j59K2L07m37L93p3j81K9K11l10
5641a97K60j93P6L18l14L2Q2k46K21m01M09K83m35J29P0j67M07m49L3K24l39R2
5663a05K03k65K42j03l9K96m89K99K1l04M56j74j92L46l26J65J16k22L35j21m85
5684c46M77k54K18J03n97N00N4l22L37l26M0L17k46J94j05k01K48J0r2L07m17
5705a01K32J17o11N50j11r8J21m52L13L71l80M91n27k04L74k52J45L47m15J50
$$ plain form
5725 60 -6 -197 333 -133 -280 220 -68 173 138 -279 117 -159 -58 239 -178 31 -1 -327 247 30 156
5746 156 90 -87 -10 216 -64 209 -117 -334 355 -69 117 -77 -363 203 161 13 204 -179 -155 233 -237
5767 -237 148 -40 -141 306 -211 214 297 -439 24 200 -182 376 -80 -97 113 -238 201 270 -173 62 -111
5788 -111 -349 367 -283 -51 -38 -451 114 113 -53 218 -126 -183 250 -222 2 51 -244 62 -63 -12 274 -230
5810 -230 162 -162 -52 270 -155 28 92 -117 123 216 -118 -151 -52 -113 300 -23 48 -72 -330 69 74 -90 139
5833 139 -102 -99 100 88 267 -82 -189 54 -212 79 116 -82 164 -102 103 175 -14 -178 70 -267 90 185
5855 185 -296 17 -21 -59 318 -156 137 87 -262 -10 135 137 106 -173 62 262 -68 175 -85 -149 341 -162
5877 -162 19 96 -262 -121 -115 -11 211 -261 -223 63 -309 44 -9 -165 29 -176 140 145 -34 216 98 -165
$$ packed form
5725F0o6j91N30m66j47N00k88K41l5m17L96k76J01K97m17K09l2l26N74k17J26
5746A56o6j77P7K26k80K73l26k17O89m24J86j94k86N66m2j48J91l83K4L88m70
5767b37L85j88j01M47n17M25Q3p36M63J76l82N58m56j7K10l51M39O9m43K35j73
5788a11k38P16o50K32J3m13N65jj66K71l44n7M33m72K24M9k95L06j25N1K86n04
5810b30L92l24J10L22m25J83O4k09K40R3l34l3R9o1M13l23P1j20k58L99Nj64K29
5833A39k41LJ99j2J79l49j07K43k66K91L7j98K46k66K05P2j89j64K48l37L57R5
5855A85m81L13l8l8L77m74K93n0l49K52J45Kl1k79K35K00l30K43k60o4M90n03
5877a62J81P7l58J41OJ04K22m72L8K86l72L53n3j56J94k05L16Nj79K50j18k63
$$ plain form
5899 -165 238 39 -60 107 -345 66 29 -82 179 -315 -114 299 -147 108 86 -334 -57 185 -83 235 -253
5920 -253 -20 -7 -150 285 -117 -278 90 2 23 267 -99 28 -44 -116 263 26 -149 121 -275 219 306 -216
5942 -216 286 -102 -265 297 -115 87 28 -261 190 109 -92 -39 -223 86 82 -231 223 -119 -311 96 -96 -51
5964 -51 189 -321 31 -60 36 383 -235 -33 78 -295 240 -10 -305 231 -113 3 206 -189 189 192 -284 238
5986 238 203 39 167 -265 65 123 -80 92 -50 -170 300 -23 98 118 -107 71 -88 -27 286 31 7 264
6008 264 -157 60 33 -102 208 -155 107 99 -197 109 -107 -162 115 142 -258 181 -197 113 27 -199 395 -269
6030 -269 -68 260 -12 -21 25 -284 182 -113 -46 368 -224 -39 70 -63 171 77 -101 -47 -130 24 119 -56 -4
6053 -4 -6 -125 148 -213 -164 -35 -314 298 314 -210 -47 40 2 335 -120 104 124 -221 164 -3 -61 9 -263 -163
$$ packed form
5899a65M03j99r9J67m52M11l7j11K61m94K01M13m46K55k2m20K77K42k68L18m88
5920b53K33J3j43M35m02j61L68q8K1K44l66J27p2p2L79k37j75K70l96M94Q7n22
5942b16N02l88j63N62m12K02n9k89M51q1k01N3j84L09ml13M54l42j92M07j92M5
5964e1K40n10L52r1R6L47o18K02J11l73N35k50k95N36l44J16K03l95L78Lm76N22
5986B38l5j64J28m32L30N8k03J72j42j20M70l23J21K0k25J78j59O1L13k55k4K57
6008B64m21K17k7j35L10l63K62qk96L06k16n5K77K7m00M39l78L10q6k26N94o64
6030b69K01L28k72rM6l09M66k95O7M14n92J85J09j33K34r4j78N4q3J54R5j75N2
6053dkj19K73l61M9J29k79O12J6n24J63Q7l8L33m55K24K0l45L85j67n8P0k72J00
$$ plain form
6077 -163 -92 -51 191 124 -313 42 -93 98 47 -103 148 117 -160 270 31 4 225 -197 45 101 -163 17
6099 17 -193 -90 274 -249 129 -18 -154 226 -114 -113 304 -159 -79 185 -239 120 -167 -82 285 -98 -103 374
6121 374 -47 39 -122 -120 124 -171 83 173 -96 269 224 -221 45 -116 23 105 -189 -22 -39 -6 158 -137 -12
6144 -12 -9 -364 13 10 -107 244 -85 205 91 -110 257 276 -292 136 34 -110 230 -321 308 89 -65 223
6166 223 131 -183 133 -104 111 203 -184 94 -21 -173 30 -252 -27 80 30 117 160 -164 237 -135 -117 66
6188 66 -321 112 41 -112 132 -114 -64 144 -246 -50 167 -241 62 -106 4 121 -195 358 109 -351 278
6209 278 -145 -123 322 -108 -74 151 -37 221 55 -177 49 -205 118 285 -181 23 210 -46 91 93 -147
6230 -147 335 68 -51 105 -175 236 137 -83 170 -55 -53 81 -325 148 -95 -109 83 -70 -26 327 -26 164
$$ packed form
6077a63P1M1K42o7m37L55j35J91n1j50K51l1k77M30k39k7K21m22K42N6k64J80
6099A7k10J03L64n23L78j47j36L80l40JM17m63Q0K64m24L59k87Q5L67l83nM77
6121C74m21Q6j61KK44k95K54R0k69L65m5m45K66j61J39Q2k94J67j7L3J64k95J25
6144a2Ll55L77lj17L51l29K90j14k01L67J9n68M28j02j44L40n51O29k19j54K88
6166B23r2l14L16k37K15R2l87K78j15j52K03k82K25J07n0Q7M3l24M01l72J8J83
6188F6l87M33p1j53K44k46N0K08l90J96K17m08L03j68J10J17l16N53k49m60O29
6209B78m23K2M45m30L4K25j88K58j66k32K26k54L23J67m66K04J87k56J37Kk40
6230a47M82k67j19J56k80M11r9k20K53k25KJ34m06M73k43j4J92j53M4L53l53J90
$$ plain form
6252 164 31 -133 -40 -267 -18 -25 20 186 64 -163 102 -145 45 30 -258 -12 108 -232 184 -126 -146 294
6274 294 -66 68 91 -174 -23 24 -15 151 -73 257 132 -208 209 -53 -101 144 -98 68 -23 -181 121 -143
6296 -143 40 121 -318 -153 108 -74 176 -13 -180 188 -187 -163 149 36 75 33 -109 137 -9 -60 183 -6
6318 -6 0 44 -242 135 -21 -216 188 -112 142 27 -352 98 -198 15 182 -115 42 198 -300 225 163 -56
6340 -56 5 14 249 140 -127 -114 75 -333 411 -71 -103 207 -62 -47 317 -202 69 -179 -134 177 -121 12 -135
6363 -135 -128 201 244 -18 146 -345 -153 -90 -263 280 81 -307 69 -239 165 85 -115 -61 -2 -347 249 -191
6385 -191 -94 203 -326 100 196 -231 173 -29 -33 58 70 -121 21 -222 291 60 -118 84 -305 -11 119 -218
6407 -218 273 162 -307 183 -47 44 200 -172 -97 -106 85 164 -129 76 107 -171 281 188 -185 -68 -105 -205 143
$$ packed form
6252A64j33j64R3k27K49pM5J66j22k27K65k47J90j5k88K46J20l40M16l10k0M40
6274B94l60J34K3k65J51M7l9J66k24L30j25l40M17k62m8K45k42J66r1j58L02k64
6296a43J83Q1m39J65K61j82K50j89j67L68l75K4L12j13L9m2j42K46j46n1K43j89
6318fOM4k86L77j56j95M04l00K54j15l79M50k96K13J67k97J57J56m98N25o2k19
6340e6O1RK35j09k67J3J89m08P44m82l2L10k69J5L64n19K71k48M5L11k98J33j47
6363a35PL29M3k62J64m91J92O3j73N43j99l88L76l08M04q0k00N4N9l45N96m40
6385a91R7K97n29M26R6m27M04k02mR1J2j91J42k43N13k31j78K02l89K94J30l37
6407b18M91j11m69M90k30R1J56l72P5rJ91P9k93K05L1k78M52r3l73J17l7j00L48
$$ plain form
6430 143 -199 25 -36 -251 118 -72 -33 197 -544 -88 70 -151 121 73 -279 91 -142 191 44 -190 304
6451 304 22 -65 124 8 -35 208 -197 -25 -172 -217 166 -259 34 294 -275 186 21 -227 282 -77 -78 257
6473 257 -323 85 95 -71 290 -141 -230 116 89 109 -132 -199 166 -20 57 176 -233 -69 9 -270 113 -38
6495 -38 -252 -97 -52 26 193 -170 42 92 -12 213 4 33 -72 -128 393 180 -203 229 -129 5 259 -111
6517 -111 -21 117 -54 153 -2 -135 122 -143 -153 33 -171 58 -163 -75 181 -332 120 248 -215 95 -137
6538 -137 42 345 -176 -34 245 -378 160 107 -81 246 -152 -38 255 -180 235 -39 -207 211 -17 75 168
6559 168 -154 93 -17 -59 150 -86 17 102 -164 80 212 -329 -5 5 126 291 -6 -106 241 -260 76
6580 76 -5 -321 2 -159 -75 123 -72 175 -145 -255 334 -155 -53 91 -224 147 -73 -16 121 -209 -306 75
$$ packed form
6430A43l42K24o1k15L69j90L9K30p41M56J58k21K72m8l52L70k33L33j47k34M94
6451C04k82q7J89j16m3K43m05J72j47m5L83m25K93K60n69M61j65k48N09l59jL35
6473B57n80M08J0j66L61m31q9L46k7K0k41o7L65j86P7J19m09J64P8k79L83j51
6495c8k14J55M5P8J67l63K12N0j04K25k09K9j05n6N21k13l83M32l58J34K54l70
6517a11R0J38j71K07j55j33K57k65j0J86k04K29k21Q8K56n13M52J28m63L10k32
6538a37J79L03n21J42K79o23N38n3j88L27l98J14K93m35M15k74j68M18k28R2R3
6559A68l22K47j10m2K09k36J03Q5k66K44J32n41L24J0J21J65k97j00L47n01L36
6580G6q1l16L23j61Q4J98j95K47l20j10N89m89J02J44l15L71k20N7J37l30r7L81
$$ plain form
6602 75 -7 253 46 -361 309 -59 -137 215 -171 41 131 -244 217 138 -238 301 -190 94 171 -287 186 -54
6624 -54 -166 189 -177 -181 -14 -263 147 129 -211 52 -124 -35 242 -233 -9 -25 -140 228 148 -109 340 -34
6646 -34 59 154 -36 -21 -176 -283 170 -135 150 281 -215 117 -107 -86 261 -110 127 126 -84 219 -128 -146 94
6669 94 -255 -114 148 -159 204 1 -49 325 21 23 -11 -319 260 -56 -86 119 -129 -230 42 -263 108 218
6691 218 -47 0 -323 75 230 -286 178 189 -199 78 -27 -122 162 -277 13 161 -23 -191 233 -92 232
6712 232 101 -41 126 -308 14 135 -82 94 -282 -131 308 -208 136 118 -163 -77 -56 -36 405 -51 -241
6733 -241 -43 140 92 173 -152 259 -100 -28 277 -155 25 -111 -92 281 8 231 93 -265 -134 66 -32 209
6755 209 -261 -296 30 29 65 -122 -60 169 -46 -34 159 -308 8 1 -188 330 40 -143 173 -113 249 197 -161
$$ packed form
6602G5q2K60k07m07O70l68p8L52l86K12R0l75M61p9l76N39m91K84P7m58M73k40
6624e4j12L55l66mJ67k49M10j8l40K63j76Q9K77m75K24j6j15L68q0k57M49l74
6646c4R3R5j90J5j55j07M53l05K85J31m96L32k24K1L47l71K37jk10L03l47j8K40
6669I4l49J41K62l07L63k03n0L74l04Kl4l08N79l16l0K05k48j01K72l05L71J10
6691B18k65M7l23L98J55n16M64J1l88K77j05r5K84m39K90J48j84j68M24l25L24
6712B32j31j42J67m34L22J21k17J76l76J51M39n16L44j8k81Q6K1K0M41m56j90
6733b41J98J83m8Q1l25M11l59P2L05m32J80j36J9L73k73K23j38l58J31K00r8K41
6755B09m70l5L26jL6j87O2K29k15J2J93m67L16pj89N18k90j83L16k86L62n2l58
$$ plain form
6778 -161 -27 -232 10 198 -14 -30 63 -93 188 -75 -184 169 -206 -176 126 -195 220 140 -155 -24 -199
6799 -199 65 277 -424 -118 174 -169 414 20 -181 190 -124 241 142 -89 287 -254 38 278 -214 -24
6819 -24 -7 -76 139 -20 -109 329 -64 -50 97 -85 62 164 -207 221 -47 -143 210 -45 133 121 -95 63
6841 63 -85 -146 137 -27 -8 213 -267 188 26 -49 50 -117 128 -39 -228 247 6 -259 162 78 8 288
6863 288 -189 184 91 57 286 -100 3 121 9 -75 -61 234 251 -189 -104 128 -201 129 -176 -238 154 -175
6885 -175 -281 78 -231 -59 7 -59 325 -84 -153 278 -289 151 93 60 43 -3 -150 231 3 172 141 -267 130
6908 130 -179 -109 156 -197 133 -17 -257 137 56 47 143 -23 -139 60 -164 36 30 -299 135 53 -164 51 -193
6931 -193 39 29 -52 45 -103 24 138 -130 200 -73 -56 191 5 -54 248 -167 44 81 -319 173 -335 -160
$$ packed form
6778a61J34k05K42J88k12j6R3j56K81k63j09L53l75L0L02l21M15q0k95J31j75
6799a99K64K12p01L06K92l43N83l94k01L71l14L65r9k31L76n41K92K40m92J90
6819b4J7o9K15j59q9M38l93J4J47j82J47J02l71M28k68r6L53k55J78j2k16J58
6841F3j48o1K83j64J9K21m80M55j62p5R9j67K45j67j89M75k41k65M21q4p0K80
6863B88m77L73r3l4K29l86J03J18j12q4J4K95J7m40Q5K32l29L30l05o2L92l29
6885a75j06L59l09J72O6o6L84m09o9M31n67M40n8l3j7m6j47L81k28J69l1m08L97
6908A30l09P0K65l53L30j50k40L94q1rR6j66j16J99k24K00ol29M34q2k17K15k44
6931a93K32j0q1R7j48J27J14k68L30k73J7K47j86n9L02m15K11L7m00M92n08J75
$$ plain form
6953 -160 142 -136 131 6 -142 -171 -46 -188 27 -72 110 357 -204 83 -4 -139 152 21 26 244 -231 165
6975 165 103 -193 -28 -68 -13 131 -91 -90 210 -322 120 123 -112 -21 -22 -65 95 -136 -103 -103 34 103 -229 -113 32
7000 32 -37 127 184 -136 366 21 -101 157 -92 65 19 16 191 40 23 112 -255 100 159 -77 12 -162 -99 117
7024 117 -28 52 42 -259 -20 -26 -86 39 -44 -126 124 -201 313 185 -60 146 4 -169 45 -144 -94 106 -105
7047 -105 141 -42 -123 66 -233 129 75 3 293 56 120 200 10 -80 193 -231 255 139 -160 138 -140 -102
7069 -102 24 -248 -52 86 28 101 -188 -48 -36 -182 42 205 -155 35 51 40 81 -240 -108 -21 -166 86
7091 86 -38 61 249 17 38 142 -135 169 82 -19 180 -114 37 -49 78 -56 -86 -176 204 -56 83 159 -228
7114 -228 199 200 -281 21 -92 12 184 -203 -42 32 -17 144 -8 -175 265 -159 73 -4 -165 184 -147 8
$$ packed form
6953a60L02k78K67j25j48k9J25j42K15r9J82K47n61K87q7j35K91j31NK18m75L96
6975A65o2k96J65m0N5J44k22JL00n32M42Lk35R1jm3J60k31L3%J37O9l32J16J45
7000C2o9J64N7l20N02l45j22K58k49J57m6lJ75j51j7Q9l67L55N9k36Q9j74O3K16
7024A17j45Q0j0l01K39oo0J25q3q2K50l25N14j28k45K06j42j73K14j89N0K00k11
7047a05K46j83q1J89k99L62n4p2K90k37O4Q0j90r0K73m24M86j16k99K98k78L8
7069a02J26k72J96J38n8P3k89J40J2j46K24J63l60J90J6j1M1l21J32Q7j45K52
7091H6j24R9J88k32K1J04k77L04q7j01J99k94J51q6J27j34l0r0L80k60J39P6l87
7114b28M27Jm81L02j13J04J72l87J61P4m9J61j52j67M40m24K32p7j61L49l31J55
$$ plain form
7136 8 58 -232 14 222 -28 47 -100 6 -134 6 -56 69 -161 126 155 -45 219 -245 -129 23 -129 234
7158 234 35 -102 87 28 39 148 -40 141 73 -109 15 -244 78 183 -120 65 92 -269 158 13 -286
7179 -286 120 -166 106 -101 -194 71 94 -203 131 16 -73 118 -68 196 -70 -30 164 15 -44 82 -33 78
7201 78 -126 33 433 -66 -71 170 -45 101 -150 -209 230 -196 -87 341 -222 -18 -40 -152 238 -32 -178 170
7223 170 -247 -51 148 46 225 -96 -93 210 -176 -164 60 -264 -51 158 -46 13 -120 -77 -102 -62 78 -10 -199
7246 -199 -17 -84 -140 91 -85 145 72 -218 79 -129 -100 -47 -126 226 138 -158 90 -227 -61 24 -123 33 40
7269 40 -267 243 60 -34 -32 -65 155 235 -258 108 -19 -169 178 -74 -141 211 -224 13 -133 -162 73 -154 -251
7292 -251 66 -269 -80 167 -85 343 -138 52 246 -74 28 -43 -122 336 -173 -268 188 -256 25 169 -75
$$ packed form
7136HN0k90K46K08k50P5j47J06j40J40o2J25k30K87K9k00K64m64J16J52j52L63
7158B34j99j37J89n9J1J09j88J81o8j82J24k59L22J05l03J85K7l61M27j45k99
7179b86M06k86K72k07r3K65K3k97L34j15q9J91j86K64k66M0J94j49n9J26j15J11
7201G8k04J59M00m99nK41k15J46k51n9M39m26J09M28n63K04k2j12L90k70j46L48
7223A70m17J96J99j02J79l21LL03l86J2K24l24K13K09k04N9j33M3k5M0J40q8j89
7246a99J82o7n6K31j76K30p3k90K97k08K9N3p9L52q8k96K48l17J66Q5j47J56P
7269D0l07N10j83r4Kl3K20Q0m93L66j27j50L47k52o7L52m35K37j46k9K35k27r7
7292b51L17l35J89K47k52M28m81J90J94l20J02p1p9M58n09r5M56m44K81J44k44
$$ plain form
7313 -75 32 -107 -13 251 9 -62 140 -211 -107 -33 152 210 -133 65 119 66 -2 -117 -69 118 -285 -131 70
7336 70 -112 75 -41 -145 250 29 -217 -55 -89 148 261 -85 76 -30 -132 121 -51 -15 109 11 416
7357 416 51 0 64 -30 30 -11 -85 -31 -177 -256 29 133 -113 -21 86 -17 -125 -144 215 -6 -131 119 -84
7380 -84 197 -103 -143 91 29 9 304 -326 -15 62 -5 100 -13 55 -9 -94 -109 112 -62 -15 -17 -27 147 99 -54
7405 -54 -65 -80 -194 -140 63 138 -101 -176 219 -157 275 66 -125 62 -100 63 296 -76 -38 149 -153 117
7427 117 -82 -311 -100 -303 -4 65 -126 -168 -129 -103 166 -29 -105 169 -337 -185 84 -56 197 -140 -176 208
7449 208 -108 100 129 -107 72 -44 64 446 -9 -31 158 102 143 -102 -122 -28 -358 0 25 -118 67 -95
7471 -95 -61 242 27 131 28 -55 70 63 -152 159 -113 -9 234 -176 143 -148 -227 -59 -135 30 64 -332 -82
$$ packed form
7313g5J07j39R4K64k42p1K02l51J04P4J85N8l43J98N4n3o8j15M8J87m03J54K01
7336G0j82J87j16j04L95k21k46J62l4K37J13l46J61j06j02K53j72L6J24r8M05
7357D16l65n1O4r4O0m1p4N4j46p9K85J04k46R2J07j03j08j9L59k21j25K50k03
7380h4K81l00m0K34o2k0K95o30L11P7o7J05j13O8o4q5j5K21j74M7kj0J74m8j53
7405e4j1j5j14N4K03P5k39p5L95l76M32k09j91J87j62J63K33l72L8J87l02K70
7427A17j99k29K11k03K99O9j91m2L9K6K69j95p6K74n06J52K69j40K53l37l6L84
7449B08l16K08K9k36J79j16J08L82m55k2J89n6M1k45k0R4l30L58K5j43J85j62
7471i5L4L03k15J04j03q3J25pk15L11k72J04K43m10L19k91p9J68p6J65L4l96K50
$$ plain form
7494 -82 -43 31 -68 -123 -27 26 19 76 210 -63 132 -292 -107 344 17 66 180 -281 135 -141 -14 42 -200 -38
7518 -38 113 -96 174 105 -160 52 -30 -4 83 -128 -58 54 -68 371 -46 -81 -2 -49 32 -128 -177 235 -62 7
7542 7 223 -104 -160 46 -275 99 106 -92 53 -188 20 97 -70 165 73 -36 202 -48 28 54 71 120 23 -120
7566 -120 74 -272 75 52 -231 -54 -36 -125 235 32 124 94 -130 -63 -39 65 82 -141 -93 233 -423 196 -93
7589 -93 -202 196 -269 -55 125 10 -87 127 -145 250 -47 -277 152 -149 -209 59 -144 102 70 -68 208
7610 208 12 9 -24 -5 31 139 -87 115 -112 -70 96 -284 34 259 -74 89 -122 115 59 9 -51 -7 -62 104
7634 104 30 -162 -149 -196 -33 124 53 34 150 -74 207 -25 -128 335 -227 -21 -198 -23 89 29 62 148 -181
7657 -181 -121 47 -12 61 -211 -119 97 -212 99 -3 -53 -138 -106 310 106 7 53 135 -200 260 21 -52 -48 -129 54
$$ packed form
7494h2L9P4r9n5R6N3pN7J34k73J95m24J85M51l27M9J14m61M16k76J27N6k42J62
7518c8J51k09K70o9k65K12q2K6Q7k11P0J12j22M39m17l5P9m7Q1j60m9M12k97O9
7542GK16l27n6K06l21L74Pj98J45k41K08P7j67K35r2j09K38k50P6K6J7M9r7j43
7566a20J94l46L47k3k83J77J8q9L60k03R2l0k24O7K4J04J7k23M8L26o56O19k89
7589i3j09L98m65K14J80j15r7K14k72L95k97k30M29l01o0K68k03K46l2j38K76
7610B08j96ll3J9L6J08k26K02k27M2J66l80L18K25l33J63k11K37n6n0o0M4n5J66
7634A04p4j92J3m7J63J57p1j9J16k24K81k32j03M63n62K06j77J75J12o0L3Q6l29
7657a81O0J68n9P3k72R2K16l09L11j02n0q5L2M16k04r9M6Q2l35M60k39p3Mq1J83
$$ plain form
7682 54 -43 -270 2 18 -179 145 63 18 166 -10 -78 11 -146 -26 -4 -39 9 -127 -98 -100 -111 58 -14 134 138 -47
7708 -47 -1 -42 -51 93 41 -20 187 -111 111 -33 -164 -64 -29 -71 -57 -128 -163 68 -234 -39 -103 -179 -98 -203 -78
7733 -78 166 -182 -47 -123 19 -203 -10 -146 35 -194 112 -56 -30 -41 2 -70 144 -45 62 112 -200 -94
7755 -94 16 24 219 -91 -154 138 -158 -31 -130 -96 299 -199 -89 26 -185 77 -3 -63 313 -36 -222 50 -122
7778 -122 80 180 -46 350 -163 -20 92 2 140 -167 30 181 -145 -21 114 -83 -31 -97 -100 62 -81 -245
7800 -245 11 -91 32 238 -253 200 -58 -5 243 -153 -166 58 -384 118 -101 -104 75 40 90 -46 -215 129
7822 129 21 -174 44 -148 33 258 -6 221 180 -173 97 56 -13 268 -218 -50 81 -128 199 -41 -104
7843 -104 99 -203 171 157 -130 101 -37 -164 77 -154 -70 89 -87 47 16 -169 50 -144 -28 117 -91
$$ packed form
7682E4r7k27K72J6j97L24q2m5J48j76o8Q9j57J20K2l5M8j36K9kj1J69p2J48Mj85
7708d7M6m1rJ44n2o1K07k98K22j44j31J00L5m2J4p1l5K31l02J95o4p6Q1j05J25
7733g8K44l48J35p6J42k22J93j36J81k29L06j68K6j1M3p2K14j89J07N0l12J06
7755i4J10QJ95l10o3K92k96J27r9L4L95m98J10J15k11K62q0o0L76l49j86K72j72
7778a22K02J00k26L96n13J43J12r0J38l07J97J51l26J24J35j97N2o6lJ62j43j64
7800b45K56j02J23K06m91M53k58N3K48l96j3K24m42N02k19lJ79l5N0j36j69L44
7822A29j08j95K18j92J81K25k64K27m1l53K70m1o9K81m86J68J31k09L27k40o3
7843a04K03l02L74j4k87K31j38j27K41k31Q4J59j76J34l1j85K19j94J16J45k08
$$ plain form
7864 -91 36 53 -156 63 65 -99 226 -206 116 25 -99 175 -78 -9 204 -204 -134 146 -32 169 -75 -137 71
7887 71 -121 -150 139 -80 146 63 -132 -13 34 189 -44 9 115 13 -255 242 -90 172 140 -45 60 116
7909 116 -203 25 -130 41 -13 -302 22 139 -24 145 -94 -60 19 137 -26 110 -34 152 211 -94 203
7930 203 -226 -93 -35 -85 343 36 -209 266 14 -337 -5 -274 177 8 -93 270 52 -215 23 65 150
7951 150 28 -236 113 -59 -135 120 75 -7 -54 -367 108 -162 -89 306 49 -302 -76 0 127 113 -43 156
7973 156 -92 220 211 -313 -36 147 55 36 -7 -120 85 -439 120 22 -81 156 -164 -144 152 -30 31 32 -149
7996 -149 135 203 10 152 -46 78 126 41 270 -86 -229 268 -47 1 75 -164 136 -55 -168 47 27 54
8018 54 -115 -93 -52 -242 -232 -49 -243 -198 172 -193 299 -9 191 37 115 -83 73 -116 -2 36 22 183 100
$$ packed form
7864i1J27J7k09K19Kj64L25m32L22r1j24K74k53O9K13m08P0K80j78K01k44o2K08
7887G1j92k9K89k19K26q3j95J19M7J55k33N3J06j02k68M97l32K62l2j85J05N6
7909A16l19K28j55J71n4k89L24J17j63J69k39L4P9J18j63J36j44J86N9l05K97
7930B03m29J33N8n0M28l07k45M75k52l51L32k69M51j69j01L63k18k67K38M2Q5
7951A50j22k64L49j72p6K55m5q2m7l13M75k70P3L95k57l51K26P6J27j4j56J99
7973A56k48L12rn24K77J83r2j9m3j13K05n24N59r8j03K37l20K0K96j82O1Jj81
7996a49K84O8j93J42j98J24M8q5K29l56j43M97l15M8P4k39L00j91j13K15k0K7
8018E4j69K2M1j90J0J83j94M5L70l65M92l08K00j54P8j98J56j89J14L8j4J61q3
$$ plain form
8041 100 -76 78 -71 -79 179 -180 80 -92 -5 63 -37 -58 114 54 118 3 -125 278 -13 -120 60 -160
8063 -160 202 22 -43 180 188 99 93 -251 129 20 -214 39 -72 -82 36 -97 13 165 -37 51 226 -59 157
8086 157 -166 4 72 77 162 -59 -65 -38 -161 92 204 -203 217 43 -44 91 -59 -157 -67 -172 67 34 -200 199
8110 199 50 7 272 -218 -140 -220 -108 55 -67 -238 216 76 -227 60 -121 252 -9 -138 297 -89 -12
8131 -12 123 -83 -47 76 -77 -103 11 160 257 -40 249 19 -125 197 -16 -46 82 -170 -26 -22 -164 363
8153 363 -84 -5 -143 -176 -17 28 -66 136 9 -56 122 -87 79 -114 -62 29 22 -105 212 84 -17 -96 -57 41
8177 41 108 -187 187 -166 159 -59 -229 145 -111 -163 240 196 -244 350
$$ packed form
8041A00j76J54j49qK58l59K60j72Q7O8j00k1J72o0O4j15j28M03k91j07J80k20
8063a60L62j80o5K23Qq9ol44L80j09k34K53j11j0J18j33J10J52k02Q8J75k85K16
8086A57l23J70O8NQ5k21oK7j23K53J12m07M20j74q7J35j50r8R0j05K39l3k34L99
8110A99j49m3K65m90P8q0J12J63j22j71M54j40l03K87j81L73k61j29M35l86P7
8131a2J35k06L6J23j53k6J14J49R7k97K89k30j44L22k13l0J28k52J44Mj42N27
8153C63m47P9j38l3J59M5r4K02j27o5J78k09J66j93N2R1pj27L17j28j01p9L9R8
8177D1O7k95L74l53L25k18j70L74k56n2M03m4m40N94
8191C50
$$ Imaginary data points
##PAGE= N=2
##DATA TABLE= (X++(I..I)), XYDATA
$$ plain form
0 0 0 0 0 0 0 0 0 0 0 0 0 0 0 0 0 -1 8 -8 8 -8 8 -16 16 -16 24 -24 32 -35 40 -48 56 -64 72 -81 91 -104 115
37 115 -131 147 -163 184 -203 226 -250 277 -308 341 -373 413 -456 503 -552 610 -672 740 -818
56 -818 907 -1005 1118 -1249 1404 -1590 1818 -2102 2472 -2969 3682 -4805 6885 -19943 124627
71 124627 95998 -36092 -134409 -188191 -33344 -3878 44523 99736 -57208 -96264 -13886
82 -13886 52287 163576 28440 -106295 -22277 18636 91427 64710 -89168 -36843 3787
93 3787 23067 114639 52216 -2121 -54614 -114173 76847 155884 2761 -101275 -168806 -62323
105 -62323 54822 -15686 5213 -20071 -111558 -38599 21148 101388 120095 -46584 -37660 54269
117 54269 59397 84600 -17541 -62479 24174 -1012 16641 14374 -56991 -14792 -36954 -15620
$$ packed form
0@%%%%%%%%%%%%%%%jRj6J6j6J6k4L2l2M0m8N6o7P5q8J04j20J36j53J72j95K19
37A15k46K78l10L47l87M29m76N27n85O49p14P86q69R59j055J162j282J412j558
56h18J725j912K123k367K653k994L408l920M574n441O651q487J1690k6828J44570
71A24627k8629j32090r8317n3782J54847K9466M8401N5213j56944l9056Q2378
82a3886O6173J11289j35136j34735Q4018M0913P2791k6717j53878N2325M0630
93C787J9280R1572o2423n4337n2493n9559J91020P9037j53123j04036o7531J06483
105f2323J17145p0508K0899k5284r1487P2959N9747Q0240J8707j66679Q924R1929
117E4269N128K5203j02141m4938Q6653k5186J7653k267p1365M2199k2162K1334
$$ plain form
129 -15620 108217 34336 -60812 -79374 -52318 88880 53754 -64080 -34070 -58394 -42462
140 -42462 14215 9587 68477 8914 -77301 26622 67544 63219 41882 -39928 21913 51197
152 51197 -15242 -140 -40401 -38076 15373 -36799 -3855 15655 -57917 -35399 -16129 42359
164 42359 93801 -33630 -65426 1464 10217 44943 83 -22888 25719 -44887 -33994 49101
176 49101 28936 23400 -23505 -23069 73526 23387 -24233 -4341 -21961 31930 14386 -51065 -13064
189 -13064 -38834 -38662 14568 -286 35760 265 -79385 1777 55322 58855 34843 -54777 -10645
202 -10645 33943 -14450 21461 16492 -16106 -15238 -49790 21901 62623 -29867 -31312 -10357 16918
215 16918 56166 -21887 -38114 -867 -23428 19039 18923 -14354 2095 -53611 -34153 55960
$$ packed form
129a5620J23837p3881r5148j8562K7056J41198l5126j17834L0010k4324J5932
140d2462N6677m628N8890n9563q6215J03923M0922m325k1337q1810O1841K9284
152E1197o6439J5102m0261K325N3449n2172L2944J9510p3572K2518J9270N8488
164D2359N1442j27431l1796O6890Q753L4726m4860k2971M8607p0606J0893Q3095
176D9101k0165n536m6905M36R6595n0139m7620J9892j7620N3891j7544o5451L8001
189a3064k5770J72N3230j4854L6046l5495p9650Q1162N3545L533k4012q9620M4132
202a0645M4588m8393L5911m969l2598Q68l4552P1691M0722r2490j445K0955K7275
215A6918L9248p8053j6227L7247k2561M2467j16l3277J6449n5706J9458R0113
$$ plain form
227 55960 45594 28194 -34266 -59433 45838 49260 12226 14933 -27855 -11833 -12528 -21751 51928
240 51928 8282 -62318 -29103 -6163 45060 23189 -55657 -7546 12771 6777 34145 -10519
252 -10519 -8270 -2214 -36635 28898 45131 -256 -13381 -57024 -883 71908 15384 -7442
264 -7442 -24342 -25052 27758 -1954 5117 33299 -37699 -40289 -5393 16374 44263 -32539 -53146
277 -53146 19638 14237 17118 2829 -26365 16207 -1659 -5215 43378 3563 -14997 -18481 -23819
290 -23819 49369 33886 -29455 -22331 -27105 18040 34327 -22343 3432 -131 -32059 3888 7041
303 7041 26852 14841 -57298 -9627 36329 10731 5224 -31723 -8915 31088 -13068 5113
315 5113 16077 -19360 -879 -11295 10467 45516 -18652 -29119 -4089 2943 41292 -3490
$$ packed form
227E5960j0366j7400o2460k5167J05271L422l7034K707m2788J6022o95r223P3679
240E1928m3646p0600L3215K2940N1223k1871p8846M8111K0317n994K7368m4664
252a0519K249O056l4421O5533J6233m5387j3125m3643N6141P2791n6524k2826
264g442j6900p10N2810k9712P071K8182p0998k590L4896K1767K7889p6802k0607
277e3146P2784n401K881j4289k9194M2572j7866l556M8593l9815j8560l484n338
290b3819P3188j5483o3341P124m774M5145J6287n6670K5775l563l1928L5947L153
303G041J9811j2011p2139M7671M5956k5598n507l6947K2808M0003m4156J8181
315E113J0964l5437J8481j0416K1762L5049o4168j0467K5030P032L8349m4782
$$ plain form
327 -3490 -36284 6702 -7757 1064 12825 -8354 17659 -14885 -34272 32275 25620 1763 -15326
340 -15326 -31195 30820 23709 -25246 21 -10486 -8219 6008 -15908 19470 8068 -37997
352 -37997 152 13174 24234 23572 -35540 -8871 24756 4395 16242 -11930 -13960 14440 -22761
365 -22761 -769 28403 -6145 -8048 -25400 -1485 49428 -5768 -26394 -1494 -6890 16708
377 16708 -5639 -19670 15934 -20880 -22560 15477 7145 19721 -10045 -28813 31381 26361 9247
390 9247 7931 -20566 13608 16304 -16140 11584 -3369 -18920 -8687 -23794 19367 21333 -36296
403 -36296 -15658 2727 14351 20948 -25717 -5045 16416 -18304 2686 6790 -144 7836 -29275
416 -29275 -773 39197 3869 2738 -4888 162 39179 3482 -8167 10009 -14096 547 -6887
$$ packed form
327c490l2794M2986j4459Q821J1761k1179K6013l2544j9387O6547o655k3857j7089
340a5326j5869O2015p111m8955K5267j0507K267J4227k1916L5378j1402m6065
352c7997L8149J3022J1060o62n9112K6669L3627k0361J1847k8172k030K8400l7201
365b2761K1992K9172l4548j903j7352K3915N0913n5196k0626K4900n396K3598
377A6708k2347j4031L5604l6814j680L8037q332J2576k9766j8768O0194n020j7114
390I247j316k8497L4174K696l2444K7724j4953j5551J0233j5107M3161J966n7629
403c6296K0638J8385J1624O597m6665K0672K1461l4720K0990M104o934P980l7111
416b9275K8502L9970l5328j131p626N050L9017l5697j1649J8176k4105J4643p434
$$ plain form
429 -6887 -18568 15113 -20591 -37602 -457 746 17152 -6812 -33424 20156 16959 -2200 12335
442 12335 -4818 11701 4035 -21911 22743 15561 -14892 -2896 -9214 21946 25074 -21274 1363
455 1363 8436 1727 16490 -15620 -7050 6445 -30181 -10207 954 -8004 -176 -35226 -14559
468 -14559 31750 4335 857 -943 288 32495 2556 -1762 27613 -4304 -7104 -1682 -1847 25317
482 25317 -12465 -30271 9835 4241 10711 1566 -23928 10479 3071 -12248 10927 -8568 -6610
495 -6610 -9362 -30374 13497 15455 -16141 -7089 -12635 17723 31801 -9862 9135 17148 -1167
508 -1167 13250 -21 10121 13685 -32804 -11660 11977 -2495 555 -26708 -15011 20948 -5216
521 -5216 -465 5239 -10461 8962 -6492 -5079 23625 -8859 -16071 -5836 -4924 26953 1306
$$ packed form
429f887j1681L3681l5704j7011L7145J203J6406k3964k6612N3580l197j9159J4535
442A2335j7153J6519p666k5946M4654p182l0453J1996o318L1160L128m6348K2637
455A363P073o709J4763l2110Q570J3495l6626J9974J1161q958P828l5050K0667
468a4559M6309k7415l478j800J231L2207k9939m318K9375l1917k800N422j65K7164
482B5317l7782j7806M0106n594O470r145k5494L4407p408j5319K3175j9495J958
495f610k752k1012M3871J958l1596R052n546L0358J4078m1663J8997Q013j8315
508a167J4417j3271J0142L564m6489K1144K3637j4472L050k7263J1697L5959k6164
521e216M751N704j5700J9423j5454J413K8704l2484p212J0235R12L1877k5647
$$ plain form
534 1306 -23385 10688 7726 12025 12807 -7290 17039 1372 -20255 14200 5865 -5531 -13371
547 -13371 -32040 8858 13164 -18704 -3663 -9237 1692 17524 -7699 11512 12977 -14025 5874
560 5874 2922 8707 16265 -26758 -13559 13815 3741 10191 -13233 -12417 18861 -4862 1478 16534
574 16534 -5291 -1486 -15692 -8201 27449 -6466 -23308 -7391 -7664 16790 2518 -15066 12542
587 12542 -935 226 18004 2750 13604 -2615 -22367 14853 12566 -982 -7351 -30539 2140
600 2140 16256 -8967 4052 -6049 -9240 6451 -7943 17241 19649 -22465 -11177 -641 10253
613 10253 19560 -19707 -12265 9726 -4815 11547 5660 -3966 10437 -12431 1185 25841 -571
626 -571 -5096 -17139 -14639 23449 2225 -15216 -7811 -18577 4871 6966 -4956 17619 -5477
$$ packed form
534A306k4691L4073k962M299P82k0097K4329j5667k1627L4455q335j1396p840
547a3371j8669M0898M306l1868J5041n574J0929J5832k5223J9211J465k7002J9899
560E874k952N785P558m3023J3199K7374j0074O450k3424Q16L1278k3723O340J5056
574A6534k1825L805j4206P491L5650l3915j6842J5917k73K4454j4272j7584K7608
587A2542j3477J161J7778j5254J0854j6219j9752L7220k287j3548o369k3188L2679
600B140J4116k5223J3019j0101l191J5691j4394K5184K408m2114J1288J0536J0894
613A0253R307l9267P442K1991j4541J6362n887r626J4403k2868J3616K4656k6412
626e71m525j2043K500L8088k1224j7441P405j0766K3448K095j1922K2575k3096
$$ plain form
639 -5477 -18423 7535 9690 23174 3270 -27461 5430 10258 1416 7998 -12792 -46 5033
652 5033 -12369 14407 9106 -11215 -2693 -11741 11845 20712 -18052 -13405 -8730 -3082 18346 -7292
666 -7292 -8491 3956 -16361 2548 13736 8559 14660 -17953 -12074 23566 8973 5268 -5495
679 -5495 -14013 13778 -1559 -7501 10772 -10121 -5994 -234 -4338 18816 -4373 -23314 1785
692 1785 2363 14209 6385 -24056 -2464 1324 -2675 15402 -1156 -732 -1338 -19128 14289 22382
706 22382 -1129 -1875 -14914 4929 21391 -9210 -2708 481 -9166 7484 -3816 -975 7132
719 7132 -21546 -5272 13877 5657 8180 -19552 -18555 15908 7171 8684 1241 -18748 1254 -1821
733 -1821 1113 24235 -1982 -12569 -7881 -5651 26302 9628 -18195 -1857 -4158 7519 12186
$$ packed form
639e477j2946K5958K155J3484j9904l0731L2891M828q842O582k0790J2746N079
652E033j7402K6776n301k0321Q522r048K3586Q867l8764M647M675N648K1428k5638
666g292j199J2447k0317J8909J1188n177O101l2613N879L5640j4593l705j0763
679e495q518K7791j5337n942J8273k0893M127N760m104K3154k3189j8941K5099
692A785N78J1846p824l0441K1592L788l999J8077j6558M24o06j7790L3417Q093
706B2382k3511p46j3039J9843J6462l0601O502L189r647J6650j1300K841Q107
719G132k8678J6274J9149q220K523k7732R97L4463q737J513p443j9989K0002l075
733a821K934K3122k6217j0587M688K230L1953j6674k7823J6338k301J1677M667
$$ plain form
746 12186 -11015 2345 -4541 -14386 15312 9090 -808 -9167 -27032 8741 23880 1235 -1358
759 -1358 -20885 -11703 15751 4003 12744 4763 -22484 -7056 -463 14845 25448 -15758 -19316
772 -19316 179 4140 20820 -792 -14471 4212 -7414 4461 17776 -3350 -4035 -15926 -8604
785 -8604 28034 8034 -12004 -14543 -19812 13655 17071 -2776 2409 -17721 -14366 11004 8816
798 8816 20841 740 -29147 -2927 9269 15950 13971 -19644 -7901 6159 -2626 14001 2526
811 2526 -8898 -921 -11689 12627 21236 -12681 -13306 -12226 2165 24284 -4380 -14006 -8195 -16070
825 -16070 9372 13513 3158 6023 -20547 -12556 18522 13790 15138 -7284 -21607 9380 8056
838 8056 4388 7351 -12932 -2549 -49 -4941 17500 -590 -17001 -2959 -2078 17194 8781 -22695
$$ packed form
746A2186k3201J3360o886r845K9698o222r898q359j7865L5773J5139k2645k593
759a358j9527R182K7454j1748Q741p981k7247J5428O593J5308J0603m1206l558
772a9316J9495L961J6680k1612j3679J8683j1626J1875J3315k1126o85j1891P322
785h604L6638k0000k0038k539n269L3467L416j9847N185k0130L355K5370k188
798H816J2025k0101k9887K6220J2196O681j979l3615J1743J4060q785J6627j1475
811B526j1424P977j0768K4316Q609l3917o25J080J4391K2119k8664r626N811p875
825a6070K5442M141j0355K865k6570P991L1078m732J348k2422j4323L0987j324
838H056l668K963k0283J0383K500m892K2441j8090j6411J4042Q81J9272q413l1476
$$ plain form
852 -22695 -7280 -2860 1538 15020 -6406 -5710 -5108 -16268 13061 17207 3016 1853 -17241 1248
866 1248 22570 2990 3385 -5713 -9752 10341 -3402 -1640 6663 -15045 -4942 2997 1675 12229
880 12229 -14196 -16227 10759 5897 9677 -2332 -18639 2076 -1046 1165 16244 -5211 -7473
893 -7473 -5298 -6094 22508 12165 -8307 -1594 -7318 9808 14451 -9680 -404 -4816 -10034 8145
907 8145 -1811 -610 -2806 -21618 3862 16312 3390 1781 -17696 -5058 17944 3074 7410
920 7410 -546 -16898 -418 -1489 8532 17800 -13384 -12715 -685 3316 21583 -40 -13519
933 -13519 2199 -4637 7003 8813 -9769 -1289 -11232 -9593 16554 3784 -4803 -9527 -14923 16901
947 16901 16936 -2651 1136 -11813 -2452 12202 1257 10116 -4132 -22376 -715 4330 10705 8189
$$ packed form
852b2695J5415M420M398J3482k1426O96O02j1160K9329M146j4191j163j9094J8489
866A248K1322j9580L95r098m039K0093j3743J762Q303k1708J0103P939j322J0554
880A2229k6425k031K6986m862L780j2009j6307K0715l122K211J5079k1455k262
893g473K175p96K8602j0343k0472O713n724J7126M643k4131R276m412n218J8179
907H145r956J201k196j8812K5480J2450j2922j609j9477J2638K3002j4870M336
920G410p956j6352J6480j071J0021R268l1184O69J2030M001J8267k1623j3479
933a3519J5718o836J1640J810j8582Q480r943J639K6147j2770q587m724n396L1824
947A6901L5j9587L787j2949R361J4654j0945Q859j4248j8244K1661N045O375k516
$$ plain form
961 8189 -20293 -6679 7274 3792 14349 -4148 -9834 2997 -6664 8820 12072 -10185 -6884
974 -6884 -11657 1190 22977 -1992 -9382 -4587 -6170 16213 9136 -2728 3852 -14823 -6720 11546
988 11546 3356 6364 -12773 -21284 8390 7205 5428 2573 -15690 1355 7472 1729 14951 -2736
1002 -2736 -10021 32 -3966 14945 9348 -16816 -6727 -4180 6095 15850 -8118 -5165 -576
1015 -576 -8354 11056 7178 -1993 -1385 -18477 -1159 15166 -1253 -1219 -11764 -9479 14161 3268
1029 3268 2840 4641 -10892 3352 6530 4371 14499 -9335 -13239 3581 1590 11984 -1477
1042 -1477 -18583 466 -955 2074 10269 -7470 -2597 -3533 -8118 15394 5857 -8448 -4821 -11080
1056 -11080 8606 13247 -7495 -729 -5643 -3643 13738 2647 5006 2543 -14508 3584 9716
$$ packed form
961H189k8482J3614J3953l482J0557j8497n686J2831r661J5484L252k2257L301
974f884m773J2847K1787k4969p390M795j583K2383p077j1864O580j8675Q103J8266
988A1546q190L008j9137q511K9674j185j777k855j8263J7045O117n743J3222j7687
1002b736p285J0053l998J8911n597k6164J0089K547J0275R755k3968K953M589
1015e76p778J9410l878r171O08j7092J7318J6325j6419L4j0545K285K3640j0893
1029C268m28J801j5533J4244L178k159J0128k3834l904J6820j991J0394j3461
1042a477j7106J9049j421L029Q195j7739M873r36m585K3512r537j4305L627o259
1056a1080J9686M641k0742O766m914K000J7381j1091K359k463j7051J8092O132
$$ plain form
1069 9716 4774 6126 -16647 -10014 8630 -393 5369 -3949 -12891 2640 -3946 3073 12922 -7696
1083 -7696 -5825 -2607 -487 17296 -1098 -11154 546 -4135 9063 8313 -7001 2777 -6145 -4501
1097 -4501 14448 3509 2464 -4122 -15333 8301 9085 -1357 1196 -13514 -3471 6612 -4553
1110 -4553 6530 -618 -11208 1949 -1865 7305 9790 -12966 -2999 4167 2039 10883 -6161 -6729
1124 -6729 4688 -5129 6970 7563 -5857 636 -8464 -1355 15761 -622 -2840 -4404 -9043 9904
1138 9904 2554 -4555 4426 -8740 -2666 4049 -3504 8107 -3119 -11028 6682 1729 3419 1800
1152 1800 -11523 5034 5754 -2371 7152 -4877 -3667 3759 -5333 9401 5984 -9746 -499 -4435
1166 -4435 3030 11318 -7653 -1868 764 -5486 6893 -1475 -2879 5556 -9133 -667 6237 -3982
$$ packed form
1069I716m942J352k2773O633J8644r023N762r318q942J5531o586P019R849k0618
1083g696J871L218K120J7783j8394j0056J1700m681J3198p50j5314R778q922J644
1097d501J8949j0939j045o586j1211K3634P84j0442K553j4710J0043J0083j1165
1110d553J1083p148j0590J3157l814R170K485k2756R967P166k128Q844j7044n68
1124f729J1417r817J2099N93j3420O493r100P109J7116j6383k218j564m639J8947
1138I904p350p109Q981j3166O074O715p553J1611j1226p909J7710m953J690j619
1152A800j3323J6557P20q125R523j2029J210P426r092J4734l417j5730R247l936
1166d435P465Q288j8971N785K632o250J2379q368j404Q435j4689Q466O904j0219
$$ plain form
1180 -3982 2435 -6763 -4465 11938 -1662 -2326 495 -6691 8034 3487 -1852 8496 -6259 -4804
1194 -4804 5055 -528 9068 -1073 -11955 3593 -313 1971 5252 -8538 1789 1349 -6200 7010
1208 7010 -1053 -3930 1690 -7698 5540 6195 -9439 -1069 -3500 1554 11277 -4834 -600 2502
1222 2502 -6332 7299 5230 1315 5535 -10945 -3329 8154 -870 4012 -5481 -9303 5953 -2921
1236 -2921 -360 5226 -6992 1422 -293 -3311 9821 -3524 -7098 2394 -2672 7708 2074 -10659
1250 -10659 2676 -584 853 9782 -2126 1999 148 -7849 9460 6057 -1531 908 -10845 59
1264 59 6251 -5877 1927 -3061 -6295 4291 -4193 2219 6127 -7624 1497 2533 64 7440 -7470
1279 -7470 -4927 6390 -2229 4108 128 -6643 5043 -2730 248 10095 -2690 381 -1473 -4858
$$ packed form
1180c982O417r198K298J6403j3600o64K821p186J4725m547n339J0348j4755J455
1194d804R859n583R596j0141j0882J5548l906K284L281j3790J0327m40p549J3210
1208G010q063k877N620r388J3238O55j5634Q370k431N054R723j6111M234L102
1222B502q834J3631k069l915M220j6480P616J1483r024M882r493l822J5256q874
1236b921K561N586j2218Q414j715l018J3132j3345l574R492n066J0380n634j2733
1250a0659J3335l260J437Q929j1908M125j851p997J7309l403p588K439j1753J0904
1264E9O192j2128P804m988l234J0586q484O412L908j3751R121J036k469P376j4910
1279g470K543J1317q619O337l980o771J1686p773K978R847j2785L071j854l385
$$ plain form
1293 -4858 10012 -23 -5850 1678 -6819 919 1531 -7128 4574 -1380 -4828 5943 -1791 2964
1307 2964 3311 -7392 6304 4216 -3159 2371 -6901 139 6019 -5801 2519 228 -5352 4498
1321 4498 -1962 2901 7876 -7242 -286 2519 -1848 5936 -5619 -5329 4416 -5264 873 1715 -5487
1336 -5487 4496 -2158 -1344 9507 -2420 -858 585 -4098 8719 367 -7191 1525 -5601 640
1350 640 4222 -4890 4306 -1524 -6276 7048 2048 3182 2821 -8563 3843 4294 -3455 3333 -5759
1365 -5759 -3519 3839 -5128 3610 2530 -6879 2356 -914 2654 8519 -7041 -2429 2051 -2448 6418
1380 6418 -2825 -5996 2812 -6179 1550 6403 -2555 2614 -3722 -2742 11472 1656 -235 615 -6581
1395 -6581 4780 1689 -4010 3867 -6380 -4316 2956 -2872 5286 -327 -8370 4029 1461 2308
$$ packed form
1293d858J4870j0035n827P528q497P738O12q659J1702n954l448J0771p734M755
1307B964L47j0703J3696k088p375N530r272P040N880j1820Q320k291n580R850
1321D498o460M863M975j5118O956K805m367P784j1555K90R745r680O137Q42p202
1336e487R983o654Q14J0851j1927J562J443m683J2817q352p558Q716p126O241
1350F40L582r112R196n830m752J3324n000J134l61j1384J2406M51p749O788r092
1365e759K240P358q967Q738j080r409R235l270L568N865j5560M612M480m499Q866
1380F418r243l171Q808q991P729M853q958N169o336R80J4214r816j891Q50p196
1395f581J1361l091n699P877j0247K064P272n828Q158n613q043J2399k568Q47
$$ plain form
1409 2308 4336 -8277 449 2855 -3250 5497 -2098 -4389 1986 -4964 5897 7771 -4837 778
1423 778 -1956 1374 9887 -3059 -1475 845 -6463 3152 3 -3576 2575 -7977 -2548 5742 -1845
1438 -1845 2676 -2973 -5205 8155 1103 -4 2185 -6866 2316 2781 -1662 6416 -3810 -5884 3171
1453 3171 -37 8230 3102 -8334 1617 172 1392 6791 -5190 -1969 -1183 -6835 5139 1036
1467 1036 -4596 -465 -6913 2973 7929 -3887 380 -2833 -1513 9415 58 171 1010 -8238 2533
1482 2533 4963 1575 4883 -8685 -5890 6102 1880 6045 -593 -8601 1937 -1035 1575 6423
1496 6423 -5854 -3673 -2593 -3346 8531 -26 -6751 -544 -3584 6157 6710 -4961 399 -2833 -1466
1511 -1466 9437 1272 296 -2433 -9778 4679 7091 1314 1383 -9785 -3470 6591 773 5327 -1099
$$ packed form
1409B308K028j2613Q726K406o105Q747p595k291O375o950J0861J874j2608N615
1423G78k734L330Q513j2946J584K320p308R615l149l579O151j0552N429Q290p587
1438a845M521n649k232J3360p052j107K189r051R182M65m443Q078j0226k074R055
1453C171l208Q267n128j1436R951j445J220N399j1981L221P86n652J1974m103
1467A036n632M131o448R886M956j1816M267l213J320J0928r357J13Q39r248J0771
1482B533K430l388L308j3568K795J1992m222M165o638q008J0538k972K610M848
1496F423j2277K181J080p53J1877q557o725O207l040R741N53j1671N360l232J367
1511a466J0903q165r76k729p345J4457K412n777O9j1168O315J0061n818M554o426
$$ plain form
1526 -1099 -8692 440 -1503 3911 6759 -8007 -4362 -636 -76 8679 -2565 -6021 1138 -2494 5914
1541 5914 5513 -4210 260 -4598 -779 10825 1182 -1573 -4316 -7860 7178 5989 -809 1127 -8068
1556 -8068 -2520 4830 50 5695 -1958 -8892 1515 467 3941 3559 -8732 -1177 1961 -270 5777
1571 5777 -3436 -4006 2164 -2579 6085 4656 -5521 -885 -3469 2608 10560 -2365 -3143 -2561 -4288
1586 -4288 7028 2448 -1598 1112 -7933 -1478 5084 -162 3382 -4732 -6582 5591 729 1017 519
1601 519 -7397 2457 2713 -608 4613 -4886 -4070 2779 265 7579 1780 -8046 -18 56 4489 7495
1617 7495 -5049 -2540 -1334 -3604 6392 1264 -3082 -993 -7528 1685 6210 -2357 261 -4455 -2226
1632 -2226 7732 -166 -244 -346 -6025 3647 3829 591 3288 -7442 -4086 5275 2559 6612 -1789 -8321
$$ packed form
1526a099p593R132j943N414K848j4766L645L726N60Q755j1244l456P159l632Q408
1541E914m01r723M470m858L819J1604r643k755k743l544J5038j189o798J936r195
1556h068N548P350m780N645p653o934J0407j048L474l82j2291P555L138k231O047
1571E777r213n70O170m743Q664j429j0177M636k584O077P952j2925p78N82j727
1586d288J1316m580m046K710r045O455O562n246L544q114j850J2173m862K88m98
1601E19p916R854K56l321N221r499Q16O849k514P314n799r826Q028P4M433L006
1617G495j2544K509J206k270R996n128m346K089o535R213M525q567K618m716K229
1632b226R958p898p8j02n679R672J82l238K697j0730L356R361k716M053q401o532
$$ plain form
1648 -8321 2080 996 3925 5260 -6259 -2872 -2295 -2389 7598 -531 -5620 -2328 -4602 5819 5342
1663 5342 -4381 -97 -3100 361 8350 -252 -382 -2170 -6926 5079 5248 846 302 -9398 -1978
1678 -1978 7002 2635 4678 -3273 -7249 2788 689 4436 4493 -7723 -3748 -1808 445 7973 -3122
1693 -3122 -6649 -443 -1765 6648 4475 -4446 80 -3243 1031 8855 -208 -1408 -4119 -6610 6671
1708 6671 4309 -795 -828 -8033 295 6516 1342 4588 -3203 -6706 2680 956 4471 2076 -9435
1723 -9435 -2286 634 1371 5835 -4815 -4646 1540 -1056 6740 3640 -4491 -359 -3552 2244 8263
1738 8263 -2609 -3130 -4109 -4040 7077 2325 -1720 -312 -6015 1884 6398 826 3216 -4636 -5512 4721
1754 4721 1425 2134 -1258 -9208 450 2024 758 4336 -5181 -3433 1991 -83 7290 1783 -6253
$$ packed form
1648h321J0401j084K929J335j1519L387N77r4R987q129n089L292k274J0421m77
1663E342r723M284l003L461P989q602j30j788m756J2005J69m402n44r700P420
1678a978Q980m367K043p951l976J0037k099L747N7j2216L975J940K253P528j1095
1693c122l527O206j322Q413k173q921M526l323M274P824r063j200k711k491J3281
1708F671k362n104l3p205Q328O221n174L246p791l503R386j724L515k395j1511
1723i435P149K920P37M464j0650J69O186k596P796l100q131M132l193N796O019
1738H263j0872n21r79O9J1117m752m045J408n703P899M514n572K390p852q76J0233
1754D721l296P09l392p950R658J574j266L578r517J748N424k074P373n507q036
$$ plain form
1769 -6253 -573 -1969 3558 6291 -5049 -2771 -2196 -2122 6997 952 -1772 54 -5202 3869 6366
1784 6366 -476 641 -5967 -3434 6112 -19 154 -2623 -7702 2063 1829 1201 3982 -5594 -2681 3186
1800 3186 1343 6826 -589 -6389 968 -666 3484 4146 -5739 -1403 -979 -907 7151 274 -2404 -644
1816 -644 -4098 5273 5050 -3274 -1113 -5600 -1596 5393 -1516 -286 -2541 -6690 3297 2869 2006 3133
1832 3133 -6141 -796 4978 1554 5103 -2341 -5219 2350 -806 2839 2752 -5765 -720 -720 478 6925
1848 6925 -2058 -3373 -240 -2301 5510 2320 -4616 -734 -4665 -688 5271 -1661 177 -2568 -4869
1863 -4869 5570 3135 1191 1906 -5204 1437 4535 -285 3369 -2779 -4152 2666 -890 2365 1175
1878 1175 -6397 280 712 1139 5079 -4272 -3033 1382 -1484 4570 479 -4679 -150 -3715 893
$$ packed form
1769f253N680j396N527K733j1340K278N75P4R119o045k724J826n256R071K497
1784F366o842J117o608K533R546o131J73k777n079R765k34o28K781r576K913N867
1800C186j843N483p415n800P357j634M150O62r885M336M24P2Q058o877k678J760
1816f44l454R371k23q324K161m487M004O989o909J230k255m149R987m28q63J127
1832C133r274N345N774l424L549p444k878P569l156L645q7q517N045%J198O447
1848F925q983j315L133k061P811l190o936L882l931L977N959o932J838k745k301
1863d869J0439k435j944P15p110O641L098m820L654o148j373O818l556L255j190
1878A175p572O677M32M27L940r351J239M415k866O054m091n158M529l565M608
$$ plain form
1893 893 5527 -2064 -352 -1771 -2360 6392 1547 -447 1488 -3924 2425 3210 -1774 2173 -3631 -3180
1909 -3180 3789 -925 1547 -813 -6053 2417 1788 940 3080 -5094 -1778 1825 -1263 4170 -547
1924 -547 -5028 377 -2408 2695 4718 -3720 -207 -762 -797 5974 -400 -1329 947 -3787 3137 2821
1940 2821 -2519 888 -4284 -1470 5094 -1000 396 -1805 -4883 3929 1751 287 2368 -5311 -1333
1955 -1333 2115 -407 4585 -1662 -4992 1483 -1010 3340 3466 -4121 880 -186 -291 5353 -1380
1970 -1380 -1517 584 -3412 3813 2337 -3206 216 -3773 50 4898 -1898 120 -1847 -4259 3776
1985 3776 903 229 1808 -5370 -242 2486 -413 3863 -2304 -3523 2794 -943 2612 2303 -3641
2000 -3641 1537 -240 -290 4639 -2498 -1362 813 -2454 4007 495 -3633 958 -2874 667 3770
$$ packed form
1893H93M634p591J712j419n89Q752m845j994J935n412O349P85m984L947n804M51
1909c180O969m714K472k360n240Q470o29q48K140q174L316L603l088N433m717
1924e47m481N405k785N103K023q438L513n55l5O771o374r29K276m734O924l16
1940B821n340L407n172K814O564o094J396k201l078Q812k178j464K081p679L978
1955a333L448k522M992o247l330O475k493M350J26p587N001j066j05N644o733
1970a380j37K101l996P225j476n543L422l989L823M848o796K018j967k412Q035
1985C776k873o74J579p178N128K728k899M276o167j219O317l737L555l09n944
2000c641N178j777n0M929p137J136K175l267O461l512m128M591l832L541L103
$$ plain form
2015 3770 -2909 293 -1514 -3430 4127 225 -104 1399 -4565 1310 2570 -1095 3008 -2196 -1633
2030 -1633 3279 -1649 1966 1260 -3831 2201 -48 -101 3399 -3306 -880 1550 -1804 3162 -849 -3542
2046 -3542 1764 -2388 691 2575 -3541 564 -971 -1899 4371 -604 -695 1384 -2980 2888 2110 -2203
2062 -2203 2494 -1968 -663 3362 -2020 1479 332 -3562 3154 233 -600 2156 -3813 513 2325
2077 2325 -1852 2521 -1787 -3105 2182 -2032 1146 1641 -4227 923 -284 -479 4521 -1784 -775
2092 -775 1712 -1986 3368 1216 -2390 2009 -2417 -460 3450 -2323 669 -513 -2965 3784 -267
2107 -267 -681 1549 -3885 1115 2052 -2030 1974 -2653 -2865 2567 -1482 1612 988 -4271 1708 584
2123 584 109 3981 -2381 -240 1814 -1930 3236 322 -2840 1454 -2448 61 2638 -3283 945
$$ packed form
2015C770o679L202j807j916P557l902l29J503n964N875J260l665M103n204N63
2030a633M912m928L615p06n091O032k249n3L500o705K426K430l354M966m011k693
2046c542N306m152L079J884o116M105j535r28O270m975r1K079m364N868p78m313
2062b203M697m462J305M025n382L499j147l894O716k921q33K756n969M326J812
2077B325m177M373m308j318N287m214L178M95n868N150j207j95N000o305J009
2092g75K487l698N354k152l606M399m426J957L910n773K992j182k452O749m051
2107b67m14K230n434N000R37m082M004m627k12N432m049L094o24n259N979j124
2123E84m75L872o362K141K054l744N166k914l162M294l902K509K577n921M228
$$ plain form
2138 945 -454 -1620 3911 -1334 -878 1549 -3045 1863 1379 -2704 1354 -2670 -1885 3115 -1620 1279
2154 1279 311 -3233 3020 640 24 3133 -2725 301 1645 -2091 2554 -785 -2694 2256 -1734
2169 -1734 646 1747 -3602 1327 443 -756 3588 -2360 -1214 1406 -2389 2452 752 -3168 868
2184 868 -2446 -180 3609 -2208 984 436 -1986 3917 241 -67 2271 -3017 1098 1823 -2253 1590
2200 1590 -2307 -2141 3157 -1423 506 434 -3969 2041 1215 -203 2758 -3483 -1504 1414 -1413 2935
2216 2935 -314 -3702 818 -1718 1300 3728 -2492 918 190 -1201 4471 -222 -1144 1185 -3257
2231 -3257 1733 1938 -2465 771 -3105 -1481 3901 -1003 462 -430 -4190 2385 1524 343 2380 -4373
2247 -4373 -1646 1619 -922 3549 -696 -3778 1269 -1194 2180 3604 -2665 918 -97 -1033 4472
$$ packed form
2138I45j399j166N531n245M56K427m594M908m84m083M058m024P85N000m735K899
2154A279r68l544O253k380o16L109n858L026J344l736M645l339j909M950l990
2169a734K380J101n349M929q84j199M344n948J146K620l795M841j700l920M036
2184H68l314K266L789n817L192n48k422N903l676l08K338n288M115P25m076L843
2200A590l897J66N298m580J929p2m403O010q26j418K961o241J979K918k827M348
2216B935l249l388M520k536L018K428o220L410p28j391N672m693r22K329m442
2231c257M990K05m403L236l876J624N382m904J465q92l760O575q61j181K037o753
2247d373K727L265k541M471m245l082N047k463L374J424o269L583j015r36N505
$$ plain form
2262 4472 -743 -1243 538 -3149 2239 1526 -3080 539 -2888 -624 4026 -1122 549 -907 -3875
2277 -3875 2855 989 188 1763 -4371 -892 1695 -919 3215 -1016 -2876 2011 -853 1959 2768
2292 2768 -2680 1036 -30 -784 3517 -2143 -1767 488 -2408 2470 897 -3235 854 -2261 264
2307 264 3910 -1472 452 -1047 -3088 3353 681 -8 1498 -3925 352 2128 -941 2761 -1165
2322 -1165 -2096 2924 -654 1772 1439 -3362 1798 408 -476 2442 -3378 -1532 1242 -1528 2915 -176
2338 -176 -3531 689 -1432 1365 3559 -2319 -109 -1029 -1891 3890 23 -811 752 -3246 1786 2327
2354 2327 -1286 1937 -1868 -954 3598 -509 927 -71 -3584 2451 944 -231 1363 -4340 -1236
2369 -1236 1700 -499 3148 -1178 -3936 911 -1105 2099 3003 -3138 -372 -913 -742 4341 -602 -1417
$$ packed form
2262D472n215n00J781l687N388p13m606L619l427K264M650n148J671j456k968
2277c875O730j866q01J575o134L479K587k614M134m231j860M887k864K812Q09
2292B768n448L716j066p54M301n660L76K255k896M878j573m132M089l115K525
2307B64L646n382J924j499k041O441k672o89J506n423M277J776l069L702l926
2322a165r31N020l578K426l33m801N160j390q84K918n820J846K774k770M443l091
2338a76l355M220k121K797K194n878K210r20q62N781l867q34J563l998N032N41
2354B327l613L223l805R14M552m107J436r98l513O035j507j175J594n703L104
2369a236K936k199L647m326k758M847k016L204R04o141K766n41J71N083m943q15
$$ plain form
2385 -1417 343 -2510 2825 2253 -1866 961 -2387 -163 4029 -912 174 -1453 -3741 2807 1081
2400 1081 55 824 -4667 -1008 2130 150 2920 -1822 -3546 1159 -266 2555 2366 -3697 -170
2415 -170 -558 95 4337 -1433 -1463 539 -1869 3560 1743 -2273 455 -2495 617 3957 -1418 -87
2431 -87 -2010 -3281 3128 1077 -87 93 -4773 -74 2372 276 2677 -2342 -2992 1992 -1 2407
2447 2407 1451 -3652 401 156 792 3823 -2401 -1768 246 -1265 3816 802 -2883 -111 -2460 1178
2463 1178 3603 -1750 -444 -2084 -2543 3656 745 -393 -164 -3987 921 2277 -247 1827 -2585
2478 -2585 -1926 2551 130 2222 357 -3718 1203 690 883 2664 -3043 -1488 883 -621 3491 -112
2494 -112 -3171 148 -1903 1668 2782 -2493 -493 -1656 -1477 3907 -44 -902 -408 -3195 2061 2271
$$ packed form
2385a417J760k853N335n72m119K827l348K224M192m941J086j627k288O548j726
2400A081j026P69n491L659L138j980K770m742j724M705j425K821j89o063L527
2415a70l88O53M242n770l0K002k408N429j817m016K728k950L112L340n375J331
2431h7j923j271O409k051j164J80m866M699K446k096K401n019o50M984j993K408
2447B407r56n103M053k45O36L031o224O33K014j511N081l014l685K772k349L638
2463A178K425n353J306j640m59O199k911j138K29l823M908J356k524K074m412
2478b585O59M477k421K092j865m075M921n13J93J781n707J555K371j504M112l603
2494a12l059L319k051L571J114n275K000j163J79N384l951q58M94k787N256K10
$$ plain form
2510 2271 -827 1410 -2727 -717 3266 -48 1649 -490 -3523 1938 977 1095 1852 -3863 -1038 1058
2526 1058 -269 3192 -1172 -3176 498 -1201 2276 2158 -2931 -367 -1193 -212 3832 -826 -1392 -489
2542 -489 -2465 2907 2100 -1240 541 -2856 132 3626 -392 1109 -1342 -2962 2494 961 639 945
2558 945 -3853 -577 1293 -285 2765 -1713 -2749 1186 -909 2274 1325 -3261 -30 -607 378 3407
2574 3407 -1800 -1274 -224 -1588 3371 1364 -1787 347 -2509 897 3504 -649 466 -1604 -2530
2589 -2530 2721 261 226 332 -3846 270 1624 -339 2032 -2226 -2118 1804 -300 2054 541 -3484
2605 -3484 597 -7 1049 2781 -2432 -1068 470 -695 3512 683 -1961 407 -2127 1549 2974
2620 2974 -1580 49 -2084 -1876 2941 -25 -502 -338 -3368 1060 1344 -507 1397 -2664 -1198 2369
$$ packed form
2510B271l098K237m137K010L983l314J697k139l033N461r61J18P57n715K825K096
2526A058j327L461m364k004L674j699L477j18n089K564q26R81M044m658n66R03
2542d89j976N372q07l340J781l397K988L494m018J501k451j620N456j533l22L06
2558I45m798L276J870j578L050m478j036L935k095L183r49m586L231n77R85L029
2574C407n207N26J050j364M959k007l151K134k856L406K607m153J115k070r26
2589b530N251k460l5J06m178M116J354j963K371m258J08L922k104K354j513m025
2605c484M081o04J056J732n213J364J538j165M207k829k644K368k534L676J425
2620B974m554J629k133K08M817k966m77J64l030M428K84j851J904m061J466L567
$$ plain form
2636 2369 -48 1715 -348 -3189 1170 318 1143 2244 -3037 -1019 569 -78 3706 -225 -2384 408
2652 408 -1367 1874 2393 -2203 -132 -1761 -998 2839 -812 -698 -546 -2820 2146 1626 -869 812
2668 812 -2670 -341 2874 -130 1292 -837 -2913 1978 830 1244 1459 -3272 -438 985 154 3130
2684 3130 -986 -2350 482 -1084 1964 1475 -2536 -158 -1177 -259 2879 -1342 -880 -433 -2064 2647
2700 2647 1114 -1164 470 -2494 354 2757 -417 1053 -1506 -2333 2298 609 889 837 -3259 43
2716 43 1020 165 2592 -1561 -2032 566 -958 1969 796 -2616 224 -942 10 2592 -1804 -709
2732 -709 32 -1386 2774 806 -1356 536 -2091 1104 2554 -910 665 -1242 -1767 2456 311 789
2748 789 498 -2916 680 868 -186 1760 -2101 -1423 921 -957 1481 79 -2660 854 -516 466
$$ packed form
2636B369k417J763k063k841M359q52Q25J101n281K018J588o47L784l931k159K792
2652D08j775L241N19m596K071j629P63L837l651J14J52k274M966n20k495J681
2668H12l482K329L215l004J422k129k076M891j148M14K15m731K834J423q31K976
2684C130m116j364K832j566L048m89m011K378j019R18L138m221M62M47j631M711
2700B647j533k278J634k964K848K403l174J470k559q27M631j689K80n2m096L302
2716D3R77q55K427m153m71K598j524K927j173l412K840j166R52K582m396J095
2732g09P41j418M160j968k162J892k627L195J450l464J575j907n25M223k145M78
2748G89k91l414L596J88j054J946l861O78K344j878K438j402k739L514j370R82
$$ plain form
2764 466 1887 -1972 -292 355 -817 2637 120 -1278 770 -1721 1552 1996 -1392 634 -1068 -1078
2780 -1078 2348 -485 73 70 -2277 1122 697 -663 1145 -2232 -560 1462 -899 1190 -645 -2449
2796 -2449 1533 -139 268 1339 -2346 289 779 -325 2346 -806 -1538 992 -1063 1838 1357 -1956
2812 -1956 503 -888 -411 2434 -792 -237 75 -2246 1835 406 -1008 754 -2186 -96 1562 -1182
2828 -1182 995 -850 -1706 2059 -159 514 1072 -2279 710 824 -562 2001 -1149 -1054 1140 -890
2844 -890 1651 668 -1941 694 -1115 -37 2037 -1402 -244 183 -1693 1781 121 -945 695 -1959
2860 -1959 495 1472 -1180 1089 -1031 -1306 1996 -337 403 600 -2201 955 1018 -289 1636 -1421
2876 -1421 -725 1274 -1014 1701 242 -2123 834 -834 -51 1795 -1731 28 334 -1471 1779 -522
$$ packed form
2764D66J421l859J680O47j172L454k517j398K048k491L273M44l388K026j702j0
2780a078L426k833N58lk347L399m25j360J808l377J672K022k361K089j835j804
2796b449L982j672M07J071l685K635M90j104K671l152p32K530k055K901m81l313
2812a956K459j391M77K845l226N55L12k321M081j429j414J762k940K090J658k744
2828a182K177j845q56L765k218O73N58l351K989J14j386K563l150R5K194k030
2844h90K541r83k609K635j809J078K074l439J158M27j876L474j660j066J640k654
2860a959K454R77k652K269k120k75L302k333P40J97k801L156O3j307J925l057
2876a421O96J999k288K715j459k365K957j668P83J846l526J759L06j805L250k301
$$ plain form
2892 -522 -881 962 -1508 707 1120 -1519 1195 -845 -706 1962 -956 286 564 -1565 1412 306
2908 306 -570 1453 -1523 -82 1138 -1298 952 -453 -1894 1446 -747 -69 1265 -1829 391 339
2924 339 -1109 1516 -759 -752 1597 -1206 849 629 -1557 1212 -375 -42 1950 -1393 160 423 -1095
2941 -1095 1956 -11 -1133 956 -1673 347 1156 -1376 758 -674 -1278 1492 -824 -189 698 -1945
2957 -1945 1179 571 -835 1316 -1083 -605 1607 -806 1043 276 -1997 1275 -372 499 1691 -1654
2973 -1654 -74 321 -882 2041 -260 -1374 719 -1684 524 1416 -1584 624 -811 -1142 1775 -927
2989 -927 -25 517 -1611 1469 603 -840 1027 -1509 -110 1675 -717 907 -76 -1722 1169 -114
3005 -114 483 1325 -2151 -88 229 -852 2049 -605 -1006 683 -1552 823 882 -1573 989 -632 -561
$$ packed form
2892e22l59J843k470K215M13k639K714k040J39K668k918J242K78k129K977j106
2908C06q76K023k976J441J220k436K250j405j441L340k193O78J334l094K220n2
2924C39j448K625k275PK349k803K055k20k186K769j587L33J992l343J553K63j518
2941a095L051j967j122K089k629K020Q09k532K134j432o04K770k316O35Q87k643
2957a945L124o08j406K151k399M78K212k413J849p67k273L272j647Q71J192l345
2973a654J580L95j203K923k301j114K093k403K208Q92l000K208j435l31K917k702
2989i27R02N42k128L080q66j443J867k536J399J785k392J624r83j646K891j283
3005a14N97Q42l476K063L17j081K901k654m01J689k235K375N9k455K562j621P1
$$ plain form
3022 -561 1897 -1129 102 840 -1353 1867 308 -857 1011 -1282 215 1489 -949 965 -402
3037 -402 -1274 1695 -400 208 1008 -1944 599 315 -1031 1758 -1015 -756 1158 -1444 616 111 -1676
3054 -1676 1286 -259 -292 1317 -1537 257 566 -878 1737 -345 -1077 991 -856 911 1522 -1495
3070 -1495 720 -638 -1072 1945 -692 -62 317 -2065 997 488 -876 1141 -1589 -381 1324 -1198
3086 -1198 493 -245 -1609 1584 116 -152 1024 -2095 177 831 -214 2232 -753 -1308 732 -1076
3102 -1076 1291 1272 -1528 428 -877 -484 2073 -854 -372 145 -1519 1422 92 -1198 611 -1521
3118 -1521 118 1597 -1055 432 -762 -1583 1802 231 433 737 -2166 312 963 -22 2022 -1074
3134 -1074 -1442 825 -667 1445 1002 -1777 387 -711 -35 2103 -1275 -420 -96 -1480 1911 431
$$ packed form
3022e61K458l026J231P38k193L220j559j165J868k293J497J274k438J914j367
3037d02q72K969k095O08Q00k952K543k84j346K789k773K59J914k602K060n05j787
3054a676K962j545l3J609k854J794L09j444K615k082p32K068j847J767O11l017
3070a495K215j358m34L017k637O30L79k382L062n09j364K017k730J208J705k522
3086a198J691p38j364L193j468k68J176l119K272O54j045K446k985n55K040j808
3102a076K367j9k800J956j305L93K557k927M82N17j664K941j330j290J809k132
3118a521J639J479k652J487j194q21L385j571K02L04k903K478O51r85K044l096
3134a074l68K267j492K112m43k779K164j098O76K138l378Q55L24j384L391j480
$$ plain form
3150 431 -1078 504 -1786 403 1766 -613 677 -828 -1421 2156 465 485 725 -2239 478 827
3166 827 -193 1657 -1354 -1251 650 -824 1571 493 -1908 591 -592 -142 1774 -1663 -293 -12
3182 -12 -1175 2061 -130 -1205 508 -1188 1125 1730 -1038 640 -947 -803 2391 -223 326 416 -2220
3199 -2220 1058 734 -199 1463 -1720 -866 1002 -646 1190 -30 -2352 754 -350 89 1219 -1715
3215 -1715 -240 262 -490 1887 -419 -1114 583 -1021 1300 1633 -1383 399 -884 -511 2330 -343
3231 -343 -33 -25 -1875 1316 882 -467 872 -1829 -330 1495 -680 829 -607 -1882 1111 -12
3247 -12 595 891 -2195 191 539 -151 2030 -883 -1221 777 -712 1790 1225 -1491 263 -840 133
3264 133 2158 -848 -362 -117 -1488 1890 677 -757 495 -1915 155 1657 -511 600 -1202 -1733
$$ packed form
3150D31j509J582k290K189J363k379J290j505n93L577j691K0K40k964K717L49
3166H27j020J850l011J03J901j474K395j078k401K499j183M50J916l437J370K81
3182a2j163L236k191j075J713j696K313O05k768J678j587J44L194k614N49R0k636
3199b220L278l24r33J662l183Q54J868j648J836j220k322L106j104M39J130k934
3215a715J475N02p52K377k306o95J697j604K321L33l016J782j283L73K841k673
3231c43L10Qj850L191m34j349J339k701J499J825k175J509j436j275K993j123
3247a2O07K96l086K386L48o90K181k913l38J998j489K502n65k716J754j103R73
3264A33K025l006M86K45j371L378j213j434J252k410K070J502k168J111j802n31
$$ plain form
3280 -1733 1473 -18 537 531 -2271 509 682 259 1715 -973 -1137 682 -310 1668 633 -1938 470
3297 470 -785 381 2173 -1282 -449 -544 -1315 1857 194 -1014 135 -1997 434 1542 -770 599
3313 599 -1386 -1130 1994 -39 476 332 -2197 659 756 29 1492 -1563 -610 971 -333 1433 68
3330 68 -1909 489 -439 620 1593 -1714 -280 -293 -889 2073 -320 -1039 154 -1542 681 1430 -851
3347 -851 455 -1017 -578 2079 -180 445 104 -1777 984 874 40 1017 -1794 -540 1348 -93 1516
3364 1516 -448 -1824 725 -287 545 1481 -1837 -227 -253 -396 1933 -655 -1061 57 -1198 1323
3380 1323 1005 -1084 648 -831 -255 1843 -424 166 -179 -1410 1490 488 -333 572 -1832 -80
3396 -80 1482 -352 1185 -668 -1541 1111 -79 691 718 -1936 -298 143 -73 1811 -962 -944 447
$$ packed form
3280a733L206j491N55ok802K780J73m23J456k688j64J819r92J978j035k571K408
3297D70j255J166J792l455Q33r5p71L172j663j208J149k132K431J108k312J369
3313E99j985K56L124k033N15j44k529K856R7p27J463l055R53J581j304J766j365
3330F8j977K398r28J059R73l307J434j3n96K962k393p19J193j696K223P49k281
3347h51J306j472M39K657k259O25l41j881K761j10q34R77k811J254J888j441J609
3364A516j964j376K549j012Q32R36l318J610k6j43K329k588m06J118j255K521
3380A323l18k089J732j479N76K098k267N90l45j231K900j002q21R05k404J752
3396h0J562j834J537j853q73K652j190P70K7k654J638M41k16J884k773J8J391
$$ plain form
3413 447 -912 1636 753 -1245 235 -642 229 1815 -632 -45 -292 -1006 1663 369 -471 461 -1824
3430 -1824 261 1321 -353 966 -1032 -1228 1129 -89 640 396 -2066 422 218 7 1439 -1173
3446 -1173 -801 534 -607 1460 562 -1346 662 -485 578 1731 -1300 26 -352 -871 1789 22
3462 22 -492 205 -1649 563 1170 -587 504 -1192 -1054 1421 -426 508 181 -1788 594 270 81
3479 81 1282 -1267 -380 937 -371 1640 58 -1652 592 -430 850 1267 -1203 -70 -222 -750
3495 -750 1759 -249 -615 180 -1194 1052 873 -765 244 -1147 -566 1438 -366 343 -113 -1418 938
3512 938 290 179 949 -1570 -121 1111 -317 1474 -487 -1253 745 -277 642 743 -1509 89 -88
3529 -88 -391 1630 -629 -671 256 -1031 997 576 -1238 450 -859 -137 1472 -746 268 -39 -1281
$$ packed form
3413D47j359K548q83j998J480q77Q71J586k447N87k47p14K669j294q40R32k285
3430a824K085J060j674J319j998j96K357j218P29k44k462K488k04k11J432k612
3446a173L72J335j141K067q98j908K008j147J063J153l031J326l78n19K660j767
3462B2n14O97j854K212O07j757J091j696J38K475j847R34l27j969K382l24j89
3479H1J201k549Q87J317j308K011j582j710K244j022J280M17k470J133j52n28
3495g50K509k008l66P95j374K246j79j638J009j391N81K004j804P09m56j305K356
3512I38o48j11P70k519J449J232j428J791j961p66J998j022R19J01k252J598j77
3529h8l03K021k259m2R27j287K028m21j814J688j309P22J609k218J014l07j242
$$ plain form
3546 -1281 1361 259 32 762 -1373 301 1116 -361 972 -731 -898 797 -503 560 573 -1496
3562 -1496 186 -175 -296 1200 -999 -755 328 -830 1132 406 -1015 529 -797 238 1303 -743
3578 -743 355 -244 -927 1550 204 17 557 -1203 550 649 -520 757 -776 -795 975 -457 361
3595 361 212 -1264 412 -218 10 809 -1047 -292 361 -725 937 -108 -708 593 -724 431 1204
3612 1204 -931 424 25 -547 1276 -312 -328 441 -1155 657 469 -725 699 -817 -501 963 -508
3629 -508 321 -103 -1234 841 -116 -570 841 -1336 -52 665 -458 969 -199 -922 745 -463 571
3646 571 813 -1146 570 166 -328 1159 -554 -35 481 -802 689 238 -1016 492 -691 -297 1045
3663 1045 -815 139 -147 -800 1018 -167 -299 524 -1281 313 780 -453 1048 -280 -807 1297 -441
$$ packed form
3546a281K642j102k27P30k135J674Q15j477J333j703j67J695j300J063J3k069
3562a496J682l61j21J496k199K44J083j158J962p26j421J544j326J035J065k046
3578g43J098n99o83K477j346j87N40j760J753R9j169J277j533j9J770j432Q18
3595C61j49j476J676o30K28P99j856P55O53j086J662j045o00J301j317J155P73
3612A204k135J355l99n72J823j588j6P69j596J812j88j194J424j516L16J464j471
3629e08Q29m24j131K075r57m54J411k177J284P17j123J427j168p23J667j208J034
3646E71K42j959J716m04m94J487j713N19N16j283J491m51j254J508j183L94J342
3663A045j860R54k86o53J818j185j32Q23j805J594M67j233J501j328n27K104j738
$$ plain form
3680 -441 585 585 -1314 503 -74 -230 1035 -827 -164 463 -779 820 6 -904 441 -459 76 899
3698 899 -1203 -108 -65 -601 1330 -32 -27 562 -995 561 852 -286 848 -618 -555 906 -480 410
3716 410 385 -947 658 -180 -311 873 -1007 68 587 -664 922 -260 -941 735 -594 316 902
3733 902 -850 256 -98 -527 1178 -71 -222 404 -1090 625 554 -640 649 -458 -154 749 -732
3750 -732 241 117 -720 587 -301 -292 726 -957 203 508 -604 673 -408 -632 776 -361 196 578
3768 578 -801 344 -55 -391 1151 -293 -29 645 -635 679 122 -722 871 -221 -159 518 -914
3785 -914 303 92 -563 896 -293 -633 531 -737 514 454 -844 462 -475 -426 779 -623 265
3802 265 313 -902 553 -106 -232 792 -591 91 903 -570 551 -209 -686 777 -243 243 616 -1048
$$ packed form
3680d41J026%j899J817n77j56J265j862O63O27j242J599q14r10J345r00N35Q23
3698H99k102J095M3n36J931j362NN89j557J556K91j138J134j466O3J461j386Q90
3716D10k5j332J605q38j31J184j880J075N19j251J586j182o81J676j329R10N86
3733I02j752J106l54m29J705j249j51O26j494J715p1j194J289j107L04R03j481
3750g32R73j24q37J307q88RJ018j683J160L05j112J277j081k24J408j137N57L82
3768E78j379J145l99l36J542j444K64O74j280J314n57q44J593j092O2O77j432
3785i14J217k11o55J459j189l40J164j268J251o0j298J306r37M9J205j402Q88
3802B65M8j215J455o59j26J024j383O82Q12j473J121p60m77J463j020M86L73j664
$$ plain form
3820 -1048 74 135 -262 914 -558 -524 427 -867 699 372 -754 419 -622 -246 980 -323 201
3837 201 -34 -650 754 113 -166 609 -695 415 644 -488 398 -190 -715 767 -354 247 280 -1372
3855 -1372 171 103 -77 1181 -786 -550 323 -712 620 254 -610 262 -776 12 1086 -501 222
3872 222 51 -497 955 138 -120 632 -601 383 605 -414 504 -658 -652 660 -275 299 233 -1430 274
3891 274 20 -98 998 -608 -84 165 -588 855 304 -598 501 -528 220 950 -683 311 -27 -374
3909 -374 1071 9 -194 240 -832 375 553 -776 342 -774 -590 859 -366 72 -156 -1144 525
3926 525 81 -7 753 -607 -188 337 -435 828 -67 -679 585 -242 162 632 -578 144 39 -181 1039
3945 1039 -285 -294 175 -656 558 389 -799 261 -657 -223 1028 -302 69 -141 -654 588 289 22
$$ packed form
3820a048J122O1l97J176j472L4R51j294J566l27j126J173j041L76J226j303N24
3837B01k35o16J404o41k79P75j304J110K29j132Q86n88n25J482j121O01L3j652
3855a372J543o8j80J258j967K36Q73j035J332l66q64Q72j038P88J074j587P23
3872B22j71n48J452q17k58P52j233R84K22j019R18j162OJ312r35N74o6j663J704
3891B74k54j18J096j606N24K49p53J443n51r02J099j029P48P30j633R94l38l47
3909c74J445j062k03M34j072J207J78j329J118j116J84J449j225M38k28r88J669
3926E25m44q8P60j360M19N25p72J263q95o12J264q27M04M70j210P22j05k20J220
3945A039j324rM69q31J214j69j188J060r18M34J251j330L71k10n13J242k99k67
$$ plain form
3963 22 586 -669 68 402 -265 672 -196 -522 701 -226 409 297 -820 220 74 -29 913 -635 -642
3982 -642 111 -543 582 124 -918 173 -549 165 905 -512 128 -171 -815 977 408 -129 423 -806
4000 -806 273 755 -45 720 -367 -527 749 -198 536 340 -1089 207 61 241 943 -827 -365 391
4018 391 -538 803 106 -907 255 -833 359 1055 -608 235 -266 -401 1216 73 -234 212 -973
4035 -973 610 546 -227 488 -736 -359 770 -181 330 21 -971 530 214 -135 486 -919 -329 329 -306
4054 -306 857 -56 -720 184 -550 508 845 -540 215 -256 -356 1106 -217 -280 125 -697 683 760 -299
4073 -299 317 -786 -203 735 -255 246 -430 -926 610 144 56 353 -958 -252 197 -155 906 -394 -590
4092 -590 438 -211 593 647 -765 246 -72 -47 1221 -398 -241 212 -639 979 427 -692 382 -657
$$ packed form
3963B2N64j255P37L34o67R37q68l26J223r27O35j12j117J040j46j03R42j548p
3982f42P53o54J125m58j042J091p22P14P40j417O40k99o44J792n69n37N52j229
4000h06J079M82q00P65j087j60J276r47P34j96j429J296j46J80P02j770M62P56
4018C91r29J341o97j013J162j088J192O96j663Q43n01j35J617j143l07M46j185
4035i73J583o4p73P15j224L77J129r51N11l09r92J501l16l49O21j405N90O58o35
4054c06J163r13o64R04p34J058L37j385P55m71j00J462j323o3M05q22J380P7j059
4073b99O16j103N83R38r90N01o76m96J536m66q8K97j311P06M49l52J061j300j96
4092e90J028o49Q04N4j412J011l18K5J268j619J57M53q51J618n52j119J074j039
$$ plain form
4110 -657 73 962 -538 153 -348 -717 600 127 -44 331 -1028 126 584 -240 641 -366 -504 781
4128 781 -255 534 450 -795 360 98 -5 934 -638 -468 189 -420 907 262 -720 59 -723 187 948
4147 948 -501 153 -284 -609 969 -31 132 230 -1091 415 486 -220 405 -778 -452 806 -271 486
4165 486 133 -904 353 23 94 752 -781 -383 242 -192 858 6 -775 264 -427 546 715 -513
4183 -513 -34 -468 -396 942 -98 -149 -12 -833 659 657 -284 612 -652 -206 747 -235 632 186 -668 469
4203 469 80 153 596 -794 -136 278 -167 816 -133 -643 218 -463 286 509 -1030 187 -211 -409 1048
4222 1048 -336 -206 8 -685 447 205 -219 222 -761 -189 698 -436 426 -32 -811 703 17 209
4240 209 359 -781 -101 339 -308 724 -342 -545 399 -499 438 446 -901 357 -223 51 892 -445 -119
$$ packed form
4110f57P30Q89j500O91n01l69J317m73j71L75j359J154M58q24Q81j007j38J285
4128G81j036P89q4j245J155k62j03R39j572J70O57o09J327o45r82P79p82R10P61
4147I48j449O54m37l25J578j000J63R8j321J506P1p06O25j183L26J258j077P57
4165D86l53j037J257l30P1O58j533L98O25m34J050q52p81J039o91R73J69j228
4183e13M79m34P2J338j040n1J37q21J492kr41Q96j264M46R53r82Q67m46q54J137
4203D69l89P3M43j390O58M14m45R83r49n10Q61o81P49K23j539J217l98j98J457
4222A048j384J30K14o93J132k42m24M41r83N72Q87j134Q62m58p79J514o86J92
4240B09J50j140O80M40o47J032j066k03R44q98R37Qj347J258n80K74Q41j337L26
$$ plain form
4259 -119 147 -393 815 311 -433 170 -610 215 791 -249 111 -401 -759 636 -225 -118 143 -1093 61
4278 61 471 -331 447 -553 -502 555 -210 668 337 -707 209 12 254 701 -504 -135 105 -483 1058
4297 1058 50 -429 372 -549 173 612 -312 164 -349 -677 604 -217 -120 -4 -879 306 339 -71 357
4316 357 -530 -298 612 -180 484 273 -545 452 -91 353 698 -800 -136 0 -238 812 -100 -416 190
4335 190 -481 87 489 -695 -61 -420 -277 833 -128 -99 361 -614 545 421 -318 441 -712 -10 691
4354 691 -187 393 -88 -590 526 -83 194 419 -875 -189 264 -169 663 -293 -455 367 -196 466 429 -632
4374 -632 169 -275 -270 688 -273 -84 -11 -741 509 76 -317 336 -356 65 643 -332 189 -60 -567 597
4394 597 14 41 452 -893 206 136 -279 526 -369 -409 259 -392 527 75 -595 226 -173 -116 709 -489
$$ packed form
4259a19K66n40J208n04p44O03p80Q25N76j040L60n12l58J395q61J07K61j236J154
4278F1M10q02P78j000N1J057p65Q78l31j044R16j97K42M47j205L69K40n88J541
4297A058j008m79Q01r21P22M39r24M76n13l28J281q21R7J16q75J185L3m10M28
4316C57q87K32R10p92O64k11q18R97n43M44L45j498O64J36k38J050r12l16O06
4335A90o71N68M02j184O34l59J43J110r61K9M60r75J159j24p39P59j153P02P01
4354F91q78N80m81n02J116o09K77K25j294O86M53m33Q32r56j62Q22n63O62l7j061
4374f32Q01m44NR58r61J89P3p30J250m33l93O53o92M21N78r75N21k49n07J164
4394E97n83K7M11j345J099p0m15Q05q95m0O68o51R19m52o70Q21l99N7Q25j198
$$ plain form
4414 -489 -186 135 -364 747 122 -271 336 -583 244 549 -363 184 -87 -317 510 25 104 196 -951 375
4434 375 -12 -246 621 -839 -199 308 -210 201 -141 -705 282 -154 -42 623 -382 102 140 -446 734
4453 734 -143 -365 273 -529 342 498 -487 418 -118 -278 624 -22 52 202 -758 212 23 -408 485 -456
4473 -456 -216 304 -490 288 -23 -675 504 4 4 330 -648 -20 256 -258 756 -262 -449 327 -565 236
4493 236 207 -487 326 -142 -242 416 -436 279 40 -692 239 21 -150 326 -590 -109 208 -433 488 119
4513 119 -440 562 -102 76 301 -668 182 112 -354 445 -478 -182 565 -350 480 126 -536 177 -253 -7
4533 -7 475 -209 -70 155 -378 567 216 -339 466 -505 44 467 -548 211 -242 -266 719 -153 -146 111 -612
4554 -612 569 92 -254 525 -509 -61 312 -316 341 306 -452 330 -320 -115 355 -524 -64 49 -359 568
$$ packed form
4414d89L03L21m99J111o25l93O07r19Q27L05r12N47k71k30Q27m85P9R2j147J326
4434C75l87k34Q67j460O40N07n18M11l42n64R87m36J12O65j005M84L8n86J180
4453G34q77k22O38q02Q71J56r85R05n36j60R02o46P4J50r60R70j89m31Q93r41
4473d56K40N20p94P78l11o52J179n00%L26r78O28K76n14J014j018j87P76q92Q01
4493B36k9o94Q13m68j00O58q52P15k39p32R31k18j71M76r16M81L17o41R21l69
4513A19n59J002o64J78K25r69Q50p0m66P99r23K96P47r15Q30l54o62P13m30K46
4533gM82o84J39K25n33R45l51n55Q05r71N49M23j015P59m53k4R85q72PK57p23
4554f12J181m77l46P79j034M48L73o28O57l5p58P82o50K05M70q79M60J13m08R27
$$ plain form
4574 568 -285 -298 426 -667 287 475 -365 275 -102 -341 587 -359 5 150 -557 379 138 -296 626 -307
4594 -307 -156 341 -331 426 -285 -580 521 -259 36 296 -650 309 6 -305 278 -427 -221 386 -252 246
$$ packed form
4574E68q53j3P24j093R54J88q40O40l77k39R28r46L64J45p07R36k41m34R22r33
4594c07J51M97o72P57p11k95J101p80K95K60r46R59l03l11N83p05K06O07o38M98
$$ [...]
8191a94
##END NTUPLES=NMR FID
##END=
