##TITLE=1H_63-2021
 CDCl3, 8 sc, 
 4.08.2021
##JCAMPDX= 6.0         $$ Bruker NMR JCAMP-DX V2.0
##DATA TYPE= NMR FID
##DATA CLASS= NTUPLES
##ORIGIN= UXNMR, Bruker Analytische Messtechnik GmbH
##OWNER= root
$$ XWIN-NMR		Version 3.5
$$ Wed Aug  4 10:37:22 2021 Russian Standard Time (UT+4h)  she@DPX200
##.OBSERVE FREQUENCY= 200.131506
##.OBSERVE NUCLEUS= ^1H
##.DELAY= (6, 6)
##.ACQUISITION MODE= SIMULTANEOUS
##.ACQUISITION SCHEME= undefined
##.AVERAGES= 8
##.DIGITISER RES= 18
##SPECTROMETER/DATA SYSTEM= spect
##.PULSE SEQUENCE= zg30
##.SOLVENT NAME= CDCl3
##.SHIFT REFERENCE= (INTERNAL, CDCl3, 0, 15.7039)
##AUDIT TRAIL= $$ (NUMBER, WHEN, WHO, WHERE, WHAT)
$$ ##TITLE= Audit trail, XWIN-NMR		Version 3.5
$$ ##JCAMPDX= 5.01
$$ ##ORIGIN= Bruker BioSpin GmbH
$$ ##OWNER= she
$$ F:/spectra/data/she/nmr/H-F/1/audita.txt
$$ ##AUDIT TRAIL=  $$ (NUMBER, WHEN, WHO, WHERE, WHAT)
(   1,<2021-08-04 10:36:00.09 +0400>,<she>,<DPX200>,
      <created by zg, POWCHK disabled, PULCHK disabled
       configuration hash MD5:
       00 E9 B6 7A A2 85 ED C7 34 08 36 98 17 FE 4E 26
       data hash MD5: 16K
       E9 A9 F6 62 DF 0A 06 5D 93 60 0A F8 2D 07 E3 CA>)
$$ ##END=
$$ 
$$ hash MD5
$$ 5B 74 9F E6 EE 6F 43 A0 F7 9C CA FA 6F A1 28 BA
##$RELAX= 
##$RELAX= 
##$RELAX= 
##$RELAX= 
##$RELAX= 
##$RELAX= 
$$ Bruker specific parameters
$$ --------------------------
##$DU= <F:/spectra>
##$EXPNO= 1
##$NAME= <H-F>
##$PROCNO= 1
##$TYPE= <nmr>
##$USER= <she>
##$AMP= (0..31)
100 100 100 100 100 100 100 100 100 100 100 100 100 100 100 100 100 100 
100 100 100 100 100 100 100 100 100 100 100 100 100 100 
##$AQSEQ= 0
##$AQ_mod= 1
##$AUNM= <au_zg>
##$AUTOPOS= <>
##$BF1= 200.13
##$BF2= 200.13
##$BF3= 200.13
##$BF4= 200.13
##$BF5= 200.13
##$BF6= 200.13
##$BF7= 200.13
##$BF8= 200.13
##$BYTORDA= 1
##$CFDGTYP= 0
##$CFRGTYP= 5
##$CHEMSTR= <none>
##$CNST= (0..31)
1 1 145 1 1 1 1 1 1 1 1 1 1 1 1 1 1 1 1 1 1 1 1 1 1 1 1 1 1 1 1 1 
##$CPDPRG= <>
##$CPDPRG1= <>
##$CPDPRG2= <>
##$CPDPRG3= <>
##$CPDPRG4= <mlev>
##$CPDPRG5= <mlev>
##$CPDPRG6= <mlev>
##$CPDPRG7= <mlev>
##$CPDPRG8= <mlev>
##$CPDPRGB= <>
##$CPDPRGT= <>
##$D= (0..31)
0 1.2 0 0 0 0 0 0 0 0.06 0 0.03 0 0 0 0 0.0002 0 0 0 0 0 0 0 0 0 0 0 0 
0 0 0 
##$DATE= 1628058959
##$DBL= (0..7)
120 120 120 120 120 120 120 120 
##$DBP= (0..7)
150 150 150 150 150 150 150 150 
##$DBP07= 0
##$DBPNAM0= <>
##$DBPNAM1= <>
##$DBPNAM2= <>
##$DBPNAM3= <>
##$DBPNAM4= <>
##$DBPNAM5= <>
##$DBPNAM6= <>
##$DBPNAM7= <>
##$DBPOAL= (0..7)
0.5 0.5 0.5 0.5 0.5 0.5 0.5 0.5 
##$DBPOFFS= (0..7)
0 0 0 0 0 0 0 0 
##$DE= 6
##$DECBNUC= <off>
##$DECIM= 32
##$DECNUC= <off>
##$DECSTAT= 4
##$DIGMOD= 1
##$DIGTYP= 9
##$DL= (0..7)
0 120 120 120 120 120 120 120 
##$DP= (0..7)
150 150 150 150 150 150 150 150 
##$DP07= 0
##$DPNAME0= <>
##$DPNAME1= <>
##$DPNAME2= <>
##$DPNAME3= <>
##$DPNAME4= <>
##$DPNAME5= <>
##$DPNAME6= <>
##$DPNAME7= <>
##$DPOAL= (0..7)
0.5 0.5 0.5 0.5 0.5 0.5 0.5 0.5 
##$DPOFFS= (0..7)
0 0 0 0 0 0 0 0 
##$DQDMODE= 0
##$DR= 18
##$DS= 0
##$DSLIST= <SSSSSSSSSSSSSSS>
$$ [...]
##$SUBNAM2= <"">
##$SUBNAM3= <"">
##$SUBNAM4= <"">
##$SUBNAM5= <"">
##$SUBNAM6= <"">
##$SUBNAM7= <"">
##$SUBNAM8= <"">
##$SUBNAM9= <"">
##$SW= 20.0188882624521
##$SWIBOX= (0..15)
0 0 2 0 0 0 0 0 0 0 0 0 0 0 0 0 
##$SW_h= 4006.41025641026
##$TD= 16384
##$TD0= 1
##$TE= 0
##$TE2= 300
##$TE3= 300
##$TEG= 300
##$TL= (0..7)
0 120 120 120 120 120 120 120 
##$TP= (0..7)
150 150 150 150 150 150 150 150 
##$TP07= 0
##$TPNAME0= <>
##$TPNAME1= <>
##$TPNAME2= <>
##$TPNAME3= <>
##$TPNAME4= <>
##$TPNAME5= <>
##$TPNAME6= <>
##$TPNAME7= <>
##$TPOAL= (0..7)
0.5 0.5 0.5 0.5 0.5 0.5 0.5 0.5 
##$TPOFFS= (0..7)
0 0 0 0 0 0 0 0 
##$TUNHIN= 0
##$TUNHOUT= 0
##$TUNXOUT= 0
##$USERA1= <user>
##$USERA2= <user>
##$USERA3= <user>
##$USERA4= <user>
##$USERA5= <user>
##$V9= 5
##$VALIST= <valist>
##$VCLIST= <CCCCCCCCCCCCCCC>
##$VD= 0
##$VDLIST= <DDDDDDDDDDDDDDD>
##$VPLIST= <PPPPPPPPPPPPPPP>
##$VTLIST= <TTTTTTTTTTTTTTT>
##$WBST= 1024
##$WBSW= 4
##$XGAIN= (0..3)
0 0 0 0 
##$XL= 0
##$YL= 0
##$YMAX_a= 121463
##$YMIN_a= -179607
##$ZGOPTNS= <>
##$ZL1= 120
##$ZL2= 120
##$ZL3= 120
##$ZL4= 120
##$ABSF1= 10
##$ABSF2= 0
##$ABSG= 5
##$ABSL= 3
##$ALPHA= 0
##$AQORDER= 0
##$ASSFAC= 0
##$ASSFACI= 0
##$ASSFACX= 0
##$ASSWID= 0
##$AUNMP= <proc_1d>
##$AZFE= 0.1
##$AZFW= 0.1
##$BCFW= 1
##$BC_mod= 2
##$BYTORDP= 1
##$COROFFS= 0
##$CY= 11.3945322036743
##$DATMOD= 1
##$DC= 2
##$DFILT= <>
##$DTYPP= 0
##$F1P= 2.36226072786647
##$F2P= -0.459571619588291
##$FCOR= 0.5
##$FTSIZE= 0
##$FT_mod= 4
##$GAMMA= 1
##$GB= 0.15
##$INTBC= 1
##$INTSCL= 1
##$ISEN= 128
##$LB= 0.24
##$LEV0= 0
##$LPBIN= 0
##$MAXI= 10000
##$MC2= 0
##$MEAN= 0
##$ME_mod= 0
##$MI= 1.114404
##$NCOEF= 0
##$NC_proc= 0
##$NLEV= 6
##$NOISF1= 3.799351
##$NOISF2= 2.8
##$NSP= 1
##$NTH_PI= 0
##$NZP= 0
##$OFFSET= 15.70392
##$PC= 1
##$PHC0= -13354.51
##$PHC1= 10.60099
##$PH_mod= 1
##$PKNL= yes
##$PPARMOD= 0
##$PSCAL= 0
##$PSIGN= 0
##$REVERSE= no
##$SF= 200.130013532006
##$SI= 16384
##$SIGF1= 3
##$SIGF2= 2
##$SINO= 400
##$SIOLD= 16384
##$SREGLST= <1H.CDCl3>
##$SSB= 0
##$STSI= 0
##$STSR= 0
##$SW_p= 3612.71676300578
##$SYMM= 0
##$S_DEV= 0
##$TDeff= 0
##$TDoff= 0
##$TI= <>
##$TILT= no
##$TM1= 0
##$TM2= 0
##$TOPLEV= 0
##$USERP1= <user>
##$USERP2= <user>
##$USERP3= <user>
##$USERP4= <user>
##$USERP5= <user>
##$WDW= 1
##$XDIM= 8192
##$YMAX_p= 0
##$YMIN_p= 0
$$ End of Bruker specific parameters
$$ ---------------------------------
##NTUPLES= NMR FID
##VAR_NAME=  TIME,          FID/REAL,        FID/IMAG
##SYMBOL=    X,             R,               I
##VAR_TYPE=  INDEPENDENT,   DEPENDENT,       DEPENDENT
##VAR_FORM=  AFFN,          ASDF,            ASDF
##VAR_DIM=   8192,          8192,            8192
##UNITS=     SECONDS,       ARBITRARY UNITS, ARBITRARY UNITS
##FACTOR=    0.0002496,     1,               1
##FIRST=     0,             0,               0
##LAST=      2.0444736,     0,               0
##MIN=       0,             -179607,         0
##MAX=       2.0444736,     121463,          0
$$ Real data points
##PAGE= N=1
##DATA TABLE= (X++(R..R)), XYDATA
$$ [...]
$$ plain form
2285 -708 807 -368 -243 -216 204 -38 -799 1028 -659 -998 1646 -677 -737 1732 -884 0 895 -704
2303 -704 666 200 167 642 -498 700 237 -639 1474 -116 -650 1092 -312 -45 531 -696 448
2320 448 -425 -141 590 -1198 389 278 -1372 1142 167 -992 1193 -262 -322 771 -115 312 78 435
2338 435 439 -792 857 145 -1525 1102 -601 -1580 1083 -732 -1201 522 -1109 -556 -47 -510 109 -693
2356 -693 390 203 -832 929 -537 -583 1606 -537 187 1358 -892 386 772 -577 713 -69 -428
2373 -428 329 -803 259 -294 -783 596 -926 -103 792 -977 509 236 -930 1096 8 55 1337
2390 1337 -629 622 857 -488 1092 -60 -139 845 -444 406 215 -754 470 -784 -190 947 -1267
2407 -1267 195 171 -1041 1176 -96 -536 990 -385 298 921 -312 578 89 175 1140 -269 805
$$ packed form
2285g08J515j175J25K7M20k42p61J827j687l39K644k323o0K469k616Q84Q95j599
2303g04J370m66l3M75j140J198m63q76K113j590n34J742j404K67N76j227J144
2320D48q73K84P31j788J587j11j650K514r75j159K185j455o0J093q86M27k34L57
2338D35Mj231J649p12j670K627j703r79K663j815m69J723j631N53N09m63O19q02
2356f93J083j87j035J761j466m6K189k143P24J171k250J278L86j349J290p82l59
2373d28P57j132J062n53m89J379j522Q23Q95j769J486k73j166K026j088M7J282
2390A337j966J251K35j345J580j152p9R84j289Q50j91r69J224j254N94J137k214
2407a267J462k4j212K217j272m40J526j375O83O23j233Q90m89Q6R65j409J074
$$ plain form
2424 805 264 -831 839 -443 -677 1060 -1082 -488 304 -1556 136 -175 -1053 206 -954 -180 496
2441 496 -658 455 -234 -708 1036 -268 426 679 -1034 760 323 -485 961 -872 -538 520 -618
2458 -618 419 -262 -837 460 -641 -66 762 -904 318 -130 -435 1019 -403 22 1014 -640 1074
2475 1074 585 -323 1278 -38 -200 1078 -199 406 352 -494 242 -427 -79 529 -1159 13 -98 -950
2493 -950 1020 -509 -623 581 -813 330 1100 -466 500 215 150 1276 141 560 133 -604 1077
2510 1077 -310 -135 959 -1330 -54 789 -1069 478 -448 -1232 44 -605 -38 227 -702 430 -629
2527 -629 -508 939 -660 189 533 -845 594 576 -483 524 -642 -187 398 -578 720 -511 -952
2544 -952 541 -897 12 785 -1233 -11 49 -610 788 -287 -286 254 -276 1060 144 -350 1202 -856
$$ packed form
2424H05n41j095J670j282k34J737k142N94P92j860J692l11q78J259j160P74O76
2441D96j154J113o89m74J744j304O94K53j713J794m37q08J446j833L34J058j138
2458f18J037o81n75J297j101N75Q28j666J222m48l05J454j422M25R92j654J714
2475A074m89r08J601j316j62J278j277O05n4q46P36o69L48O08j688J172j11q52
2493i50J970j529j14J204j394J143P70j566R66k85o5J126j135M19m27p37J681
2510A077j387J75J094k289J276Q43j858J547r26p84J276o49N67K65r29J132j059
2527f29J21J447j599Q49L44j378J439j8j059J007j166M55N85r76J298j231m41
2544i52J493j438R09P73k018J222O0o59J398j075JN40n30J336r16m94J552k058
$$ plain form
2562 -856 379 1503 -684 447 680 -850 493 316 -70 171 -483 340 -408 -214 1005 -841 -162
2579 -162 1009 -1098 378 1003 -877 529 235 -359 763 79 603 -14 -71 1009 -583 333 1056 -1452
2597 -1452 354 792 -1083 511 6 -1121 317 -219 -277 -202 -455 398 -787 -45 1001 -1180 223
2614 223 817 -1083 581 431 -792 121 -232 83 63 -368 571 -844 -307 795 -1450 -45 1016 -1446
2632 -1446 112 514 -1052 358 101 -390 -10 57 511 -712 16 1003 -1335 405 1268 -1384 526
2649 526 710 -1071 719 774 -480 -57 219 208 -231 372 800 -1203 615 1007 -1439 844 828 -1211
2667 -1211 885 346 -732 533 320 15 -190 231 435 -923 569 856 -1175 612 763 -1295 868
2684 868 462 -770 406 171 58 89 74 453 -822 129 580 -1542 471 780 -1265 571 381 -1025
$$ packed form
2562h56J235J124k187J131K33j530J343j77l86K41o54Q23p48J94J219j846O79
2579a62J171k107J476O25j880J406k94n94J122o84N24o17n7J080j592R16P23k508
2597a452J806M38j875J594n05j127J438n36n8P5k53Q53j185P42J046k181J403
2614B23N94j900J664j50j223R13l53L15k0m31R39j415N37J102k245J405J061k462
2632a446J558M02j566J410k57m91L80O7M54j223P28R87k338J740Q63k652J910
2649E26J84j781J790N5j254M23K76j1m39O03M28k003J818L92k446K283j6k039
2667a211K096n39j078J265k13l05k05M21K04j358J492K87k031J787J51k058K163
2684H68m06j232J176k35j13L1j5L79j275R51M51k122K013L09k045J836j90j406
$$ plain form
2702 -1025 108 154 -228 -113 90 498 -850 54 650 -1529 599 812 -1373 700 622 -1303 537 196
2720 196 -496 -59 166 22 -885 502 409 -1456 592 640 -1632 785 436 -1322 628 235 -739 414
2738 414 241 -117 -179 577 447 -948 786 641 -1333 1068 443 -1092 1058 137 -661 680 20 -210
2756 -210 21 71 426 -787 443 660 -1079 886 451 -872 1062 226 -623 748 -59 174 64 48
2774 48 798 -676 335 575 -1153 556 633 -1013 696 22 -944 338 -202 -272 -232 -75 173 -675 61
2793 61 406 -1102 726 729 -1079 1180 318 -918 731 -98 -476 366 -63 -204 -617 186 234 -973 557
2812 557 62 -1368 967 -93 -929 739 -212 -660 449 -301 -27 149 -9 324 -452 627 338 -732
2830 -732 1005 258 -618 897 -224 -529 635 -290 106 140 -213 344 -458 -60 135 -591 798 192 -586
$$ packed form
2702a025J133M6l82J15K03M08j348R04N96k179K128K13k185K073p8j925J840l41
2720A96o92M37K25j44r07J387r3j865K048M8k272K417l49j758J950l93r74J153
2738D14j73l58o2P56j30j395J734j45j974K401o25j535K150r21p98J341o60k30
2756b10K31N0L55j213J230K17j739J965m35j323J934q36q49J371q07K33j10j6
2774D8P50j474J011K40j728J709P7j646J709o74r66J282n40p0M0J57K48q48P36
2793F1L45j508J828Lj808K259q62j236J649q29l78Q42m29j41m13Q03M8j207J530
2812E57m95j430K335j060q36J668r51m48J109p50K74J76j58L33p76J079k89j070
2830g32J737p47q76J515j121l05J164r25L96L4l53N57q02L98J95p26J389o06p78
$$ plain form
2849 -586 709 -178 -383 751 -219 235 196 -48 701 -245 343 651 -588 713 195 -715 622 -127 -714
2868 -714 594 -213 -157 43 -346 277 -693 10 170 -1022 441 362 -819 675 -129 -649 771 -270
2886 -270 -79 464 -285 339 -11 -123 222 -567 203 -167 -608 649 -403 -773 400 -703 -312 366 -704
2905 -704 254 53 -302 401 -396 247 310 -573 443 61 -131 617 -655 100 555 -489 503 27 -290
2924 -290 510 -419 -165 568 -690 301 100 -417 471 -190 -50 481 -347 393 269 -199 531 -247 189 639
2944 639 -457 643 330 -562 675 -7 -48 532 -307 157 175 -381 169 -323 -260 242 -599 434 -12 -589
2964 -589 672 -327 -534 545 -488 20 284 -404 432 14 -201 281 -555 -16 121 -521 387 -395 -293
2983 -293 514 -683 0 27 -879 416 -116 -506 269 -384 -49 147 -423 452 32 -438 369 -328 115 432
$$ packed form
2849e86J295q87k05J134r70M54l9k44P49r46N88L08j239J301n18r10J337p49n87
2868g14J308q07N6K00l89O23r70P03J60j192J463p9j181J494q04n20J420j041
2886b70J91N43p49O24l50j12L45p89P70l70m41J257j052l70J173j103L91O78j070
2905g04R58k01l55P03p97O43O3q83J016l82j92P48j272P55M55j044R92m76l17
2924b90Q00r29K54P33j258R91k01n17Q88o61J40N31q28P40j24m68P30p78M36M50
2944F39j096J100l13q92J237o82m1N80q39M64J8n56N50m92O3N02q41J033m46n77
2964e89J261r99k07J079j033N08K64o88Q36m18k15M82q36N39J37o42R08p82J02
2983b93Q07j197O83K7r06J295n32l90P75o53L35J96n70Q75m20m70Q07o97M43L17
$$ plain form
3003 432 -402 486 27 -435 683 -421 85 266 -721 262 -51 -430 556 -317 -182 406 -445 415 24
3022 24 -397 361 -121 241 489 -531 315 25 -223 794 -170 -50 623 -565 201 420 -171 361 -133
3041 -133 -273 394 -220 400 -295 -453 802 -428 -272 498 -536 166 258 -412 271 -182 -109 171 -540 179
3061 179 40 -498 571 -378 -510 421 -337 127 129 -682 177 -136 -103 221 -488 75 100 -389 559 -503 -577
3082 -577 610 -580 12 550 -477 80 17 -105 88 -246 247 3 -493 538 -193 -222 926 -648 -82
3101 -82 667 -626 32 445 -274 32 -156 231 0 -359 614 -133 -171 870 -509 -162 710 -714 85
3120 85 612 -240 177 156 126 269 -42 489 -277 -167 830 -597 -16 578 -814 72 445 -564 66 112
3140 112 -294 13 -105 259 -321 -265 711 -517 -223 838 -661 6 681 -593 130 307 -176 100 -183
$$ packed form
3003D32q34Q88m59m62J118j104N06J81r87R83l13l79R86q73J35N88q51Q60l91
3022B4m21P58m82L62K48j020Q46k90k48J017r64J20O73j188P66K19n91N32m94
3041a33j40O67o14O20o95j58J255j230J56P70j034P02R2o70O83m53P3K80p11P19
3061A79j39n38J069r49j32R31p58M64Kq11Q59l13L3L24p09N63K5m89R48j062p4
3082e77J187j190N92N38j027N57o3j22J93l34M93k44m96J031p31k9J148j574N66
3101h2P49j293O58M13p19L06j88L87k31l59R73p47l8J041j379L47Q72j424P99
3120H5N27q52M17k1l0J43l11N31p66J10R97j427N81N94j392Q86L73j009O30M6
3140A12m06L07j18L64n80N6R76j228K94J061j499O67O75j274P23J77m83K76k83
$$ plain form
3159 -183 59 -328 -269 730 -762 -386 676 -840 -118 439 -884 -61 191 -333 -229 -177 72 -169 -40
3178 -40 776 -509 67 907 -716 88 1035 -790 72 598 -348 118 28 -114 -291 17 444 -718 -118
3197 -118 704 -818 132 927 -740 229 476 -414 370 200 149 31 98 529 -259 -50 896 -541 54 646
3217 646 -851 261 527 -576 116 -3 -219 122 -57 274 -440 -282 659 -708 -9 849 -873 273
3235 273 665 -589 430 395 -288 46 94 197 -380 -106 487 -800 -310 565 -1117 61 451 -879 60
3254 60 265 -549 -79 105 113 -205 -21 472 -658 115 614 -955 257 778 -913 333 390 -483 314 79
3274 79 -291 -17 -105 397 -626 74 509 -864 88 524 -757 255 280 -535 454 14 -23 22 256 605
3294 605 -45 289 659 -694 358 657 -525 344 284 -590 487 112 -248 52 -109 206 -303 -33 266
$$ packed form
3159a83K42l87N9R99j492L76J062j516P22N57j323Q23K52n24J04N2K49k41J29
3178d0Q16j285N76Q40j623Q04R47j825Q62N26r46M66r0j42j77L08M27j162O00
3197a18Q22j522R50P95j667R69K47q90P84j70n1j18O7M31p88K09R46j437N95N92
3217F46j497J112K66j103O92j19k16L41j79L31p14J58R41j367O99Q58j722J146
3235B73L92j254J019l5o83L34M8J03n77K74N93j287M90Q75j682J178L90j330R39
3254F0K05q14M70J84Ql18J84M93j130P73M99j569J212N21j691J246N7q73P97k35
3274G9l70K74q8N02j023P00M35j373R52M36j281J012K5q15R89m40l7M5K34L49
3294F05o50L34L70j353J052K99j182Q69o0q74J077l75l60L00j61L15n09K70K99
$$ plain form
3313 266 -691 -29 501 -772 305 434 -570 417 321 -145 173 -80 239 -90 -1 411 -531 107 472 -924
3333 -924 324 213 -825 338 67 -770 228 -35 -133 -125 -110 281 -524 228 409 -921 410 297 -686 483
3353 483 158 -379 520 -170 -69 79 -76 103 -495 47 334 -701 110 303 -657 370 -16 -340 463
3372 463 -72 -16 175 -5 486 75 109 463 -284 152 384 -593 511 219 -380 477 -168 46 182 -288
3392 -288 177 -18 -33 552 -397 34 528 -635 376 252 -280 426 -36 -94 303 -16 174 -59 -192 415
3412 415 -290 45 234 -612 399 149 -577 393 -343 -438 266 -415 -134 -43 -368 147 -327 -92 279 -460
3432 -460 208 235 -534 535 -125 -346 521 -318 66 186 -368 256 -173 -215 201 -526 -14 -18 -486 239 -230
3453 -230 -123 333 -438 94 72 -198 573 -16 -97 409 -296 136 281 -332 402 -45 -177 596 -196 0 198
$$ packed form
3313B66r57O62N30j273J077J29j004R87r6m66L18k53L19l29Q9M12r42O38L65j396
3333i24J248j11j038J163k71q37R98k63r8QJ5L91q05P52J81j330J331j13r83J169
3353D83l25n37Q99o90J01J48j55J79n98N42K87j035Q11J93r60J027l86l24Q03
3372D63n35N6J91j80M91m11L4L54p47M36K32r77J104k92n99Q57o45K14J36m70
3392b88M65j95j5N85r49M31M94j163J011j24n32P06m62n8L97l19J90k33j33O07
3412D15p05L35J89q46J011k50p26R70p36r5P04o81K81R1l25N15m74K35L71p39
3432d60O68K7p69J069o60k21Q67q39L84J20n54O24m29m2M16p27N12mm68P25m69
3453b30J07M56p71N32k2k70P71n89q1N06p05M32J45o13P34m47j32P73p92J96J98
$$ plain form
3474 198 -259 417 -1 -217 798 -179 4 462 -589 406 68 -284 316 -63 -39 558 -120 311 -2 -148
3494 -148 389 -261 8 259 -516 297 -33 -329 505 -208 -22 311 -342 23 290 -416 153 -295 -105 300
3514 300 -399 87 -147 -512 347 -241 -255 176 -387 120 6 -518 432 -315 -209 319 -333 189 150 -390 366
3535 366 -83 -163 384 -322 150 30 -314 243 -308 -136 351 -343 20 231 -321 488 18 -352 421 -235
3555 -235 29 355 -178 269 -123 9 534 -445 175 277 -364 481 101 -88 617 -324 48 399 -307 122
3575 122 157 -268 260 -242 279 113 -451 530 33 -264 562 -279 -123 480 -364 180 205 -117 324 -231 28
3596 28 225 -476 107 58 -535 395 -289 -312 359 -497 79 32 -258 153 -254 -30 193 -556 334 -47 -452
3617 -452 477 -335 -239 629 -369 -4 181 -351 263 -264 -21 171 -558 296 50 -670 451 -350 -549 476
$$ packed form
3474A98m57O76m18k16J015r77J83M58j051R95l38l52O00l79K4N97o78M31l13j46
3494a48N37o50K69K51p75Q13l30k96Q34p13J86L33o53L65K67p06N69m48J90M05
3514C00o99M86k34l65Q59n88j4M31n63N07j14n24R50p47J06N28o52N22l9n40P56
3535C66m49q0N47p06M72j20l44N57n51J72M87o94L63K11n52Q09m70l70P73o56
3555b35K64L26n33M47l92J32N25r79O20J02o41Q45l80j89P05r41L72L51p06M29
3575A22L5m25N28n02N21j66n64R81m97k97Q26q41J56O03q44N44K5l22M41n55K59
3596B8J97p01N83m9n93R30o84k3O71q56N76m7k90M11m07K24K23p49Q90l81m05
3617d52R29q12R6Q68r98L65J85n32O14n27K43J92p29Q54k46p20J121q01j99J025
$$ plain form
3637 476 -306 -131 382 -440 130 92 -33 246 -158 394 263 -434 459 36 -213 748 -119 -36 518 -357 0
3658 0 47 -78 76 -190 260 82 -351 516 -150 -266 697 -194 48 521 -292 5 375 -48 230 -152 157
3679 157 75 -368 707 -85 -407 680 -427 -177 642 -600 -116 11 -300 33 -92 26 -111 -281 535
3698 535 -114 -587 529 -403 -315 752 -378 -68 462 -212 250 33 -48 85 -470 314 -238 -456 743
3717 743 -530 -521 624 -604 -5 430 -557 -108 188 42 140 -61 282 39 -370 675 -293 -110 939
3736 939 -381 -255 622 -339 88 102 -128 61 25 234 -58 -449 364 -411 -274 671 -544 -71 737 -445
3756 -445 135 519 -282 98 77 136 196 -70 640 -165 -228 748 -318 -254 409 -641 -56 223 -303 -140 -25
3777 -25 -81 -99 -259 397 -245 -233 524 -546 -36 871 -590 47 538 -341 113 306 -5 -54 -265 324 -207
$$ packed form
3637D76p82J75N13q22N70l8j25K79m04N52j31o97Q93m23k49R61q67Q3N54q75L57
3658@M7j25J54k66M50j78m33Q67o66j16R63q91K42M73q13K97L70m23K78l82L09
3679A57q2m43J075p92l22J087j107K50Q19j242M84J27l11L33j25J18j37j70Q16
3698E35o49m73J116r32Q8J067j130L10N30o74M62k17q1J33n55P84n52k18J199
3717G43j273RJ145j228N99M35r87M49K96j46R8k01L43k43m09J045r68J83J049
3736I39j320J26Q77r61M27J4k30J89l6K09k92l91Q13p75J37R45j215M73Q08j182
3756d45N80L84q01L80k1N9O0k66P10q05o3R76j066O4O63j050N85K79n26J63J15
3777b5n6j8j60O56o42J2P57j070N10R07j461O37M91q79M54J93l11m9k11N89n31
$$ plain form
3798 -207 -302 372 -692 -359 415 -492 80 219 -703 11 78 -28 103 -47 324 -228 -178 654 -255 -193 694
3819 694 -387 63 545 -462 236 42 -270 320 -68 155 -98 -313 310 -394 -107 673 -519 -127 381
3838 381 -421 472 270 -108 380 -72 201 259 -60 396 -129 -108 624 -447 -135 513 -417 114 368 -299
3858 -299 -34 -279 -49 126 -176 361 -175 -261 538 -571 -142 573 -398 147 326 -305 248 -21 -94 -76 -249
3879 -249 252 -278 -226 362 -370 -266 292 -751 53 -3 -764 166 -283 -139 2 -228 211 36 -159 601
3899 601 -282 -167 396 -315 201 584 -259 271 -104 -145 246 -126 194 -27 -229 372 -240 -264 448 -453 -26
3920 -26 414 -334 292 104 -317 461 -114 190 157 -405 312 -139 -119 439 -332 -79 318 -560 120 185 -280
3941 -280 246 -62 2 296 -357 70 19 -253 534 -316 151 326 -368 301 -3 -328 187 -116 -135 58 -206
$$ packed form
3798b07r5O74j064L33P74r07N72J39r22P14O7j06J31j50L71n52N0Q32r09O2Q87
3819F94j081M50M82j007O98j94l12N90l88K23k53k15O23p04K87P80j192L92N08
3838C81q02Q93k02l78M88m52K73N8l19M56n25K1P32j071L12O48r30N31K54o67
3858b99K65k45K30J75l02N37n36q6P99j109M29P15r71N45J79o31N53k69p3J8j73
3879b49N01n30N2N88p32J04N58j043Q04n6p61R30m49J44J41k30M39j75j95P60
3899F01q83J15N63p11N16L83q43N30l75m1L91l72L20k21k02O01o12k4P12r01M27
3920b6M40p48O26j88m21P78n75L04l3n62P17m51K0N58p71K53L97q78O80O5m65
3941b80N26l08O4K94o53M27n1k72P87q50M67J75o94O69l04l25N15l03j9J93k64
$$ plain form
3962 -206 211 120 -320 213 -413 -190 374 -544 107 -112 -439 225 -129 -142 150 -434 95 -21 -473 327 -202
3983 -202 -118 483 -335 79 67 -328 359 60 -24 120 -350 97 107 -402 460 -12 -136 448 -478 0 190
4004 190 -118 323 -43 14 287 -329 101 -36 -436 376 -14 -28 469 -192 27 276 -348 388 -8 -260 277
4025 277 -223 53 192 -236 139 46 -157 256 -401 40 212 -468 236 112 -70 336 -271 34 268 -376
4045 -376 38 23 -224 244 -334 -117 234 -386 346 -78 -448 137 -119 -132 202 -390 -5 -2 -342 290 -403
4066 -403 -178 183 -339 12 -110 -554 250 -121 -150 165 -316 135 165 -179 166 -294 37 349 -273 336 93
4087 93 -294 604 -215 -217 466 -238 -55 -43 -185 150 34 -32 246 -251 109 242 -385 432 36 -185 497 -166
4109 -166 108 383 -138 227 133 -65 293 -253 126 200 -243 387 -79 -318 426 -263 -313 151 -348 185 33
$$ packed form
3962b06M17r1m40N33o26K23N64r18O51k19l27O64l54j3K92n84N29j16m52Q00n29
3983b02Q4O01q18M14j2l95O87k99q4J44m70M47J0n09Q62m72j24N84r26M78J90
4004A90l08M41l66N7K73o16M30j37m00Q12l90j4M97o61K19K49o24P36l96k52N37
4025B77n00K76J39m28L75r3k03M13o57M41J72o80P04j24j82M06o07L05K34o44
4045c76M14j5k47M68n78K17L51o20P32m24l70N85k56j3L34n92L85Ll40O32o93
4066d03K25L61n22L51j22m44Q04l71k9L15m81M51L0l44L45m60L31L12o22O09k43
4087I3l87Q98q19kO83p04J83J2j42L35j16o6K78m97L60J33o27Q17l96k21O82o63
4109a66K74K75n21L65r4j98L58n46L79P4m43O30m66k39P44o89n0M64m99N33j52
$$ plain form
4130 33 -166 219 -303 92 198 -320 250 174 -245 492 -24 -248 156 -280 243 255 -100 242 -494 -25 43
4151 43 -570 340 134 -586 90 -322 -303 163 -263 -33 54 -240 26 -226 177 221 -267 508 90 -537 314
4172 314 36 -109 333 -264 -171 139 -195 113 -214 62 39 -513 466 15 -409 499 -177 -193 438 -95 69
4193 69 362 -115 256 -87 -13 133 -208 418 291 -376 527 -53 -333 507 -302 -191 344 -115 53 -262 70
4214 70 68 -291 210 35 -363 517 -130 -417 588 -150 -141 474 -90 62 193 -80 158 -381 275 7 -494
4235 -494 476 -51 -455 470 -182 -435 275 -238 -52 -4 -169 130 -275 65 -142 -403 504 -119 -621 515
4255 515 -147 -278 496 -302 -38 371 -155 -97 -340 84 -9 -217 533 -94 -571 518 -3 -159 481 -190
4275 -190 108 281 64 -5 369 319 364 -177 349 37 -169 462 -91 -179 531 -323 -222 333 -280 162 -85
$$ packed form
4130C3j99L85n22L95J06n18N70p6m19P37n16k24M04m36N23J2l55L42p36M69O8
4151D3o13R10k06p20O76m12J9M66m26K30Q7k94K66k52M03M4m88P75m18o27Q51
4172C14k78j45M42n97R3L10l34L08l27K76k3n52R79m51m24R08o76j6O31n33J64
4193F9K93m77L71l43P4J46l41O26j27o67R03n80k80Q40q09J11N35m59J68l15L32
4214G0kl59N01j75l98Q80o47k87J005p38RO15n64J52J31k73K38n39O56k68n01
4235d94R70n27m04R25o52k53P10n13J86M8j65K99m05L40k07k61R07o23n02J136
4255E15o62j31P74p98K64M09n26N8k43M24r3k08P50o27m77J089n21j56O40o71
4275a90K98J73k17o9L74n0M5n41N26l12k06O31n53q8P10q54J01N55o13M42k47
$$ plain form
4296 -85 23 35 -500 262 -97 -211 494 -69 -316 665 -236 85 461 -22 -40 81 -10 -87 -158 380 -30 -530
4318 -530 430 -350 -132 585 -532 -474 440 -273 -132 119 -239 208 -82 135 0 -331 543 -177 -119 640
4338 640 -347 -296 368 -390 2 190 -340 224 -68 -79 216 -346 274 -6 -323 549 -234 -129 194 -234 11
4359 11 155 -201 110 32 92 -28 -35 325 14 -310 563 -257 -219 665 -205 91 273 -80 114 -13 -65 197
4381 197 -270 214 -60 -426 600 -193 -196 471 -389 -129 441 -203 299 77 84 312 -195 329 75 -233 251
4402 251 -149 -194 423 -280 -87 265 -272 167 44 -202 -14 -224 54 -11 -419 206 -305 -357 446 -283 -160
4423 -160 321 -449 83 57 -165 200 -97 66 143 -151 268 -202 -298 256 -414 -59 312 -408 -39 15 -309
4444 -309 336 -65 -122 -35 -189 45 -41 -275 341 -269 -95 419 -127 99 200 -30 210 -129 -10 318 -80
$$ packed form
4296h5J08J2n35P62l59j14P05n63k47R81r01L21L76m83j8J21r1p7p1N38m10n00
4318e30R60p80K18P17j117N8R14p13J41K51l58M47k90K17j35l31Q74p20N8P59
4338F40r87N1O64p58L92J88n30N64k92j1K95n62O20k80l17Q72p83J05L23m28K45
4359A1J44l56L11p8O0j20pL60l11l24Q73q20L8Q84q70K96J82l53J94j27n2K62
4381A97m67M84k74l66J026p93lO67q60K60N70o44N02k22PK28n07N24k54l08M84
4402B51m00m5O17p03J93L52n37M39j23k46J88k10K78o5m08O25n11n2Q03p29J23
4423a60M81p70N32k6k22L65k97J63P7k94M19m70r6N54o70L55L71p20L69N4l24
4444c09O45m01n7Q7j54K34q6k34O16o10J74N14n46K26J01k30K40l39J19L28l98
$$ plain form
4465 -80 211 -55 -103 451 -254 -265 368 -256 6 283 -282 140 -123 -30 254 -333 10 -56 -268 231 -61 -107
4487 -107 377 -341 -17 322 -303 254 -47 -191 134 -219 4 -94 -155 285 -128 -255 509 -357 -129 275 -346
4508 -346 197 19 -396 238 -331 101 139 -287 394 -70 -153 11 -340 31 85 -392 166 4 -196 19 -76
4529 -76 47 278 -244 191 -105 -265 326 -166 -224 295 -356 139 130 -153 435 -72 59 222 -112 169 51
4550 51 -153 271 -143 -4 276 -46 123 97 -102 104 -216 -20 120 -294 149 97 -329 240 -80 -82 340 -156
4572 -156 167 113 -283 310 -17 -74 343 -184 96 21 -302 231 -71 -51 224 -186 24 121 -312 -42 48 -322
4594 -322 300 -263 -67 134 -166 204 -154 -208 466 -396 -10 459 -198 269 -5 -247 233 -75 -79 -30 -264
4615 -264 217 -195 -88 407 -298 130 288 -457 114 -53 -208 301 -356 -63 237 -285 227 24 -130 457
$$ packed form
4465h0K91k66m8N54p05j1O33o24K62K77n65M22k63R3K84n87L43o6k12M99k92m6
4487a07M84p18L24L39o25N57l01j44L25l53K23r8o1M40m13j27P64q66K28M04o21
4508c46N43j78m15O34n69M32L8m26O81m64q3J64l51L71N4m77N58j62k00K15r5
4529g6J23K31n22M35k96j60N91m92n8N19o51M95rk83N88n07J31J63l34K81j18
4550E1k04M24m14J39K80l22J69k6j99K06l20J96J40m14M43n2m26N69l20kM22m96
4572a56L23n4l96N93l27n7M17n27K80p5l23N33l02K0K75m10K10R7m33K70R0l70
4594c22O22n63J96K01l00L70l58n4O74q62L86M69o57M67k74k42M80l08mM9k34
4615b64M81m12J07M95p05M28J58p45N71j67j55N09o57K93L00n22N12k03j54N87
$$ plain form
4635 457 -243 53 433 -281 353 298 -291 199 25 -109 251 -41 180 147 -203 429 -414 97 333 -242 169
4656 169 150 -307 201 9 -19 335 33 26 -69 -240 351 -31 89 493 -423 229 98 -412 355 -53 -327 213
4678 213 -213 84 -105 -249 118 -213 -77 290 -368 208 245 -545 272 -62 -219 270 -249 -136 128 -164
4698 -164 211 -225 -11 123 -430 108 205 -319 192 13 -396 464 -121 -161 302 -177 283 31 36 313 -278
4719 -278 241 246 -383 233 249 -370 580 130 -196 154 -198 88 14 -95 348 -380 -9 282 -561 468 196
4740 196 -641 359 0 -25 124 -127 144 181 -44 159 -232 156 317 -392 380 75 -319 389 94 -288
4760 -288 354 -126 21 -16 -51 244 -143 -65 237 -361 358 338 -318 430 -50 -282 210 -193 -172 196 -423 79
4782 79 -283 18 29 -360 173 27 -556 379 -16 -318 387 -313 -214 195 -254 183 40 -106 281 -441 301
$$ packed form
4635D57p00K96L80p14O34n5n89M90j74j34L60k92K21l3l50O32q43N11K36n75M11
4656A69j9m57N08j92k8L54l02pr5j71N91l82J20M04r16O52j31n10P67m08k74N40
4678B13m26K97j89j44L67l31J36L67o58N76L7p90Q17l34j57M89n19J13K64k92
4698a64L75m36K14J34n53N38R7n24N11j79m09Q60n85m0M63m79M60k52NK77n91
4719b78N19No29O16J6o19R50m50l26L50l52K86p4j09M43p28L71K91q43J029k72
4740A96q37J000l59k5J49k51K71L7k25K03l91L88J61p09P72l05l94P08k95l82
4760b88O42m80J47l7l5K95l87P8L02n98P19k0o56P48m80k32M92m03K1L68o19N02
4782G9l62L01J1l89N33j46n83R35l95l02P05p00R9M09m49M37j43j46L87p22P42
$$ plain form
4803 301 289 -313 521 -65 -333 386 -266 -169 364 -263 -6 -93 -208 171 -260 308 278 -326 509 -21 -168
4824 -168 394 -19 -147 260 -47 142 291 -210 250 -111 121 271 -241 394 -25 -362 497 -23 -413 407
4844 407 -136 20 276 -97 193 -49 20 130 -251 317 167 -363 528 -159 -215 323 -376 -25 128 -304 -68
4865 -68 -144 183 90 -279 331 -294 -366 633 -64 -458 432 -242 -187 301 -56 -14 -263 49 -19 -406 117 25 -461
4888 -461 301 -205 -302 407 -127 -123 192 -107 -14 107 169 -15 -55 256 30 -240 346 -38 -366 575 -18 -105
4910 -105 403 -79 -48 46 -81 108 -37 1 123 -156 327 2 -135 365 -185 -120 482 -244 111 249 -61
4931 -61 313 -79 123 51 -225 281 149 -433 461 -340 -252 319 -286 55 123 -255 165 -210 -161 31 -379 172
4953 172 -73 -356 262 -199 -161 295 -233 8 194 -235 172 -178 56 75 -378 184 -104 -278 371 -220 -153
$$ packed form
4803C01j2o02Q34n86k68P19o52R7N33o27K57q7j15L79m31N68l0o04Q35n30j47
4824a68N62m13j28M07l07J89J49n01M60l61K32J50n12O35m19l37Q59n20l90Q20
4844D07n43J56K56l73K90k42O9J10l81N68j50n30Q91o87n6N38o99L51J53m32K36
4865f8p6L27r3l69O10o25p2R99o97l94Q90o74N5M88l57M2k49L12o8l87N23r2m86
4888d61P62n06r7P09n34ML15k99R3J21O2j84m0L11k26k70N86l84l28R41n93q7
4910a05N08m82L1R4j27J89j45L8J22k79M83l25j37N00n50O5O02p26L55J38l10
4931f1L74l92K02p2k76N06j32n82Q94q01Q8N71o05L41O8l78M20l75M9J92m10N51
4953A72k45k83O18m61L8M56n28K41J86m29M07l50K34J9m53N62k88j74O49n91O7
$$ plain form
4974 -153 250 -419 92 309 -324 224 -60 91 228 -72 153 1 -229 338 -48 -84 340 -247 -67 278
4994 278 -397 150 0 -160 164 -192 -88 119 -334 315 37 -420 254 -187 225 367 -196 311 -147 -28
5014 -28 125 -43 183 125 -86 319 144 -184 283 -115 69 466 -266 99 174 -142 174 -288 -111 7 -287
5035 -287 250 39 -230 259 -217 -40 204 -320 -17 51 -373 110 -17 -79 115 -375 127 -138 -186 123 -127
5056 -127 -183 279 -273 -9 161 -233 101 -33 -105 301 -231 64 107 -114 325 -94 -91 483 -148 125 231 -340
5078 -340 254 -91 -338 313 -258 -153 106 -318 379 -10 -241 341 -260 65 301 -342 156 136 -137 266
5098 266 -90 33 287 -268 297 148 -179 257 -196 302 218 -338 289 51 -266 310 -179 -156 207 -145 170
5119 170 -58 -62 396 -104 -39 231 -390 196 23 -217 415 -266 -102 168 -378 215 -77 -439 255 -361 -118
$$ packed form
4974a53M03o69N11K17o33N48k84J51J37l00K25j52k30N67l86l6M24n87J80L45
4994B78o75N47j50j60L24l56J04K07m53O49k78m57O74m41M12J42n63N07m58J19
5014b8J53j68K26n8k11M05j75l28M67l98J84L97p32L65P5l16L16m62J77J18k94
5035b87N37k11k69M89m76J77K44n24L03O8m24M83j27o2J94m90N02k65m8L09k50
5056a27n6M62n52K64J70l94L34j34p2M06n32K95M3k21M39m19LN74o31K73J06n71
5078c40N94l45k47O51n71J05K59m24O97l89k31N82o01L25K36o43M98k0k73M03
5098B66l56J23K54n55N65j49l27M36m53M98q4n56O27k38l17N76m89K3L63l52L15
5119A70k28mM58n00O5K70o21N86j73k40O32o81J64K70n46N93k92l62O94o16K43
$$ plain form
5140 -118 121 -428 33 30 -446 321 -196 -155 142 -187 4 -80 -212 251 -109 31 334 -153 64 205 -279
5161 -279 135 -72 -36 287 -160 47 65 -188 248 59 63 203 -219 86 254 -468 170 134 -47 230 -75 158
5183 158 186 -122 340 -87 -222 262 -197 -84 250 -305 140 231 -213 392 -127 17 38 -123 280 -167 -329
5204 -329 317 -276 11 251 -173 264 29 -224 314 -216 -205 338 -167 162 -68 -110 169 -317 90 90 -487
5225 -487 4 79 -418 146 -106 -331 142 -257 86 112 -168 267 -188 -13 168 -468 200 207 -272 247 10
5246 10 -165 51 -117 153 74 20 212 -149 153 207 -392 60 308 -371 262 6 -182 266 -37 91 97 -140
5268 -140 185 -93 210 225 -384 71 171 -322 96 -93 -299 142 -151 -58 73 -1 216 -330 82 338 -224
5289 -224 377 298 -283 170 44 -335 547 -128 -9 298 -110 28 -91 -88 191 -406 121 126 -393 304 96 -185
$$ packed form
5140a18K39n49M61lm76P67n17M1K97l29J91q4j32M63l60J40L03m87K17J41m84
5161b79M14k07L6L23m47K07J8k53M36j89MJ40m22L05J68p22O38l6j81K77l05K33
5183A58K8l08M62m27j35M84m59J13L34n55M45R1m44O05n19J44K1j61M03m47j62
5204c29O46n93K87K40m24M37k35k53N38n30J1N43n05L29k30m2K79m86M07%n77
5225d87M91P5m97N64k52k25M73l99L43K6k80M35m55J75J81o36O68Pm79N19k37
5246A0j75K16j68K70p9n4J92l61L02N4n99M52K48o79O33k56j88M48l03J28Ok37
5268a40L25k78L03J5o09M55J00m93M18j89k06M41k93R3J31p4K17n46M12K56n62
5289b24O01p9n81M53j26l79Q82o75J19L07m08J38j19LK79n97N27Nn19O97k08k81
$$ plain form
5311 -185 67 -237 -276 91 -67 173 -51 -76 162 -340 69 248 -393 196 126 -268 369 28 -121 422 -156
5332 -156 40 41 5 362 -288 7 83 -347 339 185 -450 391 84 -208 367 -71 -66 58 16 238 -73 225
5354 225 366 -316 279 27 -337 298 -126 -287 265 6 85 31 -80 59 6 187 121 -351 380 227 -73
5375 -73 414 -29 -333 423 -84 137 168 -165 245 -220 -26 199 -432 170 180 -462 213 -205 -304 303 -189
5396 -189 -254 128 -33 -33 -132 -283 111 -201 92 21 -485 250 58 -386 268 -159 -140 364 -90 -133 -20 57 69
5419 69 -138 140 148 -114 280 -124 -182 412 -151 -204 252 -203 -202 84 -261 159 -102 28 204 -292 185 -53
5441 -53 -330 346 -183 -71 256 -315 67 150 -217 268 71 82 130 -208 207 -6 -304 314 51 -210 325
5462 325 -91 99 276 -195 298 80 58 242 -285 192 263 -205 441 -36 -238 237 -206 -84 139 -93 173
$$ packed form
5311a85K52l04l9L67j58K40k24k5K38n02M09J79o41N89p0l94O37l41j49N43n78
5332a56J96Jl6L57o50K95P6m30O86j54o35Q41l07k92N75m38NJ24m2K22l11K98
5354B25J41o82N95k52l64O35m24j61N52k59P9n4j11J39n3J81o6m72P31j53l00
5375g3M87m43l04P56n07K21L1l33M10m65J94K25o31O02J0o42O75m18r9O07m92
5396a89o5L82j61%r9j51L94l12K93p1n06P35j92m44O54m27J9N04m54m3J13P7J2
5419F9k07K78Qk62L94m04n8N94n63n3M56m55JK86l45M20k61J30J76m96M77k38
5441e3k77O76n29J12L27n71L82Q3l67M85j97J1M8l38M15k13k98O18k63k61N35
5462C25m16J90J77m71M93k18k2J84n27M77P1m68O46m77k02M75m43J22K23k32K66
$$ plain form
5483 173 -45 -58 117 -180 247 43 -403 129 -99 -260 140 -368 -280 170 -259 81 -4 -210 82 -230 157
5504 157 158 -262 262 80 -238 348 -13 -18 145 -152 228 66 -156 46 -209 -176 31 -311 52 15 -220 245
5526 245 -218 -159 253 -232 -26 72 -9 75 -112 61 134 -318 15 125 -348 381 -175 -74 203 -199 48 117
5548 117 -106 281 -132 134 297 -151 297 49 -3 329 -4 -230 424 -108 55 284 -135 154 -142 -38
5568 -38 269 -93 96 108 -258 349 -185 -287 308 -339 -111 -1 -301 -11 -217 -259 148 -381 -90 56 -146
5589 -146 114 82 -284 126 -191 -151 105 -126 13 14 -114 346 -119 148 188 -326 333 20 -182 299 -306 -128
5611 -128 90 -316 326 176 -334 184 -111 97 93 -204 232 49 -346 224 -131 -273 368 -395 33 33 -318
5632 -318 166 -271 3 123 -284 170 -53 -266 437 -66 -24 387 -147 248 441 -87 339 226 26 265
$$ packed form
5483A73k18j3J75k97M27k04m46N32k28j61M00n08Q8M50m29L40q5k06K92l12L87
5504A57Jm20N24j82l18N86l61nJ63k97L80j62k22K02k55L3K07l42L63l7k35M65
5526B45m63N9M12m85K06R8q1Q4j87J73P3m52L33J10m73P29n56J01K77m02K47O9
5548A17k23L87m13K66J63m48M48k48n2L32l33k26O54n32J63K29m19K89k96J04
5568c8L07l62J89J2l66O07n34j02N95o47K28J10l00K90k06m2M07n29K91J46k02
5589a46K60l2l66M10l17M0K56k31J39Jj28M60m65K67M0n14O59l13k02M81o05J78
5611a28K18m06O42j50n10N18k95K08mk97M36j83l95N70l55j42O41p63M28%l51
5632c18M84m37K74J20m07M54k23k13P03n03M2M11n34L95J93n28M26j13k00K39
$$ plain form
5652 265 50 222 130 -168 436 -137 -156 198 -292 78 286 -253 144 30 -99 51 -455 191 131 -320 156
5673 156 -162 -201 25 -303 -29 83 -488 -48 -88 -288 -22 -156 -46 145 -202 188 -29 -246 261 -132 -7
5694 -7 227 -126 150 149 -86 137 -78 93 84 -142 277 -17 -156 247 -261 -10 368 -202 -12 160 -387 215
5716 215 -142 -54 107 -233 248 76 -224 318 -50 -66 291 -371 19 271 -162 76 54 44 208 -200 218
5737 218 183 -110 472 -132 190 243 -258 73 48 -361 74 -17 -218 253 -67 46 -40 -207 260 -148 -50 191
5759 191 -173 162 162 -406 41 -29 -209 104 -174 -111 -48 -351 294 -277 -191 332 -253 -107 131 -253 136 5
5781 5 -134 248 -18 133 287 -83 148 -55 -246 314 -240 106 319 -358 135 102 -221 164 -80 155 74
5802 74 -278 135 -130 193 322 -273 -1 173 -377 256 -8 -223 176 154 82 303 -190 131 -4 -163 402
$$ packed form
5652B65k15J72r2k98O04n73j9L54m90L70K08n39L97j14j29J50n06O46o0m51M76
5673A56l18l9K26l28K74J12n71M40m0k00K66j34J10J91l47L90k17k17N07l93J25
5694gK34l53K76jk35K23k15J71rk26M19k94j39M03n08K51L78n70J90J72n47O02
5716B15l57Q8J61l40M81j72l00N42l68j6L57o62L90K52m33K38k2j0J64m08M18
5737B18l5k93N82o04L22N3n01L31k5m09M35r1k01M71l20J13q6j67M67m08R8K41
5759A91l64L35%n68M47p0j80L13k78O3O3l03O45n71Q6N23n85J46K38l84L89j31
5781Ej39L82k66J51J54l70K31k03j91N60n54L46K13o77M93l3l23L85k44K35q1
5802G4l52M13k65L23J29n95K72J74n50O33k64k15L99k2p2K21m93L21j35j59N65
$$ plain form
5823 402 -230 163 461 -337 290 214 -223 225 66 -198 261 17 174 -33 -63 171 -250 36 143 -409 150
5844 150 53 -414 234 -111 -114 87 -228 36 -99 -243 330 -214 -125 169 -320 -92 203 -318 38 42 -226 228
5866 228 -110 56 225 -87 60 -142 -91 168 -302 169 192 -399 284 312 -305 240 -237 -123 17 -131 172
5887 172 -175 -29 248 -290 130 235 -339 253 -99 -358 405 16 -72 165 -363 105 -45 102 183 -268 283
5908 283 385 -243 262 180 -269 268 -72 -41 173 -195 61 -186 -55 95 -177 -19 42 -296 253 -35 -174
5929 -174 146 -247 -108 134 -360 -153 -12 -76 367 -132 119 27 -313 25 125 -418 323 28 -217 166 -157
5950 -157 -20 -149 -35 39 -63 -112 73 -243 123 62 -390 472 -98 -246 157 -184 -119 51 -228 102 -133
5971 -133 85 245 -330 262 108 -360 224 -14 -326 162 -124 -62 75 -210 165 -53 -109 194 -152 26 168
$$ packed form
5823D02o32L93K98p98O27p6m37M48j59k64M59k44J57k07l0K34m21K86J07n52N59
5844A50r7m67O48l45lK01l15K64j35j44N73n44Q9K94m89K28K95n21L56Mk68M54
5866B28l38J66J69l12J47k02N1K59m70M71K3n91O83K8o17N45m77J14J40j48L03
5887A72l47J46K77n38M20J05n74N92l52k59P63l89q8K37n28M68j50J47Q1m51N51
5908B83J02o28N05q2m49N37l40L1K14l68K56k47J31J50k72J58O1l38N49k88j39
5929a74L20l93J39K42m94K07J41o4M43m99K51r2l40L38J00n43P41k95k45L83l23
5950a57J37j29J14P4j02m9J85l16L66o1m52Q62n70j48M03l41O5J70k79L30k35
5971a33K18J60n75N92j54m68N84k38l12M88k86O2J37k85L75k18n6L03l46J78J42
$$ plain form
5992 168 -276 216 237 -213 205 -185 292 381 -157 323 116 -65 193 -205 57 265 -283 256 148 -305 105
6013 105 -50 -193 222 -209 -61 -62 -234 226 -364 -30 80 -373 128 -25 -371 124 -50 -37 288 -214 84
6034 84 63 -179 85 -169 -33 29 -249 91 126 -377 367 156 -97 316 -118 315 206 -175 204 -112 -35 295
6056 295 -325 132 139 -243 294 -76 -142 197 -209 100 46 -367 68 -80 -65 105 -354 88 38 -204 278 32
6078 32 -142 212 -81 49 215 -126 213 -2 -71 164 -124 141 241 -68 269 140 -324 340 -82 -234 242
6099 242 -140 34 -77 -167 223 -178 27 93 -408 239 -50 -129 333 -332 -198 183 -299 -143 73 -202 277
6120 277 -137 -30 263 -418 282 14 -315 270 -111 2 334 -134 143 139 -220 104 -25 69 348 -258 33
6141 33 215 -239 279 -84 -238 317 -227 -52 125 -270 111 -185 -192 132 -232 130 186 -253 213 -4 -210
$$ packed form
5992A68m44M92K1m50M18l90M77Q9n38M80k07j81K58l98K62K08n48N39j08m53M10
6013A05j55j43M15m31J48jj72M60n90L34J10m53N01j53l46M95j74J3L25n02K98
6034H4k1k42K64k54J36O2k78L40L5n03P44k11k53M13m34M33j09l81L79l16P7L30
6056B95o20M57Pl82N37l70o6L39m06L09n4m13M35j48J5J70m59M42n0k42M82k46
6078C2j74L54k93J30J66l41L39k15o9K35k88K65J00l09L37j29m64O64m22j52M76
6099B42l82J74j11r0L90m01K05O6n01O47k89p9M62o65J34L81m82J56K16k75M79
6120B77m14J07K93o81P00k68l29N85l81J13L32m68K77ml59L24j29R4K79o06K91
6141C3J82m54N18l63j54N55n44J75J77l95L81k96pL24l64L62N6m39M66k17k06
$$ plain form
6162 -210 344 -61 122 223 -216 311 -133 -194 334 -88 204 141 -91 425 126 -173 408 -175 -51 43 -56
6183 -56 263 21 -86 169 56 107 295 -281 369 -205 -197 166 -240 -36 88 -157 79 83 -263 162 -17 123
6205 123 118 -270 99 -132 -420 208 -279 -77 53 -76 53 -126 -360 94 -268 -431 160 -131 223 -43 -210
6226 -210 349 -104 -18 231 -195 225 -56 -222 64 -128 -99 21 -296 187 50 -297 258 -112 -64 152 -272
6247 -272 -38 223 -212 312 -121 -97 -26 -321 96 129 -99 260 -179 -80 148 -189 -104 74 -163 196 164 -108
6269 -108 184 -59 193 213 -155 302 -203 -150 203 -244 -178 192 -401 -125 4 -174 180 -39 -102 188 -154
6290 -154 234 -162 -108 301 -229 -16 146 -357 137 -51 -313 131 -174 -198 127 -291 99 -174 -220 408 -241
6311 -241 -27 305 -389 66 199 -305 53 -58 3 75 -146 168 -64 -276 234 -363 -27 315 -322 46 76
$$ packed form
6162b10N54m05J83J01m39N27m44o1N28m22K92o3k32N16k99k99N81n83J24R4r9
6183e6L19k42j07K55j13N1J88n76O50n74QL63m06K04J24k45K36Ml46M25j79J40
6205A23nl88L69k31k88O28m87K02J30j29J29j79k34M54l62j63N91k91L54k66j67
6226b10N59m53Q6K49m26M20k81j66K86j92K9J20l17M83j37l47N55l70M8K16m24
6247b72K34K61m35N24m33K4P1k95M17L3k28L59m39R9K28l37Q5J78k37L59l2k72
6269a08K92k43K52K0l68M57n05N3L53m47O6L70n93K76J29j78L54k19o3K90l42
6290a54L88l96N4M09n30K13J62n03M94j88k62M44l05k4L25m18L90k73m6O28o49
6311b41K14L32o94M55J33n04L58j11O1P2k21L14k32k12N10n97L36L42o37L68L0
$$ plain form
6332 76 -294 136 153 -21 30 -307 90 207 -136 506 -250 -104 310 -227 389 166 -203 210 81 -120 116
6353 116 -43 -3 25 -14 313 -14 48 238 -274 53 211 -249 140 -71 -130 103 -150 -27 47 -234 290 66
6375 66 -175 242 -212 25 197 -240 185 97 -361 184 -15 82 41 -57 152 -116 -83 99 -68 -141 109 -213
6397 -213 182 139 -326 199 -132 -51 104 -194 168 35 -187 418 -220 84 251 -330 -28 51 -233 143 -55
6418 -55 12 70 -6 148 -176 -180 109 -160 -7 290 -236 118 95 -290 278 187 -204 388 -129 -96 214 8 387
6441 387 -172 -28 202 69 207 152 -255 279 179 -183 390 -89 18 -150 -177 46 -72 -19 158 -107 94
6462 94 56 -366 27 -126 -144 101 -175 -160 -89 -36 93 46 -6 229 -424 28 418 -218 193 -36 -174 243 -75
6485 -75 -174 94 -8 5 -170 -96 186 -73 51 204 -284 272 159 -214 244 -174 -191 169 -238 24 -129 -11
$$ packed form
6332G6l70M30J7j74N1l37L97J17l43O42p56J46M14n37O16k23l69M13j29k01K36
6353A16j59M0K8l9L27l27O2J90n12L27J58m60L89k11n9K33k53J23P4k81N24k24
6375F6k41M17m54K37J72m37M25q8m58N45j99R7m1r8K09k68L3J82j67p3K50l22
6397b13L95m3m65N25l31Q1J55k98L62j33k22O05o38L04J67n81L02P9k84L76j98
6418e5O7N8p6J54l24mK89k69J53K97n26L54k3l85N68r1l91N92n17L3L10k06L79
6441C87n59J44K30j33J38n5m07N34j00l62N73m79J07j68k7K23j18N3J77k65K01
6462I4l8m22L93j53j8K45k76J5P1N3J29m7n2K35o53M52L90o36M11k29j38M17l18
6485g5r9K68j02J3j75P4K82k59J24J53m88N56j13l73M58m18j7L60m07K62j53J18
$$ plain form
6507 -11 62 -258 -31 69 -143 46 -85 -328 217 -122 -45 109 -219 230 -45 55 228 -45 32 244 -95
6528 -95 155 212 -261 208 86 -43 138 82 71 114 -166 206 -75 10 199 -167 96 50 -369 210 65 -158
6550 -158 261 -100 -130 72 -85 56 -35 3 307 -340 105 166 -335 263 -182 -146 225 -155 -92 143 -146 95
6572 95 42 27 146 -235 -38 218 -87 263 -32 -118 259 -246 90 106 -285 122 -191 -30 110 -140 -110 145
6594 145 -156 49 72 -315 236 -60 44 27 -114 231 -67 -140 40 -35 16 444 -386 315 138 -206 126 -127
6616 -127 -116 249 -171 -23 48 112 134 -164 153 194 -177 18 78 -163 365 62 -163 132 -157 0 10 -53 187
6639 187 -157 21 75 -340 209 125 -342 209 -291 -44 205 -185 -177 -3 -361 196 -123 -202 240 -167 71 69
6661 69 -310 43 -31 -117 260 -76 94 -70 -147 142 -29 -411 204 -72 -110 53 -293 84 -4 -164 147 -150
$$ packed form
6507a1P3l20K27J00k12J89j31k43N45l39P7J54l28M49k75J00J73k73P7K12l39
6528i5K50N7m73M69j22j29J81n6j1M3k80L72k81Q5J89l66K63m6m19N79j45k23
6550a58M19l61l0K02j57J41r1L8L04o47M45O1n01N98m45L6L71l80O3K35k89K41
6572I5n3j5J19l81J97K56l05L50k95q6L77n05L36J6l91M07l13J61J40k50L0K55
6594A45l01K05K3l87N51k96J04j7j41L45k98p3J80p5N1M28q30P01j77l44L32k53
6616a27J1L65m20J48P1O4K2k98L17M1l71J95O0k41N28l03k25K95k89J57J0o3K40
6639A87l44J78N4m15N49q4m67N51n00K47K49l90QJ74l58N57l19p9M42m07K38k
6661F9l79L53p4q6L77l36J70j64p7K89j71l82O15k76l8J63l46L77q8j60L11k97
$$ plain form
6683 -150 -125 19 -99 214 42 -304 120 -152 102 72 -215 205 -222 -349 282 -122 -64 318 -160 -61 15 -14
6705 -14 123 -164 158 141 -240 291 78 -294 183 -25 0 269 -128 -26 -91 -216 246 -259 39 163 -215
6726 -215 126 -87 -157 29 12 -30 182 -46 -15 76 -325 95 126 -59 -31 -263 -13 0 -163 168 -139 -116 220
6749 220 -261 89 74 -17 172 -29 -152 177 -164 302 -76 -267 -16 21 -63 117 -268 -86 -38 -215 52 184
6771 184 -75 247 -135 -70 78 -308 -17 -44 -126 331 -52 -142 12 -129 90 -96 -28 189 28 51 142 -13
6793 -13 80 91 -98 110 -37 57 153 -134 194 167 -212 56 -27 -41 32 -151 78 104 -167 74 -78 -141 142 -107
6817 -107 18 100 -184 88 -76 -22 158 -6 -75 114 -254 288 -193 -65 127 -72 137 95 -288 175 -6
6838 -6 -85 258 -119 33 123 -157 113 -47 -120 291 -315 41 176 -67 119 -161 -94 8 -299 -53 -114 -161 123
$$ packed form
6683a50K5J44j18L13j72l46M24k72K54l0k87M20m27j27O31m04N8L82m78R9P6k9
6705a4J37k87L22j7l81N31k13l72M77k08K5K69l97J02o5j25M62n05K98J24l78
6726b15L41k13p0J86j7m2K12k28L1R1m01M20L1j85K8k32K50J3j63L31l07K3L36
6749B20m81L50j5r1J89k01j23L29l41M66l78j91K51L7q4J80l85J82M8j77K67J32
6771A84k59L22l82O5J48l86K91k7q2M57l83r0J54j41K19j86O8K17j61K3R1j55
6793a3R3J1j89K08j47R4R6k87L28k7l79K68q3j4P3j83K29K6k71K41j52o3K83k49
6817a07J25Q2k84K72j64N4J80j64o9J89l68N42m81J28J92j99K09m2l83M63j81
6838fp9L43l77J52R0k80K70j60p3M11o06L56J35k43J86k80O7J02l07K46o1m7K84
$$ plain form
6861 123 -143 -230 283 -206 -167 25 -161 -69 -39 -63 60 -4 26 199 -47 161 0 -67 196 -115 213 314 -44
6884 -44 288 -8 -152 45 44 -46 63 -77 235 -23 31 198 -225 -11 250 -191 7 56 -151 35 -5 55 -31
6907 -31 38 11 -18 -142 140 -257 -115 210 -199 21 53 -153 74 14 -102 54 -199 207 58 -214 304 -212
6929 -212 6 286 -323 117 71 -202 -6 -30 -55 22 -201 -15 -9 -281 121 -200 -160 306 -141 -15 48 -445 81
6952 81 -125 -287 144 -64 6 191 -83 369 -26 117 291 -212 157 108 -178 165 209 -231 27 94 188 126
6974 126 62 222 -37 -52 279 -216 14 295 -218 -6 40 -50 236 45 -201 -4 -211 225 -46 -140 227 -409
6996 -409 29 89 -377 87 74 -266 54 -32 -287 49 -51 164 7 -68 172 -149 -90 177 -293 31 63 27
7018 27 107 68 -161 266 -89 -16 151 -91 304 8 -22 242 55 36 45 -273 79 80 -295 82 -248 -11 -44 -187
$$ packed form
6861A23k66q7N13m89L9J92j86R2L0k4J23o4L0J73k46K08j61o7K63l11L28J01l58
6884d4L32k96j44J97jr0J09j40L12k58N4J67m23K14K61m41J98M9k07J86m0O0q6
6907c1O9k7k9j24K82l97J42L25m09K20L2k06K27o0j16J56k53M06j49k72N18n16
6929b12K18K80o09M40m6k73J96k4k5P7k23J86Ok72M02l21M0M66m47J26O3m93N26
6952H1k06j62M31k08P0J85k74M52l95J43J74n03L69m9k86L43M4m40K58O7R4o2
6974A26o4J60k59j5L31m95K30K81n13K12M6r0K86j91k46J97k07M36k71r4L67o36
6996d09M38O0m66M64j3l40L20q6k55L36j00K15j57p5K40l21N9K67m70L24L2l6
7018B7Q0l9k29M27l55P3J67k42L95k96l0K64j87j9Rl18L52Jl75L77l30K37l3j43
$$ plain form
7042 -187 22 -199 -102 100 -133 79 246 -152 149 -37 -126 243 -74 -32 129 -46 135 18 17 249 -68 112
7064 112 48 -71 170 140 -57 219 -97 -73 286 59 137 -21 -206 237 -136 125 121 -233 205 50 -120 158
7086 158 -131 -86 96 -115 111 12 -159 206 -65 43 280 -208 -10 143 -251 -10 -92 178 197 -12 145
7107 145 140 -134 185 -101 90 145 -77 -47 6 -232 214 -256 -62 58 -82 48 125 -44 54 -33 -105 169 -176
7130 -176 117 111 -127 64 -147 -276 47 -260 116 -23 -47 49 -107 112 288 -161 -58 233 -217 144 69 -94
7152 -94 375 -45 169 36 174 255 134 -108 252 -14 60 84 -233 240 -81 -38 255 -166 35 26 -315 55
7174 55 98 -151 -14 -70 -31 26 -304 198 -104 -227 83 -191 -18 127 -280 103 -97 -73 234 -252 26 213
7196 213 -89 -105 70 -293 80 -151 -73 39 -94 21 -10 -134 207 -77 66 174 -241 -10 41 -32 177 -59
$$ packed form
7042a87K09k21R7K02k33K12J67l98L01j86q9L69l17M2J61j75J81j17jK32l17J80
7064A12o4j19K41l0j97K76l16K4L59k27P8j58j85M43l73K61ml54M38j55j70K78
7086A58k89M5J82k11K26r9j71L65k71J08K37m88J98J53l94K41q2K70J9k09J57
7107A45nk74L19k86J91N5k22L0N3k38M46m70J94J20j40J30P7j69R8q7p2K74l45
7130a76K93ok38J91k11j29L23l07L76j39k4R6j56K19J76m49J03K91m50L61p5j63
7152i4M69m20K14j33J38Q1j21k42L60k66P4K4l17M73l21M3K93m21K01rl41L70
7174E5M3k49J37n6L9N7l30N02l02j23L10k74J73J45m07L83k00K4L07m86K78J87
7196B13l02j6J75l63L73k31P8J12j33J15l1j24L41k84J43J08m15K31N1p3K09k36
$$ plain form
7218 -59 -138 291 -205 2 35 95 80 8 0 191 -286 161 82 -225 136 0 -135 317 -79 -71 169 -83 264 -48
7242 -48 -37 105 -43 68 130 -114 222 13 -21 312 -137 -38 238 -94 11 148 -117 157 -191 88 164 -62
7264 -62 224 -91 -10 304 -58 78 232 -267 55 6 45 229 -78 22 92 -173 117 108 -234 319 -108 5
7286 5 75 -224 -115 -28 -115 17 -129 99 92 -237 144 -141 -120 176 -110 -83 154 -99 -93 -48 -96 -45 70 177 159
7311 159 -134 136 10 -279 50 -108 -122 323 -147 38 206 59 302 35 61 65 -221 109 17 -127 299 10
7333 10 -110 266 -212 -44 212 -45 317 -117 -259 22 -180 19 158 -82 -66 132 -28 163 -235 -100 164
7354 164 -42 -28 73 -75 134 -42 106 82 -200 5 25 15 200 -109 70 176 -60 40 -19 -172 63 -26
7376 -26 -231 104 -80 -92 26 -227 369 -276 -18 134 -234 -3 -18 -107 12 -70 62 196 -32 89 44 -163
$$ packed form
7218e9p9M29m96K07L3O0j5p2qJ91m77M47p9l07L61j36j35M52l96QK40k52L47l12
7242d8J1J42j48J11O2k44L36k09l4L33m49R9K76l32J05J37k65K74l48K79P6k26
7264f2K86l15Q1L14l62J36J54m99L22m9L9J84l07J00P0k65K90rl42N53m27J13
7286EP0k99J09Q7q7J32j46K28pl29L81k85K1K96k86K7K37k53OM5m8N1J15J07j8
7311A59k93K70j26k89L29j58j4M45m70J85J68j47K43k67K6Mk86L30r2j44M26k89
7333A0j20L76m78J68K56k57L62m34j42K81k02J99J39k40J6J98j60J91l98J35K64
7354A64k06J4J01j48K09j76J48k4k82K05K0j0J85l09J79J06k36J00n9j53K35q9
7376b6k05L35j84j2J18k53N96o45K58J52l68K31j5q9J19q2J32J34k28J21m5k07
$$ plain form
7398 -163 107 -18 -205 156 -210 186 104 -70 109 -143 149 52 -74 175 -52 -98 230 -41 13 181 -158
7419 -158 -122 137 -101 119 -102 46 -4 -86 133 -13 -2 281 -154 -98 132 -182 62 48 -196 9 -124 -23
7441 -23 80 -71 126 72 -92 319 61 -62 241 -43 73 380 -159 -4 209 -98 206 -152 -16 72 -83
7462 -83 98 -24 -116 145 -104 53 198 -264 -45 181 -153 190 -116 -137 -101 -148 143 155 -191 133 -124 -151
7484 -151 1 -143 -31 137 -126 107 -168 4 346 -139 240 -146 -311 94 -94 -15 98 -107 174 141 -178
7505 -178 137 34 -25 303 -18 132 29 -171 91 -31 88 65 -236 -127 -59 -156 146 -21 -11 55 88 15 74
7528 74 -13 97 -119 44 396 -194 -22 115 -113 -26 -66 -128 174 -173 38 170 -192 -19 -5 53 117 32 -52
7551 -52 163 -85 224 2 -244 175 -265 -59 138 -22 133 -77 -192 125 -141 78 175 -278 257 52 -194
$$ packed form
7398a63K70j25j87L61l66L96q2j74J79k52K92r7j26K49k27m6L28k71N4J68l39
7419a58L6K59k38K20k21J48n0q2K19j46J1K83m35N6K30l14K44j4k44K05j33J01
7441b3J03j51J97n4j64M11k58j23L03k84J16L07n39J55K13l07L04l58J36Q8j55
7462h3J81j22r2K61k49J57J45m62K19K26l34L43l06k1L6m7K91J2l46L24k57k7
7484a51J52j44J12J68k63K33k75J72L42m85L79l86j65M05j88P9J13k05K81l3l19
7505a78L15j03n9L28l21J50j03k00K62j22J19k3l01J09O8r7L02j67J0O6L3p3N9
7528G4q7J10k16J63L52n90J72J37k28Q7m0o2L02l47K11J32l62J73J4N8O4q5q4
7551e2K15k48L09k22k46M19m40K06J97j60J55k10j15L17k66K19R7m53N35k05k46
$$ plain form
7572 -194 4 -129 43 -62 -119 159 88 -86 30 -253 -108 134 -192 140 72 -116 243 -48 37 140 -170
7593 -170 61 -45 -118 186 -172 -27 182 -215 134 25 -185 235 -23 98 0 -38 152 6 -134 107 -183
7614 -183 1 155 -221 66 341 -14 114 -58 -105 133 -183 -116 -82 -18 229 -75 -62 237 53 105 185 -173
7636 -173 -2 49 -140 76 -211 56 -68 -137 146 -18 -217 43 -246 108 272 -226 235 16 -110 191 -91
7657 -91 -76 92 -95 5 6 -120 -9 -158 54 75 -164 138 -122 29 91 -59 79 168 -48 227 13 -294
7679 -294 44 -149 44 196 -109 152 114 32 44 -1 -65 164 -178 137 84 14 210 -221 -2 152 -53 114
7701 114 1 13 83 -91 72 133 -56 89 36 -107 89 -22 -76 3 -178 23 104 -124 48 17 -9 110 29
7724 29 -155 22 -141 46 85 -37 131 -79 15 -16 -105 -11 -22 -148 55 -159 -35 129 -108 218 31 -220
$$ packed form
7572a94J98j33J72j05n7K78p1j74J16k83J45K42l26L32o8j88L59k91Q5J03l10
7593a70K31j06p3L04l58J45K09l97L49j09k10M20k58J21r8l8J90j46j40K41k90
7614a83J84J54l76K87K75l55J28j72m7K38l16O7L4O4K47l04J3K99j84N2Q0l58
7636a73J71N1j89K16k87K67j24o9K83j64j99K60k89L54J64m98M61k19j26L01k82
7657i1J5J68j87J00Jj26J11j49K12K1k39L02k60J51O2j50J38Q9k16K75k14l07
7679b94L38j93J93J52l05K61l8q2J2m5o4K29l42L15n3p0J96m31K19J54k05J67
7701A14j13J2P0j74J63O1j89J45n3j43J96j11n4P9j81K01Q1k28J72l1k6J19q1
7724B9j84J77j63J87L9j22J68k10R4l1q9R4j1j26K03k14J24J64k37L26j87k51
$$ plain form
7746 -220 100 -73 196 23 -256 244 -41 -17 136 -69 -6 113 -73 -97 -98 -47 44 -247 -109 82 -132 311
7768 311 -19 5 174 -54 -92 200 -17 75 65 67 106 -123 244 9 -142 99 42 -49 12 -100 -131 7 -245 8
7792 8 -27 -41 58 -171 -249 134 75 114 1 -209 66 63 12 1 -66 -8 4 -233 50 -34 -78 -67 -222 38 84 -118
7818 -118 21 -43 109 98 -198 50 119 2 104 -87 206 -30 -155 18 129 -108 36 68 -167 63 -111
7839 -111 -26 -50 -269 17 -94 -78 136 93 -25 -1 -104 89 -134 -94 320 -148 -19 100 -351 -73 -56 16 268
7862 268 24 -45 -77 143 326 -219 -161 24 4 28 33 -43 4 47 -145 123 -58 44 123 -58 202 65 -85 193
7886 193 60 -168 106 -103 242 19 -125 -68 94 112 135 -207 -13 -57 -51 125 -157 1 70 -119 39 232
7908 232 -85 47 -95 124 138 3 180 39 -118 255 -70 -170 -34 -80 -163 -102 -143 81 -102 -75 32 72
$$ packed form
7746b20L20j73K69j73k79N00k85K4J53k05O3J19j86k4jN1R1k91J38J91k14M43
7768C11l30K4J69k28l8K92k17R2j0KL9k29L67k35j51K41n7r1O1j12l1J38k52K53
7792Hl5j4R9k29p8L83n9L9j13k10K75ln1j1o7N8J2k37K83q4m4J1j55K60M6k02
7818a18J39o4J52j1k96K48O9j17J02j91K93k36j25J73J11k37J44L2k35K30j74
7839a11Q5k4k19K86j11J6K14m3j18K4j03J93k23M0M14m68J29J19m51K78J7P2K52
7862B68k44o9l2K20J83n45N8J85k0K4Np6M7M3j92K68j81J02P9j81K60j37j50K78
7886A93j33k28K74k09L45k23j44N7J62J8K3l42J94m4OJ76k82J58O9j89J58J93
7908B32l17J32j42K19J4j35J77j41j57L73l25j00J36m6q3O1m1K24j83K7J07M0
$$ plain form
7930 72 -70 -4 8 70 -247 40 120 -62 -111 117 70 35 -72 -154 30 97 43 15 -16 204 -15 99 61 23 133
7955 133 161 -71 108 63 32 135 -115 11 125 -200 41 152 -53 130 -193 -60 209 -61 -146 151 -14
7976 -14 -59 -114 -32 51 -251 285 18 -7 369 -249 112 -122 -166 -57 164 65 175 -297 61 29 -141 205 -12
7999 -12 16 102 32 -178 118 -267 -67 105 -159 75 -33 -25 75 -81 8 -167 -71 132 25 -26 48 -80 127
8022 127 113 -125 16 42 -47 -139 -133 -39 -33 -184 156 81 -56 33 -171 129 -7 -12 64 -104 -68 59 46 -68 80
8047 80 -146 147 246 -199 246 21 48 221 -106 159 60 -62 93 -3 117 65 18 110 -49 37 150 29 156
8070 156 181 -152 79 18 -2 111 -121 -141 -73 -150 1 -24 -22 143 -75 -196 208 -67 85 30 -303 69 27 -127
8094 -127 -80 -184 -101 69 -168 145 -95 -175 187 -110 -21 -63 -209 61 -117 -131 123 21 149 -72 -36 204
$$ packed form
7930G2j42O6J2O2l17K87Q0j82m9K28m7l5j07q2J84O7n4k8l1K20k19J14l8l8J10
7955A33K8k32J79m5l1J03k50J26J14l25K41J11k05J83l23J33K69k70q5K97j65
7976a4m5n5Q2Q3l02N36k67k5L76o18L61k34m4J09K21r9J10m72L58l2j70L46k17
7999a2K8Q6p0k10K96l85K00J72k64K34j08QJ00j56Q9j75R6K03j07n1P4j28K07
8022A27j4k38J41K6q9r2OR4Oj51L40p5j37Q9k04L00j36nP6j68L6J27j3j14J48
8047H0k26K93R9m45M45k25K7J73l27K65r9j22J55r6J20n2m7R2j59Q6J13j21J27
8070A56K5l33K31o1k0J13k32k0O8p7J51k5KJ65k18j21M04k75J52n5l33L72m2j54
8094a27M7j04Q3J70k37L13k40q0L62k97Q9m2j46K70j78j4K54j02J28k21L6K40
$$ plain form
8116 204 22 83 49 -22 95 -4 -181 15 -37 -64 113 -42 114 -36 -187 145 -85 -132 172 -197 -190 13 -99
8139 -99 53 115 39 -7 -5 -17 154 20 78 104 27 100 9 109 42 -75 113 2 -107 136 -98 66 -40 -151
8163 -151 192 -60 -175 85 -233 -13 -34 -274 65 28 -301 -19 -198 105 142 -108 67 167 -90 34 -131
8184 -131 -41 14 -207 47 13 33 223
$$ packed form
8116B04j82O1l4p1J17r9j77J96n2k7J77j55J56j50j51L32k30m7L04l69PK03j12
8139i9J52O2p6m6Kj2J71j34N8K6p7P3r1J00o7j17J88j11j09K43k34J64j06j11
8163a51L43k52j15K60l18K20k1k40L39l7l29K82j79L03L7k50J75J00k57J24j65
8184a31R0N5k21K54l4K0J90
8191B23
$$ Imaginary data points
##PAGE= N=2
##DATA TABLE= (X++(I..I)), XYDATA
$$ plain form
0 0 0 0 0 0 0 0 0 0 0 0 0 0 0 0 8 -8 8 -8 8 -10 16 -16 18 -24 25 -32 37 -41 48 -56 64 -72 81 -90 104 -114
36 -114 130 -146 162 -179 199 -222 245 -272 297 -329 363 -402 442 -488 536 -590 650 -719 795
55 795 -883 983 -1098 1236 -1399 1598 -1845 2165 -2596 3198 -4112 5639 -8634 16593 -78799
70 -78799 -179607 63371 -27336 -109536 35669 2194 -94085 -7561 20633 -60054 -40446 7133
82 7133 -89896 -50892 85124 12267 -23678 41462 817 14026 22786 -13762 36871 13162
94 13162 -36157 33878 53363 25726 8749 -10858 -4140 -15283 -17803 -5017 -10638 11398 -5003
107 -5003 -7198 53767 25007 -11816 -11057 -33818 24540 32889 -20872 47185 38604 -39763 13854
120 13854 29903 -23350 -32121 -34127 -30611 -5045 20781 -11784 -42083 7307 -21169 -57248 17895
$$ packed form
0@%%%%%%%%%%%%%%Qj6J6j6J6j8K6l2L4m2M9n7O9p8Q9j04J20j36J53j71J94k18
36a14K44k76L08l41L78m21M67n17N69o26O92p65Q44r30J024j126J240j369J514
55G95j678J866k081K334k635K997l443M010m761N794p310R751j4273K5227r5392
70g8799j00808K42978r0707q2200J45205l3475r6279Q6524K8194q0687J9608M7579
82G133r7029L9004J36016p2857l5945O5140m0645J3209Q760l6548N0633k3709
94A3162m9319P0035J9485k7637j6977j9607O718j1143k520J2786n621K2036j6401
107e003k195O0965k8760l6823P59k2761N8358Q349n3761O8057q581p8367N3617
120A3854J6049n3253q771k006L516K5566K5826l2565l0299M9390k8476l6079P5143
$$ plain form
133 17895 -10747 -50284 6298 -13819 14575 64218 -16631 -9526 50733 -4677 -12230 48609
145 48609 34617 -7982 34769 61647 3175 36268 50131 -61877 -13719 52116 -48959 -16403
157 -16403 52007 -27323 -35169 10423 -9319 -30353 -26225 -22344 -30068 691 23594 -14952 2879
170 2879 16798 -28556 -2444 9567 -17285 765 -15021 -9074 28824 729 -4675 3386 -14441
183 -14441 -4867 -14947 -12322 11647 -9983 -6393 15498 12339 10146 -7324 -2130 -83 -17209
196 -17209 17979 16336 -225 41666 11255 -9680 38708 6369 -19274 10090 315 -1540 10338
209 10338 9662 -225 -13924 -5717 -20306 -24167 3704 -29068 -28764 14199 -13061 -4209 17721 -17881
223 -17881 -2334 7985 -13983 6270 10430 949 8056 16946 23681 3133 4643 13400 -15247
$$ packed form
133A7895k8642l9537N6582k0117K8394M9643q0849P105O0259n5410p553O0839
145D8609j3992m2599M2751K6878n8472L3093J3863j12008M8158O5835j01075L2556
157a6403O8410p9330p846M5592j9742k1034M128L881p724L0759K2903l8546J7831
170B879J3919m5354K6112J2011k6852J8050j5786N947L7898k8095n404Q061j7827
183a4441R574j0080K625K3969k1630L590K1891l159k193j7470N194K047j7126
196a7209L5188j643j6561M1891l0411k0935M8388l2339k5643K9364r775j855J1878
209A0338o76r887j3699Q207j4589l861K7871l2772L04M2963k7260Q852K1930l5602
223a7881J5547J0319k1968K0253M160r481P107Q890O735k0548J510Q757k8647
$$ plain form
236 -15247 3633 14749 -12456 17836 19045 -8389 14020 2948 -12544 -2597 -11633 -3242 -1696
249 -1696 -5505 10446 -1418 -1635 2011 -15267 -221 -2320 -11663 8738 -3381 88 14746 -6339
263 -6339 3129 1475 -18311 -1563 -8606 -12117 1971 -10749 136 5014 -7971 2430 -8307
276 -8307 -9612 1278 -9494 6907 9209 -1811 17512 4957 -2171 10322 -9983 -2856 6342
289 6342 -5709 10385 6573 706 11294 -3395 -114 1231 -10143 3976 -2479 -3026 10913 -5994
303 -5994 1464 5860 -12347 878 -4393 -11839 4501 -4726 1828 10173 -1716 10144 4394 -3634
317 -3634 7883 -5200 524 8501 -3026 11647 6798 -2658 10015 -5787 -5465 3027 -9979 2898
331 2898 3193 -2584 10400 -2213 -1432 4268 -12269 -1290 -2945 -11349 4620 -4820 -3404 5680
$$ packed form
236a5247J8880J1116k7205L0292J209k7434K2409j1072j5492R947r036Q391J546
249a696l809J5951j1864k17L646j7278J5046k099r343K0401j2119L469J4658k1085
263f339R468j654j9786J6748p043l511J4088j2720J0885M878j2985J0401j0737
276h307j305J0890j0772J6401K302j1020J9323j2555p128J2493k0305P127R198
289F342j2051J6094l812n867J0588j4689L281J345j1374J4119o455n47J3939j6907
303e994P458M396j8207J3225n271p446J6340r227O554Q345j1889J1860n750q028
317c634J1517j3083N724P977j1527J4673m849r456J2673j5802L22Q492j3006J2877
331B898K95n777J2984j2613P81N700j6537J0979j655q404J5969r440J416R084
$$ plain form
345 5680 -8648 229 -929 -9680 4071 -4650 -1232 9768 -2582 8928 8017 -4397 8181 -2588
359 -2588 -5952 4861 -7082 1090 3818 -4105 7025 -3424 -4653 2875 -12062 -1295 1538 -8974
373 -8974 7703 1187 -3760 7706 -6021 -3149 282 -8707 2383 -2475 -1496 8392 -4165 4196
387 4196 5290 -8262 5495 -1861 -7297 7466 -3768 -393 6059 -4572 3652 -1808 -5870 4529
401 4529 -6800 394 7271 -2394 11731 7981 1945 13935 2984 3887 8475 -417 9905 4008
415 4008 -46 12147 -3448 -1987 4089 -13338 -3228 -3158 -14340 -498 -3302 -7373 -3357 -6929
429 -6929 -1810 -9712 -9096 2311 -12033 -1629 7278 -10446 7548 8104 -11319 8459 7346 -5444
443 -5444 5121 5099 3789 3864 5953 7056 -3931 5187 1585 -14806 7163 949 -17703 8588 2740
$$ packed form
345E680j4328Q877j158q751J3751q721L418J1000j2350J1510r11j2414J2578j0769
359b588l364J0813j1943Q172K728p923J1130j0449j229P528j4937J0767K833j0512
373h974J6677o516m947J1466j3727K872L431q989J1090m858R79R888j2557Q361
387D196J094j3552J3757p356n436J4763j1234L375O452j0631Q224n460m062J0399
401D529j1329P194O877r665J4125l750o036J1990j0951R03M588q892J0322n897
415D008m054J2193j5595J461O076j7427J0110P0j1182J3842k804m071M016l572
429f929N119p902O16J1407j4344J0404Q907j7724J7994N56j9423J9778j113j2790
443e444J0565k2j310P5K089J103j0987R118l602j6391K1969o214j8652K6291n848
$$ plain form
458 2740 -9582 7475 -2391 -4778 4454 -2818 -921 3260 7212 2463 -3841 11016 1254 -11009
472 -11009 5956 -5501 -9596 4137 -10640 -3854 5260 -10951 -5987 -3038 -3900 -1440 -11323 381
486 381 4767 -8370 4969 7832 1002 6230 1225 5567 9021 5876 9654 1831 13496 20440 -5328
501 -5328 10819 19425 -12359 1061 10098 -8698 1869 1509 -11637 -2113 1841 -11872 -16751 2882
515 2882 -3678 -23977 5756 7364 -17635 8807 2208 -16530 15437 2383 -18419 11328 7229
528 7229 -14275 380 13505 -1920 -10397 5711 -2184 -9206 10676 -8187 -12419 17673 -4350
541 -4350 -9832 16960 -730 -7602 2586 -2312 6573 6531 -2020 4455 10377 8282 -3416 3501 13429
556 13429 -7768 -3799 10500 -2990 2242 -221 -13098 1134 -4747 -13919 -5352 -9335 -4499 -9578
$$ packed form
458B740j2322J7057r866k387R232p272J897M181L952m749o304J4857r762j2263
472a1009J6965j1457m095J3733j4777O786R114j6211M964K949q62K460r883J1704
486C81M386j3137J3339K863o830N228n005M342L454l145L778p823J1665O944k5768
501e328J6147Q606l1784J3420R037j8796J0567l60j3146R524L954j3713m879J9633
515B882o560k0299K9733J608k4999K6442o599j8738L1967j3054k0802K9747m099
528G229k1504J4655J3125j5425q477J6108p895p022J9882j8863m232L0092k2023
541d350n482K6792j7690o872J0188m898Q885m2q551O475N922k095j1698O917R928
556A3429k1197L969J4299j3490N232k463j2877J4232n881r172Q567l983M836n079
$$ plain form
570 -9578 -16296 9070 4206 -16345 282 8289 -2096 -1315 8573 6481 -2425 13015 10727 -2504
584 -2504 22586 6621 -21791 18585 15906 -16615 10444 11851 -9140 6223 6706 -8555 400
597 400 5476 -15656 -7373 22016 -7671 -19886 19732 -2786 -19031 16323 -3158 -12930 15208
610 15208 -5082 -12886 14983 7076 -13743 -2603 10273 -9533 -13548 6897 -6303 -12420 1038
623 1038 -9764 206 8192 -14306 -5904 2658 -5319 5257 2266 1466 11337 1014 1870 12035
637 12035 7245 -1596 -4542 9330 11002 -2398 4366 3355 -2464 2512 -5506 470 3465 -13313
651 -13313 -1989 640 -9175 5527 -5258 -15236 7372 -1292 -16029 1176 7624 -8146 -7727
664 -7727 12861 4913 -5797 13786 -461 -10978 16459 -690 -9083 20103 966 -11769 11128
$$ packed form
570i578o718K5366m864k0551J6627Q007j0385P81R888k092q906J5440k288j3231
584b504K5090j5965k8412M0376k679l2521K7059J407k0991J5363M83j5261Q955
597D00N076k1132Q283K9389k9687j2215L9618k2518j6245L5354j9481r772K8138
610A5208k0290p804K7869p907k0819J1140J2876j9806m015K0445j3200o117J3458
623A038j0802R970P986k2498Q402Q562p977J0576k991q00R871j0323Q56J0165
637A2035m790q841k946J3872J672j3400O764j011n819M976q018N976K995j6778
651a3313J1324K629r815J4702j0785r978K2608q664j4737J7205O448j5770M19
664g727K0588p948j0710J9583j4247j0517K7437j7149q393K9186j9137j2735K2897
$$ plain form
677 11128 3831 -6195 877 -2321 -6338 4211 9360 -6343 1080 14061 -11534 -2549 20490
690 20490 -7539 -5590 12995 -5227 1034 10655 -4861 -2664 4294 -1163 -6749 -1388 4034 -8838
704 -8838 -6461 5569 -4690 -2524 -76 -9179 -1401 -5312 -9308 3256 -2569 -2074 2896 -5174 3970
719 3970 4177 -6529 2343 2744 361 5831 4557 5450 1265 -393 3106 -1637 3505 60 -9320 6249
735 6249 1442 -9081 7332 -1736 -8431 6074 -2535 -5150 3893 -1989 -3420 2345 5751 -1230
749 -1230 -3619 7040 -3388 -7218 7248 -4416 -2850 11226 -3845 -718 8251 -5062 -1476
762 -1476 2909 -2342 -440 1006 3823 726 -1009 3074 -4822 -592 5856 -5777 1430 5109 -4155
777 -4155 5553 3446 -2073 5224 -984 -351 3934 -2932 33 -470 -1208 3032 -2786 -254 -221 -5854
$$ packed form
677A1128p297j0026P072l198m017J0549N149j5703P423J2981k5595Q985K3039
690B0490k8029J949J8585j8222O261R621j5516K197O958n457n586N361N422j2872
704h838K377J2030j0259K166K448r103P778l911l996J2564n825M95M970q070R144
719C970K07j0706Q872M01k383N470j274Q93m185j658L499m743N142l445r380J5569
735F249m807j0523J6413r068o695J4505q609k615R043n882j431N765L406o981
749a230k389J0659j0428l830J4466j1664J566J4076j5071L127Q969j3313L586
762a476M385n251J902J446K817l097j735M083p896M230O448j1633P207L679r264
777d155R708k107n519P297o208O33M285o866K965n03p38M240n818K532L3n633
$$ plain form
793 -5854 723 -3565 -4936 3141 -2988 1286 4327 -4869 852 -1566 -5359 3502 -2506 -2714 3766
808 3766 -1723 1039 695 -2124 384 -3860 1442 3113 -3752 4369 990 -3685 5824 -1202 -2684
823 -2684 2842 -4390 -772 662 -3936 2303 -905 -945 2755 -2548 1114 -431 -3034 3190 -2285 850
839 850 6506 -2019 2786 2554 -5069 2185 312 -851 3825 -936 3089 3482 -732 4543 -1016 -2161
855 -2161 3816 -1373 2149 2725 -3063 2349 -1626 -1596 3391 -4841 -1296 946 -5113 2322 739 -2077
871 -2077 3179 -1633 1258 2105 -3559 2023 -1441 -2809 4057 -1259 711 2181 -4291 490 -2231
886 -2231 -3577 2797 -3358 -291 3441 -2949 2560 910 -3665 1435 -2405 -151 2597 -2124 2887
901 2887 -147 -2252 4338 -1533 -324 2873 -3839 1783 1230 -2680 3474 -1797 -1873 1648 -4213 -1107
$$ packed form
793e854O577m288j371Q077o129M274L041r196N721k418l793Q861o008k08O480
808C766n489K762l44k819K508m244N302J671o865Q121l379m675R509p026j482
823b684N526p232L618J434m598O239l208m0L700n303L662j545k603O224n475L135
839H50N656q525M805k32p623P254j873j163M676m761M025L93m214N275n559j145
855b161N977n189L522N76n788N412l975L0M987q232L545K242o059P435j583k816
871b077N256m812K891Q47n664N582l464j368O866n316J970J470o472M781k721
886b231j346O374o155L067L732o390N509j650m575N100l840K254K748m721N011
901B887l034k105O590n871J209L197o712N622n53l910O154n271p6L521n861L106
$$ plain form
917 -1107 -2237 -5716 -162 -3750 -1212 2312 -4228 1203 248 -4317 3529 83 23 5133 543 4529
933 4529 4285 11 4866 -101 135 4618 -1636 3128 3814 -2481 3180 623 -1198 2198 -2516 1033
949 1033 49 -3031 2943 -2003 -1544 3765 -4423 137 2862 -5307 717 1106 -1902 2536 348 1421
965 1421 643 -1826 1359 -4041 -1280 2594 -6844 191 3372 -7308 86 468 -6362 557 -1119
980 -1119 -2159 1963 1533 2006 -487 3500 4879 -3639 4000 5369 -4158 4530 2759 -3417 5364 -242
996 -242 -3361 2627 -1567 -2555 -2638 -1587 152 -5212 -546 845 -5796 51 -2795 -6205 2506 -3076
1012 -3076 -3624 3398 -154 1295 479 262 5110 -1772 497 5964 -719 3664 3981 -1981 4539 1835
1028 1835 -3007 918 941 476 -3344 128 5282 -4320 233 5699 -4987 3366 4866 -6437 5042
$$ packed form
917a107j130l479N554l588K538L524o540N431r55m565P846l446o0N110m590L986
933D529k44m274M855m967K36M483o254M764O86o295N661k557j821L396m714L549
949A033r84l080N974m946M59N309q188M560K725q169O024L89l008M438k188J073
965A421p78k469L185n400K761L874r438P035L181j0680P394L82o830O919j676
980a119j040M122m30M73k493L987J379q518P639J369r527Q688j771o176Q781n606
996b42l119N988m194r88q3J051J739n364M666J391o641N847k846l410Q711n582
1012c076n48P022l552J449q16k17M848o882K269N467o683M383L17n962O520k704
1028A835m842L925K3m65l820L472N154r602M553N466j0686Q353J500j1303J1479
$$ plain form
1043 5042 5809 -5164 2099 6338 -553 -3321 1773 1671 -5826 1615 1167 -8390 4527 1122 -11313
1058 -11313 4496 1553 -11782 384 1543 -5337 -883 154 -2085 -1113 2862 -1384 -3942 7120
1072 7120 732 -6088 9372 4433 -3785 6240 1519 -67 4784 -2281 -444 2094 -1240 -1720 -2386
1087 -2386 2278 -576 -7095 751 -372 -4203 378 -2934 -351 2098 -3045 1473 1488 -385 742
1102 742 -4852 3115 5292 -6761 1988 5216 -4512 1704 2278 -2762 784 819 -2491 -867 5695 717
1118 717 -8143 5827 5038 -9730 4796 5024 -7952 5456 3979 -5359 7300 5316 -5526 1742
1132 1742 8079 -1045 -4145 7535 1349 -7174 6208 450 -6662 6675 -4586 -9848 6571 -1806
1146 -1806 -8241 2406 261 -4261 -1475 1998 -1010 -3435 1641 -2408 -1600 7707 -2692 -4122 6204
$$ packed form
1043E042P67j0973P263M239o891k768N094j02p497P441m48r557J2917l405j2435
1058a1313J5809k943j3335J2166J159o880M454J037k239R72L975m246k558J1062
1072G120o388o820J5460m939q218J0025m721j586M851p065J837K538l334m80o66
1087b386M664k854o519P846j123l831M581l312K583K449n143M518J5j873J127
1102G42n594P967K177j2053Q749L228r728O216N74n040L546L5l310J624O562m978
1118G17q860J3970p89j4768J4526K28j2976J3408j477r338J2659j984j0842P268
1132A742O337r124l100J1680o186q523J3382n758p112J3337j1261n262J6419q377
1146a806o435J0647k145m522K786L473l008k425N076m049Q08R307j0399j430J0326
$$ plain form
1161 6204 -1061 -1735 2611 -851 1898 -1211 -1383 4829 -673 -977 921 -2616 2158 81 -3879 1226
1177 1226 -131 -1679 -1495 -191 2720 -2808 -1812 2702 -3567 2051 2633 -5398 5352 2740 -7166
1192 -7166 4913 3706 -5517 -306 1459 -1440 -240 2748 -847 -4001 4625 -681 -6197 7854
1206 7854 351 -7985 7283 2155 -4025 5455 -716 -2696 4452 855 -2342 1146 3411 -2553 -1745
1221 -1745 6706 -1595 -3264 6147 -2730 -1938 5506 -4684 -850 4951 -3431 -1368 1451 -792 -1505
1236 -1505 -2499 641 -919 -2139 2743 -1126 -830 2255 -3311 273 1910 -2152 1401 -1095 -80
1251 -80 3297 -3636 287 2514 -3966 1089 1419 -2486 1487 -590 -1065 987 -395 -101 -2226 509
1267 509 939 -5097 1170 262 -5048 3685 -370 -4872 4094 -1122 -3816 3592 548 -1400 1694 3037
$$ packed form
1161F204p265o74M346l462K749l109j72O212n502l04J898l537M774k077l960N105
1177A226j357j548J84J304K911n528R96M514o269N618N82q031J0750k612r906
1192g166J2079j207r223N211J765k899J200K988l595l154Q626n306n516J4051
1206G854p503q336J5268n128o180R480o171j980P148l597l197L488K265n964Q08
1221a745Q451q301j669R411q877P92P444j0190L834N801q382K063K819k243p13
1236a505r94L140j560j220M882l869K96L085n566L584J637m062L553k496J015
1251h0L377o933L923K227o480N055L30l905L973k077m75K052j382K94k125K735
1267E09M30o036O267r08n310Q733m055m502Q966n216k694P408l044j948L094J343
$$ plain form
1283 3037 1455 -1316 3007 485 -2406 4947 -190 -2278 5092 -1718 -1233 4042 -2616 -26 2101
1298 2101 -2032 1137 591 -692 320 -439 1575 -1359 -959 3320 -2365 -209 2480 -3481 1688 2360
1314 2360 -1811 2678 -870 -1673 2301 -1473 246 573 -2523 1139 -215 -787 -183 -3584 -190 -656
1330 -656 -1948 2827 -1601 -1476 2951 -1398 1675 2263 -1696 2990 1118 -157 3572 -1038 236 1557
1346 1557 -1518 1066 -756 -1263 31 -3467 -85 -962 -3969 2018 -1927 -4079 1298 -3399 -2167
1361 -2167 1359 -2743 -407 -162 -486 2320 -901 984 1295 -1365 3511 2203 664 3369 -966 1255
1377 1255 2962 -1744 2184 165 -2825 2722 -230 -1124 962 -2055 511 418 69 2632 -1418 333
1393 333 2564 -1275 2447 2001 -831 2460 -657 57 1762 -2466 905 313 -3188 1414 -1059 -2199
$$ packed form
1283C037j582k771M323k522k891P353n137k088P370o810M85N275o658K590K127
1298B101m133L169n46j283J012p59K014k934M00M279n685K156K689n961N169O72
1314B360m171M489l548q03L974l774J719L27l096L662j354n72O04l401L394m66
1330f56j292M775m428J25M427m349L073N88l959M686j872j275L729m610J274J321
1346A557l075K584j822n07J294l498L382q77l007N987l945k152N377m697J232
1361b167L526m102K336K45l24K806l221J885L11k660M876j308j539K705m335K221
1377A255J707m706L928k019k990N547k952q94K086l017K566r3l49K563m050J751
1393C33K231l839L722m46k832L291l117P14J705m228L371n92l501M602k473j140
$$ plain form
1409 -2199 -150 -3480 -1364 -1411 -2235 1369 -2156 -1770 946 -2431 978 1409 -1455 2417 248 1117
1425 1117 4285 -342 2042 2759 -702 3191 1812 33 1067 -1519 433 -401 -2404 997 -2951
1440 -2951 -3092 588 -4032 -1762 13 -3651 -262 -573 -1324 1311 -1511 63 468 -1427 2516 442
1456 442 -161 2457 -1521 489 1658 -1837 1671 -155 -1435 2039 -853 -206 887 -2099 774 -185
1472 -185 -188 2733 -1663 379 2675 -1215 2485 2644 -268 2824 1205 1696 2107 -15 2714 -53 -847
1489 -847 3571 -2214 -1749 1464 -3973 -1924 -264 -3183 -718 -1750 -2513 -1453 -2114 418 -1668 -1249
1505 -1249 2768 -1891 470 3681 -2038 1732 2702 -1933 2776 2430 -913 1189 671 697 -618 160
1521 160 2183 -2576 -333 1673 -3761 387 551 -4184 1184 636 -2655 398 -377 -451 -847 -615 2193
$$ packed form
1409b199K049l330K116m7q24L604l525L86K716l377L409M31k864L872k169Q69
1425A117L168m627K384P17l461L893j379j779J034k586J952q34k003L401l948
1440b951j41L680m620K270J775l664L389l11p51K635k822J574M05j895L943k074
1456D42o03K618l978K010J169l495L508j826j280L474k892O47J093k986K873r59
1472a85lK921m396K042K296l890L700J59k912L092j619M91M11k122K729k767p94
1489h47M418n785M65L213n437K049J660k919K465j032p63J060o61K532k086M19
1505a249M017m659K361L211n719L770R70m635M709l46l343K102n18K6j315P78
1521A60K023m759K243K006n434M148J64m735N368n48l291L053p75p4l96K32K808
$$ plain form
1538 2193 -669 41 2204 -1997 1257 1334 -2983 1578 781 -2122 194 -1069 -412 -1149 -2393 1012
1554 1012 -1374 -1058 1874 -2299 736 2341 -2676 1687 3621 -712 1324 2066 1865 683 848 3182
1570 3182 -543 1482 3689 -2892 1531 3653 -4576 440 3126 -3167 -552 888 -2095 -1600 -412
1585 -412 -876 -2905 645 928 -4764 1711 2563 -5302 1631 3031 -3387 2132 1721 -1745 1871 963
1601 963 -1347 -246 1726 361 -2973 1846 1382 -4514 1292 712 -3200 2116 -450 -2386 2283 -459
1617 -459 -1760 147 544 1064 -1886 677 2249 -2643 544 1262 -1992 1709 11 -1869 1484 328
1633 328 -849 -1261 346 1515 -3166 -257 2822 -3512 -170 1979 -3373 1232 1759 -3274 1301 2692
1649 2692 -1022 -1014 2526 1925 -2643 2127 3324 -3201 2633 2649 -4512 3278 2538 -4837 2338 2698 -3175
$$ packed form
1538B193k862P10K163m201L254P7m317M561p97k903K316j263O57p37j244L405
1554A012k386L16K932m173L035J605n017M363J934m333K036P42k01j182J65K334
1570C182l725K025K207o581M423K122q229N016K686o293K615J440k983M95J188
1585d12m64k029L550K83n692O475Q52p865O933J400o418N519m11l466L616r08
1601I63k310J101J972j365l334M819m64n896N806n80l912N316k566j936M669k742
1617d59j301J907L97N20k950K563J572m892L187P18l254L701j698j880L353j156
1633C28j177m12J607J169m681K909L079o334L342K149n352M605N27n033M575J391
1649B692l714QL540o01m568M770J197o525N834J6p161P790p40p375P175L60n873
$$ plain form
1666 -3175 -298 2054 -467 -1972 1499 344 -2712 2844 -153 -4449 3685 437 -4528 3076 800
1681 800 -2772 1310 158 -632 691 402 -70 -389 2014 -18 -2266 2855 270 -2786 2060 -343
1697 -343 -1250 991 -1677 -357 89 -1303 152 -1203 340 638 -3149 1100 1260 -3046 543 707
1713 707 -1274 421 -193 -310 -513 178 995 -2070 1942 2114 -3930 1972 2615 -3559 1755 1856 -2406
1730 -2406 1768 891 -1896 244 1281 -728 -1583 2467 422 -3311 3125 1231 -3449 3393 633
1745 633 -2651 3964 415 -2232 2572 759 -1331 229 1507 -417 -1641 1827 -276 -2386 2213
1760 2213 -1507 -2055 2728 -1714 -1670 1791 -1347 -483 516 -828 813 -317 499 741 -691 1802 -26
1777 -26 -401 2460 -366 -120 1723 -214 731 -366 -831 1183 -1549 -178 652 -3168 -116 -77 -3041
$$ packed form
1666c175K877K352k521j505L471j155l056N556k997m296Q134l248m965P604k276
1681H00l572M082j152p90J323k89m72l19K403k032k248N121k585l056M846k403
1697c43r07K241k668J320M46j392J455j355J543K98l787M249J60m306L589J64
1713G07j981J695o14j17k03O91Q17l065M012J72o044N902O43o174N314J01m262
1730b406M174q77k787K140J037k009q55M050k045l733O436j894m680O842k760
1745F33l284O615l549k647M804j813k090J560J278j924j224L468k103k110M599
1760B213l720n48M783m442M4L461l138Q64R99j344J641j130Q16K42j432K493j828
1777b6l75K861k826K46J843j937R45j097m65K014k732J371Q30l820L052L9k964
$$ plain form
1794 -3041 658 -475 -2519 -206 -269 -371 -663 130 638 -1810 1017 1553 -2117 1896 847 -2733 2585
1811 2585 649 -1835 1591 -394 -1129 709 5 34 -713 171 -121 -1418 2153 257 -1795 2038 -908
1828 -908 -701 3267 -331 90 1853 -661 1348 1699 315 751 -382 1140 884 -506 812 -1614
1844 -1614 -1370 837 -1959 -375 -446 -3062 94 -525 -1433 1162 -1204 -823 1096 -665 1258 882 -233
1861 -233 1307 -11 1324 1952 -250 1576 -189 -704 1900 -503 624 682 -2400 221 158 -1417 825
1878 825 -1770 -2158 157 -641 285 -330 -1522 -517 -1068 1193 1423 -1366 826 -187 -1057 2843 44
1895 44 -1120 773 -1613 142 792 -1179 -609 -1916 -1208 539 -914 308 -462 -1940 902 -330
1911 -330 508 1794 -1078 932 1500 -66 2942 1346 152 1650 237 1370 1925 -5 719 -934
$$ packed form
1794c041L699j133k044K313o3j02k92P93N08k448K827N36l670M013j049l580N318
1811B585j936k484L426j985p35J838p04K9p47Q84k92j297L571j896k052L833k946
1828i08K07L968l598M21J763k514K009L51j384M36j133J522k56j390J318k426
1844a614K44K207k796J584p1k616L156o19r08K595k366L81J919j761J923l76j115
1861b33J540j318J335O28k202J826j765n15K604k403J127N8l082K621o3j575K242
1878H25k595l88K315p98R26o15j192J005n51K261K30k789K192j013q70L900k799
1895D4j164J893k386J755O50j971N70j307P08J747j453J222p70j478K842j232
1911c30Q38J286k872K010N68j566L008j596j194J498j413J133N55j930P24j653
$$ plain form
1927 -934 -448 1625 -494 156 -581 -2650 169 -459 -782 262 -2745 -1041 462 -739 1292 -269
1943 -269 -1816 825 223 1478 1761 -639 632 4 609 2338 -447 169 348 -1720 1148 47 -1506
1960 -1506 230 -2005 -851 844 -904 428 -461 -1534 415 -5 894 860 -954 749 -292 167
1976 167 2581 -881 -762 884 -1286 1064 1141 -1743 -452 -1328 -896 623 -944 -294 -1774 -2217 739
1993 739 -859 -563 648 -2066 154 1299 -9 1825 69 -31 1728 758 2111 1415 -204 1488
2009 1488 64 345 2250 -640 125 405 -1472 689 162 -905 -327 -1545 393 161 -701 1858 -1301
2026 -1301 -1516 1867 -622 855 1872 -1469 62 781 227 592 -262 425 -539 -513 1880 -1067 -1243
2043 -1243 971 -2048 -170 1690 -1969 -489 311 -1689 17 167 116 -222 -424 1193 -430 513 1959
$$ packed form
1927i34M86K073k119O50p37k069K819o28l23J044l007J704J503j201K031j561
1943b69j547K641o02J255K83k400J271o28O05J729k785O16J79k068K868j101j553
1960a506J736k235J154J695j748J332q89j073J949m20Q99l4j814J703j041M59
1976A67K414l462J19J646k170K350P7k884J291q76M32J519j567O50j480m43K956
1993G39j598K96J211k714K220J145j308J834j756j00J759r70J353o96j619J692
2009A488j424K81J905k890P65K80j877K161n27j067N78j218J938k32q62K559l159
2026a301k15L383k489J477J017l341J531P19n54L65q54O87r64K6K393k947j76
2043a243K214l019J878J860l659J480Q00k000J706J50n1l38k02J617j623R43J446
$$ plain form
2060 1959 -1660 420 1888 -1389 1065 1364 -1504 -71 -158 -442 47 -625 -142 -1536 -1069 1046 -2093
2077 -2093 -457 907 -2618 -179 1144 -1114 445 -154 -252 778 129 1284 -66 -269 1925 -943
2093 -943 297 2485 -1467 182 1732 -984 496 624 -689 -257 -45 705 -956 -42 1622 -2405
2109 -2405 14 2701 -1967 329 2328 -1529 519 1636 -842 179 992 169 -904 705 1531 -2137
2125 -2137 -42 1625 -2614 202 1383 -2591 453 667 -2111 189 770 -765 -720 274 796 -1306
2141 -1306 314 1315 -2048 788 1632 -2072 1413 947 -1871 808 443 -604 -57 -3 685 -1100 -355
2158 -355 812 -1964 75 950 -2272 472 1011 -1947 -16 301 -492 -312 83 984 -749 -101 1675
2175 1675 -1602 653 1782 -2055 650 1818 -1857 330 1287 -806 -322 586 478 -891 608 1150
$$ packed form
2060A959l619K080J468l277K454K99k868J433q7k84M89o72M83j394M67K115l139
2077b093J636J364l525K439J323k258J559n99r8J030o49J155j350k03K194k868
2093i43J240K188l952J649J550k716J480J28j313M32K12P50j661R14J664m027
2109b405K419K687m668K296J999l857K048J117k478J021Q13q23j073J609Q26l668
2125b137K095J667m239K816J181l974L044K14k778K300N81j535M5R94N22k102
2141a306J620J001l363K836Q44l704L485m66k818K679l65j047N47N4O88j785P45
2158c55J167k776K039Q75l222K744N39k958J931L17p93J80L95R01j733O48J776
2175A675l277K255J129l837K705J168l675K187R57k093M84R08j08j369J499N42
$$ plain form
2191 1150 -2003 924 1925 -2672 1281 1987 -2334 817 1385 -1382 445 680 -3 -40 944 499 -1296
2208 -1296 1142 1062 -2193 1595 1140 -2293 1380 477 -1675 1026 -31 -954 313 345 164 -904 395
2225 395 729 -1880 826 774 -1704 913 152 -1400 860 -377 -548 352 -292 471 -1006 -185 1202
2242 1202 -1748 270 973 -1540 512 543 -1657 661 121 -696 -144 95 166 -1425 158 1209 -1918
2259 -1918 440 1481 -2132 1053 1098 -1905 1073 907 -1173 470 762 190 -395 880 934 -1603 909
2276 909 1089 -1907 1621 819 -1970 1668 237 -1505 971 -188 -505 333 -6 197 -647 584 439
2293 439 -1311 1379 216 -1231 1774 -114 -735 1423 -316 232 754 -167 526 -343 -171 475 -1056
2310 -1056 553 187 -1559 904 -180 -841 739 -684 174 186 -600 978 -550 -437 897 -1186 482
$$ packed form
2191A150l153K927J001m597L953P06m321L151N68k767J827K35o83l7R84m45j795
2208a296K438q0l255L788m55l433L673r03k152K701j057r23J267L2j81j068J299
2225C95L34k609K706n2k478K617p61j552K260j237j71R00o44P63j477Q21J387
2242A202k950K018P03k513K052L1k200K318n40q17N52K39P1j591J583J051l127
2259a918K358J041l613L185M5l003K978j66k080J643K92n72n85J275N4k537K512
2276I09J80k996L528q02k789L638j431j742K476j159l17Q38l39K03q44J231j45
2293D39j750K690j163j447L005j888o21K158j739N48N22r21O93q69J72O46j531
2310a056J609l66j746K463j084o61J580j423Q58J2p86J578j528J13J334k083J668
$$ plain form
2327 482 1029 -1381 900 498 -1009 539 -128 -535 -77 -430 80 -779 -121 361 -1682 281 277 -1763
2345 -1763 806 325 -1386 1057 -173 -480 817 99 556 182 386 852 -338 847 654 -829 1399
2362 1399 226 -865 1230 -685 -373 971 -944 -65 219 -716 376 -397 -54 637 -824 484 17
2379 17 -515 1176 -373 -28 1030 -827 749 770 -576 990 -198 -145 1047 -576 164 347 -1086
2396 -1086 531 -298 -516 380 -1059 96 -168 -674 861 -819 -622 978 -747 628 818 -967 989
2413 989 66 -300 1027 -500 -187 217 -732 286 -548 -609 35 -1411 82 -172 -1457 698 -667 -1321
2431 -1321 667 -598 -112 769 -705 336 318 -54 1139 -383 315 626 -444 1131 333 -156 716
2448 716 -855 228 895 -1002 598 -155 -958 780 -425 -109 373 -1101 475 390 -320 1026 -392
$$ packed form
2327D82N47k410K281m02j507J548o67m07M58l53N10q59O58M82k043J963mk040
2345a763K569m81j711K443j230l07J297p18M57l74K04M66j190J185j93j483K228
2362A399j173j091K095j915L12J344j915Q79K84r35J092p73L43O91j461J308m67
2379A7n32J691j549L45J058j857J576K1j346J566j188N3J192j623P40J83j433
2396a086J617q29k18Q96j439J155k64n06J535j680J97J600j725J375J90j785J956
2413I89r23l66J327j527L13M04r49J018q34o1O44j446J493k54j285K155j365o54
2431a321J988j265M86Q81j474J041j8l72J193j522O98L11j070J575p98m89Q72
2448G16j571J083O67j897J600p53q03J738j205L16M82j474J576q5p10J346j418
$$ plain form
2465 -392 62 931 -146 859 353 -98 1069 -398 99 1014 -833 369 286 -874 660 -362 -466
2482 -466 360 -1120 -152 -21 -432 679 -711 -533 635 -620 888 590 -839 962 -16 -28 1409
2499 1409 -614 -14 394 -501 795 73 -359 -37 -702 57 42 -1172 349 -862 -1006 858 -1193 -339
2517 -339 382 -1264 280 291 -144 585 -369 445 267 -451 1329 119 -479 850 -884 12 950 -719
2535 -719 261 -136 -656 531 -83 14 100 -1014 803 137 -253 1117 -771 -194 942 -180 729 560
2553 560 -276 439 -10 643 695 -753 622 -53 -625 1328 -557 -663 880 -1089 -201 459 -643 -198
2571 -198 -334 -35 -1 -470 765 -242 -723 1281 -464 -243 1505 -806 -103 792 -508 472 217 -194
2589 -194 -74 -483 492 -334 -616 841 -1148 -559 1273 -1040 -320 511 -1237 137 358 -500 -96 -452
$$ packed form
2465c92M54Q69j077J005n06m51J167j467M97R15j847J202q3j160J534j022j04
2482d66Q26j480R68J31m11J111j390J78J168j255J508k98j429J801r78j2J437
2499A409k023O00M08q95J296p22m32L22o65P59j5j214J521j211j44J864k051Q54
2517c39P21j646J544J1m35P29r54Q14j78p18J780j210n98J329j734Q96R38j669
2535g19R80l97n20J187o14R7Q6j114J817o66l90J370j888N77J136j122R09j69
2553E60q36P15m49O53N2j448J375o75n72J953j885j06J543j969Q88O60j102M45
2571a98j36K99L4m69J235j007m81K004j745K21J748k311P03Q95j300R80k55m11
2589a94J20m09R75q26k82J457j989N89J832k313P20Q31j748J374K21q58M04l56
$$ plain form
2607 -452 195 -179 -405 1094 -577 -437 1296 -791 -114 1036 -944 -15 406 -331 302 -324 201 -257
2625 -257 -837 871 -409 -516 1484 -831 -234 1094 -777 166 692 -307 168 401 609 17 -438 1282
2643 1282 -582 -253 1549 -977 -320 1383 -1230 32 1056 -760 7 413 30 -199 -149 591 -830
2660 -830 -403 1443 -1026 7 1266 -1544 61 1147 -924 235 329 -272 -288 -66 400 -704 -174
2677 -174 981 -1081 -49 1131 -1471 -127 867 -1165 112 361 -464 69 -330 173 -440 -418 652
2694 652 -1101 -320 1121 -1195 -107 893 -1115 1 338 -386 155 12 292 -414 -152 1069 -920
2711 -920 -193 1384 -1267 -6 1262 -1335 46 798 -779 47 302 146 -517 -77 808 -716 -72
2728 -72 1405 -1160 172 1343 -1067 336 993 -777 350 738 -215 -162 270 436 -590 198 1112 -1067
$$ packed form
2607d52O47l74k26J499j671J40J733k087O77J150j980R29M21p37O33o26N25m58
2625b57n80J708j280j07K000k315N97J328j871R43N26r99M75K33K08n92m55J720
2643A282j864L29J802k526O57J703k613J262J024j816P67M06l83k29N0P40j421
2660h30M27J846k469J033J259k810J605J086k071J159R4o01j6K22M66j104N30
2677a74J155k062J032J180k602J344R94k032J277K49q25N33l99N03o13K2J070
2694F52j753P81J441k316J088J000k008J116L37p24N41j43K80p06K62J221j989
2711i20P27J577k651J261J268k597J381P52j577Q26K55j56o63M40Q85j524O44
2728g2J477k565J332J171k410J403O57j770J127L88r53N3M32J66j026P88R14k179
$$ plain form
2746 -1067 252 1102 -1379 542 487 -1043 323 276 -365 215 -7 111 -439 -26 830 -778 195 885
2764 885 -1131 437 695 -881 405 118 -374 113 -280 -72 -475 -386 668 -877 -307 689 -1304 -129
2782 -129 620 -1237 153 351 -512 124 -125 212 -127 -142 887 -541 -41 1124 -956 194 838 -1160
2800 -1160 381 486 -814 352 180 -388 -257 -38 303 -686 61 628 -1195 425 816 -743 527
2817 527 599 -674 782 296 -179 510 2 282 -131 134 718 -525 325 600 -1006 408 4 -819 559
2836 559 -242 -218 292 -292 104 -125 -111 485 -317 134 572 -743 492 316 -474 440 -94 -55 290 -262
2856 -262 540 -86 -595 659 -616 -340 653 -1085 -159 298 -1033 237 -109 -638 118 -297 207 -188
2874 -188 -368 690 -610 123 857 -917 306 468 -814 449 48 -577 317 -225 -199 120 -391 173
$$ packed form
2746a067J319Q50k481J921n5j530J366m7o41N80k22J18n50M13Q56j608R73O90
2764H85k016J568K58j576J286k87m92M87l93K08m03Q9J054j545N70R96j993J175
2782a29P49j857J390J98q63O36k49L37l39j5J029j428N00J165k080J150O44j998
2800a160J541J05j300J166j72n68J31K19L41r89P47N67j823J620L91j559J270
2817E27P2j273J456m86m75O89n08K80m13K65N84j243Q50K75j606J414m04q23J378
2836E59q01K4N10n84L96k29J4N96q02M51M38j315J235j76p90R14n34L9L45n52
2856b62Q02o26n09J254j275K76R93j738R26M57j331J270l46n29P56m15N04l95
2874a88j80J058j300P33P34j774J223J62j282J263m01o25Q94n42K6L19n11N64
$$ plain form
2892 173 -383 -207 325 -703 416 186 -744 589 24 -356 890 -90 31 700 -181 338 122 33 556
2911 556 -255 150 444 -611 499 -86 -283 617 -434 36 281 -738 306 89 -283 527 -506 -84
2929 -84 509 -522 441 269 -426 628 -153 74 499 -412 466 -80 -375 711 -484 -174 350 -660 156
2948 156 77 -598 427 -502 -411 284 -394 60 -143 -471 308 -318 -67 359 -687 234 160 -614 416 -152
2968 -152 -495 584 -581 4 174 -610 73 -345 -169 399 -348 57 276 -527 533 -149 -303 528 -420
2987 -420 296 504 -312 431 159 -152 605 -247 -27 482 -516 396 -29 -186 621 -211 -10 250 -577 379
3007 379 105 -163 627 -535 92 571 -474 401 176 -347 584 -34 149 427 -480 302 -52 211 671
3026 671 -407 -45 263 -579 460 -7 -786 437 -345 -163 475 -510 -165 -19 -196 52 -179 -4 153
$$ packed form
2892A73n56J76N32j028J119k30r30J333n65l80J246r80J21O69q81N19k16q9N23
2911E56q11M05K94j055J110n85j97R00j051M70K45j019J044k17l72Q10j033M22
2929h4N93j031R63j72o95J054p81K27M25r11Q78n46k95J086j195L10N24j010Q16
2948A56p9o75J025r29R1O95o78M54k03l28P79o26K51M26j046R21p4p74J030n68
2968a52l43J079j165N85J70p84O83m18J76N68p47M05K19q03J060o82j54Q31r48
2987d20P16K08q16P43k72l11P57q52K20N09r98R12m25j57Q07q32K01K60q27R56
3007C79k74k68P90j162O27M79j045Q75k25n23R31o18J83K78r07P82l54K63M60
3026F71j078L62L08q42J039m67p79J223p82J82O38r85L45J46j77K48k31J75J57
$$ plain form
3045 153 -627 303 -133 -806 497 -435 -442 595 -474 -88 77 -484 284 -234 29 390 -494 165 -95 -666
3065 -666 579 -107 -342 474 -551 75 380 -422 258 -201 -169 356 -389 350 209 -607 833 -82 -360
3084 -360 805 -222 -129 574 -103 297 226 18 573 -353 416 271 -890 572 -60 -655 921 -229 -316
3103 -316 537 -249 15 72 36 295 -435 143 62 -423 770 -49 -468 1068 -66 -224 833 -387 -289 216
3123 216 -241 141 -273 48 -20 -576 641 -556 -678 690 -648 -390 814 -588 -225 304 -330 16
3141 16 -291 188 180 -544 623 -149 -529 934 -297 -487 785 -611 -241 565 -352 2 -230 39 -149
3160 -149 -556 318 -240 -814 782 -312 -451 1017 -403 -410 810 -106 -49 216 216 3 -189 812 -252
3179 -252 -419 820 -332 -350 947 -654 -430 780 -451 -163 352 -190 -74 -240 584 -178 -383 903
$$ packed form
3045A53p80R30m36o73J303r32pJ037j069L86J65n61P68n18K63L61q84O59k60n71
3065f66J245o86k35Q16j025O26L05q02O80m59L2N25p45P39j41q16J440r15k78
3084c60J165j027R3P03o77M00p1k08N55r26P69j45j161J462o32n95J576j150q7
3103c16Q53p86K64N7l6K59p30N78q1m85J193q19m19J536j134j58J057j220R8N05
3123B16m57L82m14L21o8n56J217j197j22J368j338K58J204j402L63N29o34L46
3141A6l07M79qp24J167p72l80J463j231j90J272j396L70Q06r17L54k32K69j88
3160a49m07Q74n58n74J596j094j39J468j420pJ220r16N7K65%k13j92J001j064
3179b52j67J239j152j8J297j601K24J210j231K88N15n42J16j66Q24p62k05J286
$$ plain form
3197 903 -151 -271 1146 -396 -349 1023 -284 -71 456 -153 57 105 189 -173 -585 617 -472 -691 610
3216 610 -709 -435 776 -436 -226 297 -514 15 -128 165 3 -177 566 -277 -496 906 -462 -179
3234 -179 1079 -411 -136 470 -549 -258 -103 -154 -184 -345 465 -205 -639 632 -704 -403 778 -570
3252 -570 -119 673 -332 97 475 123 7 53 654 -174 -36 944 -430 -331 1067 -588 -177 870 -549
3271 -549 -49 340 -291 -374 -89 248 -348 -258 823 -271 -189 1083 -670 66 725 -541 295 676 -216
3290 -216 154 127 116 -44 -276 378 -433 -252 670 -642 -237 570 -690 20 203 -525 4 -79 -101 10 -256
3311 -256 382 -274 -190 784 -504 -77 764 -568 73 387 -551 -26 -1 -139 -117 -451 143 -402 -392 560 -721
3332 -721 -378 648 -701 65 489 -538 270 306 41 70 72 300 -169 -103 701 -617 59 608 -552 156
$$ packed form
3197I03j054j20J417j542M7J372j307K13N27o09K10M8Q4l62m12J202j089k19J301
3216F10j319K74J211j212K10N23q11N29j43K93j62j80P43q43k19J402j368K83
3234a79J258j490K75O06j019K91J55n1l0j61Q10o70m34J271j336L01J181j348
3252e70M51P92j005M29L78l52j16M6O01q28J38R80j374R9J398j655M11J047j419
3271e49N00L89o31q3K85L37n96R0J081j094Q2J272j753P36O59j266Q36L81q92
3290b16L70k7j1j60k32O54q11J81R22j312M05Q07j260P10J83p28N29q3k2J11k66
3311b56O38o56Q4R74j288M27Q41j332O41L14r38N25K5j38K2l34N94n45J0R52j281
3332g21L43J026j349P66M24j027Q08L6k65K9KK28m69O6Q04j318O76N49j160P08
$$ plain form
3352 156 689 -597 240 152 -206 51 -145 93 -13 -60 581 -390 -29 745 -456 226 541 -376 352 338
3372 338 -94 506 -306 159 208 -234 467 74 -345 734 -474 -165 238 -578 148 150 -303 213 -164 28
3392 28 146 -199 326 -295 -322 604 -300 -39 524 -621 294 170 -530 183 -132 -287 26 -503 352 -177
3412 -177 -385 440 -374 -177 348 -793 44 103 -538 434 -10 -262 357 -109 308 -2 -146 459 -391 46
3432 46 534 -511 185 331 -464 586 -61 -371 330 -247 138 266 -295 424 -99 -214 349 -369 48 349
3452 349 -461 379 21 -193 451 -281 158 138 -178 465 27 -380 442 -367 -18 428 -424 338 98 -316
3472 -316 210 -257 169 -85 -350 344 -239 -201 403 -516 5 278 -421 363 7 -329 216 -225 -63 254
3492 254 -477 315 -181 -277 386 -255 -213 214 -522 368 146 -591 396 -213 -200 194 -401 1 34 -420 407
$$ packed form
3352A56N33j286Q37q8l58K57j96K38j06m7O41r71L61P74j201O82L15r17P28j4
3372C38m32O00q12M65M9m42P01l93m19J079j208L09M03q16P26Km53N16l77J92
3392B8J18l45N25o21k7R26r04K61N63j145R15j24p00P13l15j55L13n29Q55n29
3412a77k08Q25q14J97N25j141Q37N9o41R72m44k52O19m66M17l10j44O05q50M37
3432D6M88j045O96J46p95J050o47l10P01n77L85J28n61P19n23j15N63p18M17L01
3452C49q10Q40l58k14O44p32M39k0l16O43m38m07Q22q09L49M46q52P62k40m14
3472c16N26m67M26k54k65O94n83L8O04r19N21K73o99P84l56l36N45m41J62L17
3492B54p31P92m96r6O63o41M2M27p36Q90k22p37R87o09J3L94n95M02L3m54Q27
$$ plain form
3513 407 -560 -112 280 -425 352 176 -449 510 -136 -153 638 -341 176 201 -362 360 -103 -135 402 -326 217
3534 217 160 -393 302 -74 -34 470 -331 95 123 -469 489 -37 -90 574 -407 198 425 -472 620 192 -236
3555 -236 616 -107 20 100 -353 300 -127 -21 268 -385 72 223 -453 492 -98 -355 419 -261 -337 -22 -451
3576 -451 372 -10 -65 354 -399 363 350 -614 218 194 -429 541 -142 -279 324 -350 269 22 -373 304 -572
3597 -572 -116 318 -298 182 32 -609 320 -101 -236 257 -154 -47 29 -101 285 -229 222 498 -511 354
3617 354 322 -380 469 -107 -279 352 -83 16 152 -256 184 -95 59 284 -499 286 189 -544 579 128 -266
3638 -266 582 109 -28 524 8 261 -33 184 354 -500 204 103 -647 421 44 -602 516 -268 -240 156
3658 156 -133 71 -57 43 194 -426 244 301 -666 479 69 -567 665 -304 -352 335 -275 -226 -55 -242
$$ packed form
3513D07r67M48L92p05P77j76o25R59o46j7P91r79N17K5n63P22m63l2N37p28N43
3534B17n7n53O95l76M0N04q01M26K8n92R58n26n3O64r81O05K27q97J092m28m28
3555b36Q52p23J27Q0m53O53m27J06K89o53M57J51o76R45n90k57P74o80p6L15m29
3576d51Q23l82n5M19p53P62j3r64Q32k4o23R70o83j37O03o74O19k47l95O77q76
3597e72M56M34o16M80j50o41R29m21j35M93m11J07P6j30L86n14M51K76j009Q65
3617C54l2p02Q49n76j72O31m35R9J36m08M40k79J54K25p83P85r7p33J123m51l94
3638b66Q48m73j37N52n16K53k94K17J70q54P04j01p50J068l77o46J118p84K8L96
3658A56k89K04j28J00J51o20O70N7r67J145m10o36J232r69m8O87o10M9J71j87
$$ plain form
3678 -242 56 -290 194 142 -714 485 3 -688 598 -160 -480 209 -116 -22 201 -2 168 -167 167 318
3698 318 -488 569 259 -418 642 -251 -356 442 -135 -97 175 -66 -107 -158 147 194 -429 518 135 -479 705
3719 705 -45 -248 648 57 -86 472 187 289 54 355 128 -265 441 147 -494 799 -205 -544 519
3738 519 -189 -396 313 -202 -224 125 158 164 -393 325 -60 -544 703 -76 -492 564 -3 -92 532 -57 -201
3759 -201 121 62 248 -429 73 -2 -576 381 -157 -697 301 -362 -561 444 -247 1 188 -173 107 -188
3779 -188 351 47 -442 582 -127 -430 719 -250 -450 379 -339 -337 220 -73 -132 -152 6 -12 -490 503 -84
3800 -84 -407 610 -99 -281 648 -303 -111 482 -294 200 93 208 212 -121 423 44 -508 665 -336 -304
3820 -304 779 -389 -147 246 -333 16 98 62 -24 -321 429 44 -415 440 -81 -238 690 -97 14 456
$$ packed form
3678b42K98l46M84n2q56J199m82o91J286p58l20O89l25R4K23k03J70l35L34J51
3698C18q06J057l10o77J060q93j05P98n77L8K72k41m1n1L05M7o23R47l83o14J184
3719G05p50k03Q96n91j43N58k85J02k35L01k27l93P06k94o41J293j004l39J063
3738E19p08k07P09n15k2L49L3On57P18l85m84J247p79m16J056n67q9O24n89j44
3759b01L22n9J86o77N02p5n74R57n38n40R98o63j99J005o91K48J87l61K80k95
3779a88N39l04m89J024p09l03J149r69k00Q29p18KN57k93n9k0J58j8m78R93n87
3800h4l23J017p09j82R29r51J92N93p76M94j07J15Ml33N44l79n52J173j001L2
3820c04J083j168K42L93n79L49Q2l6q6k97P50l85m59Q55n21j57R28p87J11M42
$$ plain form
3840 456 -274 58 167 -70 91 -239 -62 -176 -628 451 -183 -550 316 -454 -366 536 -355 -66 -17 -124
3860 -124 129 -117 114 119 -463 487 26 -106 645 -111 -297 457 -395 -189 131 -201 100 -82 -6 93 -420
3881 -420 301 -152 -338 631 -224 -228 387 -379 -18 490 -101 170 -97 76 342 -46 520 36 -63 562 -300
3902 -300 -102 621 -402 70 339 -258 141 -271 -190 -73 -143 446 168 -249 440 -85 -170 645 -77 82 482
3923 482 -72 146 62 -80 308 -306 358 212 -415 342 -258 -232 393 -481 -113 339 -534 106 -189 -171 200
3944 200 -426 88 34 -240 271 -85 -206 295 -266 -91 287 -345 219 192 -335 174 -174 -52 -160 -463 96
3965 96 -87 -255 394 -282 -76 365 -403 172 105 -269 316 23 160 601 -79 391 0 -155 444 -193 -88
3986 -88 452 -330 120 144 -272 270 -228 -108 190 -359 289 149 -304 323 -69 -75 436 -78 26 183 -60
$$ packed form
3840D56p30L32J09k37J61l30J77j14m52J079o34l67Q66p70Q8R02q91K89M9j07
3860a24K53k46K31Nn82R50m61j32P51p56j86P54q52K06L20l32L01j82P6R9n13
3881d20P21m53j86R69q55mO15p66L61N08n91K71k67J73K66l88N66m84r9O25q62
3902c00J98P23j023M72K69n97L99m12Q1J17p0N89k78m17O89n25q5Q15p22J59M00
3923D82n54K18q4j42L88o14O64j46o27P57o00K6O25q74L68M52q73O40k95J8L71
3944B00o26N14n4k74N11l56j21N01n61J75L78o32N64k7n27N09l48J22j08l03N59
3965I6j83j68O49o76K06M41p68N75o7l74N85k93J37M41o80M70l91j55N99o37J05
3986h8N40p82M50K4m16N42m98J20K98n49O48j40m53O27l92oN11n14J04J57k43
$$ plain form
4007 -60 321 -27 -92 502 -127 213 132 -243 322 -211 -178 377 -302 -43 317 -398 254 -24 -126 223 -291
4028 -291 109 128 -337 262 -357 -198 285 -235 -16 163 -319 122 -164 -275 326 -372 -90 237 -524 214
4048 214 -20 -334 470 -349 -215 341 -455 106 148 -164 312 -322 -95 299 -395 -52 -19 -328 294 -221 -2
4069 -2 359 -321 176 96 -149 257 111 -16 208 -100 303 19 -105 422 -66 -52 407 -268 103 122 -418 309
4091 309 20 -158 152 -54 107 127 -172 518 -77 -39 460 -239 123 235 -392 225 -16 -143 315 -231 -45
4112 -45 164 -234 85 -204 -32 193 -361 117 253 -453 197 -29 -299 274 -237 -149 111 -241 207 -52 -147
4133 -147 347 -219 26 349 -364 358 -35 -351 105 -266 -99 142 -190 -74 -100 -62 307 -388 64 355 -460
4154 -460 81 209 -282 546 -60 -74 237 64 79 0 16 433 -247 338 354 -406 215 242 -377 373 35 -230
$$ packed form
4007f0L81l48o5N94o29L40q1l75N65n33L3N55o79K59L60p15O52k78j02L49n14
4028b91M00J9m65N99o19J59M83n20K19J79m82M41k86j11O01o98K82L27p61P38
4048B14k34l14Q04q19J34N56p96N61M2l12M76o34K27L94o94L43L3l09O22n15K19
4069bL61o80M97q0k45M06j46j27K24l08M03k84j24N27m88J4M59o75L71J9n40P27
4091C09k89j78L10k06J61K0k99O90n95L8M99o99L62J12o27O17k41j27M58n46J86
4112d5K09l98L19k89J72K25n54M78J36p06O50k26k70N73n11Q8K60l52M48k59r5
4133a47M94n66K45L23p13P22l93l16M56l71J67K41l32J16k6L8L69o95M52K91q15
4154d60N41J28m91Q28o06j4L11j73J5p9J6M17o80N85J6p60O21K7o19P50l38k65
$$ plain form
4176 -230 197 -123 194 7 -74 261 -162 231 430 -408 126 197 -398 290 120 -357 377 -23 193 -24 -70
4197 -70 131 -424 -66 259 -493 63 217 -504 481 -13 -335 232 -69 -158 215 -231 104 -315 -68 53 -677
4218 -677 237 191 -407 414 152 -326 296 63 -229 124 -111 38 -287 -99 140 -437 224 115 -507 233
4238 233 -69 -567 380 5 -123 303 42 36 15 63 182 -252 212 159 -407 361 120 -416 343 -98 -231 372
4260 372 -73 23 19 17 289 -228 200 346 -560 364 57 -422 450 -16 -231 525 -17 127 113 81 219 -290
4282 -290 146 155 -520 414 153 -489 451 -158 -431 393 -300 -115 -15 -171 59 -56 152 81 -481 293 173
4303 173 -450 436 -83 -366 410 -59 -323 108 -203 14 -159 -46 152 -272 289 116 -501 148 -213 -617
4323 -617 476 -84 -267 388 -100 -13 -72 47 160 -373 319 145 -482 463 50 -820 463 -234 -276 269
$$ packed form
4176b30M27l20L17j87q1L35m23L93J99q38N34P1n95O88j70m77P34m00K16k17m6
4197g0K01n55L58L25p52N56J54p21R85m94l22N67l01q9L73m46L35m19K47J21p30
4218f77R14m6n98Q21k62m78O22k33k92L53k35J49l25J88K39n77O61j09o22P40
4238B33l02m98R47l75j28M26k61ok1M8J19m34M64n3n66P68k41n36P59m41j33O03
4260C72m45R6mkK72n17M28J46r06R24l07m79Q72m66k15P56n42J44j4l2J38n09
4282b90M36Ro75R34k61o42R40o09k73Q24o93J85J00j56K30j15K08p1n62P74j20
4303A73o23Q86n19k83P76m69k64M31l11K17j73J13J98m24N61j73o17O49l61m04
4323f17J093n60j83O55m88Q7n9J19J13n33O92j74o27R45m13q70J283o97m2N45
$$ plain form
4343 269 -140 -112 -18 -97 -84 -197 187 160 -468 368 188 -306 520 110 -182 432 38 131 299 -69 274 -160
4365 -160 358 350 -422 313 -68 -339 299 75 -416 234 -122 -196 108 -178 -99 -260 5 374 -324 337 -67
4386 -67 -466 392 17 -111 302 -146 -176 262 -209 33 -11 7 -2 -351 64 184 -435 202 -162 -213 278 -275
4408 -275 -158 214 -189 3 -102 -23 136 -266 340 181 -300 463 -76 -410 232 -230 -331 234 -159 79
4428 79 162 -100 310 -176 100 49 -318 254 56 -203 292 -229 42 329 -201 110 216 -259 48 124 -81
4449 -81 204 -294 242 -82 -190 359 -24 -183 156 -235 91 60 -239 239 -113 66 267 -230 392 160 -391
4470 -391 360 -137 -54 343 -217 59 308 -263 29 -79 -175 180 -117 43 71 -254 268 -31 -292 361 -299
4491 -299 -97 214 -235 152 -107 -177 58 -403 -15 135 -478 357 -212 -418 206 -205 -74 299 -258 110
$$ packed form
4343B69m09K8R4p9J3j13L84k7o28Q36j80m94Q26m10k92O14l94R3J68l68L43m34
4365a60N18qp72P35l81k71O38k24m91O50l56p4L04k86P9j61K65L69o98O61m04
4386f7l99Q58l75j28M13m48l0M38m71K42m4J8rl49M15J20o19O37l64n1M91n53
4408b75J17L72m03J92j05P9J59m02O06j59m81P63n39l34O42m62j01N65l93K38
4428G9Q3k62M10m86K76n1l67N72j98k59M95n21K71K87n30L11J06m75L07P6k05
4449h1K85m98N36l24j08N49l83j59L39l91L26l1k99M78l52J79K01m97O22k32n51
4470c91P51m97Q3L97n60K76K49n71K92j08r6L55k97J60K8l25N22k99k61O53o60
4491b99K02L11m49L87k59p0K35m61L88J50o13Q35n69k06O24m11J31L73n57L68
$$ plain form
4511 110 43 -64 260 -106 174 172 -404 191 29 -259 346 -186 53 367 -183 190 155 -110 349 -75 -98 136
4533 136 -381 191 97 -209 275 11 -6 292 -418 174 78 -291 432 -200 -42 323 -155 300 119 -414 261
4554 261 -260 -59 114 -385 171 252 -265 204 -172 -126 270 -126 101 131 -178 183 -168 -146 351 -231 68
4575 68 180 -214 191 -131 -232 234 -231 22 -21 -319 184 -309 -302 313 -481 -156 51 -443 325 35 -223
4596 -223 363 -288 194 0 -302 345 -108 -119 204 -217 115 291 -256 85 39 -230 254 -207 237 280 -303
4617 -303 338 -105 7 546 -145 -31 342 -156 316 107 -140 202 -251 -10 165 -209 362 -134 -273 194
4637 194 -337 41 157 -393 81 161 -254 226 22 -57 155 -250 338 81 -295 291 -83 -142 290 -371 57
4658 57 364 -249 200 -80 -121 186 -219 -20 167 -195 236 -127 -194 340 -375 21 179 -335 254 77 -345
$$ packed form
4511A10o7j07L24l66K80kn76N95j62k88O05n32K39L14n50L73l5k65M59m24k3K34
4533A36n17N72r4l06M84k64j7K98p10N92r6l69P23o32J58L65m78M55j81n33O75
4554B61n21K01J73m99N56Q1n17M69l76M6L96l96K27L0l09L61l51K2M97n82K99
4575F8J12l94M05l22j01M66m65K53m3k98N03m93PO15p94L25K07m94P68k90k58
4596b23N86o51M82j94l02O47m53j1L23m21L32J76n47L41m6k69M84m61M44M3n83
4617c03O41m43J12N39o91J14L73m98M72k09k47L42m53K41J75l74N71m96j39M67
4637A94n31L78J16n50M74Q0m15M80k04p9K12m05N88k57l76N86l74n9M32o61M28
4658E7L07o13M49k80m1L07m05J99J87l62M31l63o7N34p15L96J58n14N89j77m22
$$ plain form
4679 -345 -27 -185 60 -87 -103 357 -403 -46 359 -371 65 153 -312 40 -131 -261 208 -220 158 -42 -203
4700 -203 143 -205 -47 447 -295 171 264 -331 320 111 -206 151 26 -9 65 -188 320 32 -177 431 -337
4721 -337 22 330 -430 270 69 -327 64 -104 -216 135 -194 109 -270 -131 186 -416 30 406 -366 163
4741 163 242 -345 223 32 -214 64 -96 36 -231 -179 148 -279 102 292 -621 42 146 -537 247 -8 -237
4762 -237 118 -291 -60 -52 -257 246 -456 -60 507 -409 80 243 -475 128 167 -281 223 -75 -36 -49 -30 252
4784 252 -263 -48 361 -432 192 285 -471 329 137 -240 126 -42 45 228 -97 423 12 288 406 -315 161
4805 161 308 -415 321 229 -304 439 -29 -132 269 -201 276 -91 160 369 -450 126 328 -474 443 250
4825 250 -392 400 162 -198 136 -137 263 -64 -7 262 -381 126 317 -431 156 52 -518 182 -288 -213 217
$$ packed form
4679c45L18j58K45j47j6M60p60L57M05p30M36Q8m65L52j71j30M69m28L78k00j61
4700b03L46l48J58M94p42M66R3n95O51k09l17L57j25l5P4k53N08k88k09O08p68
4721c37L59L08p60P00k01l96L91j68j12L51l29L03l79J39L17o02M46L76p72N29
4741A63P9n87N68j91k46K78j60J32k67N2L27m27L81J90r13O63J04o83P84k55k29
4762b37L55m09K31Qk05N03p02L96N67r16M89J63p18O03L9m48N04k98L9j3J9K82
4784B52n15K15M09p93O24R3p56Q00j92l77L66j68Q7J83l25N20m11K76J18p21M76
4805A61J47p23P36r2n33P43m68j03M01m70M77l67K51K09q19N76K02q02R17j93
4825B50o42P92k38l60L34k73M00l27N7K69o43N07J91p48N87j04n70P00m70P5M30
$$ plain form
4846 217 -230 -71 77 -102 239 -200 27 131 -624 290 7 -522 258 -107 -427 383 -220 -89 94 -46
4866 -46 286 -245 -25 195 -387 205 203 -501 614 -55 -180 517 -14 25 102 -66 310 -272 74 354 -292
4887 -292 170 269 -606 461 113 -209 497 121 -229 169 62 144 -35 -256 251 -320 274 215 -247 323 75
4908 75 -228 369 125 -100 197 -115 62 -141 67 193 -219 141 170 -346 309 170 -308 334 -60 -294 132
4929 132 -342 248 46 -121 31 -381 -47 143 -591 252 59 -507 406 -310 -392 102 -154 -160 -14 36 221
4950 221 -103 -98 205 -263 443 112 -384 233 -80 -78 327 -211 85 235 -170 61 -77 186 369 -365 122
4971 122 25 -179 254 -71 -18 525 -79 -10 198 -121 156 91 -141 312 -244 136 78 -366 307 -106 -232 287
4993 287 -233 27 45 -179 208 30 -165 229 -391 42 210 -314 493 172 -173 458 -157 2 199 -326
$$ packed form
4846B17m47J59J48j79L41m39K27J04p55R14k83n29P80l65l20Q10o03J31J83j40
4866d6L32n31K20K20n82N92kp04J115o69j25O97n31L9P7j68L76n82L46K80o46
4887b92M62R9q75J067l48l22P06l76l50L98j07Q2j79k21N07n71N94n9m62N70k48
4908G5l03N97k44k25K97l12J77k03K08J26m12L60K9n16O55j39m78O42l94k34M26
4929A32m74N90k02j67J52m12L34J90p34Q43j93n66R13p16q2M94k56oJ46N0J85
4950B21l24NL03m68P06l31m96O17l13KM05n38K96J50m05K31j38K63J83p34M87
4971A22r7k04M33l25N3N43o04O9K08l19K77o5k32M53n56L80n8m44O73m13j26N19
4993B87n20K60J8k24L87j78j95L94o20M33J68n24Q07l21l45O31o15J59J97n25
$$ plain form
5013 -326 256 27 -276 433 -435 -93 176 -318 389 95 -365 231 -490 -181 203 -210 -100 -12 -67 156 -127
5034 -127 -7 249 -471 336 106 -361 175 -334 -325 113 -211 83 93 -116 183 -196 52 292 -317 190 141
5055 141 -358 135 53 -159 394 -48 333 152 -173 387 -9 62 402 -160 144 87 -450 471 -173 -136 192
5076 192 -406 97 91 -215 177 -261 -109 200 -298 291 39 -343 198 125 -173 336 -164 -50 96 -183 332
5097 332 -95 -289 314 -198 166 241 -436 372 17 -277 305 -174 -103 256 -177 111 -30 -347 88 -327 121
5118 121 246 -498 99 199 -430 224 -334 -244 227 -191 158 -46 -287 97 -292 -147 83 -396 168 136 -254
5139 -254 142 -309 -154 296 -136 162 184 -343 255 -5 111 274 -123 358 -23 -223 413 -239 -246 326 -384
$$ packed form
5013c26N82k29l03P09q68L42K69m94P07k94m60N96p21L09L84m13J10Q8n5K23k83
5034a27J20K56p20Q07k30m67N36n09RM38l24K94J0k09K99l79K48K40o09N07m9
5055A41m99M93q2k12N53m42L81j81l25N60l96P1L40n62L04n7n37R21o44L7L28
5076A92n98N03ol06L92m38J52L09m98N89k52l82N41p3k98N09n00J14J46k79N15
5097C32m27j94O03n12L64P5o77Q08l55k94N82m79P1L59m33K88j41l17M35m15M48
5118A21J25p44N97J00o29O54n58R0M71m18L49k04k41L84l89J45K30m79N64l2l90
5139b54L96m51J55M50m32K98K2n27N98k60J16J63l97M81l81k00O36o52pN72p10
$$ [...]
8191a0
##END NTUPLES=NMR FID
##END=
