##TITLE=1H_62-2023
 CDCl3
 8 sc, 
 31.8.2023
##JCAMPDX= 6.0         $$ Bruker NMR JCAMP-DX V2.0
##DATA TYPE= NMR FID
##DATA CLASS= NTUPLES
##ORIGIN= UXNMR, Bruker Analytische Messtechnik GmbH
##OWNER= root
$$ XWIN-NMR		Version 3.5
$$ Thu Aug 31 14:34:06 2023 Russian Standard Time (UT+4h)  she@DPX200
##.OBSERVE FREQUENCY= 200.13135
##.OBSERVE NUCLEUS= ^1H
##.DELAY= (6, 6)
##.ACQUISITION MODE= SIMULTANEOUS
##.ACQUISITION SCHEME= undefined
##.AVERAGES= 8
##.DIGITISER RES= 18
##SPECTROMETER/DATA SYSTEM= spect
##.PULSE SEQUENCE= zg30
##.SOLVENT NAME= CDCl3
##.SHIFT REFERENCE= (INTERNAL, CDCl3, 0, 15.7039)
##AUDIT TRAIL= $$ (NUMBER, WHEN, WHO, WHERE, WHAT)
$$ ##TITLE= Audit trail, XWIN-NMR		Version 3.5
$$ ##JCAMPDX= 5.01
$$ ##ORIGIN= Bruker BioSpin GmbH
$$ ##OWNER= she
$$ F:/spectra/data/she/nmr/H-F/1/audita.txt
$$ ##AUDIT TRAIL=  $$ (NUMBER, WHEN, WHO, WHERE, WHAT)
(   1,<2023-08-31 14:33:13.18 +0400>,<she>,<DPX200>,
      <created by zg, POWCHK disabled, PULCHK disabled
       configuration hash MD5:
       00 E9 B6 7A A2 85 ED C7 34 08 36 98 17 FE 4E 26
       data hash MD5: 16K
       65 A7 02 9C 0B 96 4E 31 2F 45 40 36 66 32 B5 03>)
$$ ##END=
$$ 
$$ hash MD5
$$ 52 3C D4 55 94 EE CD EB EB B9 58 3A F4 37 34 2B
##$RELAX= 
##$RELAX= 
##$RELAX= 
##$RELAX= 
##$RELAX= 
##$RELAX= 
$$ Bruker specific parameters
$$ --------------------------
##$DU= <F:/spectra>
##$EXPNO= 1
##$NAME= <H-F>
##$PROCNO= 1
##$TYPE= <nmr>
##$USER= <she>
##$AMP= (0..31)
100 100 100 100 100 100 100 100 100 100 100 100 100 100 100 100 100 100 
100 100 100 100 100 100 100 100 100 100 100 100 100 100 
##$AQSEQ= 0
##$AQ_mod= 1
##$AUNM= <au_zg>
##$AUTOPOS= <>
##$BF1= 200.13
##$BF2= 200.13
##$BF3= 200.13
##$BF4= 200.13
##$BF5= 200.13
##$BF6= 200.13
##$BF7= 200.13
##$BF8= 200.13
##$BYTORDA= 1
##$CFDGTYP= 0
##$CFRGTYP= 5
##$CHEMSTR= <none>
##$CNST= (0..31)
1 1 145 1 1 1 1 1 1 1 1 1 1 1 1 1 1 1 1 1 1 1 1 1 1 1 1 1 1 1 1 1 
##$CPDPRG= <>
##$CPDPRG1= <>
##$CPDPRG2= <>
##$CPDPRG3= <>
##$CPDPRG4= <mlev>
##$CPDPRG5= <mlev>
##$CPDPRG6= <mlev>
##$CPDPRG7= <mlev>
##$CPDPRG8= <mlev>
##$CPDPRGB= <>
##$CPDPRGT= <>
##$D= (0..31)
0 1.2 0 0 0 0 0 0 0 0.06 0 0.03 0 0 0 0 0.0002 0 0 0 0 0 0 0 0 0 0 0 0 
0 0 0 
##$DATE= 1693477992
##$DBL= (0..7)
120 120 120 120 120 120 120 120 
##$DBP= (0..7)
150 150 150 150 150 150 150 150 
##$DBP07= 0
##$DBPNAM0= <>
##$DBPNAM1= <>
##$DBPNAM2= <>
##$DBPNAM3= <>
##$DBPNAM4= <>
##$DBPNAM5= <>
##$DBPNAM6= <>
##$DBPNAM7= <>
##$DBPOAL= (0..7)
0.5 0.5 0.5 0.5 0.5 0.5 0.5 0.5 
##$DBPOFFS= (0..7)
0 0 0 0 0 0 0 0 
##$DE= 6
##$DECBNUC= <off>
##$DECIM= 32
##$DECNUC= <off>
##$DECSTAT= 4
##$DIGMOD= 1
##$DIGTYP= 9
##$DL= (0..7)
0 120 120 120 120 120 120 120 
##$DP= (0..7)
150 150 150 150 150 150 150 150 
##$DP07= 0
##$DPNAME0= <>
##$DPNAME1= <>
##$DPNAME2= <>
##$DPNAME3= <>
##$DPNAME4= <>
##$DPNAME5= <>
##$DPNAME6= <>
##$DPNAME7= <>
##$DPOAL= (0..7)
0.5 0.5 0.5 0.5 0.5 0.5 0.5 0.5 
##$DPOFFS= (0..7)
0 0 0 0 0 0 0 0 
##$DQDMODE= 0
##$DR= 18
##$DS= 0
##$DSLIST= <SSSSSSSSSSSSSSS>
$$ [...]
##$SUBNAM2= <"">
##$SUBNAM3= <"">
##$SUBNAM4= <"">
##$SUBNAM5= <"">
##$SUBNAM6= <"">
##$SUBNAM7= <"">
##$SUBNAM8= <"">
##$SUBNAM9= <"">
##$SW= 18.05172834244
##$SWIBOX= (0..15)
0 0 2 0 0 0 0 0 0 0 0 0 0 0 0 0 
##$SW_h= 3612.71676300578
##$TD= 16384
##$TD0= 1
##$TE= 0
##$TE2= 300
##$TE3= 300
##$TEG= 300
##$TL= (0..7)
0 120 120 120 120 120 120 120 
##$TP= (0..7)
150 150 150 150 150 150 150 150 
##$TP07= 0
##$TPNAME0= <>
##$TPNAME1= <>
##$TPNAME2= <>
##$TPNAME3= <>
##$TPNAME4= <>
##$TPNAME5= <>
##$TPNAME6= <>
##$TPNAME7= <>
##$TPOAL= (0..7)
0.5 0.5 0.5 0.5 0.5 0.5 0.5 0.5 
##$TPOFFS= (0..7)
0 0 0 0 0 0 0 0 
##$TUNHIN= 0
##$TUNHOUT= 0
##$TUNXOUT= 0
##$USERA1= <user>
##$USERA2= <user>
##$USERA3= <user>
##$USERA4= <user>
##$USERA5= <user>
##$V9= 5
##$VALIST= <valist>
##$VCLIST= <CCCCCCCCCCCCCCC>
##$VD= 0
##$VDLIST= <DDDDDDDDDDDDDDD>
##$VPLIST= <PPPPPPPPPPPPPPP>
##$VTLIST= <TTTTTTTTTTTTTTT>
##$WBST= 1024
##$WBSW= 4
##$XGAIN= (0..3)
0 0 0 0 
##$XL= 0
##$YL= 0
##$YMAX_a= 151206
##$YMIN_a= -186033
##$ZGOPTNS= <>
##$ZL1= 120
##$ZL2= 120
##$ZL3= 120
##$ZL4= 120
##$ABSF1= 10
##$ABSF2= 0
##$ABSG= 5
##$ABSL= 3
##$ALPHA= 0
##$AQORDER= 0
##$ASSFAC= 0
##$ASSFACI= 0
##$ASSFACX= 0
##$ASSWID= 0
##$AUNMP= <proc_1d>
##$AZFE= 0.1
##$AZFW= 0.1
##$BCFW= 1
##$BC_mod= 2
##$BYTORDP= 1
##$COROFFS= 0
##$CY= 11.3945322036743
##$DATMOD= 1
##$DC= 2
##$DFILT= <>
##$DTYPP= 0
##$F1P= 15.7292609196834
##$F2P= 12.9074282941183
##$FCOR= 0.5
##$FTSIZE= 0
##$FT_mod= 4
##$GAMMA= 1
##$GB= 0.15
##$INTBC= 1
##$INTSCL= 1
##$ISEN= 128
##$LB= 0.24
##$LEV0= 0
##$LPBIN= 0
##$MAXI= 10000
##$MC2= 0
##$MEAN= 0
##$ME_mod= 0
##$MI= 1.114404
##$NCOEF= 0
##$NC_proc= 0
##$NLEV= 6
##$NOISF1= 3.799351
##$NOISF2= 2.8
##$NSP= 1
##$NTH_PI= 0
##$NZP= 0
##$OFFSET= 15.70392
##$PC= 1
##$PHC0= -21048.28
##$PHC1= 12.05272
##$PH_mod= 1
##$PKNL= yes
##$PPARMOD= 0
##$PSCAL= 0
##$PSIGN= 0
##$REVERSE= no
##$SF= 200.130013532006
##$SI= 16384
##$SIGF1= 3
##$SIGF2= 2
##$SINO= 400
##$SIOLD= 16384
##$SREGLST= <1H.CDCl3>
##$SSB= 0
##$STSI= 0
##$STSR= 0
##$SW_p= 3612.71676300578
##$SYMM= 0
##$S_DEV= 0
##$TDeff= 0
##$TDoff= 0
##$TI= <>
##$TILT= no
##$TM1= 0
##$TM2= 0
##$TOPLEV= 0
##$USERP1= <user>
##$USERP2= <user>
##$USERP3= <user>
##$USERP4= <user>
##$USERP5= <user>
##$WDW= 1
##$XDIM= 8192
##$YMAX_p= 0
##$YMIN_p= 0
$$ End of Bruker specific parameters
$$ ---------------------------------
##NTUPLES= NMR FID
##VAR_NAME=  TIME,          FID/REAL,        FID/IMAG
##SYMBOL=    X,             R,               I
##VAR_TYPE=  INDEPENDENT,   DEPENDENT,       DEPENDENT
##VAR_FORM=  AFFN,          ASDF,            ASDF
##VAR_DIM=   8192,          8192,            8192
##UNITS=     SECONDS,       ARBITRARY UNITS, ARBITRARY UNITS
##FACTOR=    0.0002768,     1,               1
##FIRST=     0,             0,               0
##LAST=      2.2672688,     0,               0
##MIN=       0,             -186033,         0
##MAX=       2.2672688,     151206,          0
$$ Real data points
##PAGE= N=1
##DATA TABLE= (X++(R..R)), XYDATA
$$ [...]
2547d89L963m614k986M638j774L461K72o135K939m19P08N106n318r66J191k734
2563c157O203m25m147J991l552K589M385l995J186k116k509O635j615q09O53n686
2579d369L794K600k153L160n189j579M856j938L036p6o043L460j14J050L894n709
2595a320k15J500k031N390j364l968K421k877K803L727m906R95j682j094N948
2610C327k189j134N94m980M294K343k375K023m578o72N134j975K639j128n349
2625d026M507n87P65L007n897P11K194k027M767k567l433K894k339L336K477n568
2641a786J742j348m32N854l447j142L08l728M957J264k830J966m458N81M753k231
2657B3K061j743m008M801m95J85K031n631J470K400j729M282l616l048L728k069
$$ y = [-489, 3474, -1140, -4126, 512, -1262, 2199, 2471, -3664, -725, -1144, -436, 4670, -648, -1614, -423, -3157, 3046, 2621, -1526, 465, -3087, -498, 3887, -108, 1078, -1038, -3547, 3088, 1473, 664, 1317, -4369, -575, 2025, -128, 3032, -2157, -3736, 1120, -818, 2218, 2142, -3901, -441, -555, 495, 4389, -1320, -1535, -35, -2066, 3324, 1960, -2008, 413, -2464, 339, 4066, -840, 155, -1527, -2621, 3327, 1138, 4, 598, -4382, -88, 2255, -120, 1903, -2675, -3347, 1787, -188, 2451, 1323, -4026, 481, -106, 659, 3666, -2231, -1520, 674, -1353, 3414, 847, -2586, 308, -2031, 1305, 3782, -1786, -44, -1392, -1824, 4030, 583, -559, -251, -3979, 978, 2242, -588, 1378, -3080, -2499, 2254, 23, 2084, 341, -3667, 1134, 639, 824, 2855, -2776, -1306, 1094, -635, 3647, 31, -3017, 711, -1358]
2673a358L257J280n478J631p78J28N349m145j138N99l260N462P12l056J720l870
2689b945J354M526k929J870k006l292N408j208J37J335n482K330K388j785L303
2704C004l614k336L599j584L016N98n728K589j121R00M545m565q66J093k682N333
2720B181k46k994J982l460J790L836l442J670j845k044M922j843j2R54m661K899
2736c13J960j909K877l876j231L507j922K678j20m773K914q62N42L861m687L50
2752a004R36k185M439q81k796K570l073K124K696l830K135j730j194M458k501
2767A64l97J337m127L781Q99k256K654m106j7L806k578K481q19l893L633j095
2783e33M11K907m674J102J332k224M340k292k077L035k856K271J805m443K552
$$ y = [-1358, 1899, 3179, -2299, -668, -1446, -1318, 4031, -114, -1252, -653, -3913, 1549, 2261, -795, 925, -2945, -1591, 2935, 6, 1876, -130, -3422, 1986, 778, 915, 2250, -3232, -902, 1486, -299, 3004, -610, -2946, 653, -931, 2085, 2683, -3045, -456, -1577, -677, 3868, -697, -1563, -470, -3152, 2181, 1935, -1059, 923, -2537, -747, 3089, -353, 1317, -528, -2572, 2350, 507, 495, 1449, -3212, -313, 1647, -262, 2615, -1261, -2492, 1015, -907, 1771, 1651, -3122, -208, -1070, -528, 3333, -1354, -1004, -68, -2253, 2186, 1305, -1491, 1079, -1994, 130, 2826, -1004, 1131, -599, -1793, 2665, 164, -233, 1104, -3023, 758, 1657, -599, 2055, -2051, -2068, 1738, -840, 1641, 822, -3071, 562, -533, -122, 2785, -1889, -787, 545, -1679, 2661, 369, -1708, 1327, -1529, 742, 2547, -1896, 656]
2798F56j260o51M189l349j65J202l360L858L37k393K188l299P03L323k907K194
2814A266j175l230M442j497K13K060m428J991J365j862L498k668j777L225k544
2829a121K265R96m253K656q77n69L684l678K37J102k697M096o15k690K565l211
2845b110J299K990l204J878j033k512M540j908M9J856m219K443J122k083L359
2860B467l020r91L025k603K214M02l731L163j420k28L198l754P06Q32k046L521
2876A735j119k295K793k997J506K526l398K215j263j688L982k247K71J603l662
2891b038K674O89k546L276k790j55K812l287K316j87k624K996j452m35K567l911
2907b095J573J115k197L293j808j621K981k678J571J725l437K451p40j518L481
$$ y = [656, -604, -1255, 2934, -415, -580, 622, -2738, 1120, 1457, -936, 1252, -2047, -1344, 1979, -928, 1266, 91, -3139, 1303, -194, 19, 2079, -2349, -358, 1007, -855, 2643, -25, -1802, 1423, -1121, 1144, 2140, -2113, 543, -334, -903, 2781, -897, -660, 442, -2255, 1841, 1226, -1464, 1101, -2110, -811, 2179, -1025, 853, -180, -2692, 1848, -60, -11, 1845, -2374, 69, 1191, -892, 2467, -553, -1544, 1481, -1122, 1092, 1494, -2237, 926, -494, -722, 2476, -1278, -572, 260, -1786, 1735, 616, -1679, 1114, -1883, -377, 2149, -1249, 966, -297, -1985, 1997, -250, 21, 1624, -2038, 636, 1325, -1221, 2055, -735, -890, 1922, -1365, 951, 764, -1860, 1136, -316, -751, 1816, -2095, -522, 593, -1604, 1689, -119, -1740, 1241, -1437, 134, 1859, -1578, 873, 133, -1385, 2096]
2922B096k785M74J823l371K928l29k406L070k378M53K549l652J970l64k304L927
2938A701j907n39J953l681K415J276k272K759k241j322L317k311J719N87l599
2953b145L205r48o99K724l263N33J807k780L202j124k317K893k355J363K052l645
2969a497J725n81j652M009j957o52J336l409K720J463k416K716k552q81L420k678
2985h86J961K48l465L197j140m57K580l534R66J878k596L145j590k259K860k073
3001a165J482J793l778J545n76j230M041k094m68J077l081L113Q04k505K798k699
3017i43J6K902k993J893J10k734L294j597o37K535l639J453J732k654K934j980
3033c08j840L180j823J376J292l920K370p50j245L807k703N9J505k841K824M2
$$ y = [2096, -689, -215, 1608, -1763, 1165, 836, -1570, 1500, -878, -425, 2124, -1528, 442, 78, -2226, 1701, -206, -745, 1208, -2473, -58, 1218, -1054, 1705, -536, -1858, 1459, -852, 867, 1454, -2145, 1060, 112, -587, 2137, -1126, -593, 1214, -1566, 1636, 512, -1805, 1088, -1267, 96, 2148, -1497, 228, -353, -2005, 2004, 47, -605, 731, -2678, 42, 1505, -911, 1805, -747, -1628, 1792, -886, 1075, 1323, -2142, 1055, -85, -542, 2038, -1496, -530, 1348, -1248, 1897, 307, -1952, 908, -1165, 317, 2110, -1668, -123, -699, -1929, 2112, 18, -450, 627, -2454, 659, 1463, -1042, 1756, -943, -927, 1975, -1018, 875, 985, -1749, 1545, -52, -689, 1846, -1793, -340, 1392, -1262, 1672, -308, -2148, 1032, -791, 585, 1877, -2043, 327, -423, -1668, 2139, -564, -505, 1000, -1841, 983, 1025]
3049A025k193K753k356M32K453l519J743J07k189L800j765j294K194l223K246
3064B14J614k846K549k357j233L482k200J604N38l892L040m24j035L233l424L33
3080h04J816k282K913j150k158K941k058J184J927m202J774J7j212L689k109j477
3096a191J606k820L115J042k583J982k720l13L709k424J309K7l184L103l31n18
3112a91K241l726R48K055j967K849k029k442L442j905J591J452m388J569n8l10
3128h69L639k631j362J309k551L150J176k722J652k520J34L751k517J161m63k977
3144b640L821n72q10K144l875J300K239k163K500j999k257L041j224J606J001
3159B112m452J939nj34L364l013r82J187k343L507N83k978J926k497O74L468k839
$$ y = [1025, -1168, 1585, -771, -339, 2114, -1405, 338, 445, -1744, 2056, 291, -1003, 1191, -2032, 214, 1828, -1018, 1531, -826, -2059, 1423, -777, 827, 1365, -2527, 513, 89, -946, 2287, -1137, -804, 1012, -1270, 1643, 493, -1665, 1276, -782, 402, 2329, -1873, -99, -82, -1294, 2395, 286, -1191, 415, -2405, 710, 1752, -831, 1151, -1569, -1882, 1827, -597, 712, 739, -2445, 658, 327, -191, 2050, -1676, -728, 1327, -640, 2209, 180, -2262, 1180, -725, 866, 2318, -2070, -501, -559, -869, 2770, 139, -1223, 86, -2465, 685, 1861, -861, 791, -1729, -1595, 2156, -361, 800, 337, -2640, 1181, 609, -201, 1943, -1932, -632, 1607, -556, 1944, -55, -2312, 729, -495, 1111, 2112, -2340, -401, -406, -540, 2824, -189, -1171, 16, -2327, 1180, 1763, -1215, 711, -1786, -1112, 2356, -483]
3176d83J250p18k463M060q52q81J554l705J875J867j873K224k575j690L534j433
3192c09J473K52l960K026K53l30L362l500n81J461j984L388j52k716J917k166
3208a566J320K694l222J242p43j481L862j344j266J275k886K182J722k251J975
3223A513k876o85L671k119J666r1l949K826K3p8K526l715j8J622j479L093j075
3240H55k683K359j704J474K324m065J655n98j214M265k323j020J072l088L399
3255G08J166k358J589k734k39L743j999J043n45l261L435k74k99J931l598O45
3271a047J703j485L049j881k371K944j901J910J444m023J532m59k47L753k679
3286B42j093R23k344L231R38k801J656k615K32L872k403R87r69k673L596r9l92
$$ y = [-483, 767, 49, -2414, 1646, 794, -87, 1467, -2238, -363, 1504, -369, 1855, -720, -2410, 1124, -309, 1164, 1416, -2544, -518, -265, -595, 2767, -733, -1314, 147, -1837, 1551, 1399, -1317, 600, -1566, -246, 2448, -774, 468, -275, -1756, 2106, 762, -504, 771, -2115, 67, 1789, -462, 1513, -1363, -2048, 1623, -496, 1170, 1079, -2870, -44, -21, -99, 2427, -1288, -1306, 316, -1163, 1930, 855, -1828, 531, -1173, 301, 2625, -1440, 215, -383, -1597, 2668, 345, -675, 397, -2691, 708, 1874, -484, 1105, -1629, -1868, 1875, -124, 919, 374, -2887, 548, 274, -25, 1906, -1692, -1047, 656, -829, 2220, 339, -2032, 912, -989, 921, 2365, -1658, -126, -585, -832, 2921, 242, -851, 72, -2272, 959, 1897, -904, 752, -1863, -1631, 2241, -162, 825, -144, -2817, 779, 680, 288]
3303B88J456l843J267J796j465K854k282k193K988j682J854R94l926J562k16j15
3319f63L422l042q08J250k165L522J9k654J594k402J149L131k940J134q89k147
3335b489L939q21m49J291l808K069J649j462K335k703j726L009j114J347M06l770
3351b297K184l06k7L148l514l15J214j696L419n80k675J633k061J671K430l042
3367h14J055j053j190L996j349n79Q25l445K755J393j834J943k928n75L168j661
3383b93J481n17l038K575j34J53K073l604O9J715j578L127j360k610K117j736
3399a560J838K164l434J139j072m90L750j828n41N01k725L039P68j989J827k769
3415a382q2K922j764J342q39k721K921j80n3J813l826Q82J326j123K860k128j815
$$ y = [288, 1744, -2099, -832, 964, -501, 2353, 71, -2122, 866, -816, 1038, 2032, -1894, -332, -548, -663, 2759, -283, -1091, 159, -2006, 1516, 1535, -1119, 475, -1927, -778, 2353, -587, 547, -342, -2489, 1450, 629, 180, 1471, -2337, -268, 1381, -81, 2254, -449, -2175, 834, -280, 1067, 1473, -2297, -113, -419, -446, 2702, -812, -1127, 87, -1609, 1810, 1230, -1445, 188, -1873, -202, 2228, -814, 241, -812, -2002, 1994, 645, 66, 891, -2554, 201, 1594, -240, 1703, -1225, -1800, 1368, -293, 1188, 671, -2367, 208, 74, 227, 2300, -1304, -1235, 480, -1098, 2029, 669, -1941, 176, -1560, 278, 2442, -992, 147, -925, -1415, 2335, 507, -34, 467, -2258, 781, 1549, -440, 1387, -1382, -1464, 1458, -306, 1036, 197, -2524, 397, 217, 164, 1977, -1849, -967, 359, -764, 2096, -32, -1847]
3432a847K185j495J875J392l468J377n74m67L630k448m70N40k201L060L60j930
3448d81J277k484P43K773k171J365j255k412L493m02k36J175l650J655J248j063
3464d25K592k539j348K242j508K330L11l173J520m85L7K898k662k84P43j883K951
3481A317j0k185J429k326R38K554k090Q49j108j315L225j081k29R79k943J734
3497b62R58q90K005k322j111K414j148J501J45k975J933k99j67K463l065J79O82
3514D1j475K929p16k092J489j743J395J827k535J129o15j312L467j765J8P54k636
3531a840K201Q28j544J682k221l04K617j691J443l80k569K354n99J19J717l031
3547a218L58J269j398K677j196j890J707j640J609J373k596J096n26r62L173j915
$$ y = [-1847, 338, -1157, 718, 2110, -1358, 19, -555, -1022, 2608, 160, -310, 230, -1971, 1089, 1449, -481, 796, -1688, -945, 1828, -343, 1022, -233, -2645, 848, 446, 210, 1385, -2265, -610, 638, -425, 2167, -372, -1720, 522, -986, 1344, 1655, -1518, 2, -483, -446, 2452, -210, -494, 249, -1634, 1317, 1307, -878, 551, -1775, -837, 1717, -373, 476, -632, -1947, 1278, 197, -32, 947, -1996, -262, 696, -194, 1811, -511, -1622, 792, -356, 1145, 1290, -1685, 248, -51, -218, 2245, -820, -641, 41, -1434, 1495, 779, -1313, 176, -1567, -172, 1655, -880, 249, -366, -1678, 1789, 24, 42, 796, -1840, 361, 1189, -355, 1327, -894, -1198, 1419, -272, 1171, 791, -1778, 576, -23, 96, 1813, -1218, -860, 409, -989, 1688, 492, -1398, 309, -1331, 278, 1651, -945, 151, -375, -1337, 1836, -79]
3563g9k6O57k095K123P13j830J568k103K7K605j978J418o77k131K381o19N9J320
3581A333k774Q65J123j518K367j281j530K121j824J448J014k427J374q61k34K625
3597A821k292J98P45k115K706k25j497J621j994N82J890j976J233n24j765K359
3613G67o86N3Q25k305J208O48j556K417j538p67J836j798J453N81k403J757m97
3630en31K366k578K96J196j745K029k94j644J760k188J250J649k218J212q60j224
3647a529K593j156M3P92k215J641L86j532K056j760k48K068j664J240j37k116
3663a538K184l40m03J476k517P03J012j398K264r45j601J670j757J213J521k563
3679a019J482q52r41K623j512j06R96j994J665K42j317J609j751J20K079j760
$$ y = [-79, -105, 552, -1543, 580, 1293, -537, 1031, -1072, -1045, 1560, -418, 1000, 323, -1808, 573, -46, 13, 1333, -1441, -576, 547, -971, 1396, 115, -1415, 706, -1118, 330, 1344, -1083, 291, -570, -804, 1821, -471, -273, 472, -1643, 1063, 838, -659, 962, -1032, -450, 1440, -536, 697, 173, -1592, 767, 81, 134, 959, -1346, -138, 510, -1046, 1371, -167, -934, 902, -896, 557, 1138, -1265, 492, -5, -536, 1830, -748, -452, 744, -1001, 1028, 734, -910, 850, -1338, -88, 1561, -657, 555, -305, -1529, 1064, -92, -49, 743, -1472, 169, 555, -977, 1079, -681, -929, 1139, -525, 715, 578, -1538, 646, 306, -97, 1379, -1138, -435, 577, -821, 1443, 498, -1103, 567, -1190, 23, 1544, -1019, 463, -389, -1330, 1293, -219, -325, 671, -1323, 342, 584, -733, 876, -875, -755, 1324, -436]
3695d36J136l51j824K471p15l17J355k667R36Q23j151K094j441j115J878j601
3711i25J126R89k112J134m42q15K330j665J86Q50j828J990k61j354J616j689N11
3728c59J692j801R75m23j644K421p97R0J207k618J107L79q70J789j264r10J628
3745F02j482J240M77j977J824o67q18J860j918P26P55j482J790n15j292J621j510
3762g66P21J297j839R91m73j056K223j247J61R21k392J530L79r11J356j551j12
3779g68J665j619R54K55j647J988q39o43J619j902P26R36j397J501p27j184J885
3796H03j333P94Q96k144J453l29q70J939j461p2J009j770J786k60j431J707j237
3813e20L25J491k168R16or90J918p04n98J003j826J032J304j457J194j263o33
$$ y = [-436, 700, 349, -1475, 996, 281, -36, 1319, -1348, -412, 411, -740, 1354, -87, -1202, 676, -925, 201, 1190, -922, 212, -230, -1045, 1285, -380, -194, 656, -1172, 818, 557, -797, 819, -870, -359, 1333, -468, 507, 84, -1560, 861, 64, 154, 1361, -1257, -150, 229, -641, 1148, -116, -1026, 602, -880, 360, 837, -1140, 684, 17, -801, 1059, -859, -133, 622, -860, 930, 415, -877, 744, -766, -45, 1252, -587, 404, -69, -1125, 1098, -149, 12, 933, -1459, 71, 450, -461, 895, -656, -768, 897, -722, 232, 487, -1160, 828, -11, -654, 965, -937, -211, 725, -672, 829, 102, -1082, 803, -530, 264, 1160, -984, 469, 140, -730, 1209, -252, -324, 685, -1085, 701, 441, -990, 717, -520, -195, 1296, -872, 44, 38, -952, 966, 262, -336, 667, -1159, -127, 1177, -280, 914, -349, -982]
3830i82J631j013R72K75j997J520k21q10J874j748j14J087j397J628m08j422J525
3847D00j084N81J355k049Q63l58q88K406p90p96R34j925J428J045j329J363j584
3864d28o33J844r23R21M0k180J827m18p20J545j951M07J114j327J874p04j381
3881a093J519j082N85J411k235J088l24p49K382j093n67N66j718J754L51j233
3897d38J438j526l36J744j257Q47k38j568J724l41n64J166j554M62J011j137J425
3914H58p51j213J735j044Q91Q86k365J128k39m76J915j357k51P16j434J596J43
3931G38j007J041j426j51J776j485O58k31j197J942q73r2J025j675R51P04j124
3948d26J510j236r77K038q23N60L89k171J219m3l41J626j639k90Q74j262J688
$$ y = [-982, 649, -364, 608, 883, -1114, 406, 185, -625, 1249, -499, -613, 474, -923, 705, 297, -1125, 400, -684, -103, 1252, -797, 66, -292, -1180, 1226, 436, -360, 574, -1351, 77, 1122, -207, 1156, -428, -1061, 783, -140, 781, 821, -1359, 468, 50, -670, 875, -1076, -669, 445, -882, 992, 288, -1093, 426, -656, -71, 1340, -895, 193, -131, -880, 1502, 409, -158, 408, -1310, 444, 795, -438, 1000, -526, -862, 882, -375, 472, 234, -1334, 390, 49, -515, 651, -903, -441, 570, -567, 858, 107, -1106, 629, -415, 476, 1362, -1003, 125, -114, -590, 1325, -32, -283, 433, -1001, 595, 738, -269, 772, -654, -805, 971, -514, 144, -87, -1284, 658, -215, -307, 718, -957, -6, 698, -426, 1084, -152, -1129, 909, 86, 646, 1035, -1136, 83, 40, -301, 1325, -314, -604, 270, -992, 696]
3965F96j23j402J123r27L81J257j601O52j90q25J758o26m42O69j810J593R12j501
3983d06J351j514m06J940j091O33K55k201J762j78k81J527j930j46Q08q42J597
4000H78m58j479J294r03M83J324j912Q03k76p70K220r10m64K42j353J511Q67j345
4018b48J067j313m58K004j304R78l11j739J500j1r9J249k264J76J123q85J610
4035A075r93j176J248r31R73Q75j817M53j71k84K266j285n66P34j646J785N45
4052A085j314Q92j431N2J820j082P29o54j625J880J18k74N80j843M83R72p55J366
4070I99j258r85J452q14R17Q80k190R29j52j6J778j558l90M09j083J695K16j344
4088e15J122j459K17J846j221M22n69j158J865k95j70P71k228R62J001r36J254
$$ y = [696, 573, -829, 294, -633, -252, 1005, -596, 56, -134, -959, 799, 173, -269, 400, -1410, 183, 1095, -406, 945, -569, -975, 965, -126, 507, 762, -1439, 323, 145, -136, 1391, -539, -685, 123, -719, 878, 420, -1059, 235, -668, -185, 1139, -773, 30, -246, -1016, 1204, 294, -170, 72, -1281, 230, 1097, -248, 819, -494, -952, 1052, -252, 726, 415, -1324, 176, 165, 66, 1315, -949, -773, 350, -535, 1075, 82, -1094, 154, -777, 196, 1071, -746, -293, -464, -748, 1518, 233, -333, 401, -1245, 540, 1085, -229, 663, -768, -716, 1104, 22, 751, 97, -1528, 352, 470, 196, 776, -1067, -584, 388, -367, 999, -259, -1244, 208, -606, 311, 1191, -999, -70, -222, -238, 1540, -18, -408, 1, -1082, 613, 829, -515, 607, -852, -635, 1211, -10, 412, -157, -1315, 550, 255, 85, 856, -1372, -410, 591, -345, 909]
4105I09j245r50J694p28P79N06k119J073N8j05J483j678k07P24j116J845j59j532
4123g68J058j094O12J447j393L33m09r95K027o25k88P31j749R24R70j081J117
4140H17j496k89J662j004J005J1j985J293o0J18J352j880j28Q56p68J753o65j681
4158a089J508j176P84J280j993P49n10o42K220q52k98J93j623J666N76j148R09
4175E54j201m04J948j084P20k02j659J674rl11J186j860K59P57q87J653q09j214
4193h89J100p15Q27P75j830Q22m98m37K073j140n02M39j322J763K51j094J010
4210F33j500K59J770j242N78k72j496J866l56Q4O37k186Q89P01n32J075r19p69
4228g80J099j130J201P22k182Q35m7l25J908j625N4M12j234J939k05q49R12j617
$$ y = [909, -336, -1286, 408, -320, 459, 965, -1154, -81, -23, -128, 1355, -323, -530, 194, -922, 923, 764, -768, 290, -804, -192, 1255, -138, 195, -214, -1209, 818, 193, -95, 636, -1113, -189, 781, -300, 817, -679, -968, 694, -310, 695, 706, -1279, 14, -46, 72, 1424, -456, -584, 272, -496, 1257, 592, -1089, 419, -757, 27, 1307, -686, 63, -447, -1089, 1131, 279, -19, 174, -1449, 217, 793, -355, 554, -647, -1051, 897, -187, 533, 331, -1328, 346, 337, 26, 1212, -648, -389, 368, -519, 1134, 325, -889, 211, -504, 323, 1098, -732, 90, -408, -845, 1228, 88, -414, 25, -1297, 466, 717, -377, 633, -867, -608, 1162, -80, 498, 226, -1270, 596, 240, 324, 961, -1225, -336, 365, -167, 908, -11, -780, 319, -811, 390, 1112, -1070, -235, -282, -607, 1301, -324, -270, 142, -1092, 847, 642, -207, 705, -912]
4246i12O93J340j098L90n84r92J552j89r1P13k030P77P63q69J433j100r32J551
4264D15j022J103K58j971J241lm77J836j706J09M67j135J722l69q61P58j225P63
4282i7J214j614Q98m35r50J794n92j92M10j609J095O50q41J232j514o03J753q53
4300b54P79J28j820J504n92O6J368j549K65L76q91J551n62j157R61r81J096O55
4318I43j444Q17o37n69J838r61m5M32j469J273M33p55Q56j445J85J227j071R83
4336E91j44j474J308l24J61Q42j783N76N89q20J492r62p63J117j244R80N37j172
4354d93O42m04m36J641r70l31O48j386J589L4p86O00j206N32Q62n98M02j41j265
4373a066J452l78J02O34j436N72M39q30J313r78m28R63p78Q47M47j862J217o48
$$ y = [-912, -219, 1121, 23, 413, -171, -1163, 389, 200, 109, 822, -1208, -431, 332, -537, 896, -204, -1136, 415, -607, 496, 754, -1217, 24, 21, -456, 1380, -326, -217, 250, -885, 837, 468, -393, 365, -860, -97, 1117, -497, 401, -34, -984, 810, 218, 26, 436, -1173, -78, 572, -269, 963, -551, -1154, 599, -254, 525, 653, -1167, 337, -255, -189, 1179, -370, -105, 271, -620, 931, 369, -788, 173, -808, 288, 943, -501, 316, -321, -890, 948, -13, -58, 374, -1095, 178, 611, -144, 712, -733, -548, 679, -392, 591, 447, -1027, 281, -43, 118, 960, -823, -247, 342, -478, 1014, 52, -711, 406, -838, 142, 679, -493, 149, -255, -691, 950, -20, -351, 297, -1089, 500, 534, -252, 348, -858, -326, 536, -62, 340, 199, -1066, 386, 8, 110, 744, -692, -120, 319, -511, 802, -176, -604, 359, -419, 428, 875, -987, 230, -418]
4391d18j46J485j207J53L96j072J477k78r52J336j480L19J125j147O49k84p74
4408h18J409l53k75O32j441Q99K28o04R41r44l72J074p91Q22J27j669J417l49
4426f7k27J306j491K23M89j012J317j28r97J280j367O63R72j332P57m83o57J550
4444G96q26J9O42j507J096J70p84J167j048m44J229q66N37R0j194J305o08r2J272
4463I54j513M19L05r19J601n75p03J023j291P54Q40j359R02l93o09J299q88J74
4481B1K94j265J219Rr79J144r21J70R74r31O80k8j340J266m48O8O52j193O45R5
4501A32q45J424o40n36J070j211P26M20j133R40n07k78J291j296L49M94r25Q79
4519C54p6p72J007r62K41Q00j173P92Q6j047J301p28o6R16j340P39K54r99J197
$$ y = [-418, -564, 921, -286, -133, 263, -809, 668, 390, -562, 774, -706, -387, 738, -409, 240, -44, -818, 591, 238, -37, 595, -846, 53, 281, -323, 618, -326, -698, 376, -415, 407, 534, -1135, 282, -67, -294, 1012, -479, -256, 233, -779, 538, 410, -587, 693, -674, -11, 961, -371, 386, -97, -754, 796, -30, -11, 631, -876, 220, 390, -394, 773, -275, -719, 510, -356, 181, 271, -923, 382, -226, -318, 954, -559, -140, 165, -754, 847, 272, -431, 592, -699, 55, 895, -464, 438, 45, -564, 735, -153, 21, 315, -950, 269, 278, -701, 443, -478, -308, 666, -265, 415, 387, -953, 313, -135, -67, 585, -608, 37, 132, -713, 711, 71, -465, 605, -606, 120, 540, -593, 347, -160, -438, 853, -443, -94, 400, -525, 354, 278, -494, 513, -449, -208, 592, -581, 211, 297, -750, 551, -177, -243, 673, -667, 72, 326, -673, 524]
4538E24l84l47Q89j085N46R2q40Q87k85j72R22j032J44L43p81R52k95o27J166
4557F17j223M43P05j073Q09j76q19J257p11J5O08r45Q16R8j005R55o51M7Q92j298
4577f39P67J94j205J436p41k70J219j296L18M73r16J235n76o77J153q28L01O54
4595F02j219P39j9m89J053q83q8O30r43J099k02o88J049q31Q8J013j179N19k38
4614A3n69J020o27jP76j414O70L30p67J030m22m01P66r31O62N18j154Q30o59K35
4634i5R29j133J64N86r11J003l31p18P58p23L57Q93j316N89P4p33J006m65k07
4653b73N91j052P83L61q88R62p33j27Q74q18O19L0j024J044K1n86J072j331M30
4672d5L99p76R65n87n58J015r02M89N43j060O03l45l03J139o07rM28p77P72j27
$$ y = [524, 140, -207, 682, -403, 143, 235, -605, 282, -3, -175, 747, -285, -141, 202, -579, 373, 78, -549, 617, -606, -163, 542, -531, 278, 102, -717, 540, -171, -156, 452, -493, 323, 421, -584, 371, -280, -233, 659, -639, 128, 322, -883, 553, -188, -458, 761, -535, -217, 256, -660, 575, -1, -678, 475, -353, -52, 602, -617, 122, 103, -386, 667, -216, -304, 326, -617, 482, 280, -408, 641, -190, -102, 911, -268, 251, 13, -556, 464, -163, -164, 612, -802, -132, 198, -569, 461, 39, -362, 404, -527, 135, 653, -501, 329, -330, -95, 834, -299, -135, 451, -460, 543, 212, -506, 252, -471, -114, 779, -537, 52, 126, -607, 399, -66, -273, 318, -734, 49, 410, -478, 484, -249, -376, 498, -320, 299, 329, -695, 349, 370, -216, 856, -475, -45, 354, -422, 543, -44, -602, 413, -489, 0, 543, -517, 86, -259, -562, 577, -30, -39, 389, -388, 384, 257]
4692B57o97R67q66J3J100r22L42l4q91J103k92j98O78j069L15M37r12J195o22
4711i6m41Q73p14K21O70j040O63q1k52R71r78j39O53r53R33O3q14P69m96J4Q74
4732G00j018N11j18o61J109m03j37L96r39N57K86p67J135p42n18J007n19K79K01
4751C59j263R99L3m03Q76q77o6N39n30O49j0o78O98o92M52P27j339M83l9o82J496
4772G32p93j18N79j018P59P7m92P38p73k02J255q44K18M0r17Q94J49l45P09j162
4792e14J41O80m01P54l84q94Q45o34L19R34j156M74j49m49J023n49k37L90j101
4811i08J419J1j013P34o53mJ065q91L66J9j041J339k28j40O71j394M45O39m26
4830A0P31p85o17R02o36P00K78j066N80j74k90J063q61j08M49q42Q56K06p80N55
$$ y = [257, -440, 527, -339, -326, 774, -148, 194, 160, -731, 372, 80, -118, 560, -509, -194, 243, -669, 526, -96, -537, 336, -378, -157, 513, -527, 136, 55, -197, 774, -204, -343, 310, -643, 290, 353, -461, 308, -188, -174, 700, -318, 193, 75, -586, 523, 120, -17, 379, -560, -3, 283, -484, 651, -91, -609, 398, -121, 158, 359, -904, 95, 128, -275, 601, -276, -342, 197, -333, 316, 306, -372, 326, -366, 86, 813, -526, -43, -82, -764, 732, -61, -179, 400, -618, 141, 218, -274, 464, -309, -511, 744, -100, 118, 158, -759, 135, 284, -61, 648, -514, -373, 307, -94, 660, 276, -618, 227, -407, -88, 846, -310, 164, 15, -434, 589, 40, -197, 193, -908, 511, 522, -491, 243, -410, -414, 651, -240, 126, 145, -896, 443, 215, 75, 746, -648, -203, 436, 10, 741, -44, -661, 241, -395, 305, 583, -483, 97, -77, -367, 696, -165, -273, 176, -666, 190, 396, -384, 171]
4850A71o25K49Q44q18J74j71m22J262m40j67L79q48M02K44k92P75q22n84Q46m38
4870b81N59J70j032N24o9K8P59p64m29Q65p07P83Q5r31M41n70K97Q79p44K08j86
4891a15n07J020k47o2L28r94N25L20l04N20o17k53Q02o55N53q2p87O49O2k54O00
4912E02p22j76N26m67R00k20q36O55n51L40P70r30K69j59m11Q27l45R6L02r95
4932f25O84N07p85P26p35j84R01o91L98Pq58R21l18L4N01q68J10L43j94P88o17
4953D5o46P34o04P14K73q26L26o7l82J148o72k62M61p17N33M22o33L91n58l6R49
4974E93o61K78p4r85J086k50k13N73r38J57R02n68R19o51r58R02l82O56N1q96
4994d59K47J75j81Q40p97k6K14o80Q89R7p32M34n70K34J081j011L89k62o72J154
$$ y = [171, -454, -205, 639, -179, -5, -176, -598, 664, 224, 57, 436, -412, -10, 234, -58, 717, -105, -689, 157, -281, 278, 448, -584, -60, -129, -101, 658, -106, -535, 330, -377, 406, 491, -440, 1, -569, -272, 607, -137, 71, -115, -622, 398, 151, 89, 417, -577, -52, 268, -36, 484, -133, -386, 416, -239, 314, 232, -555, 94, 156, -98, 502, -220, -396, 130, -337, 563, 343, -493, 162, -389, -49, 721, -209, 60, -99, -510, 317, -28, 68, 370, -625, 59, 566, -219, 507, -228, -412, 489, -202, 196, 203, -655, 266, -52, -18, 483, -385, -275, 68, -126, 662, 45, -601, 133, -471, 243, 516, -310, 16, -51, -433, 715, 43, -219, 242, -475, 58, 480, -153, 238, -320, -356, 593, -68, 210, 136, -849, 237, -13, -226, 347, -591, -434, 468, -100, 819, 168, -790, 112, -270, 386, 437, -459, -212, -37, -218, 622, -175, -201, 13, -667, 222, 319, -413, 21, -549, -315, 766, -245, 144, -118, -790, 364]
5014C64j03l25M82j150N12N33j35L29n77l66P72n74N05M79j276N09k03J6Q97q62
5034a73k80L29n46R66Op86N43o31L93P18p40L39r7p14J154k24p6K07q54M93M65
5055D92n75P40o10m23N37l35N11j74p08M82j36L5L80o32K30K60n49J026k08n64
5075b21L97n59L31P08o87Q5K3l49Q65l88k22N22r91N01L28m66N03p90N5P17o03
5096b41M71n1q96J048l87p9O56j038K31K74l73Q02l42n19Q17m39qP29j113N70
5116A12j41m12R60m73j61K07o93R30j04m26N89o13k17Q30n15M02j6q49R61l70
5136Aj50M58p29L87K37l99O68l76l28M35n22M60L39r83N46j28j63O46k93k95J39
5157e0n35P76J70p77Q33p78J05P36p68M54j85m93O92j21k49M86q00N04K48o25
$$ y = [364, 261, -64, 418, -732, -220, 313, 178, 507, -70, -436, 336, -238, 267, 746, -530, -21, -224, -208, 689, -173, -453, -124, -670, 296, 302, -484, 59, -572, -179, 539, -201, 138, 41, -673, 481, 257, 181, 388, -466, 27, 492, -83, 657, 47, -376, 161, -174, 337, 163, -545, -63, -199, -164, 216, -416, -186, 74, -475, 551, 343, -221, 176, -383, -52, 656, -31, 54, 77, -272, 593, 205, -17, 505, -486, 15, 343, -123, 380, -410, -355, 362, -241, 230, 179, -717, 331, -56, -135, 521, -517, -286, -12, -385, 417, 75, -444, 373, -66, -74, 655, -458, 112, -29, -441, 519, 46, -115, 92, -601, 329, 225, -201, 388, -225, -442, 388, -127, 275, 259, -590, 371, 1, -149, 309, -420, -33, 204, -195, 473, 97, -231, 204, -318, 142, 481, -502, 44, -84, -247, 399, 106, -189, -50, -585, 191, 361, -416, 417, -361, -256, 480, -288, 166, -19, -512, 180, 59, -190, 296, -504, 0, 248, -377]
5177c77Q78l61p73R83o26O65J39q91O62k32l39R53p51j32M06n55P21M0q97P73
5197B86p32K09M52o14O50l65m14P34k07j24N31j052O09K11m90O85n27j05P52n43
5217e4K59J01q57O44J1k22O43p15J49M2n41J031l74m37N01n54K12O88p70L73j39
5238ik93O25m45K12J09n58M50J64m73O55o46o2P87p19M94rp86P14j82k23N31m62
5260a26l0J72m22O13j1o87P10n17K45M54p33M37l0k72N88l67k22J73l60N96J79
5281C90n87N88o64R9M40o39N47l0o09M99k29j11P67p39K03J69l55M27k74k27L76
5302D1m89M30J72m98N14r7m12P40m22j49L57o01P18p4m72N14m99p4O01o14L74
5323F0m7m59P34m30m7M69p20M89J95n40P17m48m13O95n03M56Q0p00N50k01o6P12
$$ y = [-377, 501, 140, -633, 350, -276, 389, 528, -363, 299, 67, -272, 681, -70, -202, 204, -351, 370, 410, -487, 286, -446, -237, 215, -399, 251, -114, -528, 206, -1, -125, 406, -646, -37, 174, -316, 369, -158, -263, 489, -54, 205, 306, -551, 93, 104, -118, 525, -190, -41, 1, -540, 491, 117, -320, 181, -373, -161, 527, -243, 130, -9, -302, 323, -122, 90, 199, -359, 91, 255, -218, 437, -209, -271, 516, -203, 291, 282, -504, 210, 28, -195, 336, -126, -156, 16, -406, 207, 196, -491, 219, -298, -53, 401, -332, 105, 75, -197, 391, 24, -198, -25, -385, 211, 390, -197, 391, -273, -174, 266, -373, 174, 144, -465, 34, -195, -306, 461, -278, -75, 94, -261, 166, -108, -335, 41, -448, -18, 154, -344, 170, 73, -339, 401, -21, -170, 187, -414, 304, 230, -242, 272, -227, -301, 300, -314, 60, 13, -446, 288, -142, -189, 280, -440, 49, 244, -296, 421, -27, -440, 255, -248, 208, 288, -412, 138, -63, -129, 583]
5345E83p98K12J44m29N29o2m82N26n90K17N02p47M15k9j70O11n82q5L66o44L30
5366a83N24l64L06m34qM68l91K96l4q61R41m50q2Q62p82J5L95o15N59j44m26N52
5388A44l55J4N30n65K55kk98O80m17J0K46l72J67K39n59N27l75n2N85n80K15Q0
5410A17l10K56L1k52N93p61J64M17m88M79l41j53N00p33M15J92m61K35J02j21
5430a19N41o15j01M35m17M54j0k88N73n77O2M14n92M19J09n99O30n71J06M69p62
5451d39M20K25n11M01l12N3L22m06K44K95n55M57r2k36M06k71J04O7l26L47k05
5472a2j99L53l07J59L02p57M51j8k93P31m56l10M80p87O75K38p19Q20n64n1O53
5493C89n27P6J75n07N44p7q2K29l34JL41n23N09m56r8N03l90K28J85k72J27q0
$$ y = [583, -215, -3, 141, -288, 241, 179, -303, 223, -367, -150, 352, -395, 20, -9, -179, 432, -150, -235, 131, -513, -183, 341, -23, 283, -151, -159, 309, -82, 214, 180, -681, 260, -190, -272, 590, -192, -177, 218, -397, 162, 18, -408, 144, -211, -197, 333, -232, 23, 21, -277, 403, -14, -4, 242, -130, 37, 276, -283, 244, -131, -183, 402, -178, 37, 117, -193, 63, 94, -158, 435, -326, -162, 255, -233, 246, -95, -248, 252, -481, -66, 126, -335, -100, 2, -119, 422, -193, -294, 141, -276, 178, 168, -120, 453, -124, -62, 352, -240, 179, 288, -311, 319, -252, -146, 323, -439, -19, 206, -305, 96, -216, -163, 159, -247, -3, 292, -263, 194, 102, -134, 272, 1, 105, 172, -154, 193, -12, -211, 142, -165, -6, 296, -461, -10, -28, -321, 410, -46, -356, 124, -663, 12, 250, -469, 351, -213, -264, 389, -138, -62, 113, -394, 150, 73, -9, 220, -114, -113, 228, -295, 214, -242, -340, 163, -227, 1, 186, -86, 41, -39]
5515c9j17O15l85l59M21m97O85Pn15K27pj16N66n78K74L2p09O57l4k51K59n09
5537c73K65K75m07M95l08l23O66m11J69K26o90M46Q1k17M03n33R8N39o39M50L1
5558B43m55M00n24J70L54k97L64j96l38Q23m11l03L76l12J01K76n32M18r0l34
5578b67O21k93l9K79p44M09J40q8M56o73K00J05m04M05n7l75M24j51M1M51q67
5599d27O57k98j59N75m95J46J48n08M79K27m99M39m07m2M05l29P5K16o16O97k46
5620C8k66O76p78J25L10k05J38q2k87N91m85L38L62o83K52r8j49M49j91kJ01l36
5642a82K63K70o16L41l42l9P73p18K15J27m50N51q2j48J59l42J61L11k86K28J5
5663B09n33P33n13L11K9o78M97J5j13K19l98j71M77l67M66n6m33M90m50o8P06
$$ y = [-39, -156, 459, 74, -285, 136, -361, 324, 331, -184, 43, 36, -80, 486, -92, 182, 214, -495, 162, 128, -123, 136, -373, -108, 167, -240, 255, -53, -376, 290, -121, 48, 274, -416, 30, 111, -106, 297, -236, -138, 401, -238, 212, 243, -212, 188, -336, -166, 188, -109, 255, 59, -279, 544, 133, -170, 206, -106, -5, 271, -261, 157, 67, -267, 354, 61, 22, 301, -443, -34, 106, 18, 474, -199, 1, 106, -298, 107, 50, -325, 99, -52, -11, 440, -427, 230, -68, -227, 348, -147, -1, 147, -361, 118, 345, -154, 285, -122, -164, 241, -88, -13, 203, -413, 284, 38, -228, 448, -330, -205, 105, -100, 38, -44, -331, 260, -225, 113, 475, -208, 44, -54, -203, 246, 55, 53, 154, -182, 81, 351, -265, 76, -266, -305, 468, -250, -35, 92, -358, 193, 111, -37, 122, -220, -59, 252, -34, 194, 209, -324, 409, -104, 207, 236, -442, 55, 70, -43, 176, -222, -393, 84, -283, 183, 127, -306, 184, -266, -334, 372]
5684C72o06K45J1l30M32r0j75L62m89J99L95m73N43l56j98N35m06J08J42n87L69
5705CJ06k84L44k37q0K58m68O34j3o48N30n12J95O37o09L51k85m06Q15l05k11
5726a85O30p71L19K38l71K79l03N9L40k98J72j8n44L90K60j90N20o87O2L29l40
5747a09L50k22m72M52j50K57J19n27K84l6n9M31k72L2k7l64N16O6m80K99l48j27
5769c87P87n30J58k26j49M00J60l02M96p02Q1K42k09N74l77k57M29l37K10K10
5789B71n16Q9P6j16M89k16p8J09n02O94Q8p06N42n25n9O23n00L14j57r8J66M3
5811C1k48L02l85k6N09l64L71k57l04P67n89J88L94m22Q8L5LJ47k30R8r3l30N67
5834B52O6m06J70k29l0N16m73J43J44m74L80Kn7J26k91J29K21n31O88l93j50N17
$$ y = [372, -234, 11, 22, -308, 124, 34, -141, 221, -268, -69, 326, -147, 396, 40, -158, 377, -29, 79, 221, -366, 3, 109, -175, 169, -68, -148, 110, -358, 276, 263, -385, 145, -367, -172, 465, -144, 207, -78, -484, 331, 26, -185, 445, -326, -7, 231, -140, 139, -164, -105, 235, -63, 109, 91, -453, -63, 197, 7, 527, -160, -98, 231, -109, 241, 19, -453, -1, -151, 106, 225, -302, -18, -54, -113, 318, 46, 78, 51, -313, 203, 269, -211, 88, -260, -387, 400, -130, 28, -198, -347, 53, 213, -89, 407, -295, -214, 28, -181, 393, 16, -241, 188, -149, 61, 271, -245, -156, -80, -196, 293, 77, -1, 108, -394, 300, 388, -318, 224, -301, -360, 263, -237, 77, -80, -178, -12, 31, -217, 85, -300, -326, 183, -181, 190, -67, -371, 396, -193, -5, 389, -33, 55, 90, 93, 240, 10, 108, 15, -315, 252, 318, -88, 82, -147, -177, 339, -134, 9, 153, -321, 59, 61, 4, 130, -161, -32, 189, -342, 346, -47, -197, 320]
5856C20n81M48j03k61L35k39j0N41n15j0J79k33L59p0l88L23k48J37M27n87J30
5877d6J39l53L79N9l63K22m74M23K38l34N35m92q6L19m19M30mn05N70k05j4J51
5899A70l67l4M19k65K48K2m22N03k94n7M82o15L18O1m63M62j17n6P3k33K23L04
5921C62k57m4j53k37O54n13K56J33o75M97R3j22K77n53J70J94k14K35j55p0K61
5942A39l78M08n8m54L72k91j73O10k61j6K39n47M62J28k33K47k77j32O00l87M0
5963C8l7m06M67j72P7J59m43K09J96k37N2J21l45M92j75J56J07l57oJ11p6L52
5985B83m97J11J92m48M33M6j60K19m31M9O17m61M1J41m45M98r6j49j9L5L5K69
6007B63n90M20j78j74M90j69n3L48q61O07j52k34P08k58j31R5l01J29K31k4j14
$$ y = [320, -261, 187, 84, -177, 158, -81, -91, 450, -65, -75, 104, -129, 230, 160, -228, 95, -153, -16, 411, -176, -46, 93, -260, 119, 178, -185, 37, -437, -14, 224, -110, 425, -67, -153, 166, -253, 177, 173, -332, 238, 33, 19, 170, -197, -231, 188, -77, 171, 193, -229, 274, -20, -77, 405, -210, 108, 169, -294, 168, 51, -5, 68, -165, 58, 362, 105, 61, -92, -329, 325, -188, 68, 201, -474, 23, 116, -6, 271, -282, -112, 82, -132, 103, -52, -122, 139, -239, 169, 111, -343, 29, -262, -435, 175, -86, -102, 137, -410, 52, 180, -53, 194, -83, -215, 385, -2, 38, 1, -405, 62, -110, -33, 126, -317, -108, 88, -149, -97, 24, -321, 171, -4, 152, 259, -98, -104, 7, -69, 283, -214, -103, 89, -359, 74, 120, -40, 179, -252, -203, 414, -47, -6, 135, -310, 188, 92, -57, -76, -41, -6, 263, -327, 93, -85, -259, 231, 62, 9, 357, -504, 103, -49, -283, 425, 167, 36, 131, -170, -41, 190, 166, 52]
6028E2k98L02L37o07J65J23l57P33l56J26j64m65N64k28j46L52l88O7M42m03J94
6049D5K80l57P5J65j55L14l99M2K18n52L77Qj60K39j63o0J78k61K22k0l2L22l07
6072A9P8K7l10K74J41m09L11k00M9M46n33J71J05l86P5K23M7j4k94O3L29n10L53
6095E5O8l86K61l47M69M3l58J68J5m6L70l47M0J6l13L09J63k49J58j81J18K34
6117B60k22N7k11j07M06q3j85J57r4p2J69k64L82jm26L67k78J28J52j98J10p8
6139c1j83M97l50Q7K34l78J48K22k98K33j67Jo7j51J59L05n09O48m75J25J07n08
6161c51L56O9j57J65j93J07JLL3Kl07L07m6p7J82j82M4j8R0o4K54l91L86l11J3
6186h5K50m85L23J3j66M53l29l29L56k7M8j26n1J63Ln5J70m12K87m9p1N9Q2P5
$$ y = [52, -246, 56, 393, -214, -49, 74, -283, 450, 94, 220, 56, -409, 155, -73, -219, 133, -255, -188, 254, -149, 45, 325, -32, 43, 208, 53, 367, -32, 10, 228, -324, 53, 61, -99, 140, -23, -83, 95, -166, 56, 36, 4, 326, 19, 97, 124, -186, 88, 229, -180, 131, -69, -20, 426, -107, 64, 169, -217, -142, 81, 128, 114, -180, -117, 212, -298, 55, 123, -263, -2, -349, 120, 163, -195, -27, -12, -58, 312, -35, 5, 21, -292, 17, 180, -69, 89, -92, 26, 260, 38, 95, -116, -223, 183, 100, -85, 72, -22, -94, 75, -189, 193, 192, -234, 133, -145, -17, 135, -63, 47, -31, -214, 283, -67, 20, 254, -124, 24, 246, -52, 181, 14, 15, -52, -203, -44, 261, -248, 400, -75, 50, 157, -351, 5, 74, -83, 82, -111, -4, -3, 0, 33, 35, -272, 35, -11, -88, 94, -88, -44, -62, 28, -36, 218, -173, 213, -98, -85, 165, -320, 3, 16, -150, 303, -26, -355, 1, -26, 22, -104, -155, 8, 11, -44, 126, -286, 1, -48, -119, -60, 22, 97]
6210I7o5k30J69L26l16K11Ql53R5J18j03K30n68M83o6j81K59k80j64M34j71M7
6232b0J00j56K92k92p2M75n23l8L02k01K04r2N6K40l39J13Q8k10J98o2j45J27
6254D5r6J69K76o70M47k46r0K77l00J41J65l09J89J85k77K67j2k48M16k93J91
6275B27j17l45L61M7j88J49j50M8j1l03L57k42j39L11p1K4J68k96J30n4j1K39
6297A34l25O2L08m37M15k50j05M13l02N2K33l92J85j54m5L52j52j90J61k6Q2L10
6319C29p20N62k65J69J94p32M20J43l54K93K44n38L62l54ML04m52O39l49k08M06
6340I7j95J50P7j29J55p1k94M34j70j34q0L8M3J49r5m3j75K73Q9m06L30K06m88
6363b39L79j36j07K72l01K4K37k33P9n8p8L04l21L0L34n53L65r4JM39k83M9q3
$$ y = [97, 32, -198, -29, 297, -19, 192, 200, -153, -58, 60, -43, 187, -381, 102, 36, -145, 114, -166, -330, 104, -67, -20, 80, -76, 216, -76, -148, 327, -196, -234, 68, -133, 71, -21, 35, 275, -64, 49, 137, -73, 125, 63, -82, 45, -51, 118, 394, -276, 171, -75, -165, 112, -188, -47, 118, -191, -2, 183, -94, 173, 161, -87, 329, 36, 227, 110, -235, 126, 173, -15, 134, -16, 32, 21, -282, 75, -167, -306, 5, -66, -42, 126, -170, -40, -94, -105, 134, -191, -129, 179, -258, 157, -93, -198, 215, -87, -35, 198, -194, -9, -163, -208, 144, -8, -198, -37, -63, 19, 329, -391, 171, -94, 75, 269, -463, -43, 100, -254, 39, 283, -255, 107, -247, -243, 61, -391, 248, -101, -309, 97, -98, 52, 129, 0, 155, 84, -210, 224, 54, -80, -160, -122, -79, 70, -25, -68, -243, 30, 119, -287, 43, 249, -239, 140, 4, -103, 169, -132, -108, 129, -104, -25, -83, -161, 143, -178, -148, 186, -367, -2, -96, -95, 344, 61, 110, 27]
6386B7j59M9l4j42L40j92j07K23k47J44K44k51J17Lj53K61k34J50K41l50J64p
6408H7k64K90r0o3L84p80M80J00j22L16l49l58L95q9P2J8l69L32o6K29J37m47
6430a57O9J53k86M77k92j8M8j2K8J28j75K24q2j63L57m59J57K71m50J33J94l77
6452b32K11J42j71L04k86q7J19j69K71k32J70L75o33J01K60l15M29l97J87J81
6472B28l06R1Q1k49L09k31j72O44n89M9J93k51K08J9o1K33n18L11L09k49J09j53
6494EO2K20l38J64K3j83J11J93l94N3L9k78K91m8N8J45k83K93lk96M33m33J29
6517c7M9j09K15j43MJ95l03J8J43m32M65p4k83M85k09N4K0k04M25j81k79M06k04
6540B1l57O51m27L31j43k35L07k14P7L68m56N7J14j48O2k7j43K14p7L0L12n96
$$ y = [27, -132, -83, -117, -259, 81, -111, -218, 5, -242, -98, 146, -105, 12, 15, -138, 123, -111, 39, 280, -70, 94, 87, -177, 113, 23, -40, 344, -436, 44, 144, 22, 338, -11, -369, 26, -63, 9, 27, -342, -10, -76, 153, 290, -157, -88, 65, -221, 256, -36, -54, -6, -18, 10, 138, -37, 187, 105, -58, 299, -160, -3, 268, -182, -49, 145, -232, -21, 121, -50, 254, -32, -119, 0, -169, 102, -130, 40, 415, -218, -117, 143, -172, 257, -140, 47, 228, -78, 13, 94, -155, 154, -77, -249, 395, -194, -145, 48, -203, 5, 24, -37, 196, -322, -11, 298, 49, 158, 5, 67, 287, -51, 113, 136, -47, 64, 257, -137, -84, -45, -323, -32, -80, -22, 123, -160, 133, 130, -166, 267, -166, -37, 12, -97, 118, -25, -21, 174, -129, -111, 32, -400, 65, -9, -292, 193, -16, 38, 58, -146, 279, 98, -181, 225, 21, -336, 315, -112, 219, 76, -159, 148, -66, 11, 379, -77, -20, 94, -54, 8, -19, -162, 52, -25, 5, 317, -279]
6562b79M52m57L34K01j48k50L23k80L85o2l56K08o1k12K40j96J05L5j42J27oK36
6584A97P2m25J76P8j77K80j81j06K13m25K87K17o2n0j97J17J55j51k9J05j48J38
6606H4Q3k59L43l41k00M52l57J85l2j40M13k56j02L18l05K63Q4k23L4j03j98L43
6628H6n5M9J45o25N47j49j09K63k65K11m3k15L12j27M1J5l09J79J73k22K52q1
6650G3k26K23j56L2K41m50M17j91J7K35k56j43J70o5J43q5k56L62j22K7K41k49
6672a8J62k66k18M37K1Q0O3j48K2K0l03L02k45j98M61j66n2J76l95K93J97k94
6694f9K95l28J49J43l45L18M1k45J61j08J61K0j65k05K26l7K74j35l11Q1O1q9
6716a07L55l60L41j82l22M87l11L3J14j79J76O3j85K21r4j10J96k56J98P7k99
$$ y = [-279, 173, -284, 50, 251, 103, -147, 176, -104, 281, 219, -137, 71, 10, -202, 38, -158, -53, -18, -160, -33, -39, 197, 269, -156, 20, 98, -79, 201, 20, -86, 127, -298, -11, 206, 144, 94, -103, 14, 169, 18, -11, 94, -54, 84, 167, -92, 251, -90, -290, 162, -195, -10, -42, -182, 231, -25, -127, 191, -114, 149, 233, 10, 44, -59, -257, 86, 31, 80, 225, -400, 147, -2, -111, 152, -113, 98, 55, -160, 152, 25, 66, 81, -228, -49, 124, -98, 154, 73, -153, 70, -86, -54, 187, -263, 154, -37, -20, 215, -41, -184, -14, -79, 64, -21, -277, 85, -37, -10, 231, -18, 144, -122, -340, 97, 118, 198, 261, 113, 135, 155, -148, 154, -91, -289, 172, 6, -46, 130, -265, 28, 225, -69, 226, -102, 47, 190, -155, 163, 204, -41, 120, 12, 173, 193, 28, -177, 49, 12, 286, 151, -160, -79, -18, -107, 248, -112, 229, 47, -275, 212, -99, -66, 48, -131, 45, 108, -77, 144, 50, -60, 136, -120, 78, 155, -144]
6737a44J42o1j03L54j47k30L38j87K22j03j34J52k15J42J49k19J97k6j10L43m58
6758i8J99O2l62K18K3K1J20k12p2L63m14J42M5k28K65l9n3J58l23K18L3k34J80
6781A2n4K3n4kJ19j42r4J81k41K34R5n4k76L86j32j4j1J7O1n2Q8J05j55kJ35m33
6807b60L57k61N1L67l69P9K2J1K34m44j67O06n06K19L57m07K46k48j35L04l06
6828b50K96l7l3J5j64J94p1j57J56J18P5M7m12R6L57l12J40O3l46L47n9j67L07
6851B03j78j4L02m35J86R0l28L09j31j2L33n11J72P6j91L84j64j52J60k64l7K21
6873A9j84K14p5nJ04k83K33j6j70K50r5J3J15k42m8J76k9nJ34r5J17j64o1J97
6897A00j72J58q1o4J57j35O4M9j93J41j10j11K26Q6j37O2q2N5J95l34K27p9L7
$$ y = [-144, -2, -63, -166, 188, 41, -189, 149, -38, 184, 81, -53, 99, -116, 26, 175, -44, 153, 127, 17, 360, -98, 101, 163, -199, 19, 42, 63, 183, -29, -101, 262, -152, -10, 35, -193, 72, 33, -20, 138, -185, 33, 66, -168, 12, -42, -19, -73, -75, 44, -98, -192, -11, -252, -18, 77, 23, -253, 133, 1, -13, -24, -7, 54, 2, 90, 195, 40, 38, 173, -260, 97, -164, -113, 254, -115, -36, -14, -3, 231, -213, -380, 226, -280, -61, 296, -111, 135, -113, -248, 56, -250, 46, 9, -24, -9, -173, 21, -50, -207, -51, 67, 142, 189, -223, -127, 230, -82, 58, 121, -225, 122, 63, -104, 203, 25, 11, 313, -122, 64, 154, -174, 135, 4, -8, 325, -186, -14, 62, -129, 255, 91, -61, 99, -165, -202, 19, -165, 49, -26, -31, 73, -210, 23, 7, -163, 87, -8, 5, 120, -122, -170, 6, -23, -28, 106, 11, 128, -36, -97, 100, -72, 86, 5, -59, 98, -37, 27, 76, -117, 24, -86, -197, 29, 115, -22, 40, -42, 13, 208, -126, 101, 22, 59]
6920E9N5j78K03L7k02K31j89k77J93R9j28J63j28R8k3P3M0k8l16L52l22J08J47
6943F7j43K30k12P3pr7L20l21R7KL1l28M24r3m25M57j80J14j09K6K87j41K9Pj43
6968c5K6l5p6L63l07J5J38q5j80M80m41m9L51k58L31j14j2K8k87K49mk23J23r6
6992i8K6R0j04K85l28JM72m07j37L53l83K52j63j49N49l46m1K16k86L75o4m30
7014c17M26Kl5J20k16k3j12j9L50k42O4J00j84K26j22k56L75m08N1M70k72JJ26
7037A05l94K91P1j71K92j04P2j47j08J03J2j02K05j96K46j82m9P0P0l76L23j16
7059h5j58M75k53L6J32l57L99k10j29M28l35J51Q3k44R4J18k30K33m6k58K36l14
7081b34M84j32j66kp7Q4r3j05K40j91J19K66k23j18J41K2l6P7M3l2k45O2K39j20
$$ y = [59, 114, -64, 139, 176, -26, 205, 16, -261, -68, 31, -97, 66, -62, 36, 13, 86, 126, 98, -218, 134, -188, -80, 67, -76, 154, -58, 15, 8, -89, 231, -90, 7, 9, 40, -288, 136, 43, -382, 75, -105, 9, -100, -74, 213, 72, 101, 108, -35, -9, -44, -120, 243, -64, -49, 89, 4, -176, 304, -137, -186, 165, -93, 238, 124, 112, 140, -147, 102, 98, -125, -2, -98, -72, 18, -86, 199, -129, -128, 344, -63, -200, 153, -230, 22, -141, -290, 259, -87, -128, 88, -198, 177, 113, -317, 109, 111, 76, 196, -20, -43, -155, -174, 176, -66, -2, 98, -86, 140, 18, -238, 137, -271, -220, 250, -22, -21, 105, -289, 2, 73, -98, 194, 90, 162, 15, -93, 10, 22, -80, 125, -71, 175, -7, -56, 14, 84, -292, 31, -85, -243, 232, -21, 15, 147, -210, 189, -21, -150, 278, -57, 94, 177, -67, 27, 145, -85, 148, 102, -156, 80, -234, 250, 118, -48, -50, -127, -43, -136, -241, -1, -192, -73, 193, -30, -148, -7, 15, -21, 56, 99, 67, -178, -116, 123, 3]
7105Cj03J93k68K46J1q8J3o3J47O0l57M29k89L5J27J6J10k38k06J98J89j96N9
7128B8K5j37L41l36MO8q8J14J7N9Q7l79K44J8j45Q6n0j04M4N2J11q6L5k52K77
7153C3J4n8pk2O2k18L12l05J70L8n9J9K39k57K00k44k36M72l2j85J28j47J08J79
7177B04l81J97k09J90J2k48K75l9l3R0k2k35L55j50p4J81k97K44M6k94J80o2M0
7200c0J95j62J09l0l08L30k68Q5K61l77L26j13j19K12o1j54K98l88L08qj89J41
7222E8J3j89L21k35l3J11n7j9K73j99P8k03K58J83m06J0j7j38L15L7k23J69m90
7245c83M57l0k10J92p6jj13J43q5R4k14N31n80K69K05l60J30J24j69J18J21k40
7267g7L28k34N0Q6k94R8O5%K03k86n5J92l15K94J90k71K30k04n2K74k18r3L80
$$ y = [3, -100, 93, -175, 71, 82, -6, 7, -56, 91, 151, -206, 223, -66, -31, 96, 112, 222, -16, -222, -24, 165, -31, 28, 53, -84, 257, -79, -75, -7, -95, 19, 36, 95, 182, -197, 47, 65, -80, 6, -44, -148, -104, -52, 59, -27, 8, -244, 33, 47, -11, -18, -40, 22, -196, 116, -189, -19, 19, -40, -21, 218, -39, 161, -83, -319, 153, 121, -64, 64, -83, 25, 204, -177, 20, -189, 1, 13, -235, 40, 1, -32, 58, 36, -199, 156, 6, -68, 113, -184, 60, 106, -188, -8, -70, -30, 165, 3, 112, 82, -226, 104, -164, -79, 182, -195, 131, 18, -101, 111, 50, -104, 194, -194, 114, 106, -83, 58, 71, -118, 203, -32, -65, 46, -11, -30, 243, 44, 122, -81, 177, 360, -46, -36, -53, -191, 124, 161, -62, 107, -383, 74, 44, -166, 26, -50, -51, -164, -21, -106, -12, -226, 305, -275, -6, 199, -161, -31, 93, -76, 42, 163, -77, 251, 17, 67, 153, -141, -43, 22, 22, 225, -61, -116, 76, -239, 55, 245, -26, 204, 0, -52, 222, 4, -89, 291]
7290B91n04Q2P5P1R9k45p1J78k10K34R1j74K2n4Q2o0K1J43j93P6K44n06N83j17
7314A58k41J01J58l50K47k90J39K49j99Q2P1k55J80q4j00L36m48Q0J15r8K17p1
7336ck29K82mJ17r9j94J43o7J91J50j21jj53j37J55J26j18K47m53P9K39q7lk4
7360C6k11J45J48j17J96l70K06NN4J44l70J71J30k76N9J42j44J83j25m4J97j15
7382D4L3j30l8QJ82j32J04L7j11J46k44R2p2k6J20m0K34k61j8Q5p1j7L5n1J37
7407D6M1p0N2L0k67K32j61N2J62j98J34K6j23rJ6k48L26j36K51M1m13K06j19l0
7431a59J16P8j54J87k86L72j27l25L73j77j56J93m4P7k3j34K64q4m3K45p2j70
7453d9J94p5J59l03k07L39j95J58J21k41K08p2k7K05k46Q0m5m4J8M9J7Q3k1o7
$$ y = [291, -213, -131, -56, 15, 114, -131, -202, -24, -234, 0, 91, -83, -61, -115, -33, -93, -72, 71, -122, -46, 198, -308, 275, 158, -83, 18, 176, -174, 73, -217, -78, 171, -28, 54, 125, -130, 50, -34, -134, 202, -246, -166, -51, -149, 68, -3, -232, 50, 46, 163, 64, -130, 13, -54, 137, 287, 166, 165, 12, -125, 30, 156, 38, 285, -168, -89, 150, 63, 60, 36, -175, -30, 118, 1, 197, -173, 33, 38, 92, 236, -134, 37, 167, -109, -50, 92, -52, 131, 6, -38, 159, 44, 77, -53, -91, -83, 99, -33, 71, 108, -3, 143, -101, -9, -81, -107, 13, -27, 207, -54, -72, 13, -58, -75, -40, -91, 46, 87, 17, 69, 99, -168, 64, -97, -45, 117, -81, 53, 79, -44, -53, -37, -285, 41, -95, 156, 197, -216, -10, -129, -159, -43, 35, -119, 68, -218, 154, 27, -298, 75, -102, -258, -65, -109, -32, -55, -189, 75, -9, -52, 193, 121, -49, 145, 70, 229, -74, -281, 58, -137, 21, 142, -99, 109, 37, 10, 215, -31, 49, 4, -40, -22, 27, 44, 127, 106, 39]
7477C9k6J18j50J29k54J07K36j70J06l18L27j76o9J63j45j14L16l57L81K7l16
7498a46L68k60jQ5k1j20K10l26K99l7k8J9j85K31K7j61j13J25j09M3Q9oK15m83
7522b85K21R9j06L17m40O0P5J9j2J77k76L30m8j02Ll1j10J16J4j05J0n7N3J07
7546B9o2M01o78M09k68K87j4M2j25K5j08J12j1m6Q3J87l45J73J02j16j09k96M81
7569A53k21O8P1j73k7J14J9J48j13L1K8l12J57J93j82J52k82L07o9M7j33K9j65
7592a60L26j55j16K33j76J3J39q6J47q8l30M63j14j88J57l1L0j79J52J80j55l60
7614b98M97k31m1O7m7l2J81J7J71l61K42N1l38K27k6k79K54Q9k22L13k91P4m4
7637b7J1J55q6p6J89l03J57n5j24J72p6P8j00q7J58kj69J98o8m3K12j86K78k5
$$ y = [39, 13, 131, -19, 110, -144, -37, 199, 29, 135, -183, 144, -32, -101, 62, -83, -197, 119, -238, 143, 170, -146, 222, -38, -39, 46, 25, -95, 115, -211, 88, 51, 23, 42, -143, 88, 115, -46, -159, -34, -143, -100, -11, -17, 198, -285, -64, 35, -71, 246, -194, -134, -59, -40, -52, 125, -151, 179, 131, 29, 32, 1, -109, 7, 21, -84, -74, -131, -78, 29, -33, 368, -310, 99, -169, 118, 104, 146, 21, 46, -62, 50, 39, -7, 76, 263, -82, 91, 193, 77, -32, -328, 153, -68, 0, 71, -102, -129, -15, 4, 152, 39, 70, 98, -214, -57, 136, -46, 106, -176, 131, 62, 109, -24, 5, -160, 166, 11, -105, 128, -48, -35, 104, 18, 165, 77, -253, 210, 96, -92, 65, 34, 64, -115, 37, 217, 62, -298, 199, -32, -73, -6, -53, -85, 96, 113, 284, -77, 165, 216, -122, 105, 79, -200, 54, 143, -79, 234, -57, 17, -27, -16, 139, 53, -23, 166, -137, 20, -35, -159, 13, -63, 15, -85, -172, -14, -16, -185, 13, -55, -98, 114, -72, 206, 181]
7661A81k59J93k8k19O4j71L80J04k66q1K22j48K30l91M48j71k28J80l7j08J40
7682C5k26M9K81k20J0N0j9J4K1l2J39o5j61J92N6l26L58l79J25J29MJ42k26L5
7706a4N6l00L93j84j15J20j12K65o8J6k9k7k35M12j94n9M7j84M44l63M3K98l09
7729i9q4L05l19N08k15j81J33l0k02M54l21K87j34j61K55j61j75J14k5M7L17m29
7751a16L06k43K5M9m9J10P9k26K88j97k85L27k51J70K70m28L54o6k61J17j3J48
7773A08j0N5k66n6J63R6m4J7P4r9J60j91n3O4j69K42J09k13o6m8QK27k21J21J36
7798A44j95J08jl13L65k26o8N00l99R8N9oQp8j81K45l58J72L40l50K40q0q8K22
7822A58j61O6n2o0J16o6l3J04j45J73j88j27K71K2k72N3mJ0K99j65J3k9k3K88
$$ y = [181, -78, 115, 87, -132, -68, -239, 141, 245, -21, -102, 120, -28, 202, -189, 259, 88, -140, 40, 3, -105, 35, -191, -142, 139, -81, -71, -21, -40, -26, -5, -37, 102, 37, -124, 68, 124, -202, 156, -223, -98, 31, 35, 177, -49, -14, 42, -258, 135, -49, -164, -44, -156, 109, 41, 57, 28, 1, -234, 178, -16, -75, -28, -212, 232, -131, -88, 210, -99, -183, 122, -197, 311, 96, -85, 48, 18, -184, 270, -51, 236, 102, -59, 196, 35, -140, -26, -51, -4, 313, -116, 190, -53, -28, 21, -28, 82, 161, -65, 223, 26, -259, 68, -183, -13, 257, -171, 183, 117, -144, -27, -40, 108, 98, 153, -113, -169, -6, 90, 46, 63, 137, 38, 198, 7, -46, 18, -151, 91, 200, -13, -79, -127, -119, 108, -113, 8, 144, -51, 57, 56, -257, 108, -118, -186, 314, -85, 13, 72, 66, 74, -4, -185, 60, -298, -126, 214, -136, 104, 24, -64, 158, -3, 63, 11, -49, 67, 1, -32, 72, -73, 100, -88, -215, 56, 78, -194, -141, -145, -135, 164, -1, 12, -17, -40, 248]
7846B48l71N9K63l13O0l9P9K67k09k15K49n6q8J07J23j31R6l51M53k38j15J15
7868gk4J73km08L23k74n2M10k92K38j89o4L91l10q8K30l7L7j9r4J11j31J23O3
7892A08j76K34J8l05J27q9j05M92l21J25n6j08J35k03j9L10l01J52k9q8R2J12
7914A05k31K36k84K42k27J31n6J60j76J75q6j10K83j56j20K89l19J40O3j91J97
7935F5j33L8M3k06J82J21j51J63j67J30l4l6M2M0p1R9j29j05J9j34L80P2k30J03
7959A01j77N8J82l24K29o5k3K21Jl50K86l61R5K40k09J01OQ4p6r4J39q5K3m7K25
7984A80p1Q1k86P2K13l73Q2K20l5Q0j59k2Q4j73K55j88J7p8l2K26o8p1J38o5l0
8009clP3k34J50j15P2N4k52K08J50k79J85P4l80M05k02R6o8Q9N4l7o7J74k14P0
$$ y = [248, -123, -64, 199, -114, -54, -93, -14, 253, 44, -171, 78, 22, -66, 41, 164, 33, 129, -222, 231, -7, -122, -7, -31, 142, 140, -268, 55, -219, -271, 139, -153, 85, -104, -168, 223, -87, -175, 55, 18, 55, 36, -58, 53, -78, 45, 108, -68, 166, 184, -121, 6, -83, -188, 304, -17, 108, 52, -56, 79, -124, -143, 167, -134, 18, -11, -99, -7, 105, -126, 110, -174, 68, -159, -28, -84, 76, -100, 75, -11, -121, 162, 6, -114, 175, -144, -4, 59, -132, 65, -68, -30, 13, -193, -11, 110, -41, 122, -45, 85, 51, 15, 57, 97, 26, 125, -4, -109, -90, -224, 156, 228, -2, 101, -76, -18, 164, -160, 69, 4, -19, 202, 203, -147, 139, -222, -127, 113, -96, 5, 11, 95, 19, -75, 64, -21, 2, -45, 180, 109, 190, -96, -24, 189, -184, -102, 118, 83, 163, 4, -18, 66, -107, 148, -40, -23, -101, -133, 93, 25, -46, 92, 27, -3, -6, 67, -167, -17, -132, -60, -6, -258, -50, 100, -179, 6, 80, -300, 105, -97, -1, -69, 20, 74, 37, -30, 144, -70, 0]
8034@J55l41K73l7j12L80l50N5l0J14q1J6q0O1m2K4M8k89N40l06k83L43l54M05
8058A09j44q0K74k90J5J23J2J80l8k66M3R2n4P5j22n6M07l06O2J12l43L07j63
8081e1j56L86k44K60j72m2K01j51j1J77k70l4R7kJ77k91K7J32M9p8k4J68Kj03
8105D7k06J66j2J30Q3l52K16J6l5J49n40L38j8M7k4k9j17J62j82J63j3l38K92
8128e7K41r2n3J25k38J36k65L65k4l39K82j02m8K53k53O8o6L9K46k04j25M17l24
8151a8j1K81j17j29J60j36k7J38k02N8j2QO6o0j9j64Q3j21L01K2J75l05j8J12
8175F5j49K36r7kj2j79J98K7j35J34k65O9J56j29p6J71
$$ y = [0, 155, -186, 87, 50, -62, 318, -32, 23, -7, 107, 26, 42, -38, 23, -19, 5, 53, -236, 304, -2, -285, 58, -296, 109, -35, -115, 159, -131, -116, 7, 19, 199, 161, -105, -62, 30, -24, 51, -71, -127, 280, -26, 36, 148, -195, 112, -51, -207, 179, -65, 195, 23, -19, 182, 31, 20, 197, -73, -107, -10, -12, 165, -126, -99, 33, 82, 4, -20, 148, 150, 47, -159, 7, -5, 125, 208, -144, 72, 88, 53, 202, -338, 0, -18, 29, 5, -24, -141, 21, -161, 2, -11, -349, -57, 184, 92, 39, 164, -74, 62, -203, 162, 138, -201, 81, -21, -69, 184, -69, -1, -67, -28, 218, 14, -111, 306, -18, -29, 252, 135, 6, 166, 30, 3, 141, -61, -3, -15, -7, 59, -1, -20, -184, -101, -222, 79, 101, 276, -29, -47, 65, -84, 152, 55, 53, 41, -138, 60, 87, -48, 86, -179, -110, 46, -83, -159, 12]
8191A2
$$ Imaginary data points
##PAGE= N=2
##DATA TABLE= (X++(I..I)), XYDATA
0@%%%%%%%%%%%%%%%%Qj6J6j6J6k1K9l2L9m7N5o3P2q5R7j12J28j44J63j87K09k34
38a25K66k97L30l68M10m55N04n57O14o78P48q26R11j002J105j218J342j481J638
57H61j816K016k249K523k846L237l721M342n165O314q057J1096k5952J34981l1939
72H3625j18247q1625n6979J40044L4522M2072M1899j40512k3920O9583M8050J12694
84A51206j18954j34507P6991M7202O7730l5574j44380O2781L6635L720R1119m9249
96E4720n8473n4115m6767J85401O1549j51729p8601n6799Q0296J09043m7809J4876
108A1592m3788p6198Q9557L9017N7477L9310j47932j4523Q5427K4969K1675j13844
120b7261l6606R8493l5178L061J3890n7739K3701k8156L5140J22207q7655q9666
$$ y = [0, 0, 0, 0, 0, 0, 0, 0, 0, 0, 0, 0, 0, 0, 0, 0, 0, 8, -8, 8, -8, 8, -13, 16, -16, 23, -24, 31, -32, 40, -45, 52, -60, 68, -76, 87, -100, 109, -125, 141, -156, 174, -194, 216, -239, 265, -292, 322, -356, 392, -434, 477, -525, 580, -638, 704, -777, 861, -955, 1061, -1188, 1335, -1511, 1726, -1995, 2347, -2818, 3496, -4561, 6535, -19417, 115564, 83625, -34622, -116247, -173226, -33182, 1340, 43412, 85311, -55201, -79121, -9538, 38512, 151206, 32252, -102255, -25264, 21938, 89668, 54094, -90286, -27505, 9130, 12850, 103969, 54720, -3753, -57868, -104635, 80766, 142315, -9414, -88015, -144814, -64518, 44525, -3284, 11592, -32196, -108394, -18837, 20180, 77657, 116967, -30965, -45488, 39939, 64908, 86583, -27261, -63867, 34626, -552, 2509, 16399, -41340, -17639, -45795, -10655, 111552, 23897, -65769]
132f5769L988J7280J13635j9677r5707J5216l6238K9703O5380k5395M9888l2331
144A9973q4754P7845M5417J1876k7966r2861P0418M0717p9327R194k2983Q47M1076
157I472m7482M0003J7200q2845K6944L1001M4939M1650j10595k6800N4296M922
169B705M7054m1008m0033N0548n2609L427P2129j4666j223m9870n070J02253m3828
182B9809n6403J8754j2999N1116j5094o2904L6995k7152m673N6719j1036L1263
194C4395l3616p9345P8348N3720N51j7015q5477L3638M5050m2513L5490n040l5658
207a7472L601l2225O4557M2198q7079k560J7694K2138M6169p1959k6320L7203
219d055j6372L9013j937l1277K1021n8506J0525R6796n002k5330n9067k2187J00208
$$ y = [-65769, -61781, -44501, 69134, 49457, -46250, -31034, -67272, -37569, 27811, 2416, 52304, 19973, -64781, 13064, 58481, 70357, 42391, -50470, 19948, 60665, -18662, -9468, -32451, -31604, 9472, -38010, 1993, 19193, -63652, -36708, -5707, 39232, 80882, -29713, -56513, -2217, 2705, 49759, 8751, -31282, 19266, -33343, -29916, 42213, 27547, 26324, -23546, -28616, 73637, 29809, -26594, -7840, -20839, 30277, 15183, -47721, -10726, -37878, -42551, 14168, 3132, 34395, 779, -78566, -218, 53502, 54053, 37038, -48439, -14801, 30249, -12264, 23226, 18186, -17472, -13871, -46096, 18461, 60659, -26420, -28980, -11286, 10852, 57021, -14938, -41258, -4055, -20427, 18586, 16649, -14628, 6393, -52113, -41588, 55208, 50206, 24876, -34191, -56378, 43830]
232D3830J232l4228J0799m7795O890J0164o369O2885m1909o3807L4881J3666M8053
245C8292p235q2331L3171K9068K597K2432n0981M426J4097m3960O1440L2224m7970
258E270k4875m0208N9803P2729n9097j9250j0947j4495N0105j4082N121K0430
270C0504p0189K375L5228J1550L4430o4693l5099O5795O616P327j9253l7298M7633
283A4926j2134j4068N3358k9075k8534r742k268P8479j2495o9126R841m956L4869
296I075K4795m7767J8789p323l2848M0454M294J3471l849p0982L5770M9340j9246
309A3973l680m1448J4793M8560m1500J1634J6125l6737J3804q731K1546M1050
321D9389o4045j8369K7267O453L9181l7713l7542M0419j4259O628J8660k1270
$$ y = [43830, 45062, 10834, 21633, -26162, -19272, -9108, -15477, 47408, 5499, -58308, -23427, -9761, 38292, 31057, -51274, -18103, 10965, 13562, 35994, -14987, -10561, 3536, -40424, 21016, 53240, 5270, -19605, -59813, -10, 72719, 13622, -5628, -16575, -31070, 19035, 4953, 10074, 30504, -39685, -37310, -2082, 9468, 43898, -20795, -55894, 9901, 16517, 23844, 4591, -32707, 14926, 2792, -11276, 42082, 13007, -15527, -25269, -27537, 50942, 38447, -30679, -20838, -25794, 9075, 33870, -13897, 4892, -2431, -35279, 5175, 9469, 22940, 19091, -51891, -16121, 33219, 13973, 10293, -31155, -16362, 32198, -9302, 2332, 18457, -18280, -4476, -13207, 8339, 49389, -14656, -33025, -5758, 695, 39876, 2163, -35379, 5040, -9219, -2591, 16069, -5201]
333e201K2048l0076k3406O7399k420k6056j3549k0877N6139J933m7678K2379j1885
346a1250j953K0049k2257L2205m002m9365L1232J5599J3895N625o3217J8463M0809
359B5833k1120R052k1083m706K5240l8838K2041L7731l8499n972j1541J7387N0334
372D5859m7310k1751K2461j2425K6237j1816k2122L3240k9131p231L5370n645
384E736J7910k7046l1454O1017O269k2362k661k5754L1582K338l5431L3578j0616
397C106k6742J2071r642L7816N489n5556J9267J5460O499J6760m3132Q489K4662
410A4547l0651J7277M330o644J3873m0057J8015M9784l0167q116p071M084M0874
423D0078l5092j5970K4902k6596O600o78j1299L2330l3216k1143L9209M2J5720
$$ y = [-5201, 16847, -13229, -36635, 30764, 28344, 2288, -11261, -32138, 24001, 25934, -21744, 635, -11250, -13203, 6846, -15411, 16794, 12792, -36573, -5341, 10258, 24153, 29778, -33439, -14976, 25833, 4713, 13765, -7318, -12024, 13216, -25622, -3581, 34150, -4349, -10321, -21862, -4475, 45859, -1451, -23202, -741, -13166, 13071, 1255, -20867, 12373, -16758, -23989, 11381, 5736, 23646, -3400, -34854, 26163, 32432, 10070, 7409, -18345, 13237, 15575, -19856, 13722, 3106, -23636, -11565, -21207, 16609, 22098, -33458, -14191, 1269, 7768, 24528, -18604, -10115, 14547, -16104, 1173, 5503, -1141, 12732, -27325, -9310, 40474, 10307, 2191, -4880, -796, 40078, 4986, -10984, 13918, -12678, -6078, -6756, -18055, 14275, -18941, -40084, -875, -833, 14887]
436A4887j4445l2444M7151L595k0129J5597j7735J3359j931l1760M2254J983l3689
449a3307R216o835L0049J0632m9341J7805J2378j1044J5706k8717M114J7122l9638
462c1860J5605J8658r918Q852l3945J3240N1133k4099m918J938n199L0799k4252
475F034r023L2143l0985q295Q023m491L0340k9393k6949L7688j737O625m211l0683
489b4914L2672j319k3342K4711j1985j674l183k5823M5171J1167l6624R989l059
502h213K2060J9193l8240J6199J0211k5070J5074j0097L982J0682m5557J0807
514a8969K6089j2022Q232k6703J616M3031k2440l626J2117j3404J6426j7656l552
527a0861L7857k9699j6768J4929l63K8990j8750k6360L3956m196o79Q345k2507
$$ y = [14887, 442, -32002, 15149, 18744, -1385, 14212, -3523, 9836, 7905, -23855, 18399, 20382, -13307, -4091, -10926, 19123, 29755, -19586, -1781, 10597, -447, 15259, -13458, -9344, 7778, -31860, -16255, 2403, -7515, 1337, -32608, -19368, 31765, 7666, 2748, 4686, -513, 30286, 6034, -2989, 29154, -1831, -10126, -2103, -6594, 23746, -5647, -32596, 5092, 3355, 9980, 5769, -24914, 7758, 6439, -16903, 7808, -4177, -5851, -9034, -34857, 10314, 21481, -15143, -5154, -8213, 13847, 33040, -5200, 10999, 21210, -3860, 11214, 1117, 5099, 15781, -29776, -18969, 7120, -4902, 3330, -23373, -21757, 21274, -1166, -4792, 7325, -6079, 10347, -7309, -10861, 26996, -2703, -19471, -4542, -4905, 24085, 5335, -21025, 12931, 8735, 8056, 16401, -6106]
540f106K0402q727k8595L0680m013j0584k203k5765L5257J5445l3382J2697k77
553e171Q423J6686k9081J8750J1896l3452J4357J815K289J0838m1458P942L1037
566A4871j3607P398j6995n634L2702k1775q8J9884k1476K859j2086j542L9605
579B4116k6422k2231J6924j108K4651q965k3201L1044q546p539J9475j3657R247
592A3788j1628k7677L5438M399j7099l757k4702K8377K0606k7942J3159l915r906
605a0859J6461j3464K0898J1242m3832N874J2344O581J6324l6402r07K7399j4561
618b902J3059j614j3167J8332k2136L222L1206k2852r676j1301l105M2631j5730
631E967k5254J2575j0085J7209P973j2660K4611j9736k1683K7438K896J1832j0649
$$ y = [-6106, 14296, 5569, -23026, 7654, 3641, -6943, -9146, -34911, 346, 15791, -17591, -4894, -5171, 3252, 19938, -9143, 9607, 21503, -11949, 2408, 4223, 6512, 17350, -24108, -16166, 14871, 1264, 8662, -8333, -13967, 18735, -3040, -3128, 16756, -4720, -1861, -13947, -15489, 24116, -2306, -24537, -7613, -8721, 15930, 6965, -16236, 14808, 6262, -1277, 18198, 4541, 13788, 2160, -25517, 9921, 14320, -2779, -6536, -31238, -2861, 17745, -10197, 2962, -953, -10859, 5602, -7862, 13036, 24278, -19554, -13680, -1336, 5245, 21569, -14833, -15740, 11659, -2902, 10157, 8543, -4624, 13708, -8428, -5206, 26000, 3148, -6528, -17829, -20934, 21697, 5967, -19287, -6712, -16797, 412, 8385, -4275, 20336, 600, -21083, 6355, 9251, 21083, 10434]
644A0434l7185K6362J1295j0908R238k0618Q238J2742k2466K2077M591k2973N392
657c781j0585K1190J9545m2442l053J0993J726K3288j9786n362J5938k4762J4182
670b909K0373p061P645l0278o059L8021r318m687p596j6514K8578p821j4038K1821
684A0157j6547j806Q028o988K7244j6377l1346K4412O564J0558j838l5535J6967
697f507Q544r194K3228j0955n703J654k2625K9595J8764k4808k434j4553J2432
710b562K5316k8956j1P805j2859J6880p014j417J3792l0868O784K7481n364L950
724A2957k8003j1191L8598l214o59p48k4998J4294m61j702L2034j9779k0700L604
738i968j522L4323n286l4409J3538j187O643J2706k3138Q783j713j8145L0176
$$ y = [10434, -26751, -389, 10906, -2, 9236, -11382, -3144, 9598, -12868, 9209, 13800, -9173, -3781, -14366, 6824, 26369, -16073, -19126, -8133, -6407, 16881, -2905, -8267, 7671, -17091, -2909, 17464, 10403, 18048, -12230, -18289, 19732, 10414, 5727, -1869, -18383, 10195, 2374, -11664, 10157, -6390, -8196, -168, -7156, 20088, 3711, -27635, -3223, 3341, 13899, 12061, -23474, -6507, 2037, -7157, 16071, 5116, -587, 1067, -21558, 8037, 26801, 1993, -441, -14994, -2562, 22754, -6202, -6213, 1592, -11267, 5613, -1401, -2818, 10974, -19894, -13110, 14371, 9007, 12957, -15046, -26237, 12361, 9147, 8488, 7740, -17258, -2964, -3425, -5127, 26907, 7128, -13572, -9968, -11490, 22833, 17547, -16862, -3324, -4511, 2132, 14838, -8300, 483, -1230, -19375, 10801]
751A0801L256j1765o255k6810K8674K9168j9899m971k0274l23L0937r152Q909
764A2296L043l5089N010R647J5491K1223l9505j5265K1033K055J9105j1806k1581
777a4343J7206j0647O715K1832k0002l974j2301k845M2849p007k6088n778j1582
790b5965L2605J4687k1594P327j8570j0392K6238M253J6264j3226m2018J8980
802a1411J7958O286P163l3889J653J7110j0881J9113l481j7651O887j3419J9021
815D459K2715l2705r669j191R241L2518k0946j7658P645j3211J9918J4246p698
828G664P393k9896q013L5753K648K798j7107k5991K6466M952n943J0621j9910
841h565K535N913r761K6199p673k5479J0654J62J9694L729l7232P391Q833P1J9801
$$ y = [10801, 14057, 2292, -3963, -30773, -2099, 27069, 7170, 2199, -18075, -18398, 12539, 3387, 12296, 15339, -19750, -14740, -5093, 10398, 31621, -7884, -23149, -2116, -61, 19044, 7238, -14343, 2863, -7784, -1069, 20763, 761, -3213, -15514, -18359, 24490, 17483, -8605, -14383, -25965, 6640, 21327, -267, 7060, -11510, -21902, 4336, 8589, 24853, 11627, -30391, -11411, 6547, 12833, 19996, -13893, -12240, 4870, -6011, 13102, 9621, -8030, -1143, -14562, 4459, 27174, -5531, -15200, -16391, -7150, 25368, 4422, -13236, -5591, -18802, 1116, 15362, 7664, 15057, -14839, -22852, 12901, 15549, 18347, 1240, -24751, 1715, 6667, 724, 11345, -8565, -6030, -117, -9878, 16321, 8648, -16831, -6177, -6015, 13679, 17408, -19824, -12433, -3600, -3529, 16272]
856A6272j6237m653M692j9843K4788J7443j3898j436k4224P990L1039j6583l000
869B350m772j1915J9874q516k427J6711k3003J297J3448j868J5445k2666j6075
882b2117K8214J07L946m864k4628J6703K118l702K2524j4688r380Q43q687L1860
896A8249L629k7318K380p069J2049J3904k4241O369O97j4624J9396j970o04L729
910D576k5834J7351K2240j0983N91k1604n28K9259j0551J862o95k2429J1454O19
924d672P189K2310k8118j3105J1867L149K3517j3758k3563J5372o665N693J2554
937A1770j7841M804p765q124L1494k505j2313l800j4941K8434J3691k1436K030
950C498j3995l72J9895q910R943m850k9498J4453J1537Q761P742l2880Q92J9402
$$ y = [16272, 35, -4618, 74, -19769, 5019, 22462, 8564, 7128, -17096, -9106, 21933, 5350, 2350, -2422, -14337, 5537, -2979, -5406, 11305, -11698, -10401, 3047, 1179, 16624, -6042, -22117, 6097, 6204, 10150, 5286, -19342, -2639, -521, -4223, 18301, 3613, -5767, -4924, -13611, 18249, 21878, -5440, -3060, -10129, 1920, 15824, -8417, -2048, -1351, -15975, 3421, 1451, 847, 4576, -21258, -3907, 18333, 7350, 7941, -13663, -14191, 15068, 4517, 6379, 5684, -16745, -5291, -4672, 2517, 24827, -3291, -16396, -4529, -1380, 22137, 8379, -15184, 188, -6477, -784, 11770, -6071, -1267, -9032, -17156, 14338, 11833, -480, -4280, -19221, 9213, 22904, 1468, 3498, -10497, -10869, 9026, 116, 10059, 5209, -24289, -9836, 1701, 10462, 18204, -14676, -13784, 5618]
964E618m347J3194j0875j4232J2041j1955J1733J6880k1970k345o424M769L2308
977B4395j6090j6069M439p423K0946K440j4893R046j9319m167K3315k754O375
990A0241j4334k2501K7606Q649k797L122k2702R055J1192r524J7176r680j7114
1003a1611Q336o009J9429P981l0803K191N271O128J8106k0611m973P810j3577
1016a2332J7300N481j1586L258k0726O566K7485j1027k609r877p167K7600m186
1029H180n909P706j8895O189P991m564J6810j9074j8317J8057J565J1522m459
1042F802k5432J5251L464k227J5523j5715j869K731j2027K3622K836j8983J660
1055d364r946J5612J8026k1904J137p77n906J9825o397p97M808k4616R395J4710
$$ y = [5618, 1271, 14465, 3590, -10642, 1399, -10556, 1177, 18057, -3913, -6258, -12682, -7913, 24395, 8305, -7764, -3325, -10748, 10198, 12638, -2255, 6791, -12528, -16695, 6620, 3866, 10241, -4093, -26594, 1012, 9661, 6864, 9986, -12716, -3661, 7531, -1993, 15183, 5503, -11611, -3275, -9284, 10145, 18126, -12677, -10486, -5215, 913, 19019, -1592, -6565, 1245, -12332, 4968, 10449, -1137, 2121, -18605, -12039, 15446, 4419, 1810, -8067, -15234, 12366, 8180, 2271, 9977, -8918, -2729, 5262, 698, 17508, -1566, -19883, -1826, -261, 11261, 6802, -18630, -3379, 85, -2142, 13381, -2334, -4203, -1472, -13499, 10123, 12959, -6024, -4364, -14310, 1302, 19328, -2576, -1439, -2216, -8122, 11703, 5306, 4509, 9317, -15299, -5904, 8806]
1069H806m285O060k2990n644K4281n861M496j794j6538J3969l102O40J8451j8093
1083a604o243M397k731K3171r109k0940J1356l524J0190Q439j8417P557n468q572
1097a1498K2525l008m107l523k0347J9436J2684j2046L462j4981J779J7032j1714
1110d306R490J401j7858J0343r87N769J2069k4798k95J2447l259J2284j2930j0119
1124a0749J5251r540O998J0046j5071M394q601k677K5368r552q898J91j0099J8733
1138E794J095j2990J1812j0556k254J1413q367J1648l953j7601J6646J128j262
1151B553M084j9067J1057R861j1546R889p561n958J0804j1063J1187Q470j9511
1164f801L900k026K652J6988j7779k440Q788j0354J0992k493o754J2917j4135
$$ y = [8806, 4521, 10581, -12409, -18053, 6228, 367, 4863, 3069, -13469, 500, -2602, -1962, 16489, -1604, -7847, -3450, -6181, 16990, 7881, -13059, -1703, -5227, 4963, 13402, -5015, 2542, -2926, -11498, 11027, 8019, 3912, 389, -19958, -522, 12162, 116, 3578, -11403, -9624, 7408, -4306, 5184, 6585, -11273, -930, -1917, 3852, 15921, -8877, -9172, 3275, 16, 12300, -630, -10749, 4502, -5038, 1960, 12006, -3065, 1329, -7272, -9949, 15419, 5867, -3031, -2840, -12939, 5794, 6889, -6101, 5711, -4845, -7099, 4314, -4053, 7595, 3642, -13959, 2687, 3815, 2553, 6637, -12430, -1373, 8488, -3058, 6831, -730, -6688, 4116, -6947, 4240, 12710, -6801, -2901, -4927, -2275, 14713, -3066, -5506, 3282, -7072, 3920, 1427, -5327, 7590, -6545]
1177f545K16J4359j0598N117n576o987K1060o839p460N974j0801J2213L050j1537
1191d354J3310r900q230J1895n090J0503j583k0283J2673K707k310Q515j4680
1204f827N213O263j3192J2452r14q553P969j0720Q520J1372j8011L301Q37m64
1218b754J6435j3302l816Q872j2596R571M301o930Q762j6165l570J7725o306L866
1232D093m490j1999J6507l626m302J1027j1756L106L285q681J5657o193j2134
1245i506J0426m384Q752L447j8690R822K221m508J2807r636k32L262j4697J3537
1259B621O029r985L889j2898L707J5003j2749M492J093q286J1940o759K37J1799
1273A0133j5372K724N731n363J0714j1963o525J6123p060K997J741j1709J1996
$$ y = [-6545, -6329, 8030, -2568, 2549, -3027, -10014, 11046, 4207, -3253, 2721, -8080, 4133, 7183, -4354, 8956, -944, -9174, 2721, -2369, 8134, 6551, -13732, -1059, 1648, -662, 7853, -6827, -1614, 4649, -8543, 3909, 2995, -5558, 2411, -8309, 211, 11583, -6428, -3127, -2290, -2754, 13681, 379, -3437, 5435, -7161, 2410, 6711, -219, 8543, -7622, -11192, 6533, 227, 4093, -397, -12396, 4111, 485, -3817, 7210, -4546, -1440, 1845, -6836, 8821, 2628, -9506, 920, -3464, 5288, 8735, -9955, -133, 2088, -2420, 10387, 751, 519, 3781, -10916, 2621, 8650, -1335, 2554, -10344, -6637, 8366, -4383, 109, 1202, -7084, 4856, -1903, -1666, 10133, -5239, -2515, 3216, -2147, 8567, -3396, -9921, 6202, -858, 2139, 3880, -7829, 4167]
1286D167l393m888J4599r960j898J954r846J5587j492j2982Q858o162L486P474
1300E504j2932J0000J260r787J1502n110K69N829j4908R666O220j1300N730q025
1314f082R52J3522j2165L743M027j0373R756l166r62J1569j5372m98P858n943
1328c134R465p873q085J4264o977J132O351j0375Q670k182o031J4487p985n318
1342c591M587q213J2710L14j4371Q527m352J471J0321j0961O221O65j1936J3049
1356D441K26k177L864j5814O623R707r942O538o449m300J2010q312M592O495j3380
1371e878N879k14r84J2419j4366m374Q717n557R589l090j0430J0567o186J245
1385b663J2083q843K412l518p696J7290k998p261L135j0978Q961N190j0326Q693
$$ y = [4167, 774, -4114, 10485, 525, -1373, 581, -9265, 6322, 4830, -8152, 706, -5456, -1970, 5504, -7428, 2572, 3832, -5955, 5547, 437, 706, 6535, -8373, 1293, 7513, -3787, 1943, -6082, -5130, 8392, -3773, -30, 3997, -6376, 3380, 214, -748, 10821, -4551, -5049, 2809, -3134, 6331, -1542, -9627, 4637, -2340, -1208, 5143, -5232, 3438, 1256, -4775, 9712, 1727, -3591, 996, -7217, 5493, 5807, -8564, -37, -4389, -2918, 7403, -3558, 2663, 3328, -8608, 4441, 4667, 2490, 6354, -9460, -2837, 6870, -3072, 3466, -2983, -7283, 4727, -3585, 1007, 7502, -5878, 1, -213, -1197, 11222, -3144, -7518, 1199, -4358, 5231, 2141, -8289, 2278, -3908, -2663, 9420, 577, 2989, -529, -8225, 9065, 6067, -1194, 1941, -9037, -76, 5114, -5212, 3481]
1399C481n805n493J0925n747O925J566j5536R534K971k176O620j3997J718Q917
1413C903q084Q661j877q370Q327p026N944J1131j4087N33o31k551J4457r040o089
1428d799N957r235P324L767p524Q516q562l672J4579n240J999j915j0669J4312
1442D838N16o311N305j0725L479P156p185R919m482j0900R160j990O978M374j7204
1457g072L819K935k328J0562r867l159N602r476R860N240r341M373p576L519J4262
1472A1353j0435j250p20n598J3780k706n653N393j2362L986R415l660O971j1118
1486b604r201J4184j34L862m9j5511O729K140k366J1444r331n077L928n238J3520
1501F296J460j3240M280l170N791J0245j2906jn7n693J3769j576m467J333j4035
$$ y = [3481, -2324, -7817, 3108, -2639, 4286, 5852, -9684, -150, 2821, 645, 7265, -6732, -5014, 3903, -4181, 4480, 2603, -5767, 2560, -4466, 1478, 12609, -1478, -945, -1576, -4127, 10330, 1290, -4799, 1158, -8077, -753, 3014, -4510, 4006, -4556, -8228, 6351, 1111, 3110, 1195, -9474, 4838, 5354, -957, 4348, -6377, -2898, 4258, -2927, 6992, 2510, -8390, 770, -1220, 5758, 10132, -7072, -3253, -318, -2646, 7916, -1951, -5110, 492, -8984, 876, 6116, -3225, 1148, -6428, -2909, 11353, 918, -332, -1052, -6650, 7130, 4424, -1229, 4164, -8198, -4212, 5203, 1543, 8514, -2604, -11805, 2379, 2245, 6107, 6058, -9453, -2724, -584, -2950, 8494, -837, -5914, -1986, -7224, 6296, 7756, -5484, -1204, -4374, 1417, 11662, -1244, -1245, -1302, -6995, 6774, 5198, 731, 2064, -11971]
1516a1971P739J2580n111K549j1381n108J4871k622L496N48j4202N501J114R68
1530a029J1714j2485n482N692j883J2159l446j2417P199l557M907Q628j1509J050
1544d59k947m713J6143j210o665j287j0636J1412R089p539K911r162l452J2060
1558C545l772N373r0j4663O579K956J381P424j3946j093Q315l689Q292m573q521
1573f482P420m073N147Q133j2032m11j605o18J5412o327p609J559p146J0460M691
1588F519p843M761q399k636J1556l460L914l183j1137J1200J910k521L855j1241
1602f705L485P252n611P407m921p815P645k250O582M481j4882J756J705R45J1217
1617A0291r767n228L695o446R553L309p649L718q430J911J2923o404k15k875n975
$$ y = [-11971, -4232, 8348, 3237, 5786, -5595, -10703, 4168, 1546, 5042, 5590, -8612, -3111, -1997, -1029, 10685, -1800, -7282, -1590, -3473, 8686, 5240, -7177, 22, -3535, 1372, 10000, -1509, -459, -3406, -8119, 8024, 6814, 149, -1138, -11774, -362, 8727, 1188, 4099, -5063, -8515, 3545, -227, 5146, 5056, -9607, -3028, -72, 1309, 8733, -5213, -6306, 2009, -1680, 6612, 2039, -6482, 938, -3135, 2012, 10145, -1887, -2298, -3903, -4521, 10891, 4564, -3045, -1486, -8632, 1828, 6519, -1324, 3437, -4962, -7598, 3958, 498, 4412, 1229, -9908, 1292, 3202, 681, 4536, -6705, -3220, 4032, -1579, 5828, 907, -6908, 737, -1513, 5069, 9550, -5332, -3576, -1871, -926, 10291, 524, -4704, -1009, -7455, 2098, 5407, -2242, 1476, -6954, -5043, 7880, 1476, 1261, -1614, -7589]
1632g589J2830j004m542L035j0011M745P360m375O142q474p547J1027L19N094
1646G010p54j4762N336L034M59Q322j0287l943L260m702J2041J481j0647K495
1660a657m523O173J0483j0541l86j714l665J2694k821m313J556j0996P207R157
1674F654m096K821j0900l861J3538q12K987k420j2916O610J983O68Q355j1531
1688b920m463M431j376J2047k306j1371M538k315O320P686j1523L52k004l191
1702f095J2836k337m894j055r319J0462Q289n783J244r286p27J2251k918K792
1716E460k610j1913O548K357K002O205j3571k076O824m56R542n363r371O509k608
1731b521N887N918j1209m6k397r40J3616m919o200K52o038J1488N050p275K204
$$ y = [-7589, 5241, 4237, -305, 2730, -7281, -2536, 4824, 449, 6591, -1883, -9430, 1597, 1916, 7010, 6256, -8506, -3170, -136, 323, 8645, -1642, -5585, -2325, -7027, 5014, 6495, -4152, -1657, -6180, -7, 10476, -65, -451, -2165, -5830, 6864, 4043, -270, 1286, -9710, -2503, 6654, 2558, 5379, -5521, -9382, 4156, 3344, 6331, 3911, -9005, -2395, -412, 256, 8611, -2920, -7383, -2952, -4328, 7719, 5413, -5958, -1420, -3735, 2585, 10271, -1252, -900, -2904, -6095, 6741, 4404, -490, -1545, -10864, -402, 7887, 2104, 3348, -5938, -6665, 5586, 2668, 5460, 2850, -9063, -2515, -158, 1844, 8049, -5522, -7598, -774, -1230, 8312, 2949, -6422, 87, -2521, 3366, 9284, -1925, -1971, -4368, -5308, 8308, 3389, -2811, -2559, -8597, 2891, 7941, 666, 2870]
1746B870p612O3J0843l814K215m221j0774R653K530O1K698j2570K501P689k218
1761h6P393o331p035O641k738O402M014j2632P16m16J637J1529q226m762K529
1776a365m371J0463K324p291K954q076J866J0792n740L43n096o910J1687P70j846
1791E04J904j0394M777O675k576O600p260o874P443j243N962R16j3204L712J024
1806b034J467Q729r113k430L230m260R921Q16p963J963o569M600R307q117l28
1821g81l783l504J1732j346k025K245r712N665O266k619N212r110m730Q974k116
1836C68M322j311j0670O076N6R21P372r036j324L082l229R773k121q441L354m398
1852e206N414O533r525J413j966k766J1096k416j528J179q891P085N305m113L363
$$ y = [2870, -4742, -4679, 6164, 2350, 4565, 344, -10430, -777, 1753, 1814, 4512, -8058, -5557, 2132, -86, 7307, 976, -6059, 582, -2156, 4246, 8260, -4372, -3656, -4072, -2435, 9094, 868, -3894, -1365, -5736, 4727, 7051, -240, 2714, -5362, -3496, 7296, 1556, 1899, -3197, -10107, 1580, 2350, 504, 2408, -7986, -3209, 3466, 890, 7490, 230, -6644, 799, -444, 5518, 6434, -6770, -3058, -2034, -567, 8162, -951, -3381, -151, -4411, 5510, 6326, -1637, 326, -6243, -1643, 7664, -453, -781, -4564, -8068, 3664, 2318, 293, 2538, -7174, -1509, 4757, 2138, 7350, -1760, -6490, 2484, 368, 4690, 3379, -7291, -1215, -1159, -238, 7134, -1902, -3226, -144, -3373, 6400, 4279, -4162, -808, -5206, 208, 6741, -2784, -1371, -3337, -6103, 4993, 2577, 1049, 2228, -6663, 422, 5727, 1614, 4977]
1867D977q423j754Q960m233K956q58q484O819j56L87O062r794M25M205k468P826
1883F447n072p385N811l467M849M422r201L047k265j438J0726m157k285J215o901
1898e654Q409K571o206L695o654N09P516n759L207j500p029Q510k71l95L426r987
1914e612K894N686l404N667o040n046O592l428M906K972r341K970j056M42R520
1929G722o958k333K378n245Q396R7o571M410n789J656P294o296K463k531n178
1944f485R953q14j809J722r096N231M561l618N242o600m270O908k799N443J091
1959D660r882M481j97O61P644q422q96K867m521P954j239n896M079n642L505O617
1975E773p417K004k761k979J0008k749j872J482p811N806L635l549N174o982l014
$$ y = [4977, -3446, -5200, 3760, -473, 2483, 1625, -6859, -40, -196, 191, 6253, -3541, -3116, 1089, -1379, 6447, 1375, -6010, -199, -3666, 1183, 5605, -3596, -549, -2814, -4252, 6474, 2317, 32, 1247, -5654, 2755, 5326, -880, 2815, -3839, -3330, 4186, -1573, 1634, 134, -6895, 1615, 1344, 949, 4375, -5612, -2718, 2968, -436, 5231, -809, -5855, 737, -2691, 2215, 5187, -4154, -1184, -2240, -1798, 7722, 764, -1569, 809, -4436, 3960, 4057, -2514, 1896, -3893, -2237, 5057, -1239, 1224, -1307, -6485, 3468, 2654, 845, 2567, -6529, -1298, 3263, -355, 4887, -1713, -5983, 925, -1874, 3569, 4660, -5222, -741, -938, -277, 7367, -1055, -1951, 916, -3605, 4349, 3110, -2786, 1293, -4349, -844, 5773, -1644, 360, -2401, -5380, 4628, 1879, 7, 1489, -6322, -516, 3119, -430, 4744, -2238, -5252]
1990e252P346l040M690k77r009N890k81k08N983p670L9K779m462P720k040n576
2006c368M236m562L835M929p843K631j631k299Q560m125q99K313p626O360K458
2021B969l633M777o721j173P126m410L656p43o661O902k169o19N461p770J897
2036a111K831m244O652l665m443N732m394L648K523p847M271j172j761P588n015
2051d07m78K164n755O902P71m915M490n481Q73O057n961L011j82n259P060k844
2067D6q23M037p251L554L221m542N309n040k729O903m331K598J334p333N499j115
2083f63j235O977o737P9L437m798O927j297n608N025m469J792M840o880L313p70
2099f7m127P871l347j238L205o778N452K166n118M601m970j196O720n106K909
$$ y = [-5252, 2094, -946, 3744, 3467, -5542, 348, 67, -141, 5842, -1828, -1789, 990, -3472, 4248, 2208, -3368, 868, -3694, 141, 5070, -2773, -142, -1773, -4072, 4488, 363, -536, 1777, -5849, 511, 2969, -664, 4113, -2608, -3781, 3345, -1065, 2591, 1848, -4813, 2089, -80, -699, 4762, -3008, -1111, 1720, -2524, 4128, 463, -3980, 1752, -2642, 1006, 3529, -4318, -47, -1219, -2980, 4608, -407, -885, 1279, -4476, 2426, 3197, -1718, 2772, -2709, -1836, 4221, -1740, 1271, 1089, -4170, 2890, 46, -777, 3260, -3991, -437, 2784, -1758, 3551, -1489, -4218, 2685, -1646, 952, 2286, -5047, 452, -663, -1898, 5079, -1658, -1579, 1858, -2940, 3987, 2690, -2918, 2107, -2362, -570, 4270, -2610, 703, -67, -4194, 3677, 330, -908, 2297, -4481, 971, 3137, -1981, 2620, -2350, -3546, 3174, -1932, 977]
2114I77M05o631O331j030n81N486p429J089L504m081O108k866m596N624m808K115
2130c83M052p023M104j011k823P366m809p36L479n679N489O52n691M777m379j34
2146b749O207n599K949k15n230P084j512j027M228p069K724L004m695N200k955
2161C45l653N551m789K678K629o554M915o61k332O062n965o5M173m937N058j004
2177A451n291N286m056J160N547o538K593q5l597P557k637j797L515o203L782
2192F87K290n257M731l747k077O575n068K260J058o239O600k95k258M455o815
2207c100J100M498m256M947k409n566N296k726K672M323p295K335N5k134P654
2222E394m172k148L025n759M902J798n521L861m056m67P137n062J533k18n190
$$ y = [977, 1382, -5249, 1082, 52, -529, 4957, -2472, -1383, 2121, -1960, 4148, 1282, -3314, 2310, -2498, -383, 3669, -3354, 750, -261, -3084, 4282, -527, -1263, 2216, -3463, 2026, 2678, -3013, 1764, -2615, -2749, 3458, -2141, 808, 593, -4637, 2447, 935, -92, 4136, -2933, -209, 2795, -1900, 3300, 345, -3308, 2243, -2546, 132, 2761, -3793, 1122, 461, -1871, 4191, -1774, -1839, 2334, -2603, 2455, 1451, -3840, 1446, -2610, -1450, 4097, -2441, 152, 67, -3530, 4027, 1390, -407, 3108, -3095, 687, 2977, -2280, 2451, -1296, -3373, 3202, -1866, 394, 1452, -4787, 1813, 1518, -740, 3715, -3100, -2000, 2498, -1758, 3189, 780, -4786, 510, -2216, 456, 4779, -2516, -181, -126, -2260, 5394, 1222, -926, 2099, -3660, 1242, 3040, -2481, 1380, -2676, -3143, 3994, -1068, 465, 247, -4943]
2237d943P430k91k276L415p426J501M508l025M964l690n451N614j935L211L294
2252D900p635K713j44j558P184m579k212K589n083N338J373n510L611m140R06
2267b247O477n175J303n36m633P652r19j643K550p394K413M399l030M684m421
2282e20m381O130k561L142K685p281L299l79j697O360n322j312L050m488N273
2297A998J4n576M400l515J938N356n945J430n68l501P447j793k096K328o923L906
2313a100L929l653M074m256k608O052l216K609J373o777M338j27j668M735n998
2328b293r0L825l657M860j762n164M928k183K288L750o678J415rk423P593l198
2344A202k441J909n268N213K672m327L214l879j268O577l839J618O8n761O049
$$ y = [-4943, 2487, 2196, -80, 3335, -4091, -2590, 1918, -1107, 3857, 167, -5284, 330, -1605, 1606, 4900, -2735, -22, -166, -1724, 5460, 881, -1331, 1258, -3825, 1513, 2886, -2624, 987, -3153, -2247, 4230, -945, 358, -178, -4811, 2841, 1922, 279, 2829, -4565, -2152, 2247, -783, 3901, -520, -4901, 1229, -1332, 1810, 4495, -2786, 513, 134, -1563, 4797, -525, -1837, 1213, -3275, 1998, 2012, -3564, 836, -2679, -741, 4615, -1330, 100, -468, -3969, 3478, 1685, -411, 1917, -5006, -1100, 2829, -824, 3250, -1006, -3614, 2438, -778, 1831, 3204, -3573, 765, 638, -1030, 3705, -2293, -2383, 1442, -2215, 2645, 883, -4281, 647, -1536, 752, 4502, -2176, -761, -770, -3193, 4400, 1202, -1239, 670, -4598, 615, 3287, -1040, 2174, -1705, -2973, 3604, -235, 1383, 1451, -4310, 1739]
2359A739m51j887L154o466J307M642k805L951l208m998N374j496L164K683p886
2374c183J758J71n52P140m115l124K032m199O070J772n079K674l858N02O445m516
2390f2Q79r88m690P145l40k212K255p101K594M979k641L882m726m274N959j430
2406g71L409J644q206K356M68J90O623n402k697K448l587O436P87n452K464l692
2422b982J963O054n283K98j388l394P531n16k099R89o426L644M494k624L188m895
2438a446l440O092j236L056L31p541L330M27M04N297n884j713K569k869O245o34
2454B988n566K728l105K620N313n822K62j138k414P345j160k319J095n876M294
2469g55M009l070K572m850k120O323j840K056n2o572M119O01j97M214o174p91
$$ y = [1739, 1288, -599, 2555, -3911, -2604, 2038, -767, 3184, -24, -5022, 352, -1144, 2020, 4703, -3183, -1425, -1254, -1806, 5334, 1219, -1905, 127, -4072, 1998, 3770, -1309, 1365, -2493, -1991, 4454, -62, 817, -171, -4861, 2284, 1944, -268, 1987, -5114, -2520, 2459, -182, 3700, -1026, -5300, 659, -771, 2638, 4282, -3924, -1568, -1100, -910, 5713, 311, -2386, 62, -3525, 2911, 3698, -1754, 710, -2982, -1019, 5035, -248, 50, -1338, -4732, 2799, 2283, 184, 1173, -5253, -1609, 2885, 261, 3449, -1446, -4886, 1206, -30, 3026, 3357, -4184, -854, -427, -23, 5274, -610, -2323, 246, -2623, 3622, 2988, -2578, 150, -2955, -335, 4978, -844, -582, -1720, -4134, 3211, 2051, -268, 827, -5049, -755, 3254, 184, 2756, -2094, -4214, 2109, 269, 2325, 2273, -4299, -180, 421, 224, 4438, -1736, -2527]
2485b527L217k355N397k132n008L318k118K829L793o154Q38n77j600P123k698
2500A346k443J102m435M957K797l738K470m703n34O160k455J447j249n392N423
2515G53M19m08K873o720P45L382j754M098k846m519M046j759L307K477o710J543
2531a073k92o23O380l778k258J529l703N376K054m462K117m063N68O063l339J003
2547A499j553m345N984Kr27J752o254J823L630j935L651l664l769M443j524K999
2563A812J433o242J980J49j60N526m762j753J971k850N520N03m544K131l484J619
2579a151N426l893M36j515l413O461p79j138J283n940K513L542k270L365l979
2594a052k811M982j892K733N30n862K524N82p9M546n134j160K238k091N234o07
$$ y = [-2527, 690, -1665, 3732, 1600, -3408, -90, -2208, 621, 4414, -1740, -902, -1479, -3079, 4044, 1346, -1097, 5, -4430, 527, 3324, -414, 2056, -2647, -3181, 2979, 524, 1971, 722, -4670, 753, 1172, 764, 3637, -3083, -2338, 1044, -710, 3388, 542, -3977, 69, -1690, 1617, 4094, -2616, -1073, -1365, -1988, 4392, 614, -1644, -115, -3818, 1558, 3612, -850, 1267, -2796, -2228, 3835, 496, 1499, -54, -4399, 1585, 1587, 660, 2412, -3842, -2019, 1611, -324, 3327, -337, -4106, 337, -1187, 1812, 3245, -2997, -1017, -868, -1028, 4498, -264, -2017, -46, -2896, 2624, 3127, -1417, 714, -2770, -1151, 4275, 382, 818, -697, -4110, 2351, 1572, 434, 1717, -4223, -1710, 1832, -438, 2927, -1052, -3863, 1119, -773, 1960, 2490, -3372, -848, -266, -345, 4201, -933, -2093, 145, -1946, 3288, 2681]
2610B681m659K438k963K416M613m881M64j225k456O244j444j461J159n080L500
2625f54K915k673K777m004j721N281k024J802j83n410L932M35l49L615n639k67
2641b167K745j590M409j668m284K761k233K618L265n006P96j235j437O200k191
2656I83j583J029m482M265K045k965K412l628o12N239k475J354j044m500M608
2671F46K01l04K479n660O40L032j376M143k694m045K911j503K568K535n524J092
2687h59o67p24N577k961j367J051l381M469J284l189J911l522O29M980l263J344
2703A312j423l801N256j09m40J849n902J933K621j352L447l170l262L388j645
2718a298K592J462n360J993o36k32M935l762r00J626l265M698M26l460K286l364
$$ y = [2681, -1978, 460, -2503, -87, 4526, -355, 109, -1116, -3572, 2672, 1228, -233, 926, -4154, -654, 2261, -412, 2365, -1639, -3360, 1921, -103, 1699, 1516, -3894, 38, 473, 124, 3739, -1900, -2167, 578, -1012, 3397, 1729, -2555, 206, -2027, 591, 3856, -1150, -354, -1589, -3026, 3174, 983, -600, 429, -4053, 212, 2257, -708, 1704, -1924, -2536, 2703, 228, 1582, 538, -3962, 646, 847, 543, 3022, -2638, -1998, 1034, -342, 3801, 1107, -2938, -27, -1530, 1038, 3573, -1951, -859, -1526, -2250, 3327, 366, -1001, 50, -3331, 1138, 2422, -767, 1144, -2378, -1749, 3231, -32, 1312, -111, -3912, 1344, 1235, 795, 2644, -3258, -1325, 1296, -56, 3391, 221, -3041, 347, -1298, 1294, 2756, -2604, -611, -1247, -1479, 3456, -306, -1206, 420, -2845, 1853, 2279, -1181, 1105, -2259]
2734b259J297M126l793J603j176l020N039p91o91J764n171K110K397j850L163
2749B748l276k321L842k188K319Q28m818K904n72m43L967m316L23J668k453L836
2765B048m20l344K801k924J691L183l887J391r38j995M948j855o72J050l832K602
2781a53J768k434K755l188j044L868k728J925L18l964L397o97m09L118m148P42
2797h74J905k366L716j591k852L300k469J783K332m478J701n55j226M608k775
2812A59q92J453l436L431P53k566K548k921m12L875k859J636j11l549M045r08
2828B46o34K661m213J379J911k350L395k170k411L390k340J853J652m294K146
2843B21o95j145M431l256m47J384k996L557K90k781K494k592N67L201l187J563
$$ y = [-2259, -962, 3164, -629, 974, -202, -3222, 1817, 1026, 335, 2099, -3072, -962, 1435, -415, 2748, -528, -2849, 993, -1195, 1124, 1952, -2866, 38, -534, -977, 2990, -1326, -1003, 665, -1788, 2048, 1628, -1716, 1085, -1839, -148, 3035, -852, 539, -399, -2394, 2554, 699, 27, 1077, -2755, -153, 1615, -819, 1936, -1252, -2296, 1572, -1156, 769, 1087, -2877, 520, -177, -586, 2532, -1616, -874, 1031, -1335, 2381, 790, -2062, 1238, -1231, 552, 2884, -1594, 107, -448, -1674, 2934, 159, -733, 720, -2716, 715, 1468, -1098, 1450, -1471, -1883, 1992, -867, 769, 658, -2891, 1154, 246, -388, 2273, -1940, -561, 1350, -1000, 2395, 225, -2186, 1204, -1136, 717, 2369, -1925, 221, -474, -1619, 2812, -444, -891, 493, -2503, 1054, 1344, -1437, 1057, -1535, -968, 2233, -954, 609]
2859F09k66k888M044j294m73K156l975J980J415k369K993k112j654L294k313J592
2875G39J220m107K476o10j062L835l613K21J562k960L404k16k379K879k759M77
2891h93K999l274J891k62k428L854k070m40K377l376K189R99k754K836k168q59
2907a379L302k971J660M36l425L166q26r40K981l395P79J746l053L247r89j923
2923a584L216k480P17J738l262K383j42j682L491k937l99K500l136K967J23l002
2939a489K514k247K59L103k974J188q6k868L762q97j185K451l408J443J826k797
2955a405K712j513j606L752k592R93J265l823K868R5j449L265l585j81K501k704
2971a407L148m51l054K531k209N24L342l606J278j59k647M366j320r67K147l366
$$ y = [609, 343, -2545, 1499, 205, -268, 1888, -2087, -107, 1308, -1061, 1932, -180, -1834, 1460, -853, 739, 1959, -2148, 328, -282, -1344, 2491, -1122, -901, 661, -2299, 1105, 889, -1490, 1389, -1370, -893, 2106, -1168, 723, 461, -1967, 1887, -183, -623, 1754, -1622, 567, 1566, -1188, 1648, -520, -1379, 1923, -1048, 612, 1048, -2377, 789, -37, -977, 2004, -1391, -612, 1134, -1919, 1328, 339, -1584, 1632, -848, -131, 1607, -1655, 728, 586, -1096, 2395, -542, -941, 1559, -1577, 1390, 1513, -1489, 1025, -1222, -963, 2140, -834, 354, 268, -2600, 1162, 265, -920, 1531, -1877, -434, 1392, -1405, 1307, -206, -1812, 1940, -652, 341, 1606, -2217, 651, 746, -703, 2562, -1023, -1204, 1297, -1407, 1741, 1290, -1764, 767, -1442, -918, 2424, -1182, 96, -63, -2710, 1656, 336, -631, 1516, -1850]
2987a850J915J344k634K491j880r42L415k545J325M15l683L354k36r22K881l697
3003a249N6K252k412L255p86l004K504k378J369K477l340J499k74k124M038j988
3019a05n80K209l191K175J004k916K524j583o68L581l100R72N72l358L573l68
3035G41j236K594l571M20K083k369L081j336k524L166k390J049J805l220K149
3050D42k48j751L531k565m36K549k703K533m4l152K803j531J01K979l358Q95k6
3067A9k161L674r07j231K074l603J691J969k761K316j473j743L292j990Q37J183
3083A186l350K600J13j323K657l200r5K778k217K620m66l826L106j187N53K882
3099B831m029R25J73j872M092j399j439J474k907J850J984k851K082j778j010
$$ y = [-1850, 65, 1409, -1225, 1266, -614, -1556, 1859, -686, 639, 1054, -2629, 725, 489, -433, 2448, -1249, -1193, 1059, -1353, 1902, 1116, -1888, 616, -1762, -393, 2084, -1256, 243, -31, -2155, 1883, -105, -685, 1524, -1667, 508, 1512, -1404, 1120, -463, -1131, 2450, -650, 322, 894, -2464, 1109, 741, -495, 2099, -1472, -1052, 1031, -1338, 1743, 407, -2117, 1049, -1341, -292, 1513, -1707, 442, 194, -1557, 1974, -591, -1027, 1522, -1181, 1352, 1308, -1844, 959, -572, -471, 2508, -850, 45, 19, -2142, 1532, 625, -606, 1468, -2135, -444, 1525, -1236, 1080, -393, -2136, 1156, -834, 3, 1186, -2164, 436, 549, -774, 1883, -1317, -1412, 1366, -851, 1769, 1303, -2523, 583, -604, -51, 2831, -1198, -273, -100, -1972, 2120, 721, -718, 756, -2151, -301, 1683, -1168, 914, -864, -1874]
3114a874L820k360P50L39l326L596K00j191K108l560R0K665j746K635j296l217
3130b367K685j052J260K321m071P16o7j142M020j762j605J600k813K406J624k858
3146a105J855j907l27L689k317L47K47l127L735L59j301K016l956N43K659j694
3162b84K494j751k963K902j317J483J911m053J037K45j143L744k160j274J573
3177D44k439K755J033l059K062j847j73L684k805N59j56k718M101l75j218J665
3193A513l622J131K399j806K202j884k681L659j485J199J310m044J816J91r94
3208a096L439k917p45J794j954K795L90l204K047j642N76L374l300N89k73j954
3224b081M021r81j093J312l573J892J988k001K010k315j741L936j591R08N29l821
$$ y = [-1874, 1946, -414, 336, 675, -2651, 945, 1145, -46, 2062, -1498, -1408, 1257, -489, 2146, 850, -2367, 318, -734, 526, 2847, -1224, -508, -575, -1717, 2303, 541, -1064, 536, -2277, 129, 1753, -1105, 750, -1157, -1484, 2205, -112, 235, 482, -2645, 1090, 1449, 148, 2164, -1792, -1249, 1410, -284, 2210, 459, -2504, 398, -919, 564, 2475, -1578, -541, -296, -1439, 2305, 145, -1129, 444, -1995, 760, 1793, -1266, 796, -1051, -1224, 2460, -345, 214, 58, -2660, 1441, 1066, -152, 1513, -2109, -978, 1421, -385, 1817, -67, -2748, 911, -574, 625, 1935, -2109, -293, -102, -1096, 2343, -574, -1319, 475, -1479, 1316, 1706, -1498, 549, -1093, -517, 2857, -443, 146, -127, -2081, 1940, 959, -134, 1178, -2395, -503, 1485, -516, 1494, -821, -2562, 1374, -217, 691, 1220, -2601]
3240b601K396M88q34K970l269n79K283j786L009p97l198K155j190J025L010l822
3256g40L49J13j549M276j604j533J304l129K357K255k648J549k152j174L975j794
3272a45P87J6l452L075K54p89K641l850l6K391j428K735j246l180K628j118J379
3289F62K086m091R80j29r32M032j876j609J114k674K768J781l086J806k403k12
3305a783L717j941N30j72l075L496o6o07J646l657Q06K226j428K339j718k730
3321b417L148j212J335J384l907J025K58n47L540k516j555J511j933K895R38l170
3337a223J737k330O19L267k135N86m70k489L942n41p19J222l658J457K152j620
3353b03J957j719k388L151j198J547P71m037J565N50m36L017l120q31J556j809
$$ y = [-2601, -205, 283, -551, 2419, -850, -1429, 854, -932, 2077, 1280, -1918, 237, -953, 72, 3082, -740, -391, -278, -1827, 2449, 845, -688, 616, -2513, -156, 2099, -549, 1000, -1152, -2326, 1649, -145, 642, 658, -2794, 281, 535, -254, 2387, -1463, -1499, 892, -536, 2199, 953, -2227, 401, -717, 662, 2748, -1343, -363, -492, -1424, 2608, 732, -877, 237, -2437, 331, 2112, -974, 832, -1571, -1783, 1934, -7, 523, 351, -2724, 772, 706, 99, 1745, -1912, -1106, 1120, -308, 2031, 313, -2417, 731, -481, 854, 2238, -1669, -644, -386, -933, 2607, 91, -1464, 47, -1886, 1009, 1947, -1223, 514, -1816, -1197, 2070, -65, 521, 51, -2438, 1504, 963, 244, 1466, -2192, -735, 1417, -203, 1754, 35, -2353, 798, -400, 1147, 1918, -2119, -554, -4, -440, 2577, -543, -1374, 182, -1627]
3369a627L072j3k851J490j540Q61L333k937L96m81j683L669q97p17J191l549J943
3386c40J833j815J796k236j266L256j246R80L66l725K495j30k35K633l290o38
3402a562J870j647L144p42k888J979j457J507K283l156N09j57j226L757j513j125
3418d24J092k866K359J481k108J442k270m92L436j684J108l78l154K688j61j18
3434d9J870l258k7K011j446K851j352k558K384j502J601J803l434J067m67o45
3450a151L461j856j031J014k566K986R45k473J330k270J26L185j873P82l21k827
3466b539L015o9m85J567l316O90J906j357K314j492k045K466j423J553J254l352
3482a313J455l54n45L010k155p82R29j887K574M45k254J282j882O45K704k121
$$ y = [-1627, 1445, 1432, -1419, 71, -1469, -608, 2725, -212, 184, -297, -1980, 1689, 792, 75, 1266, -2283, -340, 1493, -322, 1474, -762, -2028, 1228, -18, 962, 1328, -2397, 98, -32, -267, 2366, -924, -1562, 308, -1339, 1805, 1063, -1825, 154, -1303, 204, 2487, -669, -160, -317, -1543, 2214, 701, -424, 668, -2198, 161, 1642, -466, 976, -1294, -1786, 1650, -34, 1074, 696, -2458, 230, 69, -49, 1821, -1437, -1464, 547, -899, 1952, 600, -1958, 426, -1076, 525, 2328, -1106, -39, -506, -1151, 2310, 454, -577, 437, -2129, 857, 1802, -671, 659, -1611, -1485, 1700, -173, 609, 288, -2539, 476, 407, -78, 1489, -1827, -1137, 769, -588, 1726, 234, -1811, 655, -768, 785, 2039, -1313, 142, -212, -757, 2253, 98, -684, 245, -1642, 932, 1377, -877, 405, -1477, -832, 1872, -249]
3498b49O50n40k056L104n54l75J096k958J373J824j715K080j682j609K473j217
3514c55J350M91l140J618k46j28K534k821k71J287j598K461k31j989J481j752
3530a309Q92K228k168N41o16j397L299j013o45R71k384J750J086j558J696j759
3546c86j029K567j523J180K34l143K196J4l79J937k662J82J025j544K740q31j804
3563a226J575j520Q77K097k690R30m44j003L139j459n60R86k307J864J169j761
3579c33J719k373k98K588j564R06r6k568K596m88o60K150k734M37J064j495K497
3596A348j054j797K226j508R41J316k643J512l67q40K776k029k99J036j962J961
3612F17N32j760J550j834l1K626k366J189k9k078K388q10l83J560k669J050J238
$$ y = [-249, 401, -139, -2195, 909, 355, -20, 1076, -1882, -509, 1315, -400, 1680, -2, -1611, 862, -355, 995, 1486, -1654, -36, -282, -410, 2124, -697, -968, 319, -1279, 1182, 951, -1038, 443, -1309, -417, 1811, -357, 184, -432, -1829, 1470, 457, -188, 783, -1601, 149, 1235, -323, 1373, -386, -1415, 1152, -371, 809, 1043, -2100, 96, 110, -269, 1668, -994, -812, 213, -1331, 1409, 578, -1226, 349, -1171, -294, 1803, -887, 43, -401, -1404, 1735, 276, -284, 702, -1605, 259, 1428, -333, 1386, -987, -1285, 1303, -261, 645, 549, -2019, 577, 89, -571, 1579, -1155, -718, 346, -1149, 1348, 294, -1503, 723, -785, 156, 1472, -1171, 341, -26, -866, 1910, -119, -418, 618, -1344, 617, 1149, -611, 939, -895, -926, 1700, -666, 523, 494, -1584, 804, -6, -389, 1171, -1498, -448, 790]
3629G90j593K061j355j504K668j446P65P52k492J706m26m66K282j952l31J088
3645E47j640K008N7k023J812j642K19J899j996J254j97j702K379r54n82J274k197
3662a484J605Q67j715J682j439o25K235j434Q91L79k316J531p1m14K155k430R2
3679d91Q55j525K407p27j632J906j785P35J479k176J076j40j302K494j194n63
3695e83J018j964J878P05j626J293j343m98K468j425R33j94k259J912j72l00J482
3712A325k106K18J038j367J726n29j276J619j373N74J308k285J245j3j006K433
3728A531j667n14J051j505J736K57j593J628j568p9J963j467R75j85k125K068
3744E06n84k90J706k248O48Q78j654J844o23j142J887j631Q29O49k086J356L8
$$ y = [790, -803, 1258, -97, -1601, 1067, -379, 386, 1138, -1354, 352, -74, -540, 1742, -210, -541, 547, -1093, 915, 972, -1051, 761, -881, -662, 1237, -759, 495, 298, -1404, 975, 21, -561, 713, -1484, 121, 988, -727, 955, -484, -1109, 1126, -308, 583, 962, -1354, 177, 106, -308, 1847, -583, -491, 364, -1161, 1246, 519, -1113, 793, -992, -257, 1222, -954, 122, -18, -1320, 1174, -20, -583, 435, -1529, 349, 1054, -572, 721, -622, -1120, 1348, -77, 856, 662, -1597, 315, 143, -157, 1325, -781, -563, 475, -892, 834, 305, -971, 648, -725, -151, 1157, -1128, 117, 104, -902, 1531, -136, -650, 401, -1104, 632, 889, -704, 924, -644, -723, 1240, -227, 748, 563, -1562, 506, -78, -368, 1338, -910, -262, 616, -1038, 806, 183, -959, 928, -703, 126, 775, -1311, 45, 83]
3761H3p61J846j711J22J115j602J670J2j556J598j298O6J686j945J115k43j442
3778a245K213j189j49J318j888J146M98j656J652j059m21K040j632M55K81j984
3794a620K182k40p58J402j767M26R87j147J350k57j501J610r08n0J463k064J136
3811B44L41j429J973j542m99J710j646J404J56j715J341r26K19J752j803K84L79
3828B43j586J891q8q61J457k067O34J189j380J581r76r94J718j005M09O15k075
3845a295J303J75o80J712j752l09J124r89J447J3j751J116q80L02J889j892N50
3862H3k00j280K364o24k64J048k155R25J166j427J510j190r02K026j501L83N51
3879E13j827J326M8m90J590j923k53J194r91J699l00j640J477j141M27J695j772
$$ y = [83, -678, 1168, -543, -421, 694, -908, 762, 774, -782, 816, -482, -416, 1270, -675, 440, 197, -1245, 968, -221, -370, 948, -940, 206, 704, -952, 700, -359, -780, 1260, -372, 83, 364, -1620, 562, 322, -436, 966, -801, -375, 612, -535, 815, 558, -943, 667, -241, -291, 1172, -892, 244, 585, -844, 1129, -413, -912, 798, -848, 556, 712, -1003, 338, -588, -369, 1383, -420, -136, 243, -1343, 548, 460, -401, 1056, -1011, -377, 812, -568, 1013, 37, -957, 761, -244, 165, 780, -1295, 8, 183, -497, 1215, -537, -846, 278, -711, 736, 749, -1002, 114, -766, -464, 1425, -467, 83, -117, -1397, 967, 343, 79, 1127, -1028, -103, 1063, -364, 1146, -44, -946, 1080, -421, -38, 513, -1314, 12, 60, -430, 1160, -763, -1016, 178, -813, 886, 586, -1054, 423, -718, -291, 1404, -368]
3896c68M82J50j523K363p15n88J048j984J416N23j467J324j108l61J670j224J90
3913a72N05j707J673J22p42J318j908L75J154j202J608o30j359J542r91M50J307
3930A343j829M82K99j040J989j050p26J143j422J169N45j851J305r62k16J812
3946I91j219J60K19j280J856j27p34R38j912O18J415j421J371q23j409J961r41
3963c37O85R25k285R71J76p15J831j542l41J238j432J537j2j550J106j010L04
3980d51J705j494J03J87j289J994l80o50P27j587P74J239j240J431j325r83J881
3997F42q26O44M12k179J392K56n58J280j389l91J071j269J821j36j904J138n97
4014e93K56J720j748M37k09j148K400n43q09N66j649J242J159j315R27r43q82
$$ y = [-368, 114, 264, -1259, 1104, 389, -199, 849, -1135, 281, 804, -663, 661, -447, -808, 862, -362, -172, 333, -1374, 299, 421, -321, 997, -911, -536, 618, -584, 1024, 394, -965, 577, -414, 36, 1343, -486, -4, 295, -745, 1244, 194, -532, 611, -811, 358, 903, -948, 357, -605, -821, 991, -228, -68, 151, -1129, 727, 600, -134, 804, -1108, -490, 925, -496, 875, 52, -1357, 604, -337, 348, 1273, -1012, -41, 135, -580, 1251, -291, -632, 606, -826, 711, 699, -851, 255, -755, -451, 1254, -240, -137, 50, -1239, 755, 375, -275, 452, -1135, -361, 878, -362, 1069, -256, -1239, 642, -184, 460, 872, -1307, 85, 341, -217, 1063, -326, -717, 354, -915, 906, 770, -1134, 4, -593, -337, 1383, -365, 72, -137, -1285, 1115, 572, -237, 329, -1320, -78, 1081, -234, 693, -250, -1132]
4031a132K023q74M98J22j973J355P3l57J596k000m58J497r59J710n81j829J360
4048G1o76P36J237j927N36r8p88K131p17q75O63j569J547Q83j468O27r63k90K029
4067A089j228N91J8j892J741j27l89J357k144K78J009q34J633r08j511J585n79
4084c11Q09P47j988O97j15m19K065j197q77R08j480J694O09j665J036j104m0J797
4102A166j293M16j75j693K145k98m01R00j983P16J166q98J309j142j065J578r30
4119d82Q98O26k017P29J13n7J647j740m83J070j208J701Q1j567R42r27M10J507
4137A243j355J73j70j043J915n28n97Q78j630R94Q54r19J018j166r55K104r37
4154a21P29J71k097J135L28k93J415j495l21O26q38J638l15j255Q48q05P33J197
$$ y = [-1132, 891, 17, 515, 637, -1336, 19, 92, -265, 1331, -669, -1127, 370, -589, 1121, 540, -1289, 71, -605, 131, 1368, -559, -23, -121, -909, 1222, 505, -370, 293, -1276, 271, 1154, -314, 313, -650, -940, 1089, -139, 452, 470, -1422, 319, 192, -197, 1160, -984, -706, 303, -531, 1102, 194, -1317, 268, -311, 498, 1245, -743, -46, -161, -580, 1485, 288, -589, 319, -1161, 533, 1142, -523, 513, -591, -631, 1166, -127, 289, 114, -1579, 566, 268, -133, 767, -1216, -500, 666, -232, 1077, -65, -1130, 448, -482, 416, 1042, -975, -246, -133, -190, 1457, -283, -766, 304, -904, 797, 878, -689, 253, -674, -264, 1243, -112, 61, -109, -1152, 763, 235, -362, 516, -1114, -120, 734, -185, 833, -333, -1288, 816, -121, 608, 779, -1318, -183, 145, -148, 1267, -228, -549, 77, -761, 877, 562, -693, 155, -650, 83, 1280]
4172A280j666J44jr50K083n59p02P09j630J103Q32j030J080j244m97J847o40M35
4190E94o4j758J338J02k92J337j638k35R41j023J766o03j204R14q72J067O83j650
4208e97N30k50m67J831q60n95O72j564J452P23j068R43j360l10K013j043L98j58
4226B90j525J633j75k03J125j884K31Q88r08J651j185j169J549r65P64Q23j905
4243i65R37k98n30J961j060l72N24j263J643L71j346R68j263K40J689j295N37
4260D78k71j411J772m34k66R30j689N81R03j153J324r62r12J395o16O50N01j850
4278a030R96j39l08J708j422l22Q85j036J524j51j370J029r90L99J440j417N09
4295C05k88j265J866m83k22N50j580R16O97r16J249j058n98J272p76P32L97j694
$$ y = [1280, -386, -242, -243, -1193, 890, 331, -371, 338, -1292, -189, 643, -387, 693, -551, -1048, 799, 159, 594, 530, -1228, 110, 212, -80, 1257, -381, -616, 325, -698, 1068, 465, -739, 175, -697, 370, 1053, -597, -67, -317, -784, 1047, 187, -408, 264, -1300, 152, 875, -193, 750, -610, -920, 1093, 50, 448, 290, -1235, 398, 223, 20, 1145, -739, -508, 380, -528, 1123, -62, -1231, 318, -647, 117, 940, -965, -28, -326, -856, 1105, 45, -327, 197, -1066, 577, 948, -398, 570, -693, -453, 1236, -59, 478, 207, -1204, 568, 134, -132, 798, -891, -310, 593, -560, 764, -198, -1110, 285, -331, 319, 820, -1030, -34, -173, -481, 1227, -195, -517, 368, -668, 856, 705, -665, 364, -626, -227, 1213, -204, 305, 17, -1248, 618, 135, -87, 463, -1117, -201, 496, -420, 829, -229, -827, 445, -331, 401, 798, -896]
4313h96Q09j6j15J540j490j74O92r43J302k04j198J011r24N95J163j707N83l86
4331c58o08J857q55j56O13j490J114M31r83J282j138k87J164p25N02J74j578J172
4349A31n4j78J240j682K73P70j170J514o06j102J092r50Q31R05j609O37k57n57
4367g72J678r44j24N44j349J158K79q62J055j011j40J284j112Q35j02j263J449
4384F03n82k20J108j527L65P72r07J097p45q94J274q55P85N02j648R66l40k18
4402d64J236r84p4N99j163J351L6j013Q28r00Q9J290j000L36M7j062J692p24L4
4421A54N34j522P15P01j002J358j008p39J253p56L36M76j385J003k89l13J513
4438A029j112k76O09j046J369j52r07J079r50K44R61j340O06P6j038J681o76j76
$$ y = [-896, -87, -103, -218, 1322, -168, -342, 350, -593, 709, 505, -693, 318, -606, -11, 1152, -555, 28, -358, -966, 891, 36, -120, 493, -997, 117, 548, -435, 847, -291, -578, 586, -139, 363, 537, -1041, 131, 77, -101, 1139, -543, -270, 500, -670, 844, 238, -864, 228, -722, 109, 1014, -595, 42, -215, -772, 906, -38, -162, 382, -967, 191, 470, -392, 663, -348, -488, 796, -316, 519, 417, -846, 603, 21, -199, 909, -618, -253, 519, -388, 709, -36, -930, 344, -511, 274, 776, -872, 94, -246, -464, 772, -212, -286, 313, -850, 501, 537, -476, 352, -548, -459, 831, -169, 167, 214, -848, 844, 120, 154, 688, -834, -119, 582, -420, 938, -70, -809, 444, -312, 24, 500, -885, 118, -171, -484, 1029, -83, -359, 250, -796, 573, 421, -486, 593, -357, -113, 848, -492, 114, 190, -848, 833, 157, -19]
4456a9M40j319Q61O26j055J021o93o62J244r78Q93nj236J032j73k89J284j217
4474b45m2N76q75J152l58q82J300j055L16R41j369Q01k95p22J498p55j47L99r93
4493g55R78K85j006R77p12m06J034q05O84K6j182J390n43j94R00j258O39J91p04
4512d61J100l31n82P43q44L66P96j363Q11l65l90J291r91J1O66j250J078O7q75
$$ y = [-19, 421, -898, -37, 589, -466, 555, -138, -800, 444, -534, 359, 354, -882, 150, -23, -312, 972, -245, -287, 289, -586, 566, 208, -674, 626, -429, -113, 828, -541, 260, -35, -757, 741, -14, -161, 238, -755, 223, 508, -498, 479, -233, -639, 395, -410, 274, 300, -882, 508, -35, -229, 671, -587, 52, 243, -461, 639, 308, -274, 469, -375, -9, 787, -576, 235, -130, -520, 771, -220, -209, 457, -793, 285, 352, -523]
$$ [...]
8191d1
##END NTUPLES=NMR FID
##END=
