##TITLE=1H_62-2021
 CDCl3, 8 sc, 
 2.08.2021
##JCAMPDX= 6.0         $$ Bruker NMR JCAMP-DX V2.0
##DATA TYPE= NMR FID
##DATA CLASS= NTUPLES
##ORIGIN= UXNMR, Bruker Analytische Messtechnik GmbH
##OWNER= root
$$ XWIN-NMR		Version 3.5
$$ Mon Aug  2 12:24:15 2021 Russian Standard Time (UT+4h)  she@DPX200
##.OBSERVE FREQUENCY= 200.131506
##.OBSERVE NUCLEUS= ^1H
##.DELAY= (6, 6)
##.ACQUISITION MODE= SIMULTANEOUS
##.ACQUISITION SCHEME= undefined
##.AVERAGES= 8
##.DIGITISER RES= 18
##SPECTROMETER/DATA SYSTEM= spect
##.PULSE SEQUENCE= zg30
##.SOLVENT NAME= CDCl3
##.SHIFT REFERENCE= (INTERNAL, CDCl3, 0, 15.7039)
##AUDIT TRAIL= $$ (NUMBER, WHEN, WHO, WHERE, WHAT)
$$ ##TITLE= Audit trail, XWIN-NMR		Version 3.5
$$ ##JCAMPDX= 5.01
$$ ##ORIGIN= Bruker BioSpin GmbH
$$ ##OWNER= she
$$ F:/spectra/data/she/nmr/H-F/1/audita.txt
$$ ##AUDIT TRAIL=  $$ (NUMBER, WHEN, WHO, WHERE, WHAT)
(   1,<2021-08-02 12:22:47.14 +0400>,<she>,<DPX200>,
      <created by zg, POWCHK disabled, PULCHK disabled
       configuration hash MD5:
       00 E9 B6 7A A2 85 ED C7 34 08 36 98 17 FE 4E 26
       data hash MD5: 16K
       0E DD 94 62 35 F2 F5 0C D9 EC 78 65 F1 6D 99 6A>)
$$ ##END=
$$ 
$$ hash MD5
$$ 21 A6 47 B4 3C A2 DA C1 97 C8 73 43 A3 9F 86 41
##$RELAX= 
##$RELAX= 
##$RELAX= 
##$RELAX= 
##$RELAX= 
##$RELAX= 
$$ Bruker specific parameters
$$ --------------------------
##$DU= <F:/spectra>
##$EXPNO= 1
##$NAME= <H-F>
##$PROCNO= 1
##$TYPE= <nmr>
##$USER= <she>
##$AMP= (0..31)
100 100 100 100 100 100 100 100 100 100 100 100 100 100 100 100 100 100 
100 100 100 100 100 100 100 100 100 100 100 100 100 100 
##$AQSEQ= 0
##$AQ_mod= 1
##$AUNM= <au_zg>
##$AUTOPOS= <>
##$BF1= 200.13
##$BF2= 200.13
##$BF3= 200.13
##$BF4= 200.13
##$BF5= 200.13
##$BF6= 200.13
##$BF7= 200.13
##$BF8= 200.13
##$BYTORDA= 1
##$CFDGTYP= 0
##$CFRGTYP= 5
##$CHEMSTR= <none>
##$CNST= (0..31)
1 1 145 1 1 1 1 1 1 1 1 1 1 1 1 1 1 1 1 1 1 1 1 1 1 1 1 1 1 1 1 1 
##$CPDPRG= <>
##$CPDPRG1= <>
##$CPDPRG2= <>
##$CPDPRG3= <>
##$CPDPRG4= <mlev>
##$CPDPRG5= <mlev>
##$CPDPRG6= <mlev>
##$CPDPRG7= <mlev>
##$CPDPRG8= <mlev>
##$CPDPRGB= <>
##$CPDPRGT= <>
##$D= (0..31)
0 1.2 0 0 0 0 0 0 0 0.06 0 0.03 0 0 0 0 0.0002 0 0 0 0 0 0 0 0 0 0 0 0 
0 0 0 
##$DATE= 1627892566
##$DBL= (0..7)
120 120 120 120 120 120 120 120 
##$DBP= (0..7)
150 150 150 150 150 150 150 150 
##$DBP07= 0
##$DBPNAM0= <>
##$DBPNAM1= <>
##$DBPNAM2= <>
##$DBPNAM3= <>
##$DBPNAM4= <>
##$DBPNAM5= <>
##$DBPNAM6= <>
##$DBPNAM7= <>
##$DBPOAL= (0..7)
0.5 0.5 0.5 0.5 0.5 0.5 0.5 0.5 
##$DBPOFFS= (0..7)
0 0 0 0 0 0 0 0 
##$DE= 6
##$DECBNUC= <off>
##$DECIM= 32
##$DECNUC= <off>
##$DECSTAT= 4
##$DIGMOD= 1
##$DIGTYP= 9
##$DL= (0..7)
0 120 120 120 120 120 120 120 
##$DP= (0..7)
150 150 150 150 150 150 150 150 
##$DP07= 0
##$DPNAME0= <>
##$DPNAME1= <>
##$DPNAME2= <>
##$DPNAME3= <>
##$DPNAME4= <>
##$DPNAME5= <>
##$DPNAME6= <>
##$DPNAME7= <>
##$DPOAL= (0..7)
0.5 0.5 0.5 0.5 0.5 0.5 0.5 0.5 
##$DPOFFS= (0..7)
0 0 0 0 0 0 0 0 
##$DQDMODE= 0
##$DR= 18
##$DS= 0
##$DSLIST= <SSSSSSSSSSSSSSS>
$$ [...]
##$SUBNAM2= <"">
##$SUBNAM3= <"">
##$SUBNAM4= <"">
##$SUBNAM5= <"">
##$SUBNAM6= <"">
##$SUBNAM7= <"">
##$SUBNAM8= <"">
##$SUBNAM9= <"">
##$SW= 20.0188882624521
##$SWIBOX= (0..15)
0 0 2 0 0 0 0 0 0 0 0 0 0 0 0 0 
##$SW_h= 4006.41025641026
##$TD= 16384
##$TD0= 1
##$TE= 0
##$TE2= 300
##$TE3= 300
##$TEG= 300
##$TL= (0..7)
0 120 120 120 120 120 120 120 
##$TP= (0..7)
150 150 150 150 150 150 150 150 
##$TP07= 0
##$TPNAME0= <>
##$TPNAME1= <>
##$TPNAME2= <>
##$TPNAME3= <>
##$TPNAME4= <>
##$TPNAME5= <>
##$TPNAME6= <>
##$TPNAME7= <>
##$TPOAL= (0..7)
0.5 0.5 0.5 0.5 0.5 0.5 0.5 0.5 
##$TPOFFS= (0..7)
0 0 0 0 0 0 0 0 
##$TUNHIN= 0
##$TUNHOUT= 0
##$TUNXOUT= 0
##$USERA1= <user>
##$USERA2= <user>
##$USERA3= <user>
##$USERA4= <user>
##$USERA5= <user>
##$V9= 5
##$VALIST= <valist>
##$VCLIST= <CCCCCCCCCCCCCCC>
##$VD= 0
##$VDLIST= <DDDDDDDDDDDDDDD>
##$VPLIST= <PPPPPPPPPPPPPPP>
##$VTLIST= <TTTTTTTTTTTTTTT>
##$WBST= 1024
##$WBSW= 4
##$XGAIN= (0..3)
0 0 0 0 
##$XL= 0
##$YL= 0
##$YMAX_a= 183968
##$YMIN_a= -263672
##$ZGOPTNS= <>
##$ZL1= 120
##$ZL2= 120
##$ZL3= 120
##$ZL4= 120
##$ABSF1= 10
##$ABSF2= 0
##$ABSG= 5
##$ABSL= 3
##$ALPHA= 0
##$AQORDER= 0
##$ASSFAC= 0
##$ASSFACI= 0
##$ASSFACX= 0
##$ASSWID= 0
##$AUNMP= <proc_1d>
##$AZFE= 0.1
##$AZFW= 0.1
##$BCFW= 1
##$BC_mod= 2
##$BYTORDP= 1
##$COROFFS= 0
##$CY= 11.3945322036743
##$DATMOD= 1
##$DC= 2
##$DFILT= <>
##$DTYPP= 0
##$F1P= 2.36226072786647
##$F2P= -0.459571619588291
##$FCOR= 0.5
##$FTSIZE= 0
##$FT_mod= 4
##$GAMMA= 1
##$GB= 0.15
##$INTBC= 1
##$INTSCL= 1
##$ISEN= 128
##$LB= 0.24
##$LEV0= 0
##$LPBIN= 0
##$MAXI= 10000
##$MC2= 0
##$MEAN= 0
##$ME_mod= 0
##$MI= 1.114404
##$NCOEF= 0
##$NC_proc= 0
##$NLEV= 6
##$NOISF1= 3.799351
##$NOISF2= 2.8
##$NSP= 1
##$NTH_PI= 0
##$NZP= 0
##$OFFSET= 15.70392
##$PC= 1
##$PHC0= -12999.2
##$PHC1= 16.40099
##$PH_mod= 1
##$PKNL= yes
##$PPARMOD= 0
##$PSCAL= 0
##$PSIGN= 0
##$REVERSE= no
##$SF= 200.130013532006
##$SI= 16384
##$SIGF1= 3
##$SIGF2= 2
##$SINO= 400
##$SIOLD= 16384
##$SREGLST= <1H.CDCl3>
##$SSB= 0
##$STSI= 0
##$STSR= 0
##$SW_p= 3612.71676300578
##$SYMM= 0
##$S_DEV= 0
##$TDeff= 0
##$TDoff= 0
##$TI= <>
##$TILT= no
##$TM1= 0
##$TM2= 0
##$TOPLEV= 0
##$USERP1= <user>
##$USERP2= <user>
##$USERP3= <user>
##$USERP4= <user>
##$USERP5= <user>
##$WDW= 1
##$XDIM= 8192
##$YMAX_p= 0
##$YMIN_p= 0
$$ End of Bruker specific parameters
$$ ---------------------------------
##NTUPLES= NMR FID
##VAR_NAME=  TIME,          FID/REAL,        FID/IMAG
##SYMBOL=    X,             R,               I
##VAR_TYPE=  INDEPENDENT,   DEPENDENT,       DEPENDENT
##VAR_FORM=  AFFN,          ASDF,            ASDF
##VAR_DIM=   8192,          8192,            8192
##UNITS=     SECONDS,       ARBITRARY UNITS, ARBITRARY UNITS
##FACTOR=    0.0002496,     1,               1
##FIRST=     0,             0,               0
##LAST=      2.0444736,     0,               0
##MIN=       0,             -263672,         0
##MAX=       2.0444736,     183968,          0
$$ Real data points
##PAGE= N=1
##DATA TABLE= (X++(R..R)), XYDATA
0 0 0 0 0 0 0 0 0 0 0 0 0 8 -8 8 -8 16 -16 24 -24 32 -40 41 -53 64 -72 87 -97 113 -133 152 -175 199 -225
33 -225 256 -288 325 -366 408 -456 511 -568 631 -701 776 -859 949 -1047 1155 -1272 1402
50 1402 -1544 1703 -1875 2070 -2286 2529 -2806 3124 -3488 3920 -4436 5066 -5852 6871 -8246
65 -8246 10214 -13290 18796 -31793 131783 37049 -39047 144102 -105899 -56213 183968 74259
77 74259 -61149 89953 -14121 -207949 -21851 89158 -104157 57515 169377 -114075
87 -114075 -65150 105117 -99479 -43148 171398 20029 -69163 76879 -23480 -171328 5782
98 5782 54754 -129871 4278 79636 -174579 -97493 50990 -144122 -78106 107087 -55767
109 -55767 -100309 50095 -48955 -147150 28606 44810 -109664 24691 78576 -141177 -41383
120 -41383 87054 -98955 -17493 143045 -26592 -34447 112971 4393 -54618 112178 93274
131 93274 -36183 93353 114733 -81037 23115 113825 -74712 6309 127336 -55580 -44054
142 -44054 83722 -39088 -68776 82752 39225 -56353 72856 79083 -75184 40288 111647
153 111647 -55200 32541 127680 -50131 -22978 81811 -53237 -68393 54085 -19376 -97930
164 -97930 11840 -6687 -134310 -22726 27518 -116944 -21621 60469 -95603 -42458 59728
175 59728 -63285 -48527 67354 -10647 -59579 45189 14710 -85142 19716 48719 -80720
186 -80720 9541 69770 -76585 -15762 69230 -52917 -23542 74560 -11318 -36725 56848 16076
198 16076 -56476 39397 50121 -58361 26696 68344 -60989 5475 72162 -43808 -2463
209 -2463 76786 -12246 -16059 63121 13844 -33256 49380 42912 -43932 30987 53164 -59992
221 -59992 3853 50043 -60213 -15290 43583 -47326 -36211 28386 -26580 -50783 21815 6263
233 6263 -55450 16637 30845 -58836 8895 46059 -50661 2439 50469 -37788 -13404 40550
245 40550 -20856 -30361 29537 2006 -44651 18140 20189 -54827 8577 35205 -51658 3713
257 3713 43262 -38924 -4487 41553 -18883 -13383 37201 5540 -24014 28963 24715 -34589 20524
270 20524 37500 -37815 12855 41151 -34043 2347 36587 -22487 -9058 28528 -5668 -21728
282 -21728 18803 9963 -33277 11389 22192 -39004 5798 27365 -37220 4 25866 -27510
294 -27510 -6702 21287 -12180 -15752 14994 3522 -24970 10244 16342 -30917 7127 22775
306 22775 -31382 4436 23082 -24906 70 19221 -13060 -7052 13684 349 -16140 9428
318 9428 11198 -24047 6768 16972 -27678 4776 17421 -24359 2637 14659 -14545 -1515
330 -1515 10840 -1913 -7344 8789 10124 -13854 8551 16629 -17932 8573 17214 -17816 7356
343 7356 12766 -12758 3226 6964 -4632 -3377 3030 4089 -10468 2101 10137 -15291 4018
356 4018 11823 -15465 6487 10069 -10312 6914 6535 -1617 4714 3956 6966 -7 3408 12172 -5339
371 -5339 4708 11838 -9496 5377 6602 -10151 4186 -1538 -7612 312 -8186 -3498 -5138 -10582
385 -10582 120 -10041 -8150 1635 -11626 -2348 152 -9558 3149 -3277 -4292 5710 -6903
398 -6903 1244 3968 -8762 4870 -289 -7710 3967 -4901 -4064 -693 -6825 349 -6818 -4723 3711
413 3711 -11503 409 5592 -11518 6478 6861 -6238 10492 8151 2789 10958 10353 12012 7291
427 7291 13046 17812 996 14763 17972 -5364 13568 12894 -9578 8308 6017 -9852 146 1040
441 1040 -5992 -8247 268 237 -14734 3721 6281 -17107 8035 10191 -15447 9157 10407 -11532
455 -11532 4364 7557 -7345 -6346 3416 -4158 -18919 120 -2464 -28281 -1421 -924 -30963 -1987
469 -1987 843 -26152 -3347 3355 -15368 -6596 7116 -3057 -11593 11185 7086 -16286 14419
482 14419 13894 -17561 15400 17018 -14595 12156 18432 -7199 5877 18974 1310 -3617 18351
495 18351 7970 -14138 16916 11881 -21255 13733 12640 -22925 8431 13491 -17356 3250 16416
508 16416 -6153 -3437 20089 5621 -10023 23136 14317 -16207 21304 16337 -22235 12424 12477
521 12477 -24916 -870 7155 -23860 -16708 3212 -17897 -27862 5172 -6932 -32028 9618 4103
534 4103 -29941 13143 13993 -21812 12042 19820 -13285 2270 19907 -6607 -10891 19244 -119
547 -119 -23600 15623 3290 -31824 12678 8817 -29414 10026 14696 -22061 2288 18890 -10833
560 -10833 -5771 24489 1228 -15877 24188 7406 -25158 21827 14253 -25349 17583 18406 -22993
573 -22993 7090 20561 -13938 -2124 24966 -3525 -15247 22633 1173 -27679 18956 6948
585 6948 -32457 12143 7714 -35048 -69 9711 -25981 -6387 17541 -12069 -15287 21049 -383
598 -383 -20610 27103 13796 -20624 25169 16728 -25201 13073 16648 -21689 1696 17476 -17693
611 -17693 -16189 13449 -12501 -26547 18464 1734 -27373 20454 9171 -28054 17457 19112
623 19112 -17244 14839 26288 -11117 -1306 23553 -7002 -14293 25950 1569 -24738 20260
635 20260 1637 -34184 13711 9239 -27496 10237 15633 -23298 -4580 17102 -14369 -12458 25216
648 25216 -2288 -22387 21475 -726 -31851 18135 9143 -26523 14767 14519 -24685 336 17144
661 17144 -14663 -5521 26986 -2541 -17158 23504 -1301 -27776 21814 8423 -25878 16479
673 16479 10365 -29021 1194 12913 -18810 -3761 23864 -6940 -14693 23845 -1384 -20964
685 -20964 28465 12357 -18797 24919 13453 -24198 10042 15605 -17700 1703 20984 -13233
697 -13233 -15995 16538 -10479 -24601 22169 2533 -24541 19562 4949 -28207 11295 13035
709 13035 -17456 7818 20683 -13108 -8921 18061 -9350 -17094 23930 916 -22182 19238
721 19238 277 -28509 12530 8371 -19887 8866 14616 -17221 -5813 15419 -11178 -12246 23855
734 23855 -1378 -18844 20415 -1152 -25217 17000 7667 -18866 13014 12355 -18466 -1043 14956
747 14956 -11251 -6802 23718 -3188 -16055 20755 -2814 -23075 19729 5841 -19384 14782
759 14782 8662 -21111 1175 12120 -14110 -4412 20527 -6756 -14804 19112 -4785 -20773 20679
772 20679 4477 -18418 16459 6900 -20286 5415 11233 -13241 -517 18179 -8179 -11856 17717
785 17717 -5474 -17469 20252 2065 -17626 16298 3813 -19445 7780 9150 -13053 2107
797 2107 14734 -9533 -8874 15614 -6096 -14031 19577 221 -16122 16371 1338 -18123 10407
810 10407 6600 -12939 4662 11492 -10606 -6062 13396 -7226 -11324 17938 -2423 -14910 15667
823 15667 -1107 -17192 11751 3835 -13560 6523 7805 -11955 -3246 10727 -8472 -8586 15566
836 15566 -4241 -13189 15324 -2148 -14643 13976 3138 -11646 9788 6801 -10006 1411
848 1411 10479 -6787 -4616 14452 -4558 -11162 14074 -4048 -14218 12813 -366 -13086 8803
861 8803 2963 -11092 2374 7808 -6823 -2223 12851 -3745 -7598 14837 -2023 -10318 14738
874 14738 346 -10613 10657 1904 -10317 4052 4721 -7981 -2082 8429 -6116 -7869 10775
887 10775 -4236 -10444 12272 -1686 -10254 10537 658 -8918 6181 4200 -6047 1475 7614
900 7614 -3938 -4112 10478 -2620 -7327 11891 -1421 -8481 10304 -885 -8206 6322 1094
913 1094 -6548 909 3439 -5213 -4371 6067 -4092 -7404 8680 -3156 -7917 9153 -1721 -6702
927 -6702 7709 470 -4447 4093 3141 -2994 -589 5808 -2755 -4734 7434 -3202 -7253 7268
941 7268 -3934 -7479 5615 -2784 -6063 2728 -498 -4166 -636 3329 -1991 -2827 7194 -953 -3686
956 -3686 9078 -637 -3358 8798 -278 -2238 6039 707 -1197 1715 2495 -1122 -2247 4260 -1737
971 -1737 -4615 5395 -2694 -4796 5491 -2664 -3301 4228 -1342 -1232 2040 1145 532 -464 4005 642
987 642 -2097 5749 -180 -2811 5558 -1944 -2550 3439 -2755 -1930 218 -2701 -1386 -2769 -789 -1352
1003 -1352 -4367 1570 -1688 -4066 3326 -2385 -2184 3375 -2264 428 2159 -1416 1868 -193 64
1018 64 1777 -2090 1775 621 -2622 2872 -1081 -1684 2523 -2413 -29 1157 -2835 1696 -873 -1648
1034 -1648 2295 -2210 272 1638 -2158 1991 423 -632 3129 -442 1891 2541 -845 4205 1135
1049 1135 -497 4620 -857 -187 3166 -2241 12 363 -2053 -280 -2227 -699 -907 -3638 1711 -1611
1065 -1611 -3279 3818 -1874 -1378 4661 -1433 660 3751 -164 1294 935 1470 221 -1754 2812 -1715
1081 -1715 -3521 3626 -3497 -3907 3423 -3840 -2812 2393 -2652 -1609 932 172 -870 -819 3355 -1116
1097 -1116 -2183 5339 -2192 -2500 5825 -2723 -2326 4411 -2343 -1935 2351 -45 -1687 -349 2571 -1968
1113 -1968 -2196 4878 -2763 -3024 5882 -3308 -3105 5186 -3166 -2782 3366 -1077 -2379 989 2108 -2202
1129 -2202 -829 5531 -2388 -1411 7761 -2690 -1797 7787 -2417 -1794 5531 -1271 -2496 2270 632
1144 632 -3686 -987 3655 -4491 -2681 6209 -4646 -3084 7087 -4019 -2410 7036 -1561 -2093 4627
1159 4627 1230 -2662 1442 4350 -3854 -1086 6378 -5286 -3348 6725 -5559 -3943 6385 -3944
1173 -3944 -4100 4336 -1031 -4182 1807 2987 -4310 -386 6156 -5037 -2302 7498 -5331 -3208 7846
1188 7846 -4074 -3418 5647 -1832 -4097 2901 2078 -4385 698 5487 -5401 -1706 7613 -5486 -2626
1203 -2626 8342 -4608 -3547 6257 -2878 -4327 4092 955 -4547 1434 4415 -5533 -850 7280
1217 7280 -5508 -1571 8938 -4797 -2525 7769 -3395 -3373 5677 70 -4045 2789 2978 -5894
1231 -5894 -439 6089 -6046 -1399 8279 -5965 -2825 7692 -4565 -3166 6908 -820 -3366 4225
1245 4225 2271 -5547 1147 5829 -5662 -220 8317 -6501 -2545 7874 -5711 -3119 7706 -2639
1259 -2639 -3826 4923 404 -5934 2070 4839 -5990 571 7595 -7254 -2278 8028 -6592 -2747
1273 -2747 8195 -3675 -3960 5306 -1211 -5725 2752 3608 -6026 929 6622 -7517 -1974 7804 -6808
1288 -6808 -2226 8638 -4539 -3596 5746 -2275 -4940 3901 2697 -5316 1726 5604 -7122 -1226
1302 -1226 7450 -6647 -1176 8723 -5031 -2951 6334 -3080 -4101 5114 1713 -4265 3026 4664
1316 4664 -6371 350 7201 -6085 86 8749 -5422 -2283 6643 -4255 -3135 5740 55 -4105
1330 -4105 3175 2750 -6796 909 6095 -6354 721 8138 -6269 -1870 6845 -5041 -2382 6703
1344 6703 -1072 -3671 3786 1179 -6299 1437 4919 -6379 904 7120 -7294 -1479 6505 -6115
1358 -6115 -1950 6684 -2623 -3432 4017 -399 -5652 2351 4124 -6130 1156 6278 -7444 -1201 6516
1373 6516 -6528 -1231 7173 -3444 -2667 4658 -1027 -4773 3219 3364 -5372 1817 5396 -7517 -476
1388 -476 6286 -6515 -790 6729 -4682 -2749 4524 -2240 -3790 3791 2382 -4452 2547 4755 -6473
1403 -6473 583 6261 -5542 463 7073 -4441 -1558 5066 -2815 -2730 3846 1102 -3909 2509 3235
1418 3235 -5888 907 5481 -5521 1032 6536 -5143 -506 5099 -3183 -1585 4702 177 -2980
1432 -2980 2777 2231 -5165 1398 4464 -5695 980 5286 -5827 -553 4418 -4541 -1242 4250 -1692
1447 -1692 -3267 2315 360 -5069 1272 3089 -5853 975 4289 -6421 -266 4197 -4890 -851 4390
1462 4390 -2301 -2051 3029 -13 -3815 1995 2977 -4763 1397 4228 -6007 415 4450 -5042 122
1477 122 4292 -2708 -1248 3014 -401 -2566 2513 2532 -3634 2061 4221 -4601 1382 5094 -4152 894
1493 894 4618 -2926 -223 3297 -965 -1935 2054 1475 -3318 1526 2973 -4800 759 3898 -4625 523
1509 523 3610 -3718 -306 2640 -2030 -1509 1910 222 -2770 1301 2039 -4207 833 3015 -4552 734
1525 734 3090 -4328 -32 2450 -2763 -762 1665 -696 -2060 1111 1391 -3308 1015 2853 -3825
1540 -3825 986 3083 -3708 919 2851 -2560 549 2209 -561 -791 1453 1240 -2077 1164 2489
1555 2489 -3347 1393 2547 -3641 823 2346 -2876 421 1820 -1263 -535 973 239 -1938 930
1570 930 1583 -2880 808 2362 -3463 831 1915 -2969 774 1276 -1944 -128 678 -263 -1353 382
1586 382 933 -2345 316 1559 -3282 626 1682 -2925 936 1299 -1687 703 824 -119 -119 889 1214
1603 1214 -1097 961 2105 -1753 1228 2112 -1898 1590 1629 -1273 1213 584 -225 589 71 854 -701
1620 -701 153 1572 -1717 691 1686 -2034 957 903 -1706 991 41 -605 476 -332 105 -429 -645 671
1638 671 -1562 -263 853 -2291 295 279 -2198 579 -488 -1488 427 -1049 -304 -105 -998 395
1654 395 -1102 -639 1013 -1617 240 648 -1260 982 73 -721 1210 -390 238 1033 -693 1098 229
1671 229 -291 1359 -441 449 1305 -516 1032 544 -370 1552 -400 310 1277 -946 1098 713 -629
1688 -629 1335 -130 -42 970 -481 586 223 -222 1053 -978 52 966 -1714 539 432 -1602 844
1705 844 -219 -953 478 -775 -299 -389 -568 405 -1309 -256 725 -1882 443 448 -1852 734 77 -1558
1723 -1558 657 -266 -736 -57 -264 300 -984 -114 851 -1785 720 821 -2132 1126 701 -1576 1120
1740 1120 216 -662 696 452 304 -443 713 1025 -1361 999 1415 -2018 1611 933 -1734 1329 776
1757 776 -1183 812 571 -439 -289 744 413 -1484 1132 972 -2430 1423 1106 -2357 1456 774 -1726
1774 -1726 658 828 -805 -351 780 92 -1559 1125 816 -2349 1381 1024 -2682 1365 931 -2236
1790 -2236 1006 660 -1415 -34 493 -281 -1294 1065 501 -2473 1394 1041 -2840 1413 968 -2508
1806 -2508 1375 993 -1705 464 805 -685 -873 1207 469 -2099 1397 975 -2874 1734 968 -2794
1822 -2794 1436 882 -2141 791 1026 -973 -334 1237 272 -1651 1776 760 -2476 2059 951 -2785
1838 -2785 1912 1000 -2644 1355 1183 -1421 196 1312 -488 -1221 1563 245 -2398 1993 839 -2959
1854 -2959 2262 944 -2944 1400 928 -2031 512 1105 -975 -1077 1434 -73 -2322 2120 737 -2980
1870 -2980 2239 883 -3357 1881 1133 -2400 920 1341 -1445 -776 1495 -393 -1820 2203 578 -2712
1886 -2712 2454 851 -3290 2243 1124 -2484 1571 1420 -1618 -107 1725 -522 -1194 2313 464
1901 464 -2376 2486 733 -3273 2295 1002 -2609 1622 1270 -2242 356 1353 -842 -922 1897 -134
1917 -134 -2291 2162 87 -3146 2135 593 -2935 1702 502 -2700 274 838 -1546 -634 1432 -828
1933 -828 -2266 1719 -451 -3196 2326 439 -3013 1996 501 -2963 1185 1041 -1797 155 1727
1948 1727 -678 -1418 2178 40 -2385 2761 620 -2654 2529 857 -2607 2081 1359 -1417 989
1963 989 1882 -890 -682 2331 -14 -1820 3128 635 -2403 2860 629 -2611 2116 1191 -1930 1271
1979 1271 1335 -1559 -717 1650 -500 -1780 2447 -83 -2897 2130 -138 -3415 1838 460 -2756 735
1995 735 570 -2151 -954 856 -1200 -1826 1721 -619 -3008 1984 -435 -3367 1914 420 -2548 1140
2011 1140 565 -2037 9 1011 -1070 -946 2025 -140 -2059 2344 11 -2459 2687 643 -1961
2026 -1961 2169 737 -1551 1147 1362 -535 254 2325 -113 -1136 2409 271 -1854 3037 589
2041 589 -2013 2524 517 -1842 1374 1051 -1152 331 1458 -742 -1290 1767 -372 -1963 2396 -131
2057 -131 -2524 2062 -273 -2457 1154 262 -1640 272 859 -1117 -1221 1299 -950 -1891 2066 -197
2073 -197 -2574 1903 -444 -2448 1702 28 -1677 580 566 -1189 -595 1353 -505 -1482 2269 -204
2089 -204 -1794 2253 17 -1920 2242 386 -1425 1197 638 -828 276 1355 -417 -878 1963 31
2105 31 -1483 2377 70 -1825 2224 133 -1584 1357 361 -1028 228 723 -617 -747 1468 -336
2121 -336 -1435 1649 -356 -1780 1729 -389 -1702 1348 -128 -1205 540 393 -619 -356 998 -465
2137 -465 -1262 1460 -377 -1621 2000 -215 -1455 1570 -119 -892 1025 130 -430 216 975 -231 -907
2154 -907 1665 -248 -1182 1842 -256 -1403 1905 -439 -1007 1104 -32 -462 285 560 -345 -484 1133
2171 1133 -192 -981 1621 -271 -1556 1496 -552 -1134 1286 -418 -725 225 -130 -495 -502 533 -378
2188 -378 -1051 1146 -179 -1260 1245 -589 -1108 1221 -416 -653 434 -99 -481 -216 364 -94 -976
2205 -976 1010 -254 -1103 1448 -337 -1038 1424 -423 -439 959 -62 44 193 294 298 -347 964 92
2223 92 -731 1376 -298 -761 1309 -409 -338 1082 -371 -137 312 116 162 -412 650 250 -681 1047
2241 1047 -213 -780 1076 -515 -552 791 -604 -379 417 -313 254 -195 146 178 -581 835 -72 -929
2259 -929 911 -485 -452 777 -395 -189 423 -538 79 -175 -204 192 -751 344 234 -650 919 -369
2277 -369 -562 847 -572 -122 457 -486 239 -65 -333 325 -509 292 192 -959 479 -167 -525 870
2295 870 -592 -85 516 -703 321 151 -378 698 -182 32 531 -493 493 138 -534 539 -387 -80
2313 -80 689 -450 388 378 -533 690 -131 -160 658 -374 300 389 -348 549 -94 -34 583 -432 382 384 -574
2334 -574 721 -73 -268 890 -404 246 519 -550 251 19 -145 377 -504 412 42 -742 558 -309
2352 -309 -680 590 -704 -440 486 -750 -97 152 -446 37 -507 -41 21 -819 467 -445 -741 974 -563
2371 -563 -501 751 -694 -31 309 -417 105 -24 107 76 -495 491 -67 -592 1111 -304 -271 1127 -346
2390 -346 -159 783 -236 95 364 272 301 -325 787 126 -640 1056 -142 -409 1079 -469 -193 848
2408 848 -438 26 328 -48 11 -289 580 -60 -658 999 -475 -650 1048 -568 -451 856 -651 -188
2426 -188 369 -283 -203 -6 191 -310 -510 664 -566 -864 1145 -588 -637 1069 -729 -85 660 -469
2444 -469 -85 166 41 -315 -425 549 -480 -689 1215 -607 -493 1303 -733 -389 988 -280 -194 359
2462 359 -8 -275 -90 602 -432 -404 1096 -658 -702 1246 -935 -612 1153 -735 -252 607 -91 -172 34
2481 34 472 -350 -342 1118 -376 -447 1375 -740 -526 1185 -656 -325 751 -345 -353 244 276 -368 -237 1170
2501 1170 -513 -421 1440 -838 -539 1270 -654 -276 1151 -581 -156 343 115 -298 -153 764 -255
2518 -255 -426 1168 -731 -612 1286 -844 -328 1074 -764 -109 572 -355 -455 -235 434 -497 -425 892
2536 892 -1019 -754 1113 -1064 -594 1377 -1101 -420 815 -476 -329 87 114 -495 -284 690 -758 -449
2554 -449 1232 -1018 -215 1216 -865 -305 1042 -469 -302 537 198 -384 85 962 -575 -177 1308
2571 1308 -819 -208 1517 -988 -147 1094 -661 -371 671 -25 -477 254 820 -681 -231 1355 -706
2588 -706 -213 1413 -888 -343 1098 -782 -342 702 -131 -307 280 301 -511 -335 1047 -580 -536 1217
2606 1217 -1043 -548 1240 -940 -232 707 -410 -284 215 -6 -395 -301 717 -691 -405 1051 -1034
2623 -1034 -364 1063 -947 -266 1063 -652 -331 510 -187 -281 -40 678 -463 -143 1049 -915 -357 1084
2641 1084 -1063 -261 1072 -732 -173 615 -411 -257 107 426 -439 -283 706 -927 -475 1225 -1032
2658 -1032 -168 1215 -910 -132 809 -437 -237 586 215 -502 -10 769 -877 -239 1295 -1025 -101 1275
2676 1275 -1097 -250 805 -596 -253 580 -43 -205 36 488 -614 -312 1193 -928 -237 1295 -955
2693 -955 -198 1005 -706 -58 660 -147 -248 78 583 -546 -245 1113 -628 -171 992 -898 -148 791
2711 791 -799 66 540 -300 -93 232 3 -387 -226 650 -799 -273 970 -1004 -139 853 -867 20
2729 20 681 -701 -110 116 -141 -326 1 469 -520 -268 773 -851 -119 816 -868 -68 811 -720 9
2748 9 454 -327 148 -14 402 -343 -150 767 -715 -193 1142 -687 194 842 -761 141 665 -459 131
2767 131 173 151 -273 -140 648 -425 41 1053 -726 80 963 -936 181 642 -531 8 187 7 -159
2786 -159 13 397 -568 -183 785 -783 -6 1088 -804 121 440 -705 193 201 -134 -65 -264 123 -519 -371
2806 -371 566 -685 -93 727 -820 115 644 -754 32 51 -287 54 -152 208 -71 -246 682 -374 -263
2825 -263 729 -591 -35 608 -713 306 242 -483 354 76 138 45 -247 563 -292 -200 690 -565 225 775
2845 775 -574 345 459 -549 331 61 -13 305 -129 281 -70 -244 770 -458 -30 687 -759 388
2863 388 338 -589 426 89 -112 295 -134 181 15 -196 366 -322 -244 621 -416 -19 347 -772 146 53
2883 53 -479 346 -380 47 -111 -292 344 -261 -328 350 -364 35 299 -701 240 58 -420 213 -90 104
2903 104 44 -316 183 -261 -367 416 -268 -23 312 -664 253 150 -399 514 -97 -109 327 -317 192 46 -233
2924 -233 524 -116 -15 419 -392 265 348 -201 471 -52 -312 447 -413 189 129 -385 409 -53 -248 392 -507
2945 -507 80 311 -413 476 -51 -65 468 -331 178 425 -321 515 -107 -241 428 -358 -85 363 -312 304
2965 304 -72 -308 322 -403 -128 218 -570 161 191 -368 422 -194 73 221 -366 209 -75 -322 350 -277
2985 -277 -259 504 -437 211 189 -386 267 7 -142 268 -203 -15 -25 -391 392 -84 -124 269 -480 92 261
3006 261 -556 328 13 -157 293 -130 56 176 -342 430 -191 -46 508 -496 210 500 -631 387 116
3025 116 -504 287 -65 32 248 -30 275 -233 -232 440 -370 119 450 -497 409 302 -287 462 -28 5 274
3046 274 -305 119 47 -37 409 -383 -27 495 -672 218 245 -595 359 194 -117 307 -178 -2 -59 -192 173
3067 173 -501 -180 582 -749 158 302 -800 178 115 -828 146 -57 -46 167 -168 275 -368 -168 428 -584
3087 -584 116 390 -874 243 165 -672 181 46 -192 68 -117 259 -306 82 296 -490 198 440 -591
3106 -591 469 311 -619 459 247 -377 285 -173 42 -178 12 401 -339 254 510 -621 342 424 -663
3125 -663 439 78 -353 311 41 -217 -11 -164 514 -352 158 526 -607 215 303 -625 386 348 -569 405
3145 405 33 -307 222 -87 -110 -132 154 560 -772 30 509 -805 431 161 -544 369 116 -431 164 -27
3165 -27 38 -190 117 280 -593 180 386 -753 309 246 -532 365 253 -546 74 17 53 -21 66 240 -399 -36
3187 -36 436 -793 398 410 -742 590 191 -577 276 18 -102 117 -67 95 -318 112 326 -646 208
3206 208 376 -529 414 168 -704 257 31 -114 132 52 77 -132 261 288 -506 379 404 -852 489 305 -644
3227 -644 632 151 -379 313 70 159 91 82 251 -523 214 485 -754 385 176 -595 381 198 -496 211
3247 211 -55 -217 61 68 213 -439 231 290 -845 241 200 -800 576 63 -622 479 28 -281 333 -16
3267 -16 14 -321 225 198 -519 274 199 -760 604 174 -767 398 162 -552 276 38 -58 -69 260 272 -454 344
3289 344 441 -535 679 389 -715 492 -201 -319 489 114 -217 72 32 189 -374 373 344 -682 461
3308 461 245 -707 534 158 -532 447 87 -329 214 124 191 -209 175 181 -623 504 368 -742 477 20
3328 20 -582 573 11 -210 187 -197 1 -240 199 240 -691 243 220 -571 359 189 -692 441 -179 -198 292
3349 292 -73 -73 -88 -91 39 -469 204 363 -826 344 355 -792 457 -160 -641 438 64 -242 146 -218
3369 -218 144 -339 178 242 -694 380 339 -657 523 212 -465 638 -139 -177 300 95 -87 -124 109 424
3389 424 -560 287 285 -526 715 229 -418 464 -188 -262 282 -84 41 -78 20 195 -429 117 211 -724 414
3410 414 220 -565 583 23 -441 398 -168 139 108 -167 63 -244 39 124 -642 398 74 -622 538 -228
3430 -228 -497 546 -232 -207 228 -378 41 -198 101 344 -487 267 165 -591 556 19 -509 355 -323 -34
3450 -34 290 -268 176 -153 -93 405 -358 251 348 -485 565 170 -458 554 -317 -234 298 -239 61 34 -80
3471 -80 293 -293 39 142 -594 396 -24 -512 380 -108 -337 464 -218 -68 73 -283 200 -229 65 332
3491 332 -457 543 46 -606 372 -97 -339 528 -216 -66 209 -322 76 -85 -38 315 -258 351 137 -432
3511 -432 464 -22 -412 469 -353 50 103 -286 134 -199 -330 220 -386 5 306 -523 246 -12 -472 461
3531 461 -234 -289 283 -284 149 223 -262 186 -253 39 101 -544 228 -2 -255 423 51 -308 403 -72 50
3552 50 175 -154 507 -35 -72 494 -480 164 61 -372 487 -109 -400 468 -297 -17 360 -289 397 -92 -78
3573 -78 378 -317 125 131 -333 417 -105 -364 473 -207 30 526 -514 401 82 -337 505 -231 -190 182 -526
3594 -526 212 49 -381 419 -230 3 109 -387 220 30 -216 327 -285 -130 424 -198 323 6 -220 261
3614 261 -227 -223 215 -400 348 61 -373 414 -230 -381 353 -276 167 345 -340 235 -87 -61 299 -320 8
3635 8 132 -407 217 49 -421 418 -341 58 351 -411 324 125 -276 341 -283 179 128 -378 375 57 -149
3656 -149 453 -117 -286 535 -520 131 214 -174 250 -271 -146 360 -369 384 -26 -366 420 -221 -175 455
3676 455 -227 51 321 -278 286 -190 -137 351 -376 353 60 -301 515 -194 -334 566 -389 16 349 -179
3696 -179 216 -8 -143 143 -320 66 151 -606 374 -113 -420 546 -284 -95 204 -457 20 -9 -242 314 -307
3717 -307 211 162 -472 332 -98 -422 493 -449 -262 427 -247 80 236 -259 141 -273 -101 440 -337 427
3737 427 134 -563 468 -209 -299 441 -369 -247 357 -265 400 28 -95 191 -318 350 68 -289 575 -206
3757 -206 -121 451 -256 -92 413 -438 146 164 -226 155 -271 145 10 -414 450 -42 -229 689 -165 -150 608
3778 608 -362 -40 89 -273 120 -244 185 59 -378 232 -93 -353 623 -263 -74 553 -233 -48 168 -315
3798 -315 205 -250 -133 187 -422 350 -88 -366 606 -247 -467 488 -399 86 206 -294 112 -31 0 172
3818 172 -306 292 128 -482 500 -131 -244 699 -453 -175 279 -381 242 155 85 237 -164 214 90 -264
3838 -264 523 -172 -258 505 -436 -127 583 -325 98 198 -91 140 -71 132 -42 -205 323 -163 -423 346
3858 346 -309 -16 415 -350 86 356 -258 31 14 -172 -25 -87 205 -26 -396 415 -508 -303 525 -355 -158
3879 -158 315 -483 96 -7 -184 -1 -294 226 -75 -369 401 -462 -349 502 -294 23 259 -335 63 142
3899 142 -213 153 -72 236 97 -347 536 -236 -297 582 -354 -138 501 -461 79 102 -255 118 -12 27 120
3920 120 -202 587 -76 -413 764 -254 5 612 -414 152 308 -238 244 -117 -63 63 -318 213 53
3939 53 -376 449 -61 -114 354 -433 77 437 -417 85 24 -352 259 71 194 42 -371 470 -250 -238 611
3960 611 -595 -47 352 -446 13 129 -315 99 -175 156 -22 -287 359 -299 -316 258 -360 -310 392 -588
3980 -588 -16 310 -489 195 -69 -99 65 -152 220 -252 -303 394 -559 -54 380 -401 54 329 -417 142 41
4001 41 -170 160 -93 258 1 -231 323 -259 -150 458 -468 96 425 -346 286 33 -307 133 -57 54
4021 54 157 -207 252 -145 -184 358 -426 -163 382 -630 7 122 -240 327 -51 11 117 -239 379 -52 -247
4042 -247 519 -412 -139 329 -461 139 328 -425 334 -108 -100 212 -258 184 -36 -249 384 -231 -38 269 -466
4063 -466 128 304 -391 279 -120 -248 252 -191 12 -34 -363 244 -279 -297 527 -467 -30 259 -583 212 194
4084 194 -294 165 -151 190 181 -294 285 -127 -165 393 -286 15 358 -397 182 198 -178 504 -136 97 165 -309
4106 -309 421 5 -318 394 -348 -90 275 -324 227 23 -500 235 -119 -122 324 -90 72 132 -218 250 -229
4127 -229 38 449 -434 214 319 -421 242 192 -71 279 -191 -38 9 -304 419 -13 -242 265 -329 -1 79
4148 79 -426 180 -70 -404 244 -331 -107 90 -244 220 -168 -237 207 -263 -167 251 -319 172 47 -343 259
4169 259 -119 3 338 -324 35 58 -257 302 -150 -77 353 -499 157 218 -384 362 -127 -138 250 -240 178
4190 178 249 -313 271 -92 -60 338 -234 174 184 -221 19 -98 -136 152 -128 -89 97 -197 300 -73 -61 353
4212 353 -194 -8 166 -338 44 53 -254 458 -222 77 284 -288 263 79 -201 332 -220 -32 126 -436 9
4233 9 13 -157 335 -161 100 289 -420 138 5 -304 445 -150 -305 174 -375 328 109 -291 284 -285 -98
4254 -98 270 -277 124 -43 -304 258 -37 -453 165 -280 13 68 -477 278 -60 -41 284 -305 -32 251 -404
4275 -404 362 48 -213 283 -94 -93 235 -174 284 38 -194 311 -136 -32 300 -169 262 123 -348 245 -115
4296 -115 -76 386 -294 99 34 -152 312 -385 -95 298 -428 35 261 -453 357 -50 -159 99 -291 156 -13
4317 -13 -188 226 -127 -31 315 -210 244 255 -357 159 48 -229 246 -273 81 137 -254 215 -208 -322 467
4338 467 -179 -170 282 -336 98 -108 -158 189 -162 -131 145 -315 233 -211 -226 346 -285 -7 380 -347 256 -11
4360 -11 -356 299 -278 -236 180 -233 67 125 -220 150 -129 125 208 -422 359 237 -230 247 -28 -262 217
4381 217 -163 -128 9 -147 281 -170 -156 214 -246 53 375 -396 179 190 -67 295 -178 -117 171 -42 276
4402 276 -91 -59 290 -373 58 343 -551 97 89 -338 229 -117 -108 168 -302 -39 -100 -258 329 -349 -57 341
4424 341 -503 112 141 -304 220 -137 -258 218 -194 140 -109 -154 352 -281 -48 113 -317 61 99 -265 165
4445 165 -8 -379 231 -171 -134 70 -199 246 -188 -18 254 -232 326 129 -441 196 -46 -239 371 -156
4465 -156 -81 228 -321 98 19 26 282 -367 278 280 -441 205 204 -277 404 -220 -204 269 -224 186 51 -152 123
4488 123 -280 146 287 -573 130 75 -405 400 29 -276 358 -163 -93 62 -237 163 -165 117 266 -398 78
4509 78 62 -474 279 -67 -310 123 -134 -110 -1 -193 294 -330 -116 211 -303 204 235 -551 206 57 -369
4530 -369 226 -166 -15 115 -39 161 -151 -53 259 -187 191 230 -442 204 29 -277 242 -211 -113 223 -223
4551 -223 8 -6 -4 214 -206 86 335 -402 306 85 -463 275 -70 -114 197 -169 49 35 -302 115 -95 -21
4573 -21 262 -431 255 113 -473 403 -3 -105 260 -124 -119 324 -166 177 -28 149 302 -455 32 -107 -453
4594 -453 307 64 -245 325 -112 -96 150 -65 -52 -147 -30 252 -241 115 39 -250 399 83 -372 489 -66
4615 -66 -11 269 -338 -36 -9 -216 139 -261 -70 249 -363 213 -24 -348 258 -55 -124 80 -114 123 41 -154
4637 -154 408 -153 26 157 -168 178 149 -388 574 -5 -137 230 -282 12 351 -44 386 -84 -202 150
4657 150 -358 175 -43 -407 227 92 -96 284 -166 -59 233 -133 240 151 -111 295 -223 201 141 -441 235
4678 235 140 -260 338 -172 41 254 -155 -62 -7 -28 305 -220 -87 77 -317 142 0 -285 294 -48 -229
4699 -229 187 -286 22 116 -328 326 -317 -111 285 -294 235 89 -296 255 -186 -62 320 -332 219 167 -302
4720 -302 196 35 -212 267 -256 58 241 -303 183 -133 -167 277 -178 -57 163 -305 254 131 -118 454
4740 454 -101 111 195 -136 203 29 -363 220 -64 -133 292 -252 105 133 -113 184 -88 -112 149 -126 201
4761 201 -29 -101 227 -94 -206 311 -237 -35 325 -348 -38 -126 -217 370 -216 104 147 -405 293 -154 -290
4782 -290 304 -305 -67 280 -219 100 -75 -204 -14 -77 125 54 -178 104 -78 -179 365 -73 -6 273 -185
4803 -185 -42 234 -154 192 -371 -38 353 -101 339 -15 -289 162 -242 -214 166 -222 187 135 -290 303 -205
4824 -205 83 85 -216 240 113 -133 261 173 -154 207 -18 216 -32 -173 138 -27 -41 289 -252 130 233
4845 233 -256 178 -23 -165 261 -260 18 128 -319 380 -124 -337 128 -129 38 332 -309 258 -57 -282
4865 -282 172 -209 -209 191 -248 270 39 -256 187 -138 -130 82 -225 -74 -147 -201 74 -232 -56 304 -130 307
4887 307 187 -139 282 -283 -71 220 -244 192 151 -165 64 -64 2 181 -285 55 125 -229 377 -95 -158
4908 -158 314 -167 -19 285 -227 330 -55 -85 315 -118 83 316 -209 298 -119 -101 373 -246 42 313 -299
4929 -299 168 -76 -259 232 -62 50 165 -127 225 56 -353 257 -211 19 209 -261 235 163 -306 53
4949 53 -184 17 68 -197 132 -34 -142 319 -48 -125 269 -292 -21 91 -172 248 -7 -145 152 -140 89
4970 89 146 -234 212 -206 -83 67 -208 -52 153 -188 77 -89 -147 86 -159 57 87 -178 166 128 -98 234
4992 234 -84 -155 107 -303 135 49 -47 337 -107 101 -52 -157 216 -4 -13 190 -45 -100 203 -102 288 108
5014 108 13 226 -69 -33 196 -184 191 -43 -267 332 -147 -244 356 -216 -92 290 -234 213 -104 -63 50
5035 50 -136 116 101 -215 350 90 -172 293 -180 -180 211 -262 16 47 -190 120 -44 -19 211 -205 147 -173
5057 -173 -193 271 -245 -158 163 -257 20 -43 -185 146 52 27 242 -98 110 49 -273 357 -234 -227 333 -374 -99
5080 -99 167 -352 22 121 -56 72 -122 93 43 -260 273 -3 -125 252 -221 36 68 -225 308 10 -68 246
5102 246 -405 74 206 -145 504 -16 -132 250 -56 87 293 -280 -17 14 -315 159 -111 64 168 -217
5122 -217 219 210 -103 208 -271 -114 142 -196 40 129 -266 272 -167 -177 -35 -360 292 107 -282 314 -172
5143 -172 -60 240 -311 18 104 -359 131 74 -84 149 -382 108 53 -146 104 -147 -92 226 -328 84 182 -266
5165 -266 102 58 -35 365 -179 6 17 -175 171 -202 17 128 -20 18 207 -177 56 142 -103 244 -205 75
5187 75 74 -15 278 67 -22 412 -39 64 300 -291 99 107 -35 198 64 -8 89 -206 116 108 -128 247 -310 -165
5211 -165 255 -75 166 32 -177 179 57 -98 217 -74 71 84 -200 258 -68 -276 158 -189 -57 110
5231 110 -203 141 -32 -167 59 -290 25 88 -223 217 -131 0 -51 -190 138 169 -175 6 162 -53 138
5252 138 129 -138 284 -106 106 36 -223 158 -190 37 235 -319 -129 144 -116 295 -52 -261 122 -137 88
5273 88 136 146 211 -106 104 350 -98 -1 200 -134 223 130 225 67 -52 30 10 8 237 -81 -113 382 -235 148
5297 148 153 -292 4 22 -217 68 -163 91 -32 -227 87 176 -156 206 -168 6 128 -360 268 -24 176
5318 176 44 -88 -36 70 -182 -116 67 13 200 -52 -65 290 -264 -119 299 -158 149 -225 -106 -13 -156 -2
5340 -2 75 -105 182 -43 31 198 -93 229 207 -319 189 26 -204 193 -185 152 111 -44 226 -21 -125 178
5362 178 -101 97 69 -243 191 -149 -85 129 -117 -13 208 -17 15 -103 7 83 -116 129 142 -177 7 36
5384 36 -83 112 60 -79 138 -146 73 72 -77 217 -257 -29 75 -126 -3 128 -190 111 -171 58 313
5405 313 -187 21 74 -109 226 41 -130 172 -153 32 162 -248 40 -109 -41 83 -24 142 152 -249 101
5426 101 34 -308 343 -155 -61 -19 -97 306 -28 -155 87 21 -51 54 -75 93 -1 -278 26 -74 54 214
5448 214 25 67 -33 79 278 -243 -198 173 -139 6 120 -225 86 -47 35 99 -106 116 85 -214 266 -35
5470 -35 -52 168 -170 113 123 84 222 74 -113 165 -18 36 266 -58 79 88 37 -57 -111 -82 263 -94 17 -6
5494 -6 -121 126 -13 -26 38 -257 25 -95 -297 193 -165 -16 216 -237 -37 74 -146 180 -90 -13 91 -157
5516 -157 120 -163 -82 173 -28 -80 73 -163 60 -113 -165 -25 -18 33 255 -152 -108 120 -73 54 -179 -117 161
5539 161 -74 12 137 -92 -57 -55 -113 257 -215 -7 82 -241 107 -5 -37 123 -85 68 149 -186 171 155 -166
5562 -166 142 -161 -83 125 -124 10 -4 -100 116 -52 -105 274 -16 -96 133 -40 68 -125 -118 13 -197 28
5584 28 -188 -136 246 -7 -170 121 -197 -7 67 -191 185 -340 -13 0 -126 -114 30 -200 104 -121 -48 -50 -204
5607 -204 142 298 -149 225 -15 112 122 -102 -37 89 25 21 -83 63 339 -233 15 258 -181 16 17 -209
5629 -209 275 -39 121 212 -192 178 -21 5 88 -333 10 187 -133 210 15 -31 37 -112 -210 61 -259 76
5651 76 84 -199 -22 -134 49 164 -91 137 179 -228 91 -118 -72 -109 -167 172 -120 6 31 -99 -29 156 -45
5674 -45 -73 28 -157 161 -137 -77 194 -12 94 190 -37 -15 7 9 92 -156 60 109 -149 161 48 -381 197
5697 197 -122 -15 71 -55 167 137 -115 332 -207 67 85 -25 110 32 -149 90 225 102 92 -84 23 -21
5719 -21 -143 34 -112 -131 -61 -22 137 149 -215 28 -13 -30 326 -98 -25 50 -118 163 -100 -58 83 -84 109
5742 109 199 76 128 43 65 101 -54 -17 56 -82 46 25 73 79 -203 10 191 -86 36 -146 -7 345 -286 -66
5766 -66 38 -199 -15 60 -214 51 -31 138 15 -98 107 -75 -126 50 -95 23 79 -32 74 173 -113 154
5788 154 -98 145 141 -228 -14 11 -139 113 -64 -127 145 -92 48 69 -159 166 -51 0 217 -102 40 -106
5810 -106 -255 101 216 -166 -45 -96 -49 220 -165 164 146 8 13 -155 114 28 -304 116 -12 -75 175 10
5832 10 10 145 -46 -39 122 -116 32 -86 -22 141 -91 97 -42 -180 13 -227 -289 143 -83 114 33 -248 47
5855 47 -24 38 108 -279 70 -130 -165 122 -58 -174 189 -116 -104 135 -1 113 -66 30 69 -65 -192 105 -34
5878 -34 -44 63 46 220 8 80 83 -137 14 178 -50 124 -105 -49 93 -259 227 17 -223 272 178 -119 234
5901 234 10 78 87 -102 -48 95 10 55 39 215 135 -22 150 26 -10 130 -54 50 -35 -53 179 26 16 136
5925 136 -37 194 159 -172 37 25 -225 109 24 -107 -45 -192 185 -87 -137 194 -117 -32 89 -218 238 -21
5947 -21 -246 21 -119 43 -3 -176 -44 -15 -73 73 -338 -126 -75 34 226 73 -67 112 -146 -52 215 -19
5969 -19 5 38 -266 41 -36 -71 -21 -96 90 31 -201 53 -138 -245 191 -7 66 123 -104 130 69 -9 257 -90
5993 -90 -4 197 -130 100 24 1 304 0 -47 86 -99 21 141 -171 30 -23 65 -87 4 30 -45 -80 148 -214
6017 -214 -124 54 -62 66 129 -90 -29 -1 -53 165 -95 287 -3 -221 167 39 52 164 -49 180 70 -11
6039 -11 147 114 -167 69 -183 -86 114 -170 122 60 -169 35 -90 -119 73 -212 26 -164 -79 89 -72 226
6061 226 -28 -96 44 -124 37 252 -53 98 99 -205 79 41 -105 210 118 105 130 -136 45 16 -158 168 -96
6084 -96 36 150 -119 205 0 -60 250 -12 -13 147 5 205 77 -52 21 13 -186 167 -93 -65 -38 -108 44
6107 44 -209 -42 210 52 3 101 -103 134 -154 -27 19 134 100 -2 -198 13 137 -49 112 -290 -38 68
6129 68 -219 123 30 -159 168 -123 -15 53 -164 89 16 76 164 -75 -149 52 -116 53 178 -233 191 -113
6151 -113 74 53 -132 74 60 -171 3 65 47 22 -136 -54 141 15 -12 -69 -76 179 -23 30 15 -154 205 -112
6175 -112 -78 180 -1 2 102 -135 134 -71 -187 175 -220 -75 -138 -113 -20 49 50 39 63 -48 162 -227 221 91
6199 91 -199 30 -197 -82 191 -200 88 -88 -249 138 -235 -33 86 -6 19 -17 -82 70 99 -96 149 -46
6221 -46 -35 84 -89 130 -110 -48 50 -93 97 41 -29 25 9 3 172 -107 129 -74 -256 153 -87 -74 -53 -32
6245 -32 123 103 40 -71 -3 112 165 -108 -4 -5 -134 129 47 -31 117 -101 -11 233 -48 -51 157 -27 224 102
6269 102 185 63 -212 -173 176 -173 103 -120 159 246 -132 57 4 -111 170 -200 88 213 78 -58 -20 -257
6291 -257 -166 -172 -79 31 9 102 -56 -94 19 -147 -1 -126 -245 101 79 -126 41 -21 8 141 -37 13 170 -178
6315 -178 16 -32 -46 26 -40 25 66 -174 61 33 -161 96 -59 112 204 -71 132 -158 24 237 59 27 29 -59
6339 -59 9 124 -118 144 42 -17 -32 76 -127 54 -102 78 -110 -95 143 -110 66 138 -58 279 113 -66
6361 -66 218 -6 13 9 -120 227 150 -35 66 -67 111 143 16 101 -109 -57 79 -128 1 114 -153 27 84
6384 84 -130 246 -58 73 -21 -146 4 -71 -30 93 -196 13 105 -126 11 -3 -69 137 0 53 54 -152 -126 -62
6408 -62 -205 50 144 -93 184 -16 145 -85 -108 -51 62 42 41 27 122 90 -85 62 -119 -69 207 57 -126 120
6432 120 -56 152 125 -118 -59 30 -168 70 -180 46 -201 -134 169 -5 -245 18 -172 -132 21 47 119 -40
6454 -40 -69 139 41 -37 -45 -132 139 -241 -83 31 -94 -12 -28 -111 -79 -165 -59 -89 -107 1 60 -186 -25 -6 -75 183
6480 183 -185 106 -3 -218 101 -74 50 61 -105 -50 61 -62 19 10 13 -22 -173 -40 194 -76 56 -162 -114
6503 -114 140 33 44 43 -65 59 160 -135 62 -83 -49 -79 -85 148 90 -16 144 -132 -141 81 -182 -24 70 -16
6527 -16 99 -102 74 272 106 -15 84 -35 187 14 -106 231 -124 214 60 -63 75 -109 -140 192 -84
6548 -84 -26 86 -119 172 2 -108 -47 -84 -122 -41 -142 283 7 -23 47 -239 -97 113 -23 -13 -38 -57 -30 -2
6572 -2 30 118 89 -1 114 -90 93 -23 -151 190 37 183 -70 -100 47 7 161 -14 -59 -91 73 -4 123 -200
6596 -200 -120 37 -23 -91 57 -2 84 28 120 81 -70 89 -69 17 90 29 -40 -79 -72 212 -107 -116 131 -20 -72 -37
6622 -37 -7 -1 28 -47 -18 -135 -142 185 -88 11 -50 -78 -17 -14 -97 93 16 -14 118 -120 -103 155 -7 139 -5 -56 79
6649 79 -141 15 -50 -56 24 -109 9 115 -40 -11 -69 -290 44 150 85 -46 -223 68 155 35 148 -12 -87
6672 -87 68 -97 165 -69 -135 58 -30 87 125 -223 -125 101 -222 118 8 -135 84 -46 0 -89 105 15 -53
6695 -53 37 197 -108 85 60 -155 67 -47 69 13 61 -132 53 -106 78 148 -160 58 16 -213 123 57 -4
6718 -4 24 -58 104 -71 -102 83 23 64 13 124 17 104 -68 99 -19 14 -5 -136 -46 -16 -79 -1 62 65 -62 -165
6744 -165 31 169 -67 -45 -138 40 320 -34 18 -65 48 -213 -104 -15 -80 -34 -158 10 -134 132 28 -74
6766 -74 110 119 77 57 -27 -3 54 -85 141 22 169 -139 167 133 52 64 69 -56 70 -58 -23 -20 -33 72 187 -49
6792 -49 -76 99 -38 57 32 14 82 -34 129 93 -94 98 75 -25 -79 19 -51 161 -79 24 178 -206 106 -117
6816 -117 -34 -72 33 59 -64 -181 200 26 -102 213 -180 110 130 -147 -24 80 -4 68 13 -132 58 82 60
6839 60 -47 22 -30 -9 134 11 -151 -123 -47 6 93 35 -94 45 -102 -7 -114 17 -46 -12 112 182 -58 135
6863 135 -107 32 43 -123 -64 13 -77 27 17 14 32 22 34 33 -72 14 -19 -26 134 53 -116 132 -4 -48 58 -14
6889 -14 84 12 158 -10 -36 -21 148 -35 109 141 -45 110 -158 -138 170 -264 -81 -26 -136 -139 -23 104 -52
6912 -52 -108 35 -3 77 -1 76 21 33 48 155 -140 30 56 1 -35 -33 -41 33 -68 -23 125 -140 -169 132 -146 24
6938 24 128 0 49 111 1 -57 -93 -31 -54 -129 150 -106 21 46 4 -11 -21 25 63 -170 47 -15 -238 -211 19
6963 19 -235 39 90 42 122 -68 -39 3 -100 160 11 57 88 -20 8 -43 -142 92 54 54 167 83 81 299 126 -47
6989 -47 1 -136 -138 -102 78 34 -103 -9 -35 -53 38 115 -54 169 113 35 19 -8 107 -44 -93 -117 -88 87 106 27 31
7016 31 94 -131 138 -168 142 -56 -7 36 126 -4 137 50 -6 19 61 5 2 23 -34 -129 -68 49 -15 -23 -11 -24 28
7043 28 -100 26 105 -220 2 51 -79 -17 32 3 128 18 15 -58 69 57 87 66 -36 39 181 30 119 149 -4
7068 -4 157 212 -172 -13 0 20 -37 -42 15 -4 -158 22 -92 -61 91 -115 26 -75 -21 108 -52 15 146 -56
7092 -56 42 -115 -38 87 47 -173 52 -158 -68 -51 49 -23 7 -77 253 49 -16 84 -188 -8 -4 -49 14 -32 54
7117 54 -26 -32 -82 39 -173 -8 -104 -111 -55 -181 -77 54 -214 14 115 -136 77 -149 -107 18 -74 -10 -62 -113 41
7142 41 52 -72 122 -136 73 -62 -196 198 -40 80 66 95 -69 -125 12 11 81 -178 -52 36 147 -30 16
7165 16 -38 -6 -78 197 175 44 108 -96 -171 0 -14 67 5 -95 -84 -134 12 11 -59 -62 -101 17 -8 144 67 48 -199
7192 -199 16 -129 -133 15 -89 157 43 -89 129 146 -47 140 -114 -67 -20 -140 34 -45 101 143 -46 64
7214 64 117 -19 41 -103 -185 -65 -115 89 -57 -128 22 97 -45 17 14 144 46 -30 60 70 7 52 -126 -76 139 30
7240 30 31 -97 167 -98 13 -124 57 78 26 -165 -187 -37 -38 11 63 25 5 -99 -99 40 32 27 -8 -50 -62 3 -179
7267 -179 131 -53 45 -31 -80 68 -17 -111 200 -175 33 -78 -72 -112 -7 -64 5 -154 -9 84 -201 18 -4 27
7291 27 -65 162 -7 -84 -4 -127 -55 -275 -45 116 -11 -49 -97 -24 109 -42 -20 -67 51 -52 -58 1 68 -174 196
7316 196 117 -55 49 22 180 161 97 4 -4 68 96 31 48 3 -61 47 -135 -26 57 40 -109 82 -57 40 -72
7341 -72 -36 12 -109 -23 -176 -80 -44 68 118 -80 -73 47 86 113 82 42 -91 44 157 -25 -20 7 -89 150 -30 282
7367 282 -27 86 20 -44 -47 -52 43 22 -28 128 1 71 37 -55 -87 -57 67 -48 126 4 128 19 -175 114 78
7392 78 57 39 -8 20 72 -113 106 146 -153 194 -105 108 159 -149 -74 -48 -62 -23 26 -13 -44 -122 52 52 88 87 -91
7419 -91 -66 75 -71 116 118 -18 -81 -72 -158 107 -31 30 -84 110 -39 27 -128 139 128 -38 102 -138 -87 -21
7443 -21 -98 66 -10 3 78 140 106 169 33 47 -50 -38 75 3 -120 -105 60 89 -125 33 140 -81 -55 5 -142
7468 -142 -37 -12 -76 18 -8 -164 214 -180 45 -31 -185 -77 -101 -52 12 -78 128 -40 75 -17 29 -133 -2 3
7492 3 45 65 -42 0 -113 39 -9 177 84 108 -234 9 16 -26 59 -35 -35 91 81 -165 -4 -121 169 -57 89
7517 89 -59 184 10 22 -49 118 -138 1 72 -72 -122 -203 50 -39 14 73 57 -286 -22 24 42 73 -85 -108 89
7542 89 8 71 -166 -4 8 49 34 -9 -39 -3 -144 -208 -35 25 7 65 51 124 69 -120 33 132 54 -133 -64 46
7568 46 72 23 157 110 -51 -10 -113 49 -46 132 -68 -53 -19 111 -155 115 48 55 7 -20 -1 166 -59 -43 -54
7593 -54 -109 125 -144 60 1 25 -7 52 -201 50 -36 100 90 -73 -118 141 114 35 73 235 -22 4 57 119 116 107
7619 107 73 -153 -1 48 43 23 -167 54 -17 -39 120 156 -224 109 -13 107 2 -176 91 76 -134 15 -62
7642 -62 -90 -9 -154 -5 -54 -207 195 -4 -76 -51 155 -10 70 29 57 66 -4 162 -75 121 -12 -89 -172 -77 110
7667 110 -55 -108 93 -100 -239 8 -71 -100 0 14 224 210 -90 120 59 -35 162 -30 203 73 -36 91
7689 91 115 -70 87 -49 -81 297 -60 71 76 10 119 82 78 -11 -81 129 -181 -100 -45 -123 -11 80 -131 50 -77
7714 -77 74 233 -109 69 -59 85 -80 -96 -1 101 -178 -62 169 -132 145 -106 -222 160 64 -60 104
7735 104 124 -71 73 -42 15 25 -11 120 31 -29 -107 122 124 121 161 -9 32 47 71 -234 -2 69 20 155 -5 -22
7761 -22 58 -16 -143 -112 85 -76 -48 -80 5 -40 194 22 15 92 0 150 -115 -15 68 108 46 -13 -27 -53 -55 -11 36
7788 36 15 -147 -17 29 125 93 102 98 195 135 93 -63 -98 168 -219 81 74 -140 -56 61 62 -78 -139 -123 -143 -146 17 -21
7816 -21 -5 -89 -142 -72 -12 -72 -36 -43 180 -2 -69 -3 45 -84 118 -18 -175 7 -19 198 10 -79 59 -28 5 11
7842 11 8 -44 -53 10 28 -42 -35 17 -104 -40 83 147 -60 111 -126 -95 -75 -57 -78 -98 -29 -112 -94 84 -128 -173 164 -132
7870 -132 -70 60 -119 67 14 -216 39 17 -22 145 57 -12 -42 144 66 -107 -83 155 -118 -2 -16 -102 -37 -173
7894 -173 -141 6 -79 -90 60 -118 54 -108 -20 -165 -129 160 138 -12 129 152 -101 -24 -61 -128 -57 132 24 133
7918 133 113 28 56 19 -26 -28 17 19 -81 88 -40 -51 46 13 86 -1 26 129 -14 -230 47 3 -20 -13 44 3 -17 21
7946 21 -130 -35 -17 -42 -76 127 -10 4 149 -107 78 34 -25 -63 89 28 -12 -108 132 2 66 96 7 -95 113
7971 113 23 32 110 -30 62 48 79 24 62 -85 -16 -5 -44 25 73 -59 10 -44 -69 -151 66 -89 -101 46 -17 85 -3
7998 -3 220 63 -12 -145 61 -67 195 157 6 98 -89 -109 72 -142 29 -41 -21 -167 -147 -64 122 -36 -12 -11
8022 -11 -3 91 176 -84 25 -70 69 48 -63 33 202 160 62 38 -78 -119 -244 63 -123 39 -38 -24 0 -82 -6 28
8048 28 -45 -123 95 66 -183 -71 14 87 12 -39 86 82 105 48 -153 50 40 -114 2 -23 44 74 -16 -58 -89 -8 44
8075 44 -10 52 11 -140 79 13 -17 -50 -132 52 -25 -91 -19 226 -52 0 -5 -109 -100 68 -23 14 -20 -55 -83 -101 -44 -59
8103 -59 69 206 -163 36 -9 -77 71 10 -84 47 2 18 61 1 -36 -5 -107 102 -75 45 92 -43 141 65
8127 65 11 139 -3 -36 17 63 -44 88 -12 100 81 195 23 100 166 -25 -9 70 -104 60 20 -134 6 -167
8151 -167 -52 49 -110 20 97 42 -7 105 -37 36 61 82 11 -264 109 -8 48 9 128 106 -101 -96 -121 85
8175 85 -145 183 -16 -28 178 -177 -95 110 93 -7 28 31 73 104 -7 101
8191A01
$$ Imaginary data points
##PAGE= N=2
##DATA TABLE= (X++(I..I)), XYDATA
0 0 0 0 0 0 0 0 0 0 0 0 0 0 8 -8 8 -8 8 -10 16 -16 16 -24 30 -32 40 -46 49 -59 70 -80 88 -102 113 -129 145
35 145 -164 182 -205 229 -254 283 -313 346 -383 425 -467 515 -570 626 -690 759 -838 922 -1019
54 -1019 1127 -1252 1392 -1556 1747 -1976 2257 -2603 3049 -3647 4487 -5753 7858 -11981 22934
69 22934 -109306 -263672 11338 -111579 -148160 117484 37060 -170972 -31235 -18124 -182922
80 -182922 -16119 176201 -18637 9948 175435 -74331 -113854 142671 2334 -49909 176874
91 176874 50911 -120596 29221 14363 -136915 12788 127306 -65700 -26938 114621
101 114621 -101144 -101305 128681 -18455 -56113 153236 18972 -106214 57822 23546 -103211
112 -103211 44190 109489 -67837 -12565 101365 -93246 -69477 129853 -24976 -46365 145604
123 145604 204 -90261 78755 18813 -86812 58547 78060 -83272 -14067 65863 -113950
134 -113950 -73022 90407 -68888 -71568 102927 -44059 -97069 77166 5986 -66621 86229
145 86229 81269 -47205 41241 97048 -57226 -3442 121861 -37276 -34071 106126 -50096
156 -50096 -89904 61235 -33240 -93314 45143 11726 -92663 3498 39145 -84113 -13149
167 -13149 91663 -45372 -21143 106169 -35413 -50635 90947 -10204 -54220 72679 16611
178 16611 -71614 20770 29042 -80219 -10811 63081 -64255 -33618 73630 -58306 -56487 73651
190 73651 -28695 -53693 67032 1245 -61511 33417 25175 -60685 10957 60419 -49247 -10906
202 -10906 75383 -42895 -27930 83623 -18187 -27647 79419 4432 -36769 51486 24431
213 24431 -41321 25278 47830 -45193 -6383 54641 -50825 -30027 59640 -38377 -36613 57223
225 57223 -20228 -41060 43066 6431 -36839 30105 36624 -34508 9082 52725 -37478 -11337
237 -11337 59961 -34223 -26457 52349 -30054 -41332 34065 -15827 -46604 16179 6669 -48551
249 -48551 -2422 27807 -46362 -14260 45808 -37301 -20172 51507 -26180 -25248 44717 -9078
261 -9078 -26956 31111 10417 -30166 12321 28128 -32374 -2897 41849 -31256 -13215 45868
273 45868 -26191 -19563 40397 -14405 -21917 28810 1389 -24250 13379 18496 -25691 800 32966
286 32966 -25624 -8234 39745 -22966 -12823 37567 -14915 -14695 28144 -2919 -17063 14907
298 14907 10866 -19602 2593 23773 -21796 -5967 30951 -22342 -10364 31126 -17870 -11556
310 -11556 24248 -9081 -12952 13376 2664 -15261 2914 14939 -18006 -4251 23746 -19106
322 -19106 -6712 26829 -16614 -6100 23373 -9416 -5291 15373 673 -6619 5946 11041 -10427
335 -10427 -2026 17826 -15542 -6542 19141 -17754 -7607 14934 -15996 -7376 7265 -8856 -7279
348 -7279 -283 962 -8880 -4988 10131 -10931 -5477 15316 -12142 -3040 15044 -10504 155
361 155 10330 -4944 1902 3397 1815 156 -2365 7942 -4041 -5071 10818 -8348 -4183 9542
375 9542 -10478 -949 4922 -7775 2756 -128 -1590 4628 -2917 6000 4084 -2084 11327 1766
389 1766 1178 11919 -1322 5646 7215 -3131 7947 -702 -3335 6524 -8471 -1945 2143 -11811
403 -11811 -992 -3530 -10051 -1259 -7273 -3864 -3223 -7879 3869 -5814 -4345 9965 -7641 997
417 997 12319 -6135 5400 10444 -2341 5745 5934 2996 1468 713 7490 -5983 -3023 9664
431 9664 -12833 -4352 9365 -15537 -3530 7649 -11514 -1999 6199 -1610 -915 6091 10089 -1901
445 -1901 6679 19189 -5323 6269 21422 -9210 3479 16949 -11495 -2935 7898 -10244 -10990
458 -10990 -939 -5052 -18677 -6510 2485 -22969 -7182 9921 -22836 -5161 14014 -17623
470 -17623 -3730 13730 -8826 -5256 10494 1371 -9781 6012 10642 -15299 2746 17425 -18290
483 -18290 536 19840 -17230 -1451 18596 -10770 -4693 14657 -1556 -10138 9659 8888 -15357
496 -15357 6243 18321 -17636 5147 24700 -15037 5228 27968 -6272 4871 27559 4244
508 4244 226 22326 13882 -8471 14347 18624 -19441 3503 16995 -28026 -7093 12764 -29091
521 -29091 -14859 8339 -21844 -20228 5773 -7368 -21820 7051 8983 -22784 6476 19425
533 19425 -23609 3802 22890 -22285 -3496 18193 -20219 -15093 9796 -12993 -24319 4395
545 4395 -1871 -30926 769 9678 -31057 1964 21612 -23770 2710 26695 -14758 -1188 27347
558 27347 -999 -5991 24928 11323 -14601 18309 20670 -20354 14735 29801 -18959 9689
570 9689 31346 -16104 1478 29765 -5773 -5912 24890 3346 -18847 14614 10302 -27605 8342
583 8342 18382 -30500 849 19979 -28872 -5255 22743 -15272 -7926 23101 -2850 -17565
595 -17565 16559 7914 -24128 12144 16084 -31499 -177 13005 -37551 -11109 12786 -29601
607 -29601 -17124 10903 -19812 -25831 9147 -2254 -24399 15466 17090 -23361 12865 24221
619 24221 -22701 10286 31249 -14183 3706 27245 -11248 -11902 19853 -538 -18423 19037
631 19037 11299 -26420 11415 17047 -27715 10469 28279 -18320 6415 28039 -13923 -5916 25213
644 25213 -747 -11484 24137 9011 -24238 13138 12982 -29359 10804 23274 -24674 3615
656 3615 21179 -23519 -8413 20437 -9642 -13365 19666 -997 -28419 8548 4177 -33744 7652
669 7652 15428 -31521 115 14735 -29762 -7406 20284 -11595 -8149 23414 -288 -19779 17355
682 17355 9951 -22870 18368 21138 -25068 7744 17357 -28300 -1909 20819 -15357 -6565 20029
695 20029 -7974 -19955 15904 5134 -19892 20983 19501 -22170 13225 19755 -23279 7746
707 7746 25729 -12338 785 21894 -10407 -15787 15460 -244 -19891 17100 9575 -27261 7805
720 7805 10169 -29007 5886 18844 -19204 171 16553 -16082 -12916 15066 -3641 -16173 17157
733 17157 5205 -25510 9501 8138 -27323 9463 17429 -20390 3288 15683 -18029 -7389
745 -7389 17017 -4723 -10906 18855 2730 -22260 12701 7438 -24372 13254 16695 -21030 6051
758 6051 15350 -19336 -2738 18440 -5947 -6756 19842 880 -18250 15061 7646 -20635 16164
771 16164 15841 -20470 8187 14026 -20035 213 16905 -9433 -5602 16410 -3959 -16987 12881
784 12881 3651 -19891 14103 10776 -21806 7260 10595 -20707 2126 14008 -11836 -3678 13784
797 13784 -6730 -13879 12282 1595 -16915 13838 8102 -20507 8318 8784 -19855 5139 13003
810 13003 -12982 -814 12141 -8655 -9825 12079 -455 -13738 13512 5292 -18796 9749
822 9749 7184 -19076 7603 11116 -14083 1998 10613 -9902 -5961 11676 -2058 -10242 13131
835 13131 3539 -15742 11349 6867 -16180 10304 10176 -13465 4917 9800 -10559 -2349 10344
848 10344 -4277 -8473 10936 248 -14983 9720 4214 -15970 9816 7966 -13699 6567 9122
861 9122 -9613 1715 11138 -2954 -3844 11597 956 -10667 10559 3850 -14194 9383 5361
874 5361 -15001 5269 5243 -12780 678 6184 -7168 -4388 7478 -2410 -9918 8341 2089 -12320
888 -12320 9182 4808 -13082 6963 5287 -11183 3515 6185 -7013 -1748 6285 -3104 -7153
901 -7153 6527 505 -10703 7283 2601 -12597 5955 3115 -11219 3787 3842 -7451 47 4620
915 4620 -3032 -3884 6450 1208 -6798 8320 4017 -8235 8630 4905 -7402 7237 5066 -5367
929 -5367 3486 4374 -2940 -1659 4205 -505 -6299 5062 736 -8995 5664 1552 -8700 5580
943 5580 2330 -6320 4057 3177 -2668 880 4361 569 -2828 5508 2091 -5908 5998 1815 -7432
958 -7432 5364 897 -7051 2755 -187 -5066 -677 -19 -2497 -4078 1463 -440 -6088 3404 916
973 916 -6415 4899 1496 -4813 4878 1440 -2017 3050 1867 591 122 2251 1659 -3290 2877 1379
989 1379 -5297 3154 -191 -5555 2778 -1132 -3800 1592 -1410 -1078 -219 43 1686 -1887 1973 2640
1005 2640 -2796 3908 1940 -2605 4374 427 -1307 3166 -1256 210 815 -1535 1316 -1900 -809
1020 -809 1158 -3378 664 265 -3489 1761 -1278 -2151 2159 -2211 70 1277 -2139 2324 -93 -888
1036 -888 3444 -963 1197 2881 -925 2577 849 -11 2906 -1337 1078 1603 -3083 2106 -434 -3362
1052 -3362 2132 -2202 -2631 1134 -2403 -550 -186 -856 1378 -1498 1946 2245 -2298 4401 1695 -2321
1068 -2321 4925 512 -2069 3385 -810 -1441 310 -1393 -1082 -3131 -328 -1081 -5206 1877 -906 -5427
1084 -5427 3578 -738 -3873 3893 -210 -1752 2423 808 43 -325 2179 596 -3226 3680 316
1099 316 -4727 4788 -238 -4896 4121 -372 -3444 2852 448 -1667 31 2009 -388 -2721 3774
1114 3774 -147 -4812 5229 -47 -5042 5312 -136 -3991 4173 1174 -2177 1997 2799 -378 -983
1129 -983 4897 308 -3514 6366 -297 -5414 5859 -1007 -5826 4151 -921 -5014 1094 572 -3489
1144 -3489 -1571 3343 -1701 -3603 5992 -768 -5004 7474 -39 -4988 6702 481 -4578 3672
1158 3672 1174 -3916 -592 2901 -3338 -4334 4788 -2832 -6679 6210 -1852 -6654 6435 -663 -5680
1173 -5680 4675 1070 -4244 1583 3619 -2796 -2018 5850 -2300 -5240 7084 -1681 -6364 7286
1187 7286 -882 -6329 5496 459 -5004 3071 3472 -3365 -851 5554 -2626 -4218 7449 -1693 -5766
1202 -5766 8218 -1169 -6419 6543 -12 -5336 4284 2823 -3749 530 5172 -2925 -2698 7633
1216 7633 -1720 -4757 8796 -1431 -6408 7253 -685 -5966 5186 1289 -5016 944 3249 -4450
1230 -4450 -2477 6335 -2716 -4401 8463 -2510 -6420 7882 -1260 -5936 6589 975 -5226 2643
1244 2643 2566 -5270 -1263 5782 -3680 -3948 7376 -3844 -6701 7844 -2386 -6588 7524 -33
1258 -33 -6488 3649 1736 -5633 480 5652 -4071 -2625 7432 -4213 -5837 8426 -2375 -5809
1272 -5809 8484 -858 -6595 5120 1171 -5587 2123 5216 -4250 -1335 6959 -4543 -4966 8892
1286 8892 -2540 -5199 9117 -1403 -6360 5910 570 -5429 3585 4316 -4167 -507 5976 -4658
1300 -4658 -4060 8311 -2653 -4549 8960 -1991 -6247 6623 -206 -5195 4986 3360 -4508 745
1314 745 4827 -4831 -2749 7887 -3159 -4139 8425 -3402 -6469 6691 -1843 -5464 5301 1456
1328 1456 -5202 1349 3266 -5252 -1545 7098 -3658 -3426 7972 -4141 -5888 7327 -2390 -5147
1342 -5147 6515 78 -5675 2317 1967 -5612 -395 5938 -4270 -2868 7283 -4783 -5273 7670
1356 7670 -2870 -4394 7389 -606 -5454 3359 1431 -4957 1158 5485 -4022 -1730 6964 -4626
1370 -4626 -4077 8400 -2633 -3747 8071 -1018 -4854 4689 713 -4512 2442 4567 -4227 -1069
1384 -1069 5972 -5042 -3614 7880 -3311 -3531 7610 -2334 -4807 5234 -35 -4032 3559 3592
1398 3592 -3845 -99 5164 -4644 -2717 7095 -3817 -3617 6954 -3662 -5097 4767 -1622 -4355
1412 -4355 3410 1426 -4154 182 3751 -4491 -1459 6476 -3460 -2596 6993 -3570 -3779 5762 -1658
1427 -1658 -3249 4226 694 -3728 1140 2716 -4241 -903 5690 -3696 -2032 6427 -3745 -3372 6133
1442 6133 -2336 -2931 5065 -381 -3481 2095 1870 -3703 289 4814 -3549 -1561 5826 -4067 -2662
1457 -2662 6110 -2897 -2727 5105 -1418 -3481 2626 677 -3718 548 3472 -3920 -1532 4825 -4616
1472 -4616 -2855 5596 -3295 -2487 5129 -1900 -2747 3341 158 -2661 1740 3141 -2908 -276 4825
1487 4825 -3323 -1558 5777 -3013 -1795 5351 -2102 -2218 3518 -339 -2211 2090 2071 -2500 0 3935
1503 3935 -2888 -682 5338 -2683 -1344 5253 -2365 -1691 3678 -1050 -1733 2120 868 -2281 29
1518 29 2416 -3022 -1197 3764 -3534 -1760 3917 -3405 -2160 3030 -2495 -2116 1733 -633 -2286 -165
1534 -165 1198 -2821 -995 2893 -3289 -1412 3784 -3139 -1335 3336 -2380 -1214 2394 -804 -1410
1549 -1410 813 1079 -1724 -180 2808 -2335 -707 3875 -2447 -572 4008 -1989 -352 3272 -627
1564 -627 -399 1970 1136 -437 731 2805 -1276 -78 3587 -1976 -308 3741 -2080 -214 2846 -1370
1580 -1370 -500 1316 -287 -816 -82 1225 -1665 -899 2215 -2315 -1039 2383 -2641 -692 1945 -2192
1596 -2192 -679 639 -1141 -573 -362 372 -1242 -1022 1331 -1939 -1123 1900 -2204 -774 1674 -2080
1612 -2080 -99 840 -1206 -114 -213 380 -281 -425 1525 -663 -414 2223 -1160 16 2203 -1424 612
1629 612 1566 -722 843 607 105 589 -219 1229 -190 -658 1824 -1146 -286 1757 -1435 314 1093
1646 1093 -1196 910 249 -635 748 -600 401 144 -1061 1267 -685 -487 1223 -1499 38 704
1662 704 -1347 591 -208 -963 716 -922 -216 380 -1209 637 -347 -770 952 -843 75 584 -962
1679 -962 693 84 -479 1296 -718 110 1238 -992 751 656 -781 1060 -201 -26 691 -616 956
1696 956 -154 -663 1320 -874 -241 1552 -1284 336 810 -1375 527 275 -503 346 -642 343 -438
1713 -438 -734 1260 -960 -583 1268 -1826 -59 967 -1770 163 148 -1179 5 -242 -42 -447 -434
1730 -434 957 -959 -390 1624 -1523 -112 1682 -1653 460 1158 -1026 455 573 137 -109 138 1060
1747 1060 -757 87 2003 -1521 454 2107 -1850 444 1678 -1355 610 1141 -404 -96 334 826
1763 826 -840 13 1711 -2038 262 2106 -2364 377 1782 -1925 -52 1125 -1222 -434 437 3
1779 3 -1304 205 1250 -2208 -21 1819 -2660 -57 1811 -2426 -88 1433 -1721 -441 791 -291
1795 -291 -1075 671 1005 -2030 292 1965 -2506 272 2441 -2330 543 1837 -1706 -53 1158 -508
1811 -508 -766 722 1019 -1868 423 1773 -2269 467 2410 -2304 430 2103 -2234 312 1703 -1088
1827 -1088 -526 1376 302 -1472 662 1430 -2317 658 2242 -2704 497 1995 -2651 274 1838
1842 1838 -1630 -209 1347 -322 -1501 980 1007 -2179 868 2104 -2789 871 2162 -2757 574
1857 574 1970 -1785 87 1870 -887 -1014 1278 538 -1881 1141 1975 -2748 889 2130 -3066 676
1873 676 2316 -2393 39 1979 -1221 -1124 1110 180 -1919 1182 1326 -2964 888 2018 -3367 688
1889 688 2391 -2965 109 1792 -2004 -1083 1353 -132 -1659 1032 911 -3030 790 1575 -3515 760
1905 760 2268 -2825 497 1959 -2110 -452 1576 -615 -1100 1681 887 -2111 1140 1782 -2751 1432
1921 1432 2510 -2798 1040 2110 -2285 170 1941 -878 -468 1844 205 -1884 1245 1481 -2540
1936 -2540 1585 2294 -2799 1091 1830 -2887 541 1828 -1491 -141 1424 -459 -1803 1326 700 -2459
1952 -2459 1548 1594 -3391 959 1693 -3351 525 1910 -2204 -209 1602 -1217 -1481 1446 371 -2443
1968 -2443 1489 1485 -3323 1143 1769 -3088 1160 2097 -2298 425 1750 -1389 -765 1494 131 -1667
1984 -1667 1888 1234 -2981 1296 1690 -3152 1344 2218 -2438 705 1672 -1884 -469 1528 -139 -1486
2000 -1486 1632 797 -2667 1134 1453 -3026 1062 1885 -2706 544 1373 -2020 -369 1270 -701 -1073
2016 -1073 1222 216 -2458 1073 1203 -2792 1618 1679 -2720 837 1452 -2220 303 1550 -828 -540
2032 -540 1574 182 -1898 1512 971 -2266 1954 1605 -2464 1384 1567 -2196 944 1704 -1029 -32
2048 -32 1526 -430 -1362 1556 720 -2010 1763 1352 -2674 1410 1301 -2576 860 1337 -1702 139 1218
2065 1218 -1022 -1299 1020 96 -2092 1281 826 -3028 1009 681 -2903 1011 997 -2192 61 894 -1228
2082 -1228 -1095 951 -158 -1882 1178 591 -2662 1108 920 -2624 1347 1214 -1865 832 1090 -1013
2098 -1013 -120 1322 163 -882 1566 641 -1737 1530 1212 -1834 1632 1391 -1549 1185 1182 -969 451
2115 451 1107 93 -537 1236 558 -1328 1362 1040 -1938 1406 986 -2057 1096 783 -1530 354 583
2132 583 -762 -561 523 -203 -1508 779 392 -2176 900 376 -2344 948 193 -1879 438 404 -1147
2149 -1147 -232 409 -351 -1147 735 168 -1681 982 411 -1974 1016 480 -1609 989 592 -751 525
2166 525 684 -125 -564 956 644 -1244 1213 708 -1497 1460 757 -1255 1286 727 -827 514 476
2183 476 -259 -37 742 539 -724 1051 805 -1396 1293 849 -1415 881 245 -1019 424 215 -424
2200 -424 -187 112 -93 -869 241 379 -1428 677 671 -1426 945 203 -1084 774 40 -525 334 141
2218 141 -26 -608 66 450 -1314 620 345 -1402 925 118 -1171 932 67 -403 472 -20 16 -260
2236 -260 102 536 -740 524 324 -1081 894 422 -849 1011 -90 -444 783 -187 128 59 174 259
2254 259 -614 201 547 -1018 518 -55 -1089 892 -350 -728 473 -422 -236 197 -413 166 -409 -88
2272 -88 368 -951 499 283 -883 792 -129 -599 806 -478 -133 225 -444 233 -18 -345 536 -466
2290 -466 159 434 -681 754 143 -429 756 -267 91 666 -414 430 229 -195 634 -173 129 540
2308 540 -675 588 218 -372 759 -259 -34 640 -475 321 172 -543 588 -253 -256 510 -601 79
2326 79 34 -477 105 -366 -266 620 -765 92 256 -878 592 1 -699 392 -436 -145 75 -712 224
2345 224 -256 -356 226 -911 207 134 -879 658 -282 -756 723 -334 -346 494 -557 95 -28 -288
2363 -288 360 -496 60 377 -892 690 151 -819 772 -335 -628 687 -182 -30 227 -222 487 -268
2381 -268 348 576 -745 878 481 -500 1176 104 -411 954 -45 80 630 -44 375 -124 405 420 -733
2400 -733 654 278 -1108 751 44 -779 799 -109 -574 567 -276 -97 -65 -52 254 -712 453 -76 -1169
2419 -1169 525 -164 -1061 769 -390 -790 425 -617 -434 -4 -176 -65 -624 287 -148 -1011 678 -275
2437 -275 -1136 935 -256 -850 856 -308 -549 326 50 -39 -141 515 196 -696 936 277 -735 1246
2455 1246 80 -872 1065 -110 -498 756 92 26 22 412 206 -543 1131 303 -647 1259 61 -992
2473 -992 1487 73 -680 1086 93 -326 261 160 -108 -730 755 50 -948 873 -86 -1197 1002 -227
2491 -227 -1120 662 -458 -629 241 -135 -303 -576 582 -82 -1277 942 -433 -1291 1266 -330 -934
2508 -934 800 -236 -465 374 -261 -302 -117 376 95 -841 973 42 -897 1312 -295 -773 1349 -33
2526 -33 -715 929 -230 -223 207 351 26 -459 836 136 -743 1356 -60 -766 1598 -152 -844 964
2544 964 -16 -392 385 218 -144 -326 646 -307 -783 1030 -400 -1126 1239 -365 -968 1034 -276 -560
2562 -560 584 -40 -404 -150 547 -177 -927 1039 -319 -1137 1231 -524 -1032 1149 -467 -732 759
2579 759 90 -442 109 400 -278 -464 1074 -224 -911 1446 -183 -1004 1576 -159 -557 914 -99
2596 -99 -698 238 369 -370 -333 862 -225 -948 1305 -404 -1041 1225 -327 -682 1050 -267 -746 408
2614 408 -36 -291 -235 480 -165 -695 989 -544 -968 1208 -541 -779 1069 -451 -697 696 -338 -481
2632 -481 12 433 -179 -702 1035 -490 -885 1355 -441 -859 1272 -486 -684 920 16 -351 431 242
2650 242 -215 -234 929 -257 -550 1284 -265 -645 1297 -305 -704 1296 -131 -338 410 31 -189 -164
2668 -164 579 -175 -444 1131 -428 -836 1413 -500 -797 1220 -324 -466 650 -137 -371 -37 381 -178
2686 -178 -488 1000 -401 -1029 1273 -762 -872 972 -491 -544 763 -278 -235 148 169 -62 -379 819
2704 819 -360 -763 1098 -622 -682 1005 -566 -634 926 -418 -346 127 28 1 -150 615 -217 -555 801
2723 801 -432 -812 1162 -374 -496 883 -339 -382 402 -42 -187 41 535 63 -473 818 -382 -591
2741 -591 1147 -360 -579 1095 -500 -276 727 -390 64 369 184 -189 -323 603 -343 -489 1064 -458
2759 -458 -627 1043 -687 -291 821 -274 7 232 -77 -38 -245 473 -310 -522 824 -379 -810 880
2777 880 -534 -707 795 -620 -317 421 -113 -53 -259 299 -163 -561 599 -425 -825 800 -618 -530
2795 -530 802 -678 -473 309 -394 -20 -96 88 -71 -310 834 -29 -480 989 -519 -396 997 -708
2813 -708 -342 338 -511 29 129 -15 3 -171 426 -148 -350 869 -372 -524 864 -549 -56 665 -321
2832 -321 68 472 -95 162 -124 389 42 -443 683 -378 -348 912 -369 -158 697 -424 -37 310 -163
2851 -163 128 -115 39 -163 -428 493 -125 -471 604 -582 -323 724 -744 21 413 -325 7 -137 -115
2870 -115 -23 -366 248 -230 -392 692 -324 -575 586 -514 -62 462 -539 204 43 -3 102 -396 280
2889 280 47 -514 584 -277 -200 721 -452 50 562 -303 340 301 -331 317 -70 -127 92 -238 351 -13
2909 -13 -361 528 -473 -12 479 -449 222 83 -373 452 -168 -185 452 -243 308 54 -310 335 -99 -153 569
2930 569 -520 45 147 -653 342 -117 -173 414 -557 -11 42 -461 254 -272 -234 512 -344 80 246 -321 339
2951 339 -4 -313 472 -415 -85 213 -472 136 -9 -408 264 -254 -75 187 -438 356 -3 -379 546 -236
2971 -236 -98 352 -555 132 94 -398 327 -131 -184 380 -444 313 114 -404 500 -220 -340 555 -309 -68 180
2992 180 -396 93 16 -138 405 -238 272 -61 -344 665 -128 -49 447 -357 68 400 -259 413 176 -297
3012 -297 381 -254 234 116 -461 670 -155 -234 584 -499 -39 550 -516 226 188 -359 55 50 128 154 -280
3033 -280 464 -91 -314 452 -438 -182 625 -479 -60 178 -344 260 -98 -112 101 -348 144 -4 -314 492
3053 492 -394 -209 546 -735 -108 419 -519 293 -40 -246 37 -159 163 -134 -243 554 -332 -268 769 -431
3073 -431 35 527 -440 108 381 -270 344 -45 113 -244 -398 419 -191 -216 650 -271 -70 633 -508 188
3093 188 369 -402 201 137 -21 169 -39 516 -87 -140 601 -512 -210 644 -746 33 446 -250 77 205
3113 205 -30 90 -81 352 -230 -186 644 -312 -137 712 -614 -5 581 -511 59 228 -182 9 -73 112
3133 112 -208 -338 451 -347 -143 689 -580 -47 637 -532 112 365 -450 121 -236 -58 -124 -318 356 -380
3153 -380 -95 441 -600 -79 708 -805 -24 529 -426 142 103 -50 -10 -171 475 -279 -245 732 -513 8
3173 8 827 -753 26 349 -571 228 408 -93 185 -76 251 -295 -86 606 -410 42 682 -601 78 555
3193 555 -609 324 247 -263 100 68 -20 64 -66 385 -316 -303 710 -750 -184 690 -696 43 597 -635
3213 -635 274 23 -125 -77 -66 291 -339 -102 555 -640 -100 591 -734 150 398 -686 165 224 -322 59
3233 59 -156 159 -309 -119 548 -829 -120 672 -772 152 571 -724 316 88 -491 89 -45 97 -240
3252 -240 23 472 -559 -82 763 -609 89 724 -907 373 388 -479 338 -133 -3 -26 -154 332 -595
3271 -595 -180 643 -712 324 593 -874 236 718 -465 203 238 -99 149 48 246 -275 -158 602 -657
3290 -657 43 729 -722 243 476 -625 205 202 -226 21 162 82 -146 -95 426 -555 -235 569 -642 158
3310 158 432 -790 296 231 -335 167 -180 -67 -139 -201 286 -554 -49 516 -707 77 248 -752 359
3329 359 339 -480 110 -75 -143 61 23 303 -390 -177 468 -733 -61 556 -680 370 443 -579 231 118
3349 118 -212 62 -169 272 -243 -17 378 -455 160 365 -711 479 344 -611 321 96 -186 177 129 -57
3369 -57 -39 -266 381 -393 9 748 -712 156 386 -758 357 244 -330 340 41 -124 31 -135 378 -332
3389 -332 -51 552 -553 153 353 -770 401 426 -536 301 -9 -97 182 -219 172 -372 -290 362 -390 93
3409 93 357 -920 105 74 -705 304 -110 -110 54 -144 65 -206 -63 261 -676 105 343 -631 -11 231
3429 231 -681 419 -32 -359 124 -56 -38 140 -242 115 -109 -114 572 -525 159 455 -528 483 74 -370
3449 -370 389 -15 -18 188 -76 254 -191 -91 332 -383 308 384 -408 310 198 -473 394 -87 -259 194 -216
3470 -216 148 -96 -178 468 -482 6 262 -717 303 281 -569 505 148 -264 176 -122 143 5 -217 164
3490 164 -404 -42 333 -625 254 83 -510 380 26 -395 416 -338 -229 268 -237 263 -227 -54 313 -479
3510 -479 142 278 -531 286 32 -478 580 -182 -225 110 -230 251 -53 -190 609 -344 -70 390 -621 389
3530 389 167 -233 278 -91 -161 310 -432 263 -12 -331 320 -241 157 291 -428 239 162 -423 312 -211 -190
3551 -190 337 -254 79 286 -434 398 -334 -169 450 -515 188 230 -439 337 -86 -251 443 -231 -33 157
3571 157 -383 262 -250 -214 488 -233 121 152 -520 441 61 -349 312 -185 -59 321 -219 238 99 -311 333
3592 333 -333 -20 274 -318 146 128 -332 383 -227 -9 350 -430 22 63 -438 450 -313 -121 521 -370 62
3613 62 189 -354 269 -322 -197 318 -293 137 288 -299 350 -129 -315 287 -249 69 272 -218 441 -94
3633 -94 -226 270 -450 161 317 -532 339 131 -190 394 -346 -172 431 -82 353 -15 -199 448 -155 -156 347
3654 347 -401 343 -40 -447 425 -350 -131 263 -331 251 -8 -298 365 -383 2 192 -558 233 -56 -541
3674 -541 413 -52 -172 383 -425 65 1 -236 185 -197 -268 186 -348 158 46 -453 218 -153 -474 406 -221
3695 -221 -116 358 -164 298 -7 -178 200 -557 161 361 -605 387 -75 -429 485 -351 -80 367 -215 282
3715 282 -144 -27 279 -414 122 355 -383 292 67 -348 437 -144 -62 178 -294 19 92 17 190 -38 14
3736 14 393 -345 215 88 -654 638 -116 -247 380 -224 10 305 -228 354 -136 -65 249 -512 180 297
3756 297 -371 475 -150 -410 508 -268 44 248 -301 126 -341 10 346 -547 97 101 -548 252 -8 -433 489
3777 489 -191 -248 210 -99 11 -8 -93 213 -549 115 189 -449 473 213 -314 572 -77 -326 368 -355 -63
3798 -63 -10 -103 297 -380 120 188 -423 368 208 -470 586 -153 -57 363 -177 -38 -21 -67 78 -27 45 281
3820 281 -468 46 194 -525 340 -35 -334 552 -248 -142 298 -204 67 99 -125 268 -420 178 122 -535 298
3841 298 -29 -472 472 -180 -272 402 -180 56 7 -234 215 -266 86 282 -540 505 42 -342 657 -107
3861 -107 -230 536 -277 -210 97 -289 126 -325 -29 61 -239 265 105 -553 648 -96 -400 501 -261 -142
3881 -142 188 -120 -3 -245 72 177 -506 186 67 -524 440 -132 -454 646 -377 -401 377 -199 20 62
3901 62 -147 309 -261 200 132 -314 523 34 -506 634 -209 -148 316 -160 -35 145 -81 280 -280 143 99
3922 99 -348 374 44 -369 529 -114 -307 495 -209 -11 156 -148 68 -203 -22 265 -500 338 125 -624
3942 -624 337 -266 -323 311 -385 -120 283 -284 -16 26 -118 193 -374 121 -14 -421 469 -246 -439 509 -182
3963 -182 -128 535 -339 136 82 -163 108 -355 -137 162 -676 467 -182 -391 468 -222 -233 535 -297 -188 228
3984 228 -188 100 -86 100 67 -404 245 18 -494 671 -3 -230 374 -285 64 286 -189 197 1 23
4004 23 261 -286 226 -78 -218 542 -141 -178 455 -221 -143 394 -336 151 111 -176 54 -252 118 52 -450 570
4026 570 -79 -435 380 -347 -87 318 -278 -51 46 -111 157 -264 118 96 -283 426 1 -175 405 -319 -292
4047 -292 319 -348 122 90 -388 51 -117 183 95 -347 425 14 -387 471 -281 -377 494 -146 121 308 -297
4068 -297 477 -95 -118 241 -359 267 -42 -276 426 -152 -242 526 -330 73 493 -51 -18 104 -59 312 -174
4089 -174 181 82 -391 435 -45 -244 548 -99 -281 389 -226 288 256 -182 171 -125 21 185 -323 -14 -16
4110 -16 -294 372 -81 -141 292 -399 62 89 -121 269 81 56 247 -260 172 115 -216 374 -21 -251 267 -330
4132 -330 10 215 -413 251 67 -127 179 -204 105 -8 -226 244 -239 -233 315 -318 47 352 -358 93 147
4153 147 -307 119 -251 -33 125 -311 180 52 -230 270 -176 -106 326 -328 121 22 -312 286 -70 -103 200
4174 200 -234 333 -39 -349 265 -202 -66 403 -424 -41 329 -185 323 -77 -277 257 -280 156 115 -257
4194 -257 326 -204 -251 446 -202 -55 -23 -320 331 -146 -259 269 -233 112 178 -318 273 34 -276 442 -331
4215 -331 -118 304 -370 192 32 -241 225 -101 -48 224 -279 25 -145 -278 333 -119 -156 266 -229 163 164
4236 164 -306 180 -259 -136 215 -252 50 -17 -372 388 -100 -151 43 -385 139 166 -246 341 -74 -245 191
4257 191 -341 52 285 -313 262 65 1 360 -331 -157 240 -233 452 42 -277 424 -350 141 121 -50 286
4278 286 138 -345 234 -361 -29 192 -250 122 26 -125 464 -204 -73 349 -344 237 66 -156 340 -75
4298 -75 100 131 -257 256 -30 -351 223 -260 -197 270 -454 124 165 -303 150 -180 -12 244 -355 185 -53
4319 -53 -318 162 -173 -284 371 -235 -65 200 -450 327 94 -157 299 -301 57 161 -287 346 -138 -278
4339 -278 389 -320 -116 171 -220 268 128 -322 180 -209 -52 188 -272 168 -44 -263 419 -67 54 542
4359 542 -278 218 250 -217 442 83 98 305 -221 267 -1 -162 408 -117 -237 293 -266 152 321 -390 301
4380 301 87 -195 351 -194 230 86 -344 295 -144 -103 347 -439 73 378 -534 157 -105 -124 179 24 140
4401 140 175 -344 257 -305 -99 192 -371 106 285 -325 120 -43 -269 113 -106 -98 216 -372 140 -132 -231
4422 -231 247 -403 73 402 -283 148 130 -351 233 -46 -130 284 -227 187 -2 -123 272 -255 105 366 -369
4443 -369 185 261 -230 410 -144 -103 307 -243 147 -43 -292 367 -187 -51 480 -257 153 276 -399 299 -55
4464 -55 -179 325 -218 3 164 -328 203 -232 -113 421 -310 -78 319 -391 211 107 -206 322 -202 -63
4484 -63 -62 -81 27 -148 -276 202 -284 86 443 -353 69 205 -407 18 -116 -59 142 -66 136 -48 -162 157
4506 157 -357 -130 344 -484 -6 309 -401 232 -7 -221 241 -222 163 35 -84 136 -77 -21 233 -256
4526 -256 106 411 -349 275 119 -387 206 -206 -18 102 -128 259 -25 -214 314 -184 -93 297 -432 208
4546 208 144 -246 441 81 -82 151 -131 20 9 -329 238 -343 75 278 -391 -3 241 -475 352 32 -319
4567 -319 261 -334 45 -122 -162 206 -374 -81 256 -334 58 277 -356 131 -50 -189 69 -179 68 -44
4587 -44 -133 123 -259 -204 408 -479 37 201 -447 283 48 -347 341 -90 -32 99 -120 222 -142 -86 269 -181
4609 -181 83 221 -462 151 199 -146 221 -20 -94 152 -81 110 -94 -83 234 -194 10 138 -421 213 60
4630 60 -371 247 -15 -62 253 -47 -58 65 -75 308 -173 90 245 -358 72 324 -353 257 14 -142 499
4651 499 -180 87 185 -113 191 -124 -185 243 -421 36 281 -484 361 97 -285 190 22 -184 135 -156 100
4672 100 -275 -191 342 -307 -84 226 -365 246 -21 -573 288 -75 -32 199 -107 114 -102 -126 233 -200 79
4693 79 220 -254 28 -29 -184 283 -104 -250 141 -215 147 20 -194 84 -133 -192 273 -306 179 163 -337
4714 -337 251 60 -192 288 -145 246 161 -223 174 50 -142 355 -375 40 406 -317 228 60 -225 363
4734 363 89 176 413 -274 208 19 -141 245 -257 252 307 -275 247 79 -327 244 -19 -186 221 -230 -51
4755 -51 -221 -316 225 -329 -122 292 -384 136 -10 -288 204 -117 -310 240 -176 -216 181 -241 223 -3 -93
4776 -93 197 -263 273 209 -343 419 77 -151 244 -108 -134 117 -142 43 -145 -130 112 -223 17 275 -313
4797 -313 154 43 -289 331 -242 -113 84 -369 146 -30 -227 284 -84 -100 138 -346 165 122 -216 506 28
4818 28 130 421 -437 241 -58 -226 300 -52 105 369 -274 194 152 -190 384 -140 -127 296 -183 78 267
4839 267 -405 265 -224 -102 215 -205 1 26 -389 236 -69 -306 251 -228 80 104 -424 219 -48 -140 96
4860 96 -200 -35 -5 -280 362 -132 -274 183 -164 90 131 -280 181 -53 -299 294 -278 -10 29 -366 234
4881 234 149 -175 376 -75 -79 142 -448 82 144 -248 425 -284 -117 250 -243 100 212 -194 300 7 -150
4902 -150 371 -335 161 16 37 310 -61 -168 371 -75 135 168 -169 241 -35 -329 93 -242 34 178 -173
4923 -173 177 -17 -179 251 -221 -85 138 -157 53 26 -253 98 -168 -106 130 -345 135 -177 -450 336 35
4944 35 -191 282 -293 64 -119 -213 184 -160 -16 142 -434 20 97 -310 262 -29 -146 211 -290 -67 179
4965 179 -275 250 -9 -97 255 -182 159 -21 -264 269 123 -157 241 -108 22 233 -1 259 -78 -157 450
4986 450 -129 194 287 -227 236 -29 -116 330 -194 -129 207 -163 117 129 -121 85 -266 2 232 -179 250
5007 250 131 -237 409 -166 -226 247 -480 91 82 -287 157 -219 104 181 -434 263 201 -267 327 -59 -101 183
5029 183 -372 39 163 -200 200 17 -141 201 -136 122 75 -292 251 -172 -133 243 -272 -100 168 -289 314
5050 314 -93 -101 58 -191 4 31 -415 224 26 -165 290 -142 4 157 -80 194 -18 -216 323 -118 71
5071 71 266 -339 24 46 -91 415 -167 -12 192 -157 72 -27 -210 278 30 -60 126 -232 137 175 -156 234
5093 234 -41 -126 344 -192 0 155 -156 139 -90 -43 205 -108 168 198 -263 201 -131 -163 252 -221 -133 243
5115 243 -293 159 16 -143 179 -40 122 68 -355 213 -80 -227 313 -168 -276 154 -230 163 16 -224
5135 -224 59 -118 8 192 -330 111 -22 -109 377 -238 -44 170 -162 20 221 -247 206 -73 -267 194
5155 194 -148 5 204 -268 268 -172 -183 202 -192 -61 153 -311 235 263 67 323 -112 232 67 -296 439
5176 439 -32 -300 273 148 -103 100 -335 -38 -4 -234 214 -65 -1 136 -110 179 -30 -215 231 6 -90
5197 -90 220 -285 55 89 -49 139 32 36 26 -95 102 -66 -351 239 -175 -229 214 -204 -137 -74 -232 220 -44
5220 -44 -122 245 -368 162 6 -279 407 -149 -136 265 -65 -60 370 -245 51 1 -138 149 -231 107 113 -61 332
5243 332 -90 -133 288 -192 23 167 -69 127 214 -100 158 -14 -111 40 -258 229 61 -184 234 -216 -340
5264 -340 208 -157 247 333 -90 67 -49 -76 213 -43 72 -185 -228 184 -99 45 304 -75 70 161 -401
5285 -401 186 -162 -113 66 -288 -49 66 -148 99 -48 -215 214 -197 36 -34 -239 147 -89 10 295 -208
5306 -208 -53 77 -272 95 20 -14 173 -17 21 328 -164 56 18 -10 212 -39 13 30 -128 193 18 -199
5328 -199 266 -65 -83 271 -109 117 155 -179 -4 115 -29 184 -146 -19 127 -297 129 -70 127 78 -161
5349 -161 111 207 0 349 107 -124 191 -46 -110 154 -71 92 -17 -175 252 -137 -57 147 -102 101 -13
5370 -13 -122 130 -51 -74 -17 -50 270 -123 -153 298 -125 -2 155 -255 15 60 0 -64 -169 28 18 -223 51
5393 51 -5 -168 398 -399 -113 189 -267 23 -47 -84 74 46 -49 228 -176 74 196 -11 316 -152 145 190
5415 190 -97 39 306 -203 238 38 -110 148 -185 5 27 -34 80 33 -78 135 -138 309 235 -147 308
5436 308 107 68 262 -179 44 265 -77 106 116 8 -8 -52 7 102 -181 31 136 -131 259 26 34 200 -186
5459 -186 67 -170 -113 103 -91 -106 5 -121 58 236 -280 224 -44 -14 -8 -161 43 127 -210 150 -128 -214
5481 -214 161 -130 57 159 -152 71 7 -5 104 -102 -107 136 -9 171 -129 -227 118 -2 -51 212 -56 66
5503 66 -15 -178 169 -132 21 74 -59 -33 77 -159 245 -30 -311 87 -233 -3 28 -195 180 -104 -40 166
5525 166 -260 -119 194 -166 -136 27 12 151 -187 84 109 -102 151 -187 -103 1 -209 102 62 -173 66 41
5547 41 -109 100 95 -20 -45 -329 3 1 -99 112 -85 37 213 -215 95 71 -80 191 -93 -177 135 -180 180
5570 180 72 -135 81 -218 -10 51 -142 15 67 31 138 -176 -71 1 -100 124 26 -227 96 -117 75 168
5592 168 -126 -30 -30 -103 12 -28 -26 425 -26 81 109 -69 123 17 11 132 -137 -20 -22 -266 149 -11 -97 118
5616 118 -114 98 5 -92 58 66 -120 24 -18 90 122 -128 134 80 -130 160 55 11 50 -314 -68 -16 -97 122
5640 122 -130 45 118 -186 -35 69 -9 136 -190 -49 150 -141 96 10 -85 83 -205 -35 220 -247 71
5661 71 -85 -50 93 -214 -23 150 -191 23 13 -67 177 -172 0 120 -203 71 113 -153 -89 -16 -86 141 -58
5684 -58 48 -113 -142 67 -38 11 241 -103 88 146 -165 79 93 -44 233 -72 -24 276 -162 38 -91 -106
5706 -106 143 -159 -55 129 -168 -61 141 -135 64 -34 -11 148 -160 116 113 -191 126 -153 -102 -20 -130 2
5728 2 130 -191 -21 -140 -143 162 -62 47 23 -113 71 75 -108 30 -32 -172 -32 -196 143 173 -210 42 -195
5751 -195 -27 -81 -175 82 -211 2 195 -234 7 47 -256 253 -6 -131 140 -162 -115 159 -32 -93 15 -252
5773 -252 135 -5 -36 -14 -190 31 46 -73 299 -67 -33 157 -240 8 29 -92 100 -48 20 -58 -150 11 188
5796 188 -32 -28 100 -65 59 -46 -35 139 -233 134 -61 -155 270 -395 28 126 -274 42 -70 -150 76 -217
5818 -217 52 66 -110 -9 195 -146 215 -39 -13 111 -190 105 -1 -181 69 14 -114 -88 -115 67 33 -108
5840 -108 147 -21 -139 106 -214 122 -47 -70 271 -146 -156 88 -253 103 93 -95 61 -156 -72 44 -102
5861 -102 125 -45 -52 221 11 -61 73 -194 117 160 -211 178 -142 13 122 -116 25 220 -63 162 -64
5882 -64 -250 93 -43 14 -25 -68 0 54 107 263 -69 -91 206 -123 -35 161 -170 205 135 -158 191 -140 109
5905 109 -79 -173 100 128 107 48 -372 -35 -28 -261 90 -161 -142 95 -7 70 176 -120 -43 -42 -85 109 -83 50
5929 50 97 -193 100 99 -30 190 -182 -237 189 -133 181 84 -6 -15 -62 99 150 -73 209 -91 -7 22 -113 -75 -46
5954 -46 -155 18 21 -5 150 -72 15 0 48 18 33 -220 131 -13 112 159 -211 -29 262 -123 -6 -35 47 32
5978 32 -296 128 -19 -202 33 89 -110 51 -39 -53 77 2 -92 -86 -141 28 -15 7 228 -272 97 104 -64 82
6002 82 5 -85 222 -170 43 0 3 84 40 -148 24 3 76 47 -200 197 -80 16 229 -76 59 95 -92 198
6026 198 35 -26 178 -158 -16 120 -141 229 -25 -198 180 -129 140 91 -93 -74 21 8 205 65 67 -76
6048 -76 -225 -8 10 -102 153 11 103 60 -72 -22 44 23 66 -245 168 9 -240 -27 -145 30 143 111 4
6071 4 207 -90 21 113 -35 179 -81 -27 -7 -32 54 34 -195 30 -147 -144 11 -253 115 -207 -189 143 -125 -64
6095 -64 -19 19 8 140 -182 264 -11 34 60 -168 -83 -9 -38 19 -191 -94 153 -120 43 220 -240 152 29 -271
6119 -271 47 -199 -36 80 -92 -102 -103 -154 30 -138 -102 36 -70 60 -50 -20 -88 -65 -38 147 -148 49 8
6142 8 -94 176 -70 -47 186 67 -38 -55 -16 137 -7 -80 19 -83 18 207 -237 251 -123 -148 166 -35 104
6165 104 227 -148 213 -130 -71 131 -66 -28 -68 -67 223 166 -117 185 -42 -173 32 -14 237 -33 -70 191 -15
6188 -15 63 162 -190 44 81 -85 272 -71 74 133 -89 -53 -92 -115 107 -91 -52 139 18 93 -1 -74 147 64
6212 64 -99 87 -193 -66 159 -43 115 -176 -110 128 -58 70 8 -73 116 53 -54 271 61 93 146 -108
6234 -108 -25 15 -6 -97 -189 76 -115 -77 -60 -214 14 118 8 4 43 20 94 113 147 281 -153 25 160 -114 62
6259 62 -2 -53 -41 -160 -19 193 -290 138 -31 -43 172 -55 1 -87 -131 -64 89 -201 -44 -156 -34 121 -78
6282 -78 -2 -80 -67 -57 -24 -87 159 30 56 103 -37 -6 -75 -301 109 -107 -176 113 -254 54 2 -132 -24 -163
6306 -163 21 30 -180 4 76 -71 196 10 147 92 -243 -113 -172 -10 155 45 144 221 -91 -231 -12 -261
6328 -261 -37 -124 33 120 -12 94 75 107 60 4 -50 49 -106 -45 -71 -67 147 -18 -149 26 -93 -60 -53 13 176
6353 176 -33 -192 96 -127 119 120 -94 -3 74 -178 16 14 -5 78 -64 -126 4 -46 14 -91 22 13 -35 54 7
6378 7 -157 296 -13 7 10 20 110 1 -47 -62 -51 58 46 -131 112 -35 -68 162 -9 -241 169 -198 -178 -35
6402 -35 -17 203 -186 110 27 4 -91 75 28 -129 -86 49 172 -114 -15 67 0 76 -54 122 54 -102 112 185
6426 185 -50 97 42 -44 85 148 -71 -5 -86 29 -55 -215 29 3 -77 -139 -87 98 148 0 108 -24 3 -31
6450 -31 -215 49 43 -44 30 7 118 -24 -133 146 126 -91 138 163 32 -96 -208 -1 -73 -167 95 106 -85 62
6474 62 -84 212 4 -97 48 96 -99 -35 -153 -86 61 -177 47 -138 -93 63 -22 74 9 80 63 -101 -113 118
6498 118 -117 -82 12 -126 24 117 -85 191 -83 -149 -14 -49 25 -71 -56 135 146 1 43 -143 3 85 0 45
6522 45 -100 -11 170 -80 -21 -45 -20 -4 184 -59 36 6 79 -46 60 -41 -159 -21 70 -118 127 20 -193
6545 -193 179 143 -48 96 -63 -155 -88 -147 98 -59 -62 3 -10 74 157 -58 11 -82 -78 85 25 4 134 -116 -35 -59
6571 -59 -56 5 70 -98 -108 -45 50 -74 -22 29 -114 177 -26 10 -100 -6 -30 76 -147 -31 42 -76 133 76 -263
6596 -263 117 -124 -131 215 41 120 -59 -131 66 128 -148 13 -254 71 159 -169 102 -152 23 -35 -159 28
6618 28 278 -138 28 229 86 132 8 285 66 -50 179 4 -46 215 63 102 189 -99 -6 32 -48 47 34
6641 34 -128 212 -90 -81 -127 -43 -90 -129 28 165 -170 -12 8 -158 157 -20 22 74 -128 -29 169 -99 -90 -157 -120
6666 -120 134 -192 84 41 25 208 16 -66 63 40 50 62 -102 118 67 -12 186 -160 -46 69 -105 84 -20
6689 -20 23 48 22 6 31 106 216 -144 -94 -40 -8 299 88 20 21 -142 -41 60 54 39 25 -35 20 -43 60 86 -55
6716 -55 -99 -116 -6 28 -102 22 93 61 -14 28 -115 71 111 -298 34 -21 -140 15 -117 -204 100 -171 165 -186
6740 -186 -137 -100 -109 45 56 -125 126 8 -54 106 -30 -106 87 -90 -22 -57 -233 45 -93 117 -107 -185 102
6763 102 -6 -116 32 -86 273 -113 125 82 76 -86 35 -154 -136 131 -136 -11 78 -46 165 -1 -12 -143
6785 -143 26 -37 -63 -141 -10 36 -67 295 24 -83 -92 40 -140 -30 -17 61 -68 2 -58 -47 67 43 5 23 -1
6810 -1 -57 153 -119 25 -12 -145 -64 -67 1 95 -112 12 162 22 -110 8 -269 123 29 -17 55 78 116 84 -111
6835 -111 125 -90 91 -4 -122 132 -71 -18 90 -52 34 5 -108 8 99 -106 9 -44 -4 -51 79 -60 -49
6858 -49 59 98 -130 59 -33 -218 61 61 20 126 -28 51 29 -25 21 20 -70 23 -90 49 -60 -23 6 107 23 100
6884 100 -26 -29 -11 -78 -16 170 -25 258 87 -57 98 -188 -21 -17 -184 -62 -59 0 18 -10 45 -155 -119 82 64
6909 64 60 62 -169 91 11 -13 -56 0 28 18 -80 -149 -45 -86 143 27 19 81 -148 -145 89 -71 33 -41 -182 49 -49
6936 -49 -47 58 -56 83 -5 -58 -8 -24 -78 56 -6 -68 84 -4 161 -61 133 92 -60 94 12 14 80 19 52 76
6962 76 6 84 -24 -154 30 110 -67 0 -91 148 95 10 -83 -102 -72 -42 10 -196 29 -81 99 87 -68 78 -157
6987 -157 -11 -86 205 117 37 -27 28 -181 -32 4 148 77 2 -69 -130 134 15 183 -92 26 -126 -105 -79 -58
7011 -58 208 -17 36 143 -69 -160 146 76 24 227 -141 -43 -23 -52 77 -82 35 50 161 -109 135 -203 97
7034 97 -101 56 -40 -116 21 210 27 189 86 -136 12 63 15 -103 12 136 4 22 107 -91 -8 -80 -73 194
7058 194 47 -202 168 92 80 9 -282 109 240 41 179 -14 6 -65 61 12 31 -44 41 37 37 19 -55 18 7 58
7084 58 -50 44 -131 -6 27 12 -33 -68 -21 51 -98 65 -97 -12 -5 -154 20 -46 -78 -50 59 -75 27 -173 -92
7109 -92 -44 -30 -11 -61 -88 5 77 9 9 -85 -68 -16 101 10 -149 107 -151 -5 113 -74 87 -21 -118 -117 111 -52
7135 -52 -13 -87 -55 188 47 -49 99 -32 238 -106 -15 105 -202 -153 14 -36 167 -48 -38 59 -27 -12 109 14
7159 14 24 -39 18 65 54 147 -155 -34 44 77 35 -6 -178 -30 34 -87 64 -114 -194 58 -144 64 57 1 50 29
7185 29 -119 -118 6 -40 -195 1 43 -19 0 123 38 67 -124 -7 2 209 70 105 -144 64 -143 -39 143 -49
7209 -49 55 20 -69 25 -69 -12 -63 33 -17 42 -63 -17 -16 -68 -45 -115 42 -128 -59 48 14 23 84 87 -42 48 66 41 -19
7238 -19 -85 139 -15 -65 131 -7 -16 -50 21 129 10 -145 -13 -60 68 -96 -27 -138 109 63 9 106 -74 69
7262 69 76 -107 122 -33 -39 33 -46 289 172 169 133 121 -84 154 -16 206 -18 32 -42 -99 45 -123 44 -39 -48 -82
7288 -82 -114 -12 -129 -129 -4 -122 111 -56 300 -67 -45 31 -204 80 146 -168 8 78 -51 -88 9 63 80 27
7312 27 151 28 270 51 -21 88 -16 36 -7 155 -74 63 -34 29 74 -163 21 -72 -191 -62 37 -7 62 -42
7336 -42 27 -30 -115 67 -26 -88 49 -30 91 -108 -188 28 -167 80 -146 -62 -24 -149 -107 59 36 35 198 -55 25
7361 25 -8 -104 109 -183 116 27 23 91 -13 -58 -33 -186 9 30 122 -126 -39 -12 7 174 -23 47 14 -49 -22 -21 54
7388 54 -87 100 74 -227 137 10 -7 33 -105 3 233 10 -73 235 -57 70 68 108 -127 104 -109 8 -129
7411 -129 48 28 -217 94 -43 -96 61 -121 39 87 -14 133 -28 -28 33 -234 48 73 -27 -34 -127 -182 16 47
7435 47 152 -16 -187 61 -24 -147 -150 156 -56 17 -125 -50 136 -76 -45 66 -66 9 -100 -55 43 -97 40
7458 40 -105 6 49 -129 -85 -18 -71 134 -70 -48 -121 -114 186 106 78 96 -105 25 -46 73 20 38 -93 71 -21
7483 -21 -17 52 101 28 -80 -270 80 50 17 73 -128 90 18 42 118 66 -7 216 190 -53 -144 -41 -21 28 80 -70
7509 -70 34 157 151 -75 128 24 -59 7 56 -34 240 -98 111 -101 -76 -180 27 -151 64 -44 -58 89 -31
7532 -31 16 27 4 19 -137 -14 -7 -109 78 42 -98 -94 18 -20 102 132 -68 175 -70 -40 -65 -208 171 -41 -26
7557 -26 -4 -129 -110 31 -26 108 -41 65 -105 -120 15 17 23 -36 -41 103 -49 -173 15 73 -100 119 -7 -100 -8
7582 -8 83 103 -91 1 183 -50 55 153 96 57 95 -10 -75 -44 94 30 69 -40 5 61 31 -120 -115 -48 -168 46
7608 46 52 -157 -94 -82 5 -70 -41 46 53 -94 116 -35 65 -2 -180 90 -17 53 85 20 53 -89 -173 100 -103 69
7634 69 77 -208 69 159 9 -70 51 18 -50 23 28 13 -119 51 -64 -68 -19 -92 -14 6 -157 43 28 113 2 8 66
7661 66 12 -13 53 -79 -106 106 32 -28 187 -156 167 32 198 -116 -124 -19 -26 35 70 -63 1 -60 92 218 0
7686 0 -85 -56 71 -137 74 -80 -79 28 -50 96 -275 -2 14 -28 5 -82 -273 42 156 42 4 -59 26 34 -131
7711 -131 261 18 10 -28 145 -6 -59 -117 -33 180 -23 -82 186 58 3 -6 -72 3 -75 -112 209 -106 189 98 70
7736 70 37 -21 50 -118 -62 87 3 12 111 -32 171 122 -260 162 -102 -168 -16 -129 207 -160 -86 -140 2 -134
7760 -134 110 99 12 162 -35 25 87 99 87 0 -67 115 24 3 -9 39 160 -81 93 150 -90 -93 -95 -10 62 243
7786 243 118 44 121 -76 82 -72 -127 -79 -226 176 -90 -130 80 -10 34 -24 -14 -179 -33 -50 127 -41 -14 -113
7810 -113 -59 0 9 -33 -11 -41 35 51 -43 9 -78 -31 39 -93 41 0 -75 -94 -100 -102 115 76 84 122 -95 -54 11 -9 88 8
7840 8 19 -91 -81 19 -66 126 -49 -177 111 -130 22 -33 -56 -116 211 -53 -8 202 -93 62 35 26 64 -80
7864 -80 50 1 -47 30 -164 113 -127 -63 40 -20 -196 -1 -32 27 85 27 72 70 57 -24 142 -94 -24 -11 126 43
7890 43 -13 -19 41 -179 18 -1 9 -72 -70 43 -64 -36 -63 -75 -222 181 -73 42 51 12 12 21 -64 84 -99 -18 108
7917 108 -8 48 -111 -65 72 -16 92 -24 -82 129 89 -239 -38 6 105 -10 44 44 139 -40 156 -21 24 -107
7941 -107 -83 2 -143 2 107 153 0 98 -67 -109 -124 56 -44 -29 58 132 -55 83 42 134 4 -17 99 126
7965 126 -64 -120 -245 -78 3 -28 23 78 50 105 168 -28 9 -139 -137 4 -75 16 -126 -69 108 61 39 -54 -232 -56
7991 -56 100 -145 -46 207 -99 -3 -45 -72 -24 -33 34 25 -83 -123 -19 204 -82 -131 -43 -31 18 111 -46 7 171 -120
8017 -120 52 -97 -143 161 120 108 65 -110 21 137 -6 3 -85 -70 43 -10 6 49 22 109 49 54 67 156 -27 257
8043 257 -33 139 -28 45 4 -83 87 -57 -6 45 58 39 67 92 -95 -151 -48 -86 217 -23 -6 21 17 32 39 92
8069 92 -24 -61 73 -90 -29 23 -122 61 -84 -107 -27 -112 -41 70 -122 52 -221 33 -44 190 103 -43 134
8092 134 78 30 83 313 -107 -33 -5 -250 -25 95 -89 -66 22 19 -30 -266 79 45 -8 -59 -63 -72 81 -70 117 -6
8118 -6 70 25 83 -53 71 -104 1 -16 -32 124 -71 73 -67 -16 -17 39 -85 174 -164 18 32 -106 160 11
8142 11 16 -45 -11 -117 70 100 22 -78 18 19 108 -154 73 34 -37 157 -65 10 106 24 45 96 -71 237 -84 -212
8168 -212 58 -92 163 -36 -38 -38 -154 -44 -134 -104 30 23 1 60 39 -58 20 -36 -6 8 169 162 64
8191F4
##END NTUPLES=NMR FID
##END=
