##TITLE=1H_61-2023
 CDCl3
 8 sc, 
 31.8.2023
##JCAMPDX= 6.0         $$ Bruker NMR JCAMP-DX V2.0
##DATA TYPE= NMR FID
##DATA CLASS= NTUPLES
##ORIGIN= UXNMR, Bruker Analytische Messtechnik GmbH
##OWNER= root
$$ XWIN-NMR		Version 3.5
$$ Thu Aug 31 14:28:24 2023 Russian Standard Time (UT+4h)  she@DPX200
##.OBSERVE FREQUENCY= 200.13135
##.OBSERVE NUCLEUS= ^1H
##.DELAY= (6, 6)
##.ACQUISITION MODE= SIMULTANEOUS
##.ACQUISITION SCHEME= undefined
##.AVERAGES= 8
##.DIGITISER RES= 18
##SPECTROMETER/DATA SYSTEM= spect
##.PULSE SEQUENCE= zg30
##.SOLVENT NAME= CDCl3
##.SHIFT REFERENCE= (INTERNAL, CDCl3, 0, 15.7039)
##AUDIT TRAIL= $$ (NUMBER, WHEN, WHO, WHERE, WHAT)
$$ ##TITLE= Audit trail, XWIN-NMR		Version 3.5
$$ ##JCAMPDX= 5.01
$$ ##ORIGIN= Bruker BioSpin GmbH
$$ ##OWNER= she
$$ F:/spectra/data/she/nmr/H-F/1/audita.txt
$$ ##AUDIT TRAIL=  $$ (NUMBER, WHEN, WHO, WHERE, WHAT)
(   1,<2023-08-31 14:27:21.54 +0400>,<she>,<DPX200>,
      <created by zg, POWCHK disabled, PULCHK disabled
       configuration hash MD5:
       00 E9 B6 7A A2 85 ED C7 34 08 36 98 17 FE 4E 26
       data hash MD5: 16K
       E6 E6 63 8F 20 D3 7F 24 89 DE 8B 9D 1C 52 0E B9>)
$$ ##END=
$$ 
$$ hash MD5
$$ 77 FA 21 4D DC 5F 03 49 2E 83 0B 67 44 E1 0C 6A
##$RELAX= 
##$RELAX= 
##$RELAX= 
##$RELAX= 
##$RELAX= 
##$RELAX= 
$$ Bruker specific parameters
$$ --------------------------
##$DU= <F:/spectra>
##$EXPNO= 1
##$NAME= <H-F>
##$PROCNO= 1
##$TYPE= <nmr>
##$USER= <she>
##$AMP= (0..31)
100 100 100 100 100 100 100 100 100 100 100 100 100 100 100 100 100 100 
100 100 100 100 100 100 100 100 100 100 100 100 100 100 
##$AQSEQ= 0
##$AQ_mod= 1
##$AUNM= <au_zg>
##$AUTOPOS= <>
##$BF1= 200.13
##$BF2= 200.13
##$BF3= 200.13
##$BF4= 200.13
##$BF5= 200.13
##$BF6= 200.13
##$BF7= 200.13
##$BF8= 200.13
##$BYTORDA= 1
##$CFDGTYP= 0
##$CFRGTYP= 5
##$CHEMSTR= <none>
##$CNST= (0..31)
1 1 145 1 1 1 1 1 1 1 1 1 1 1 1 1 1 1 1 1 1 1 1 1 1 1 1 1 1 1 1 1 
##$CPDPRG= <>
##$CPDPRG1= <>
##$CPDPRG2= <>
##$CPDPRG3= <>
##$CPDPRG4= <mlev>
##$CPDPRG5= <mlev>
##$CPDPRG6= <mlev>
##$CPDPRG7= <mlev>
##$CPDPRG8= <mlev>
##$CPDPRGB= <>
##$CPDPRGT= <>
##$D= (0..31)
0 1.2 0 0 0 0 0 0 0 0.06 0 0.03 0 0 0 0 0.0002 0 0 0 0 0 0 0 0 0 0 0 0 
0 0 0 
##$DATE= 1693477641
##$DBL= (0..7)
120 120 120 120 120 120 120 120 
##$DBP= (0..7)
150 150 150 150 150 150 150 150 
##$DBP07= 0
##$DBPNAM0= <>
##$DBPNAM1= <>
##$DBPNAM2= <>
##$DBPNAM3= <>
##$DBPNAM4= <>
##$DBPNAM5= <>
##$DBPNAM6= <>
##$DBPNAM7= <>
##$DBPOAL= (0..7)
0.5 0.5 0.5 0.5 0.5 0.5 0.5 0.5 
##$DBPOFFS= (0..7)
0 0 0 0 0 0 0 0 
##$DE= 6
##$DECBNUC= <off>
##$DECIM= 32
##$DECNUC= <off>
##$DECSTAT= 4
##$DIGMOD= 1
##$DIGTYP= 9
##$DL= (0..7)
0 120 120 120 120 120 120 120 
##$DP= (0..7)
150 150 150 150 150 150 150 150 
##$DP07= 0
##$DPNAME0= <>
##$DPNAME1= <>
##$DPNAME2= <>
##$DPNAME3= <>
##$DPNAME4= <>
##$DPNAME5= <>
##$DPNAME6= <>
##$DPNAME7= <>
##$DPOAL= (0..7)
0.5 0.5 0.5 0.5 0.5 0.5 0.5 0.5 
##$DPOFFS= (0..7)
0 0 0 0 0 0 0 0 
##$DQDMODE= 0
##$DR= 18
##$DS= 0
##$DSLIST= <SSSSSSSSSSSSSSS>
$$ [...]
##$SUBNAM2= <"">
##$SUBNAM3= <"">
##$SUBNAM4= <"">
##$SUBNAM5= <"">
##$SUBNAM6= <"">
##$SUBNAM7= <"">
##$SUBNAM8= <"">
##$SUBNAM9= <"">
##$SW= 18.05172834244
##$SWIBOX= (0..15)
0 0 2 0 0 0 0 0 0 0 0 0 0 0 0 0 
##$SW_h= 3612.71676300578
##$TD= 16384
##$TD0= 1
##$TE= 0
##$TE2= 300
##$TE3= 300
##$TEG= 300
##$TL= (0..7)
0 120 120 120 120 120 120 120 
##$TP= (0..7)
150 150 150 150 150 150 150 150 
##$TP07= 0
##$TPNAME0= <>
##$TPNAME1= <>
##$TPNAME2= <>
##$TPNAME3= <>
##$TPNAME4= <>
##$TPNAME5= <>
##$TPNAME6= <>
##$TPNAME7= <>
##$TPOAL= (0..7)
0.5 0.5 0.5 0.5 0.5 0.5 0.5 0.5 
##$TPOFFS= (0..7)
0 0 0 0 0 0 0 0 
##$TUNHIN= 0
##$TUNHOUT= 0
##$TUNXOUT= 0
##$USERA1= <user>
##$USERA2= <user>
##$USERA3= <user>
##$USERA4= <user>
##$USERA5= <user>
##$V9= 5
##$VALIST= <valist>
##$VCLIST= <CCCCCCCCCCCCCCC>
##$VD= 0
##$VDLIST= <DDDDDDDDDDDDDDD>
##$VPLIST= <PPPPPPPPPPPPPPP>
##$VTLIST= <TTTTTTTTTTTTTTT>
##$WBST= 1024
##$WBSW= 4
##$XGAIN= (0..3)
0 0 0 0 
##$XL= 0
##$YL= 0
##$YMAX_a= 242283
##$YMIN_a= -164420
##$ZGOPTNS= <>
##$ZL1= 120
##$ZL2= 120
##$ZL3= 120
##$ZL4= 120
##$ABSF1= 10
##$ABSF2= 0
##$ABSG= 5
##$ABSL= 3
##$ALPHA= 0
##$AQORDER= 0
##$ASSFAC= 0
##$ASSFACI= 0
##$ASSFACX= 0
##$ASSWID= 0
##$AUNMP= <proc_1d>
##$AZFE= 0.1
##$AZFW= 0.1
##$BCFW= 1
##$BC_mod= 2
##$BYTORDP= 1
##$COROFFS= 0
##$CY= 11.3945322036743
##$DATMOD= 1
##$DC= 2
##$DFILT= <>
##$DTYPP= 0
##$F1P= 15.7292609196834
##$F2P= 12.9074282941183
##$FCOR= 0.5
##$FTSIZE= 0
##$FT_mod= 4
##$GAMMA= 1
##$GB= 0.15
##$INTBC= 1
##$INTSCL= 1
##$ISEN= 128
##$LB= 0.24
##$LEV0= 0
##$LPBIN= 0
##$MAXI= 10000
##$MC2= 0
##$MEAN= 0
##$ME_mod= 0
##$MI= 1.114404
##$NCOEF= 0
##$NC_proc= 0
##$NLEV= 6
##$NOISF1= 3.799351
##$NOISF2= 2.8
##$NSP= 1
##$NTH_PI= 0
##$NZP= 0
##$OFFSET= 15.70392
##$PC= 1
##$PHC0= -21048.28
##$PHC1= 12.05272
##$PH_mod= 1
##$PKNL= yes
##$PPARMOD= 0
##$PSCAL= 0
##$PSIGN= 0
##$REVERSE= no
##$SF= 200.130013532006
##$SI= 16384
##$SIGF1= 3
##$SIGF2= 2
##$SINO= 400
##$SIOLD= 16384
##$SREGLST= <1H.CDCl3>
##$SSB= 0
##$STSI= 0
##$STSR= 0
##$SW_p= 3612.71676300578
##$SYMM= 0
##$S_DEV= 0
##$TDeff= 0
##$TDoff= 0
##$TI= <>
##$TILT= no
##$TM1= 0
##$TM2= 0
##$TOPLEV= 0
##$USERP1= <user>
##$USERP2= <user>
##$USERP3= <user>
##$USERP4= <user>
##$USERP5= <user>
##$WDW= 1
##$XDIM= 8192
##$YMAX_p= 0
##$YMIN_p= 0
$$ End of Bruker specific parameters
$$ ---------------------------------
##NTUPLES= NMR FID
##VAR_NAME=  TIME,          FID/REAL,        FID/IMAG
##SYMBOL=    X,             R,               I
##VAR_TYPE=  INDEPENDENT,   DEPENDENT,       DEPENDENT
##VAR_FORM=  AFFN,          ASDF,            ASDF
##VAR_DIM=   8192,          8192,            8192
##UNITS=     SECONDS,       ARBITRARY UNITS, ARBITRARY UNITS
##FACTOR=    0.0002768,     1,               1
##FIRST=     0,             0,               0
##LAST=      2.2672688,     0,               0
##MIN=       0,             -164420,         0
##MAX=       2.2672688,     242283,          0
$$ Real data points
##PAGE= N=1
##DATA TABLE= (X++(R..R)), XYDATA
0 0 0 0 0 0 0 0 0 0 0 0 8 -8 8 -8 9 -16 16 -24 27 -32 40 -48 56 -68 80 -96 107 -126 144 -166 188 -216 243
33 243 -275 312 -350 394 -442 491 -547 611 -677 752 -833 921 -1016 1122 -1235 1363 -1500
50 -1500 1653 -1820 2007 -2213 2448 -2710 3010 -3355 3755 -4229 4799 -5501 6390 -7551 9140
65 9140 -11462 15171 -22032 38863 -163978 -128714 242283 -38839 -73402 93462 73215 -111150
77 -111150 -83985 94246 -3016 -94578 146765 59558 -106985 -5226 -9697 -15523 39168 12329
89 12329 53967 -15986 -64725 18933 -8227 -11911 8750 3747 83088 -38753 -116890 50992
101 50992 19181 -34382 44555 2907 -10947 -14924 -20188 21270 -28709 16479 62848 -43390
113 -43390 4480 16701 -58361 37533 32383 -23126 22550 -12732 -5514 9870 -14556 21120
125 21120 -24456 -2455 58448 -57456 -26719 56877 -27732 -8969 10450 -19255 11050 -12559
137 -12559 12421 17482 -41914 20995 4934 -34820 43975 -1733 -17706 38008 -20276 -14432
149 -14432 5425 -4575 36233 -4611 -3296 20264 -50735 1264 32582 -27050 24315 16087
161 16087 -21504 -3541 -36951 3763 26232 -15150 32175 2033 -41075 2257 -20199 9224
173 9224 34192 -12554 27402 -765 -49040 11577 -1063 5736 39057 -1511 7416 -19119 -36935
186 -36935 26147 -4860 4607 46692 -21285 -15776 -5382 -33305 16617 10361 8668 26020 -32129
199 -32129 -13745 -2744 -28764 30817 17108 -4907 22106 -29309 -18309 10988 -13143 29522
211 29522 19141 -8961 10934 -28549 -8798 19143 -12520 29508 15339 -26746 7665 -17786
223 -17786 -13222 20943 -5562 16183 2596 -27048 9190 -16657 -8832 28265 -12123 6254
235 6254 8351 -27357 10345 -1931 -6807 24351 -9657 4046 7808 -21228 18152 445 -11439
248 -11439 25141 -12618 -4053 14891 -17176 10678 710 -14614 16854 -14323 -2832 17412
260 17412 -19145 7278 727 -21519 15133 -6160 -2104 19645 -16571 2129 704 -18578 19947
273 19947 389 -514 22793 -17835 -4965 4270 -13658 21591 5205 -2163 16704 -24980 -8912
286 -8912 10841 -12530 17623 8960 -7529 4817 -28099 -5275 14891 -13314 21974 11940
298 11940 -22316 -666 -14629 -2522 15435 -3721 24360 2815 -28204 7893 -9858 -4218
310 -4218 28160 2126 8789 -2773 -24734 7121 -7240 1458 29512 -7587 -900 -2546 -27971
323 -27971 6219 1801 2225 23773 -13025 -7917 -1967 -22806 12532 8648 -1840 19816 -11349
336 -11349 -10499 1077 -14156 18340 10181 -5111 18446 -14847 -14064 12688 -7644 9140 10205
349 10205 -5368 8200 -17610 -6861 14204 -14850 10866 13065 -20251 3409 -4119 -8539 10147
362 10147 -7575 7857 4787 -16476 12131 -4928 -10159 19522 -7361 -1003 10818 -11416 8188
375 8188 1468 -5962 12889 -11835 1297 13778 -14427 7999 4683 -13722 7685 -7737 -1762
388 -1762 10891 -11616 8562 484 -20411 9138 -2664 -3420 14623 -6683 3328 -2009 -16301
401 -16301 12896 -375 -1698 20502 -7568 -4343 437 -13138 12596 4272 553 16834 -14304
414 -14304 -8556 3674 -13087 11536 8290 -2752 9166 -17902 -9851 5946 -11068 14516 11116
427 11116 -10069 4220 -13995 -8612 9999 -4026 16186 8863 -13893 4475 -11623 -7055 17767
440 17767 -311 10298 6518 -16710 1500 -7171 -3653 17973 -2397 5115 2002 -20909 2268
453 2268 -2372 -4302 18355 -3602 -3122 581 -17395 4140 2237 -1488 17236 -6172 -5035 4402
467 4402 -14546 7149 8396 -2967 13224 -5802 -6560 5620 -10671 7574 7733 -6864 9880
480 9880 -7191 -8373 8211 -9583 4320 7217 -10601 6440 -4585 -7623 9115 -8178 2586
493 2586 6110 -11107 8235 -711 -6823 11661 -6810 -462 8149 -8870 7968 2820 -6267 9242
507 9242 -7736 -1827 8913 -8228 8317 3580 -10870 6106 -7789 -4693 10017 -5810 5618
520 5618 1756 -13150 4102 -6413 -3178 13610 -4462 3731 2422 -14089 4738 -473 -738 15170
534 15170 -3399 498 973 -13920 6354 2918 -240 15390 -6384 -5356 976 -13417 6208
547 6208 6141 -1411 10450 -9134 -8484 915 -10968 8845 8355 -4392 8065 -9614 -9862 5802
561 5802 -5534 9862 10145 -6185 4926 -8624 -7531 9555 -2523 9158 8723 -10214 2304
574 2304 -6493 -7189 11464 -1099 4630 5319 -12840 466 -4478 -5686 12213 -2372 454 4211
588 4211 -13347 1047 850 -4490 11757 -1681 -1549 4391 -10612 3766 3823 -4034 11557 -2701
602 -2701 -4210 6059 -8666 3071 5442 -5840 7921 -3347 -5598 6431 -7842 2002 4735
615 4735 -8344 5688 -2206 -5848 7771 -6656 -23 4910 -8498 5512 943 -4241 8568
628 8568 -5452 -994 5653 -7688 6621 4411 -4775 7401 -5057 -3443 5391 -6093 6335
641 6335 3976 -6777 5181 -6771 -6009 6836 -4876 4930 4420 -8993 2222 -5580 -4855 9088
655 9088 -2459 4546 4134 -10512 2326 -2825 -3115 12327 -457 2050 3023 -11329 1990 493
669 493 -1359 12411 -1956 -1631 1723 -12194 1908 3162 -1778 10557 -4154 -5772 641 -10564
683 -10564 3323 5769 -2273 8639 -4844 -6990 2808 -7417 5330 8692 -3059 6168 -4212
696 -4212 -7244 5186 -3751 5572 7694 -5250 3986 -4324 -7662 6690 -2562 3302 6654 -7910
710 -7910 673 -3026 -6364 7293 -2025 1060 5187 -8789 951 -563 -5876 8538 -815 -847 5282
725 5282 -7635 2073 2666 -4478 7968 -1173 -2643 5999 -6378 1527 3473 -5521 6333 -1769
739 -1769 -4590 5826 -5764 862 3616 -7346 3808 -1118 -4041 6677 -4741 -520 3970 -7575
753 -7575 3628 1194 -3351 7710 -3021 -1478 3608 -6948 4710 3980 -2898 7313 -3633 -3744
767 -3744 3730 -5923 4012 4662 -3848 5100 -5053 -6113 4017 -4671 4027 5099 -5801 2915 -4864
782 -4864 -5811 5933 -2534 3896 5750 -6726 1690 -3147 -4656 8534 -130 2934 5093 -8252
796 -8252 822 -1067 -3561 9297 -31 591 3169 -9701 -53 659 -2999 8809 -1029 -2907 1609
811 1609 -9295 490 3178 -2546 8259 -1252 -4648 2282 -7103 1848 5746 -2046 6635 -1744 -5393
826 -5393 3464 -4596 2620 6456 -3138 4410 -1857 -6275 4199 -3472 1523 5776 -5272 2177 -1666
841 -1666 -6068 4981 -2455 295 5265 -5870 1337 161 -5187 5921 -1178 -546 5134 -5522
855 -5522 1904 2248 -4648 6158 -778 -2098 5427 -4555 1616 3319 -5077 4160 -1494 -3691 5192
870 5192 -4100 616 2911 -6262 2658 -960 -3969 5886 -2601 -225 3238 -6422 2028 723 -2706
885 -2706 6726 -1694 -697 3398 -6259 2427 2980 -2426 6680 -1273 -3020 2585 -5592 1765 3816 -2634
901 -2634 5558 -2522 -5093 2408 -5171 1909 5040 -3425 3679 -2930 -5988 3396 -2861 2601 5735
916 5735 -3895 2286 -2803 -5375 5484 -869 2383 6032 -5097 413 -1156 -4492 5710 -25
930 -25 1517 4251 -7003 -442 -98 -4400 6060 264 -1371 2899 -6647 -778 1141 -3479 6278
945 6278 422 -2830 2729 -5797 -140 3668 -2067 5851 226 -3534 3417 -4315 265 4687 -2588
960 -2588 4073 -69 -4612 2867 -3190 372 4703 -3973 2204 -330 -5083 3475 -2255 -955 4374
975 4374 -4114 1477 780 -4738 4348 -791 -1277 4241 -4027 1431 2537 -3737 4081 -796 -2204 4765
991 4765 -3298 897 3120 -3947 3151 -772 -3707 3832 -2803 917 3189 -5007 1474 -847 -3865
1006 -3865 4356 -1741 185 3554 -5131 860 -90 -3396 5498 -360 -220 2976 -4766 845 1854
1021 1854 -2388 5665 -124 -1747 2727 -5376 6 2668 -2158 4923 -655 -3887 1679 -5062 368
1036 368 3664 -2672 3742 -955 -5050 1779 -3606 886 5091 -2057 2824 -1093 -4948 3353 -1467
1051 -1467 1206 5384 -2984 1482 -645 -4879 3464 -361 981 4818 -3990 -393 -427 -4484 4112
1066 4112 73 -716 3818 -4570 -1046 580 -4009 4045 875 -1491 3038 -4204 -770 2378 -2646
1081 -2646 4302 1257 -2493 3249 -3123 -538 3145 -2345 3135 754 -3345 2749 -2697 -649 3691
1096 3691 -3296 1599 471 -4054 2934 -1761 -1306 3153 -3383 1280 1145 -3578 3463 -866 -1649 3382
1112 3382 -3104 865 2541 -2890 3259 -152 -2150 3121 -2670 724 2630 -2815 2590 -386 -3168
1127 -3168 2635 -2512 241 3277 -3347 1178 -708 -3769 2972 -1369 194 3395 -3536 689 -131
1142 -131 -3501 3647 149 13 3413 -3464 84 736 -2453 4159 570 -857 2769 -3970 -526 1376
1158 1376 -2370 4069 553 -2319 1736 -4091 -1213 2285 -2067 3222 224 -3307 1530 -3322 -237
1173 -237 3587 -1352 3008 329 -4023 1911 -1749 182 4070 -1462 1681 108 -3967 2093 -926
1188 -926 -49 4073 -2450 331 339 -4327 1939 7 -393 3159 -2689 -302 689 -3459 2666 597 -1156
1205 -1156 3149 -2400 -876 1713 -2846 2650 1138 -1431 2679 -2169 -315 2458 -2516 2110 999
1220 999 -2239 2411 -1792 -969 2352 -2641 1355 585 -3070 2314 -1519 -1127 2473 -2740 461 1108
1236 1108 -2578 2559 -427 -1307 2670 -2486 460 1799 -2309 2603 134 -1924 2389 -2227 61
1251 61 2310 -1803 2176 83 -2681 1827 -1996 -200 2855 -2265 1195 -159 -3160 1748 -1366
1266 -1366 -64 3092 -2153 782 -108 -3136 2443 -105 191 3132 -2128 3 379 -2444 2744 680
1282 680 -280 2674 -2629 -811 830 -2440 2855 641 -1380 1927 -2960 -1090 1308 -1965 2521
1297 2521 691 -1935 1641 -2779 -776 2381 -1527 2301 759 -2494 1602 -1556 -438 2792 -788
1312 -788 1737 784 -2580 1346 -1023 -546 3047 -1603 651 400 -3004 1554 -537 -947 2704 -1675
1328 -1675 -85 612 -2770 1697 98 -1031 2815 -1804 -553 1354 -2189 1914 619 -944 2442
1343 2442 -1409 -388 1999 -1981 1506 646 -1829 2231 -1258 -752 2151 -2240 673 629 -2306 1966
1359 1966 -806 -963 2042 -2083 141 712 -2307 2040 -193 -1030 2263 -1955 -16 1573 -1696 2253
1375 2253 359 -1120 2004 -1888 -206 1813 -1384 1779 485 -1940 1273 -1795 -405 2053 -1533
1390 -1533 1298 136 -2688 1107 -1246 -305 2570 -1200 717 104 -2617 1524 -363 40 2830 -1291
1406 -1291 220 437 -2172 1513 214 -271 2440 -1655 -434 436 -2187 1903 622 -778 1787 -1997
1422 -1997 -1067 889 -1903 1596 792 -1429 1447 -1668 -888 1455 -1398 1697 1152 -1444 1425 -1387
1438 -1387 -707 1948 -976 1498 902 -2029 1097 -823 -819 1983 -1118 623 687 -2147 957 -789 -905
1455 -905 1893 -1199 19 618 -2135 1058 90 -1209 1880 -1149 -177 1135 -1662 1223 497 -1184
1471 -1184 2134 -921 -106 1651 -1527 1343 486 -1555 1428 -764 -509 1657 -1571 575 394 -1924
1487 -1924 1193 -423 -508 1710 -1726 88 556 -1819 1393 43 -638 1638 -1323 -92 993 -1418
1503 -1418 1533 538 -756 1456 -1414 -417 1156 -1190 1424 512 -1407 1136 -1549 -816 1418 -1203
1519 -1203 1132 463 -1894 784 -1248 -496 1813 -985 884 430 -2082 737 -684 -433 2176 -626
1535 -626 572 539 -1899 1018 -3 -281 2199 -772 -215 323 -2057 948 396 -376 1700 -976 -691
1552 -691 485 -1692 1019 571 -683 1566 -1239 -707 987 -1376 1350 1151 -896 1434 -1110 -764
1568 -764 1343 -993 905 1014 -1353 964 -672 -732 1535 -807 579 710 -1648 731 -418 -1072
1584 -1072 1574 -1016 84 758 -1566 720 -77 -778 1488 -837 -37 1155 -1362 976 401 -1127
1600 -1127 1369 -806 -354 1433 -1102 711 481 -1272 965 -671 -418 1263 -897 560 366 -1614
1616 -1614 800 -325 -424 1560 -948 157 176 -1579 1160 -120 -589 1732 -1054 -249 682 -1223 1187
1633 1187 477 -342 1421 -881 -395 623 -1100 1181 638 -866 1058 -1157 -638 852 -1053 816
1649 816 597 -1405 578 -1001 -726 1029 -684 775 628 -1409 788 -551 -526 1621 -522 660
1665 660 772 -1484 555 -153 -571 1641 -372 242 509 -1506 537 119 -472 1400 -756 -390 203
1682 203 -1728 521 259 -565 1187 -642 -503 730 -1231 800 633 -833 1229 -585 -472 1063
1698 1063 -934 869 915 -701 966 -326 -714 1029 -948 291 643 -1277 528 -318 -708 982
1714 982 -651 0 552 -1347 501 -26 -813 1088 -523 -214 800 -951 876 257 -583 1032 -321
1731 -321 -162 953 -670 682 459 -1005 778 -487 -432 892 -870 284 300 -1258 603 -434 -533
1748 -533 1190 -885 174 219 -1357 499 -161 -430 1201 -595 -60 466 -1318 634 379 -491 1223
1765 1223 -589 -265 391 -1174 767 508 -726 896 -804 -428 465 -1126 644 422 -715 565
1781 565 -925 -754 952 -735 808 555 -929 640 -535 -647 1172 -336 516 846 -874 531
1797 531 -65 -539 1254 -529 196 738 -1027 424 -158 -549 1069 -605 -133 406 -1219 223 217 -742
1815 -742 1052 -478 -424 500 -1079 490 618 -354 1101 -407 -293 883 -1024 407 390 -546 1016
1832 1016 -536 -490 877 -753 212 721 -880 527 -194 -519 928 -555 77 508 -938 548 -66
1849 -66 -580 1021 -522 -25 551 -894 666 299 -627 815 -560 -283 785 -764 595 392 -964
1866 -964 721 -541 -556 878 -673 349 545 -1057 558 -295 -493 811 -639 174 429 -1275 536
1883 536 -64 -463 981 -560 190 430 -1058 518 239 -278 1307 -358 -64 538 -947 665 373
1900 373 -619 1080 -406 -488 417 -996 443 534 -676 658 -528 -656 538 -1037 399 570 -770
1917 -770 881 -307 -586 561 -400 500 646 -729 458 -246 -438 736 -489 231 555 -929 560
1934 560 13 -323 961 -407 -65 366 -981 457 -129 -638 832 -289 -79 673 -799 330 302 -498
1952 -498 926 -282 -272 570 -573 591 337 -790 723 -323 -478 856 -528 86 233 -682 371
1969 371 -497 -524 765 -674 47 320 -909 540 18 -387 777 -235 -199 500 -775 623 355 -246
1987 -246 919 -567 -479 758 -633 588 507 -419 611 -508 -389 587 -443 439 561 -664 322 -620
2005 -620 -554 607 -363 128 289 -942 219 36 -188 975 -363 65 567 -732 368 219 -403 832
2023 832 -149 -136 572 -700 264 182 -409 1021 -317 -238 441 -1114 460 205 -548 553 -282 -404 513
2042 513 -855 72 375 -569 663 -270 -520 518 -624 519 741 -582 573 -164 -523 677 -378
2059 -378 185 520 -614 632 -115 -307 818 -352 91 371 -629 376 30 -450 737 -525 -135
2076 -135 541 -849 187 80 -566 815 -85 -338 590 -505 473 505 -542 769 -231 -92 816 -507
2094 -507 119 384 -809 595 -224 -435 648 -656 -116 544 -500 430 70 -403 649 -462 25 524
2112 524 -784 346 174 -282 629 -366 -166 632 -703 292 434 -555 761 -120 -481 555 -515 230
2130 230 424 -571 420 -337 -482 522 -492 193 293 -795 323 -252 -422 715 -187 14 467 -736
2148 -736 404 -132 -362 540 -218 38 450 -772 316 228 -234 875 -278 -42 444 -711 215 279 -382
2167 -382 481 -438 -243 434 -815 234 220 -727 439 -157 -233 624 -403 202 579 -509 517 -24 -343
2186 -343 861 -269 -73 586 -525 408 37 -620 450 -723 60 270 -464 252 68 -581 448 -392
2204 -392 -121 342 -685 371 460 -550 686 -355 -456 550 -448 183 477 -530 595 -32 -195 646
2222 646 -466 311 354 -670 480 -138 -387 622 -405 168 489 -649 315 -162 -587 553 -290 44
2240 44 384 -691 278 98 -350 715 -146 -99 358 -590 262 515 -270 690 -428 -241 493 -471 266 267
2260 267 -520 527 -429 -510 255 -436 166 289 -523 279 -40 -384 588 -287 242 465 -470 343 -176 -474
2280 -474 430 -59 56 764 -722 314 119 -418 665 -93 47 397 -639 86 325 -413 431 -194 -192
2299 -192 354 -596 57 305 -594 478 -92 -141 458 -304 115 530 -281 400 -94 -387 531 -431 -4 317
2319 317 -575 184 166 -393 588 -528 -177 492 -860 12 36 -383 578 -263 -111 412 -611 185 25 -482
2339 -482 585 -162 -312 603 -647 310 210 -541 368 -13 -146 491 -366 252 571 -468 401 -266 -339
2358 -339 389 -408 148 418 -449 377 -177 -604 589 -169 -254 445 -723 77 129 -327 616 -260 -265 266 -564
2379 -564 252 303 -432 500 -169 -9 520 -512 170 259 -312 424 -116 -331 203 -565 321 368 -284 414 56
2400 56 -388 310 -452 181 638 -581 372 -46 -318 471 -269 125 575 -575 233 2 -244 388 -140 -28
2420 -28 348 -425 99 28 -583 452 -159 -186 422 -727 273 303 -256 497 -141 -280 450 -455 145 146 -417
2441 -417 351 -151 -223 383 -498 102 424 -297 249 64 -416 306 -155 -1 394 -304 278 -58 -484 517
2461 517 -311 -129 183 -321 11 139 -318 489 -169 -64 429 -328 291 332 -408 232 -231 -271 594 -327 69
2482 69 320 -316 292 0 -259 522 -285 -37 305 -315 133 -199 -298 432 -372 47 355 -480 166 -46 -143
2503 -143 505 65 -99 421 -386 184 133 -280 524 -89 -23 392 -431 -42 274 -357 465 -120 -291 350 -423
2524 -423 -2 310 -308 354 -68 -420 273 -291 110 462 -442 257 -36 -396 535 -99 -52 242 -244 165
2544 165 -70 -320 438 -153 -160 493 -207 223 230 -443 293 -257 -61 349 -232 -56 110 -284 357 -41 -52 487
2566 487 -507 91 152 -419 300 21 -222 367 -210 137 307 -421 331 -80 -254 365 -176 -212 180 -597 190
2587 190 111 -317 292 -324 71 177 -490 131 198 -311 324 -246 -53 366 -342 186 80 -264 361 -133 -233
2608 -233 173 -436 187 180 -156 256 -177 -225 362 -280 -48 397 -383 243 56 -284 307 -317 7 307 -399
2629 -399 85 170 -387 226 -117 -55 129 -358 122 -66 -224 425 -339 -41 334 -461 -17 173 -194 306 -38
2650 -38 -301 188 -398 -82 318 -155 342 74 -332 203 -294 185 268 -263 371 -17 -154 312 -308 245 359
2671 359 -258 271 -137 -207 344 -201 15 269 -273 61 -62 -307 300 -244 -257 355 -290 7 65 -396 320
2692 320 10 81 294 -202 173 148 -279 198 -28 -113 432 -165 209 170 -512 391 -137 -158 547 29 -74 124
2714 124 -319 64 -27 -243 414 -103 -86 139 -447 163 130 -349 231 -98 -53 275 -266 -76 145 -129 374
2735 374 26 -91 416 -203 51 336 -142 230 -231 -167 235 -145 13 289 -231 182 -87 -309 224 -108
2755 -108 93 204 -354 76 12 -169 482 -211 172 228 -405 188 203 -131 324 -177 -106 312 -350 114 40 -239
2777 -239 453 -270 -317 143 -191 124 144 -133 123 -102 -183 288 -303 85 278 -254 313 30 -278 404 22
2798 22 164 196 -181 332 39 -331 144 -251 -70 69 -354 187 -63 -242 461 -36 -115 274 -348 -49 74
2819 74 -177 172 -97 -62 168 -258 178 310 -265 256 -32 -255 337 -283 -41 494 -342 199 -56 -241 412
2840 412 -300 23 264 -166 239 -142 27 304 -194 -23 155 -433 145 -118 -434 248 -267 229 215 -301
2860 -301 169 10 -329 257 -91 6 275 41 116 124 -314 149 3 84 303 -579 93 139 -101 253 -72 -203
2882 -203 284 -446 99 385 -372 200 3 -362 225 -103 66 180 -311 171 292 17 157 -155 -3 311
2902 311 -277 158 -101 -273 525 -127 67 59 -324 122 -47 -231 414 -75 -181 146 -529 52 95 -104 200
2923 200 -179 66 250 -308 16 393 -249 15 199 -176 329 -139 34 366 -136 130 49 -154 279 -305
2943 -305 -179 65 -293 211 104 -285 315 -190 -62 97 -247 85 122 -245 217 -101 -159 214 -57 75 326
2964 326 -409 240 -113 -149 94 -145 123 88 -268 125 -210 -171 83 -199 -57 177 -236 91 -2 -176 376
2985 376 47 56 254 -375 122 74 -350 275 148 -85 196 -114 177 6 -218 213 -171 105 105 -227 9 -81
3007 -81 -265 187 -212 -227 202 -193 47 -5 -212 33 17 -173 302 -97 -22 404 -245 232 -7 -210 285 56
3029 56 92 220 -255 -50 28 -225 349 -100 -68 -12 -417 -52 170 -168 291 -138 -181 174 -288 269 102 -201
3051 -201 290 -31 9 359 -221 79 155 -228 265 43 -206 254 -388 -111 85 -238 237 -14 -125 19 -113
3072 -113 18 91 -154 271 144 -28 256 -20 63 145 -225 -1 -107 -185 202 -109 -104 221 -242 19 126 -224
3094 -224 460 62 -202 130 -38 120 188 -151 105 -79 -26 25 -213 180 36 -192 37 -195 -85 178 -240
3115 -240 90 175 -165 66 168 -273 351 -75 15 149 -259 8 181 -56 411 94 -222 -21 -363 -77 147
3136 147 -130 195 -172 -28 188 -295 49 59 -109 171 -130 -274 67 -353 -7 163 -131 199 -106 -129 206
3157 206 -76 -120 240 -244 286 -5 -174 331 -38 -42 141 -256 47 22 -189 215 -149 140 -53 -321 258
3178 258 205 -259 302 27 -128 126 -266 113 214 -236 145 -57 -105 195 -48 205 114 -58 112 -201 -195 350
3200 350 -30 29 151 -366 138 -29 -323 276 -388 -41 96 -481 128 240 -189 260 -39 -155 281 -256
3220 -256 2 79 -141 387 -128 -40 291 -229 -45 -4 -73 254 -26 -243 94 -332 194 174 -276 -16 -24 -295
3242 -295 200 -99 49 296 -81 82 -39 -197 245 129 82 32 -322 117 -112 -239 312 -158 -169 293 -174
3263 -174 241 -82 -247 364 -239 -205 118 -100 2 -136 -409 240 -203 -121 107 15 140 300 10 172 35
3284 35 -113 314 -189 -37 102 -242 -8 91 -221 420 -266 -49 146 -406 147 139 -120 111 -337 -179 303
3305 303 -201 109 -48 -171 137 -148 -85 137 -304 65 192 -73 119 38 -165 94 -223 -28 20 -324 213
3326 213 -155 -210 213 -136 -84 123 -33 50 -118 -101 189 -74 -85 122 -341 331 -50 -197 343 -83 -138 298
3348 298 -301 391 203 -147 312 -108 -52 100 -69 168 203 -258 230 -100 -183 153 -20 160 257 -171 232
3369 232 -75 16 139 -271 -13 250 -161 152 149 -63 200 -92 -45 121 -53 115 -50 -125 203 -302 -18 141
3391 141 -184 189 164 -303 212 -148 -177 217 -249 -40 171 -125 207 115 -200 119 -127 158 123 -287 163
3412 163 -17 -187 261 -119 195 265 -334 48 -75 -158 259 -243 -221 416 -283 163 69 -253 81 -30 30 11
3434 11 -325 120 65 -248 135 -93 -132 43 -157 127 2 -242 222 -107 -184 108 -161 -106 219 -116 79 240
3456 240 -120 136 -222 -61 104 -212 151 5 -81 432 -112 157 186 -184 168 42 -42 203 -12 -175 316
3477 316 -237 195 182 -114 281 -208 -96 52 -203 19 64 -151 318 54 -67 176 -138 61 35 -129 292
3498 292 22 -187 127 -89 -133 206 -62 264 127 -89 344 -53 -34 156 -150 163 60 -230 191 -54 16
3519 16 194 37 -82 87 -32 611 79 -38 69 -206 128 -8 -288 174 -45 13 306 -278 253 124 -208
3540 -208 67 -49 -94 75 -211 117 111 -156 49 -88 -58 544 -9 76 -22 -36 199 10 -198 114 11 -65 285
3563 285 -197 25 -63 -22 337 -10 -51 293 -44 1 -128 -199 196 -30 -20 101 -12 84 143 -116 75 -263 -139
3586 -139 305 -99 -44 42 -19 29 -70 -16 76 -256 41 175 -327 235 -182 -152 225 -122 65 132 -250 123 12
3609 12 -151 228 -144 46 213 -62 116 158 10 273 59 -69 333 -145 -9 161 -386 160 -181 -162 300
3630 300 -96 39 168 -176 194 -8 -33 124 25 14 277 -81 37 12 -413 169 -168 3 400 -196 -28
3651 -28 12 -16 263 -112 -55 106 -79 157 227 -236 216 -77 -84 318 -233 222 128 -122 -80 -153 -2 220 -314
3674 -314 148 146 -418 186 112 11 227 138 78 246 -374 121 -209 -75 262 51 -20 37 -144 54 61 -118 132
3697 132 -13 225 213 -254 -57 -199 -373 107 -61 96 245 -300 59 118 -110 346 39 -113 342 -167 126
3718 126 45 -58 241 -31 -114 76 -94 -166 67 -160 49 125 -229 244 -61 236 156 -326 50 33 -211 357
3740 357 -105 85 248 -300 17 91 -53 206 -104 90 -11 -251 -30 36 48 366 15 -88 200 -17 -116
3761 -116 100 -111 3 -138 -217 28 -131 236 475 -131 202 244 -188 130 -189 -92 234 -88 184 29 -62
3782 -62 189 -66 -20 156 -182 38 123 -180 456 2 -4 148 -199 44 -85 113 42 -41 19 120 -258 92 36
3805 36 -194 206 -134 -301 195 -261 1 236 -47 149 5 -255 120 -55 104 165 -222 165 -77 -246 23
3826 23 131 -5 254 -161 56 91 -187 206 -45 -9 125 -153 155 -6 46 64 -52 56 184 -66 -34 91
3848 91 -170 273 -11 -204 45 -141 -95 110 -186 154 -244 -130 206 -154 100 278 -353 247 106 103 128 -77
3870 -77 58 183 -26 -60 45 -71 62 110 35 178 -135 -26 57 -38 97 0 -112 171 -170 -68 35 -124
3892 -124 108 22 -216 195 -46 147 11 -202 15 -131 -192 193 -231 -49 186 -213 122 -59 -21 -18 3 -107
3914 -107 175 -97 12 18 -170 206 -400 -48 211 -170 176 160 -49 40 34 -78 -16 -15 9 58 -258 -21 -58 -76
3938 -76 229 -143 -28 30 -169 206 110 -62 114 -83 3 109 -144 236 94 -183 219 -66 -148 103 -202 275
3960 275 11 -163 167 52 -86 -7 -269 43 145 -217 309 -52 5 34 -129 126 -63 -23 183 67 -295
3981 -295 -13 -137 121 33 -63 132 -8 -49 109 -86 90 66 -159 60 -131 -104 102 -112 -48 136 -121 -5
4003 -5 14 -138 237 -34 -29 67 -180 176 21 -168 176 8 -71 258 -257 -165 -146 -299 283 -105 -192 309 -233
4026 -233 169 198 -66 154 43 -244 189 -28 5 -58 -61 18 282 -242 124 -38 88 -95 -172 -123 -11 -259 126
4049 126 -39 -44 107 -41 126 -14 -74 233 219 -71 240 -233 171 104 -14 112 -21 -8 264 -82 4 -57 -215
4072 -215 99 -268 -193 145 -214 41 72 -270 -12 -53 -176 113 -73 -4 171 -217 -34 -34 -233 271 -106 -79
4094 -79 44 -76 137 169 -206 166 -113 -45 165 -174 116 197 -54 130 173 -391 258 -188 -25 111 136 208
4116 208 -26 -79 -26 -16 -110 168 -185 188 66 -141 265 6 14 150 -276 74 -68 -138 325 -23 12 166 -230
4139 -230 154 131 -131 109 -99 -74 173 -177 -8 81 -228 125 -18 -136 223 -202 -202 110 -206 281 -199 -31
4161 -31 20 -269 -4 254 -114 10 37 174 214 -102 -11 247 -454 149 -4 -51 5 -309 128 95 -157 -73 -111
4184 -111 -159 265 53 -69 191 -119 156 62 -4 245 -223 -4 102 -60 -46 129 -257 187 123 -84 275 -259
4206 -259 -230 75 -163 212 63 -180 218 -295 -26 182 -311 -93 -25 -180 14 -15 -27 203 -193 217 126 -26
4228 -26 214 -196 -75 -43 -3 75 31 -250 158 -155 -162 49 -314 -184 141 -208 160 -156 -307 59 -288 -104
4250 -104 -101 -133 178 -37 -95 198 58 162 155 -98 34 160 -238 278 -47 -38 89 -19 93 206 -126 341 -81
4273 -81 3 259 -131 272 -80 -307 136 -93 -38 55 -235 -33 81 -131 135 177 -175 67 5 55 -73 -230
4295 -230 252 132 14 99 -27 41 -45 -266 110 142 -174 197 24 -208 38 -213 -101 136 -374 47 87 37
4317 37 246 -100 24 173 -70 130 -218 -228 156 -183 -93 24 -45 102 20 -67 -66 -366 -84 291 -322 263 -149
4340 -149 -312 207 -249 -31 165 -42 194 24 -83 266 -14 -110 79 -283 -94 10 -254 236 -12 64 118
4361 118 -80 68 -103 -114 52 -155 -70 210 -58 47 171 -159 192 -13 -119 91 -395 14 181 -307 208
4382 208 177 -19 102 -91 50 150 -138 190 -29 -90 201 -95 -235 48 -109 -25 -59 -87 113 -77 -11 92
4404 92 -254 -48 234 -269 73 95 -16 216 -134 31 63 -8 208 -261 -67 152 -47 -80 117 -165 127 153
4426 153 -108 226 -116 -52 199 -46 183 -165 -76 304 52 -248 65 -26 155 -62 102 350 72 -89 169
4447 169 -103 107 381 -254 152 -121 -179 113 -152 185 187 -119 313 -124 -121 -16 6 73 153 -236 93 -63 -48
4470 -48 267 38 -17 182 -222 221 -21 -31 189 177 12 70 -30 90 15 -173 -17 -117 143 23 -208 166
4492 166 -153 59 220 244 23 19 -148 110 -26 -261 276 137 -158 176 -64 7 280 -57 -31 -263 -62 181
4514 181 25 50 226 -137 265 204 81 38 -148 6 288 -295 -33 -73 -198 207 -233 11 345 -192 -29
4535 -29 64 -177 208 -194 -75 89 -85 89 59 -147 119 149 -86 242 -26 138 211 -167 8 37 -287 161
4557 161 96 -54 170 -102 -35 -126 -114 125 59 -30 114 -17 137 -31 -4 243 -42 69 229 -67 -5 -7 -186
4580 -186 12 -157 0 7 -286 18 74 -146 228 50 -139 411 -130 -175 33 -44 7 -111 -137 60 -150 -3
4602 -3 225 -215 5 57 -114 203 99 -92 39 -199 -47 -32 -141 333 -25 -120 98 -256 -145 54 -264 133
4624 133 -107 -23 108 21 10 32 -246 328 15 -172 0 -6 -7 -80 -67 -38 186 -242 164 -176 -116 181 11 154
4648 154 30 -145 123 -199 -38 144 -86 79 95 -239 41 -14 -40 73 -264 -179 -76 -194 44 -43 -279 -60
4670 -60 -270 56 234 -133 40 21 -184 114 -165 201 82 -6 283 3 -228 246 -35 138 80 -108 93
4691 93 31 -73 175 12 61 147 -70 -61 181 -174 132 -103 -18 118 -26 247 258 -253 148 -49 -12 95 -131
4714 -131 76 71 -208 -41 74 -192 169 47 -102 180 -72 -75 103 -276 11 9 101 124 -187 128 127 -169 200
4737 200 64 -97 269 -180 92 173 -15 259 35 -114 200 -381 49 -75 -144 73 42 -80 216 114 -141
4758 -141 -93 -48 6 22 -87 54 -41 78 102 152 148 -106 -177 230 -80 -117 165 -33 -47 0 -185 -21 -60 9 82
4783 82 -55 -107 77 -292 216 -33 -245 75 -68 -87 45 -154 24 172 -50 20 -401 98 53 -309 125 37
4805 37 -110 185 -116 136 191 -90 -175 78 -170 87 -196 -16 47 -149 -42 -2 -213 134 -87 -1 167 -165
4827 -165 161 249 -72 17 -157 -155 201 -246 -90 19 -246 177 91 20 259 -109 90 9 -78 47 91 -119 177
4850 177 -78 -156 130 -373 360 -175 -258 253 -36 143 91 6 105 49 -25 57 -77 111 147 -49 79 20 -202
4873 -202 191 -23 -2 84 -97 107 37 -158 278 31 -100 170 -73 228 121 43 234 76 -125 297 127
4894 127 21 21 -215 69 56 -162 64 -38 -266 281 41 41 -81 -221 61 162 -69 43 -44 146 40 55
4916 55 254 -12 -238 -175 -9 132 21 -295 152 83 -120 24 37 134 198 -91 11 212 -187 82 -128 -42
4938 -42 78 -238 165 154 -91 -10 197 -37 255 58 2 181 -185 -90 -68 -48 382 -254 -77 113 -183 177
4960 177 -37 -67 246 -20 -101 -99 39 52 100 329 97 -46 187 71 -181 70 -115 -192 58 -217 -78 62
4982 62 -55 105 -5 -191 159 -76 -41 249 22 -38 112 -181 9 -162 -158 35 -104 230 -60 -3 297 131
5004 131 -55 52 -48 -69 70 -84 28 -252 -195 85 -235 74 133 43 145 13 -34 -7 3 92 60 1 31 157
5028 157 -24 29 -158 -38 242 -87 74 -2 -117 298 -121 25 51 -116 137 -61 -140 134 21 13 161 -165
5050 -165 140 91 -161 54 -5 3 179 -135 -33 -101 -134 28 -2 -283 241 -67 -138 -24 34 -5 97 -108 47
5073 47 -167 161 -15 -136 179 -99 -438 96 -6 -104 109 -71 125 50 -298 86 64 -198 108 -101 20
5094 20 124 -314 97 47 -170 -38 -44 27 73 -130 251 106 -155 235 -49 134 108 -142 310 -13 -190 89
5116 89 -173 -104 66 11 -36 65 -189 143 1 -72 7 -55 -86 205 -180 155 -98 -232 147 -82 -76 0 -4 -179
5140 -179 -11 -50 72 -237 -23 7 -242 63 80 -193 88 -112 98 -17 -54 169 17 -63 87 -148 14 147
5162 147 -30 220 -74 -54 350 -173 -179 127 -73 235 -7 -61 46 27 37 206 -240 160 46 -156 -64 -28 36
5185 36 115 66 36 104 -109 15 -44 -32 105 6 70 69 -14 172 223 170 42 -177 -110 95 -210 38 67 -87 75
5210 75 7 12 2 -175 -110 172 -47 10 -90 -7 28 -203 -99 220 -210 17 53 60 212 -115 109 126 20 3 9
5235 9 -71 199 20 -61 163 -173 22 55 -182 12 -99 -85 116 -129 203 140 15 -6 -224 -22 122 -104 59
5258 59 12 191 187 66 5 104 -3 -149 41 -173 13 164 204 -3 -183 -81 29 -140 164 166 -247 18 -217
5281 -217 20 195 -198 31 -75 -7 68 -156 -125 75 70 -253 45 26 166 -23 86 146 -125 -163 42 -83 101
5304 101 14 2 119 -203 136 209 -52 213 79 -29 171 -68 -91 213 97 -223 131 -33 236 55 12 65
5326 65 9 9 -1 -33 131 185 -167 136 -194 149 42 95 195 -11 -91 45 -16 132 -31 -37 -72 -73 -160 197 -75
5351 -75 58 -95 -191 114 107 -170 38 -61 -102 -14 -41 80 348 156 94 -70 94 222 -247 11 139 -162 135
5374 135 -217 -10 145 31 143 -10 -211 44 -164 -52 -21 -47 36 106 -52 -24 103 25 231 -96 -94 -2 -257
5397 -257 -116 18 -40 6 -38 -102 195 -84 -64 86 -74 50 99 -146 -26 -121 -23 -87 -173 64 -14 10 137 -13
5421 -13 -212 102 78 -52 21 -93 73 -288 126 -40 -239 156 -106 30 -38 -29 -119 -7 -81 22 -164 -65 138
5444 138 -53 -96 97 -137 128 129 -4 184 136 93 92 55 27 -6 -98 43 -62 -67 147 -131 -12 168 16 162
5468 162 -69 -228 -4 -35 -86 239 -261 -26 1 120 132 6 27 -33 -158 212 104 22 28 9 154 17 -265
5491 -265 90 69 7 37 -5 -107 -56 153 -2 -47 -7 109 76 24 -27 -138 50 -20 -290 265 -143 -137 -40 19 195
5516 195 40 -202 30 6 -45 139 16 64 -73 -11 291 -27 -249 -156 -3 -4 -69 -29 113 152 -24 27 100 -1
5540 -1 156 -126 67 194 22 99 101 -75 10 80 95 282 53 26 -32 103 65 -73 -46 53 -199 260 101 9 149
5565 149 -257 72 4 -174 -61 81 29 109 -106 -67 69 -276 -42 -104 -67 143 63 44 273 -214 29 -6 -190
5588 -190 47 -85 71 -45 -37 -90 97 -39 76 -11 -46 233 -72 -103 -20 -191 104 177 76 -105 18 -237 84
5611 84 -139 65 -18 -141 34 24 151 62 151 -190 113 -105 141 38 -181 57 -127 113 47 48 112 -32 127
5634 127 11 -15 58 -4 150 -49 81 -46 37 -158 -66 119 -12 157 79 -18 30 -46 -41 10 -16 180 45 -94
5658 -94 -101 19 208 24 -201 153 40 -96 77 135 158 288 -167 50 -94 117 121 -22 206 -121 -53 -39 181
5681 181 -194 -5 -103 51 -13 -150 -10 112 3 128 -6 33 141 -97 158 69 -146 71 90 -74 -83 -175 92
5704 92 130 -222 47 -39 -121 33 -2 -91 -124 -138 32 -16 -127 39 -57 72 -32 -110 10 -7 -132 66 19 -98
5728 -98 -27 -233 36 -18 -149 38 84 -57 -27 -184 -114 177 -1 73 -48 197 158 26 -27 62 46 331 174 -41
5752 -41 291 81 60 34 10 -116 23 -80 -27 86 -25 395 48 99 -117 -174 -16 -69 48 -38 -250 -162 -46
5775 -46 68 -21 120 -199 210 -134 127 -69 22 136 54 -130 165 -57 29 11 -118 141 203 53 -106 -105 109
5798 109 13 95 -42 -96 -72 109 38 63 17 -256 -61 200 -76 -20 30 -59 37 137 259 0 40 96 -135 295
5822 295 -102 -168 -39 104 76 33 59 -160 41 -67 -47 60 -25 98 77 -83 167 -121 12 241 -168 -130 32
5845 32 -10 -108 33 -104 206 -130 193 -68 -186 9 -220 48 77 126 -70 -29 -60 163 -60 -215 42 -179
5867 -179 -55 195 -108 34 8 84 136 -31 2 127 52 98 22 -165 142 43 -131 6 -4 -45 23 86 -124 89
5891 89 -176 -20 -135 -150 129 -129 106 -27 159 70 14 24 58 -76 77 173 161 106 11 -45 -65 -102 37 -64
5915 -64 232 120 -17 5 45 14 56 -52 -112 -5 -97 -168 136 -200 146 -60 -66 163 -104 57 -47 16 -15 170
5939 170 -210 163 94 108 273 61 -2 -40 -173 -37 138 -123 6 -65 45 197 74 -9 3 -62 95 -82 -183
5962 -183 -28 -149 -54 165 -117 24 -13 40 100 104 21 99 -66 177 55 -12 25 90 -60 236 -40 107 15 22 229
5987 229 69 -54 -108 -52 162 138 -40 66 74 -52 96 -162 -9 -56 2 230 -22 22 187 177 19 -12 -3 92
6011 92 -90 -45 153 -80 19 -214 -83 54 -42 1 243 36 88 8 178 -88 -60 -30 12 44 64 57 13 239 38
6036 38 25 -206 79 220 28 -59 -45 -145 -129 -102 -123 261 133 -74 -94 69 52 -19 -120 -138 224 -118 -27 -1
6060 -1 -97 -6 -121 122 -69 -99 2 134 -74 -104 -39 -14 165 -156 -15 271 -130 138 55 -109 76 -98 22
6083 22 -111 -89 -12 -33 19 188 -18 -105 -31 -7 19 270 -254 134 98 -47 242 67 15 -123 -69 156 100 -27
6107 -27 85 -3 -161 -18 -16 -162 -4 111 -28 -25 157 32 111 82 70 -115 -7 -99 153 94 -121 15 -60 67
6131 67 -65 7 -30 -47 57 -39 -5 159 49 23 -24 315 -118 -9 93 41 195 -119 -140 -28 -155 -25 11 15
6155 15 87 2 50 -128 105 -125 79 -100 30 69 -131 41 -146 57 -12 -121 55 -39 -83 -117 -4 28 28 -46
6179 -46 49 166 -111 84 -6 23 92 -153 -201 223 0 -56 65 89 -19 -5 -124 235 -27 30 -167 150 60 -96
6203 -96 30 -117 13 19 63 -24 -62 2 53 -19 83 -123 -5 -176 -23 3 -181 49 -3 225 92 184 97 141 30
6228 30 -34 -15 -60 137 -142 -61 -17 71 -67 -35 75 -21 -57 173 -211 54 46 -202 173 18 -82 119 108 104 196
6253 196 16 -130 344 -75 52 1 -153 70 -116 -109 38 1 75 -11 -60 104 -53 -90 78 29 84 -46 65
6276 65 99 87 -22 -118 109 16 128 56 148 -5 2 -24 7 -11 69 -160 36 -69 2 51 -42 31 -129 -69 11 82 89
6303 89 -65 -14 -30 -94 9 -55 -50 -233 -59 279 -21 30 -31 -112 -153 -102 -96 -69 -102 -212 -103 106 -34 -39 -36 39 -135
6330 -135 -86 -76 -90 -130 -98 95 79 105 145 -37 53 -73 47 127 -52 -92 164 31 -53 134 -81 120 170 -44
6354 -44 135 40 -16 28 -7 99 9 231 105 -116 1 37 -96 35 -194 -254 14 -46 66 25 127 -35 31 -46
6378 -46 -79 13 168 117 78 -27 -150 -55 228 -8 -44 -25 80 -23 -47 -129 116 -38 43 113 7 -14 -2 156 -6
6403 -6 -123 38 187 -83 161 -77 10 -112 -25 -263 -3 70 -95 -25 208 10 45 85 -99 72 111 64 -46
6426 -46 41 10 -26 12 -21 -47 11 -124 40 167 -131 0 62 26 33 165 48 -175 -9 103 -110 -109 -83 -28 -122 105
6452 105 -87 -13 4 13 -192 -51 -184 85 186 115 152 -101 82 -72 -183 114 -98 -149 37 -120 25 -57 42
6475 42 -56 -222 -47 2 -7 198 -3 68 -9 -82 -3 113 44 192 -157 -35 -31 -117 -135 -86 -60 295 99 -20 -84 62
6501 62 0 15 56 10 -89 -140 320 21 -102 32 -176 11 -74 -217 154 -28 204 178 -109 -67 -37 -48 -41 229 85
6526 85 97 -28 108 -27 -78 82 -122 -130 212 110 -12 118 -136 -52 -4 -62 -9 225 -21 101 -145 -65 113
6549 113 100 -23 75 -200 30 -149 7 28 97 28 -59 23 119 191 -87 61 -247 -108 -96 -104 -126 188 -2 -86 -208
6574 -208 -52 -98 131 62 130 -103 89 -46 30 88 62 89 50 -98 8 90 208 197 -90 60 -64 -154 62 -151
6598 -151 160 126 -27 120 -94 -123 134 1 155 -17 -53 64 45 -134 19 36 -91 115 -110 204 -47 -92
6620 -92 101 -59 36 -131 -95 67 87 -1 -150 -14 25 30 -7 -229 145 7 98 -172 22 16 47 -152 29 125 100
6645 100 1 -101 179 -103 21 149 62 20 150 62 104 -68 214 -46 -282 -47 -163 -76 111 -78 -171 -45
6667 -45 0 -126 19 -61 -46 166 -183 -68 -19 11 -115 -178 118 -113 68 2 -73 43 -61 149 269 -145 -39
6690 -39 180 -7 81 -15 -191 112 16 116 -121 116 55 -53 -143 -54 80 -208 107 -4 -141 -21 -80 74 132
6713 132 3 -28 63 80 -79 128 33 109 -166 33 10 -105 50 -38 35 -183 -6 57 -1 -2 -9 64 -1 -149 -69 -27
6739 -27 76 -233 31 116 -47 -7 -83 -75 -69 -184 -23 34 -7 74 37 46 -33 -51 35 16 153 -109 -74 -212 119 -83
6765 -83 -38 -106 32 46 -47 72 -28 -223 172 -47 -145 212 -12 167 -68 -9 -208 14 37 221 -78 -212 -50
6788 -50 -85 -51 -77 -276 -28 -92 56 200 -209 -23 -34 -14 128 37 11 10 -8 -103 7 -72 175 -216 75 -28 -20
6813 -20 32 -43 -89 64 -115 -66 166 -2 165 -32 -221 58 -63 -139 -54 -63 177 16 131 128 -107 -43 -158 -48
6837 -48 60 -280 -56 -1 -26 166 62 -84 116 90 -96 -203 -49 -113 132 63 -86 26 117 -66 99 141 -61
6860 -61 -67 -93 66 18 44 173 28 93 -80 -25 150 -70 -14 99 102 -96 -59 -37 199 -196 66 20 5 -38 -128 -83
6886 -83 -3 -77 225 65 103 180 -27 148 -103 -196 9 108 -110 0 132 20 156 65 -108 63 54 25 108 -326
6910 -326 63 -4 -30 -112 -12 14 161 13 -206 219 157 178 -169 46 80 -2 254 14 193 3 -40 -169 -40
6933 -40 -81 -58 -205 -54 -34 26 63 156 111 133 33 -137 19 -89 -111 43 64 66 127 -294 -63 -34 -108 -18 31 2
6959 2 126 -43 106 56 -130 25 41 14 13 122 -200 57 -29 -48 -197 42 -78 187 70 -48 187 1 -98
6982 -98 -73 114 -160 81 23 -182 -1 -104 1 -13 118 -160 -2 -76 249 -103 2 37 -20 163 44 71 -67
7005 -67 -39 -150 7 -104 -200 84 -77 0 3 -215 79 -77 184 32 -205 -138 -24 110 50 -47 0 35 2 -113
7029 -113 92 -86 -50 91 128 138 153 220 -87 -122 -87 192 -253 131 145 -99 -65 -5 -66 1 -96 -109 -29 -49 82
7054 82 -208 55 -86 17 -70 -28 114 240 38 104 121 -84 118 40 -61 31 -62 71 42 -25 200 -98 -97 -30
7078 -30 -123 165 -90 -178 106 63 72 23 -12 33 51 -184 51 199 -21 106 36 100 -65 -65 150 39 43 57 85 31
7104 31 52 -216 -9 -69 21 29 25 21 -79 202 128 127 -18 20 -115 13 35 185 -7 19 -6 131 242 18 100 19
7130 19 -15 -54 -55 -24 -17 4 112 -232 -146 -178 48 -98 81 18 -10 -34 42 15 92 28 -13 34 -94 90 100 169 69
7157 69 -32 89 -46 -182 126 -73 -70 -93 95 56 -197 164 -34 -84 -87 -88 -163 -74 -53 8 -119 -5 57 -198 -71
7182 -71 -32 -241 -175 34 -100 39 47 127 -32 -6 51 -80 -76 2 77 2 -29 64 -25 72 -54 112 61 18 28 34 -140
7209 -140 -36 -122 -16 -40 -104 -93 -19 -95 8 -47 4 -19 -63 -45 66 121 169 -86 -53 104 102 146 -12 -152 -3 180
7235 180 -30 -49 -91 -138 -89 -148 179 99 -39 168 -103 54 13 -152 -40 -1 -65 -25 -187 85 97 60 -63 -93
7259 -93 -233 33 -149 92 -54 -198 -3 -179 -50 -61 0 -61 184 114 -69 20 16 129 -28 -4 112 -47 -4
7282 -4 -115 58 -9 -106 -102 245 -11 214 111 87 104 -85 51 3 52 78 -32 -63 -56 -167 9 -52 72 -106 -186
7307 -186 113 -7 -118 191 42 93 46 88 -88 -134 149 -47 -66 199 92 70 -72 -75 -78 79 145 -52 -10 -3 50
7332 50 326 48 -155 -96 -41 -108 -41 -27 61 227 -94 -201 172 22 -89 -88 107 38 89 58 -164 -105 60 109 -122
7357 -122 28 8 4 -180 -16 55 79 -145 69 -82 -221 162 -15 70 224 -3 77 -2 128 44 99 42 -77 11
7381 11 83 -7 -230 52 135 -103 -143 101 -16 40 -135 129 80 -22 44 -47 5 285 -147 -72 6 -137 128 -31
7405 -31 -91 60 90 -33 171 -109 17 51 111 -56 -76 -66 -186 -11 93 38 -117 31 86 -14 46 118 129 -92
7429 -92 -36 27 -41 -57 -99 -9 170 36 -56 206 196 -100 -88 -74 -106 29 -4 -54 -1 95 44 104 73 -106 0 9 -97
7456 -97 114 25 -83 79 -34 -46 -63 -37 115 -26 -90 10 75 -31 90 17 -85 -183 -71 10 73 -219 -69 -135
7480 -135 98 -68 24 -27 -33 94 -84 -18 216 -18 5 -7 143 -78 149 -27 -78 -104 -168 -103 72 -202 118 -151
7504 -151 -132 213 81 -15 -18 -109 27 9 -207 130 -187 -57 77 1 156 190 -156 -146 -144 26 -179 -116 101 0
7528 0 -81 110 103 48 217 -10 -242 -80 177 166 -107 117 -38 -37 8 -58 74 192 -52 -57 -103 143 53 -33 32 63
7554 63 -99 24 -15 -27 -132 137 -53 -74 30 -155 92 22 -67 -84 200 -26 32 -13 41 -54 101 88 53 154
7578 154 400 -7 56 -5 -189 100 -34 233 -170 -314 -64 -38 -188 110 91 -175 80 142 -86 36 -49 76
7600 76 -104 -71 -204 36 -94 -148 218 41 -227 -110 -14 -164 24 39 41 -52 -190 -49 -14 42 86 -68 126 -23
7624 -23 -56 -41 28 -57 -111 16 51 116 -83 200 81 -155 64 -18 -182 -36 12 -40 -10 9 -146 -167 -44 210 -193
7649 -193 133 -121 17 -132 -215 -230 -52 133 -111 101 -39 -232 -33 75 7 -122 -64 63 6 -199 -1 -53
7671 -53 -145 121 55 7 -179 137 165 -20 99 -92 127 115 74 -69 67 191 -5 -31 76 69 -112 51 -108
7694 -108 72 119 -46 -140 25 -69 1 -62 114 51 -27 -5 -24 -46 -67 108 -144 210 220 -4 120 -108 -43 13 198
7719 198 -61 -41 -43 59 -92 -76 13 13 156 43 180 51 94 -150 87 -255 -214 80 20 -38 -105 87 -154 136
7743 136 -22 -110 188 -11 63 -124 63 -48 -137 100 -79 160 97 307 -72 19 -109 148 -46 -122 7 -61
7765 -61 -27 83 113 -12 -45 143 157 122 105 158 105 123 69 -64 61 38 -114 -62 121 -27 -31 -19 163 229 119 84
7791 84 -49 12 225 41 30 -26 46 46 107 19 -6 -5 -14 25 -197 -112 -24 23 97 -124 128 81 -130 78 161 -126 28
7818 28 -25 -53 19 -41 79 68 24 -135 3 82 196 61 -166 -41 -25 -172 -76 148 37 -52 195 -47 -64 52
7842 52 35 196 -36 -32 104 -308 -55 -9 49 41 61 6 107 140 -119 23 -43 157 101 -17 9 9 -143 -132 -219 143
7868 143 135 67 91 31 -33 81 -90 -57 -97 12 61 -230 68 180 13 -27 -46 -2 154 226 -4 -3 -5 -85 -60 -7 -57
7895 -57 34 -140 -151 -40 -35 187 -86 -16 39 -70 92 88 80 102 -66 64 -43 -98 -59 140 -115 -45 82 -91 -35
7920 -35 81 -7 135 -115 -28 -159 -51 5 -56 36 275 -90 34 29 -12 -186 -63 106 -51 160 59 47 49 -89
7944 -89 -141 107 -158 166 201 -96 -148 -22 49 64 -117 167 188 -85 32 -17 87 9 -50 -148 108 61 -96 -1
7968 -1 7 -79 57 -22 -191 -37 -28 124 -10 -20 -9 -50 37 71 -21 179 -61 -135 138 34 76 70 93 -129 17 -55 99
7995 99 -76 -5 49 -29 -113 57 -251 -76 -114 -116 -30 -95 -101 160 190 121 51 -202 -102 -158 87 83 -61 97 13 -41 36
8022 36 -9 161 -27 -2 -46 10 -12 120 -21 -219 8 82 117 -196 -10 -102 -133 -181 -13 49 -57 132 -4 80
8046 80 61 92 -134 -169 -115 -87 134 53 -50 -157 -12 0 -10 -168 -137 -21 74 52 -13 -125 55 -130 -127 118 -99
8071 -99 -58 -139 233 -41 -33 -19 -42 21 81 -101 -134 -109 49 161 66 144 -51 85 -101 24 80 -28 75 -5 -72
8096 -72 19 17 286 -59 69 -72 -14 -95 -107 -18 -39 200 31 -16 -62 7 70 64 -38 -3 137 -157 -47 -36 95 104
8122 104 -150 18 -31 -92 148 -31 45 84 -54 166 -97 -225 120 -43 -72 -56 -61 22 144 17 -59 134 -102
8145 -102 -35 -137 56 -73 44 -70 162 45 173 -50 24 104 -185 80 -89 147 40 -53 58 13 -93 -105
8167 -105 -228 124 -50 -54 91 -38 220 38 -37 42 -22 -7 -20 -76 152 7 11 105 112 -84 -20 141 -86 21
8191B1
$$ Imaginary data points
##PAGE= N=2
##DATA TABLE= (X++(I..I)), XYDATA
0 0 0 0 0 0 0 0 0 0 0 0 0 0 0 0 0 -8 8 -8 8 -9 16 -16 20 -24 28 -32 40 -45 52 -60 68 -81 92 -105 117 -133 150
37 150 -168 190 -213 235 -266 294 -326 360 -399 441 -487 538 -592 651 -718 789 -871 959
55 959 -1058 1172 -1298 1442 -1608 1802 -2032 2307 -2647 3074 -3628 4362 -5336 6412 -8711
70 -8711 234751 25059 -164420 85328 63482 -98925 -92059 93629 43887 -102397 81622
81 81622 85043 -148281 -27797 46438 -10699 43863 17435 8076 -6460 -71298 24122 32842
93 32842 -14295 27382 6919 35981 -15858 -116437 49983 75066 -49226 23162 12816 -39125
105 -39125 -7405 -17737 19165 -1730 -10907 53250 -38442 -39512 36804 -41214 14147 55611
117 55611 -38019 2410 5671 -18424 22012 -7153 10769 4267 -17776 51203 -26108 -48409
129 -48409 68852 -4942 -35075 25867 -14643 3415 4242 -7637 19259 -36331 -4142 27943
141 27943 -38212 23067 19062 -41295 24494 -6471 -31490 21611 2033 21620 5899 -27246
153 -27246 18410 -25438 -10404 55601 -14561 758 27365 -32654 -6902 -8243 1452 42803
165 42803 -11723 1785 8586 -50644 279 9598 -421 36389 -15984 -9190 4986 -51093 8114
178 8114 28868 -4353 30184 -6734 -21065 -6449 -29060 30015 25679 -10682 35443 -16084
190 -16084 -37433 13022 -12842 17705 31263 -7183 11554 -26737 -28701 18360 -12059 20275
202 20275 28325 -26819 1732 -18708 -29428 25424 747 11618 21239 -27247 -3719 -12095 -14533
215 -14533 33446 -337 8284 20464 -34819 -1946 6583 -12662 29295 5523 -2388 8348 -29284
228 -29284 3741 7156 -13345 28945 -3766 -15958 12297 -25595 -379 14625 -14317 16885
240 16885 -3696 -15326 11995 -18299 5703 15228 -18726 17599 647 -17318 20564 -8501
252 -8501 -657 14895 -16022 13138 2328 -12496 22350 -10948 -6790 13639 -20111 9476 9012
265 9012 -13886 16272 -12238 -13615 10564 -16359 11414 11721 -15631 13536 -12259 -18221 15861
278 15861 -6495 12732 14576 -15688 9444 -12896 -15067 25486 -1250 7451 15679 -17755 -566
291 -566 -11625 -8001 28366 -4831 3925 14505 -31035 -7833 2240 -4574 20859 -2467 2323
304 2323 3415 -35300 2119 10636 -7567 26531 2995 -12227 -754 -22192 7616 14300 -2493
317 -2493 25936 -4500 -18393 5310 -17410 6771 20867 -2931 15077 -10444 -22071 6859
329 6859 -11690 8224 19903 -11318 6411 -8528 -21977 8192 -4563 9606 16903 -15687
341 -15687 5017 -6120 -20830 18997 3938 356 14552 -10176 715 -4942 -10219 21759 -3022
354 -3022 -1294 18367 -19784 -4860 9224 -9533 10335 -354 -3968 8197 -17703 2503 6887
367 6887 -16075 14540 445 -13716 12290 -8843 -1475 9354 -10389 9357 -1716 -7465 18288
380 18288 -8594 -2280 13571 -13703 4593 5294 -6047 14474 -6332 -2581 8375 -19197 5164
393 5164 10321 -9533 11227 -4737 -9635 3175 -14956 8180 10093 -10340 12968 -5294 -16286
406 -16286 6536 -6412 8586 13426 -7791 9193 -8129 -15412 13523 -2231 7099 15544 -9527
419 -9527 1708 -9184 -12952 16188 -759 5023 13792 -17688 -4911 -4088 -10619 15547 1735
432 1735 2316 7874 -21132 -3457 1092 -8066 19844 4361 -4536 5858 -17757 -1980 7812 -2738
446 -2738 18555 2071 -7957 4468 -16301 791 12761 -4378 14177 147 -14385 2578
458 2578 -11147 1021 12546 -5426 8869 -4030 -16125 6154 -7757 1220 15141 -7413
470 -7413 3639 -1664 -13445 8557 -2003 1948 13803 -8671 2928 1423 -11494 11303 -108
483 -108 -2062 12234 -10041 -216 3842 -10209 9103 -1303 -5514 9118 -10334 71 5845
496 5845 -11592 7570 -1078 -8745 9891 -6162 -318 7913 -10131 5286 -25 -6925 12381
509 12381 -3297 638 9024 -12208 2940 2926 -6539 12859 -651 -3117 5471 -12905 1325 3984
523 3984 -5835 12712 -2215 -7885 3955 -13203 565 8464 -4421 10568 -2247 -10312 3307
536 3307 -9575 3797 12139 -3814 9141 -3230 -12475 6319 -4552 4698 14242 -4848 3723
549 3723 -4604 -12814 7145 -2268 4491 12510 -9975 -836 -4217 -13402 9355 1527 1765 9920 -11732
564 -11732 -3661 -1944 -9287 12339 3681 4 8365 -12434 -3496 3498 -5674 13152 4794 -3648
578 -3648 5635 -11126 -2744 6484 -4442 11237 2274 -8097 4155 -10396 -2984 8677 -5022
591 -5022 6648 1158 -10167 3490 -7112 -1046 9437 -5455 5310 1389 -10205 6176 -2603
604 -2603 -1306 10524 -5091 2911 2949 -8399 7374 -978 -2580 9191 -6711 1118 3979 -8433
618 -8433 6374 -1143 -6045 7050 -6506 -343 5388 -8012 4670 -1402 -7303 7171 -4966
631 -4966 713 7850 -7591 2882 184 -7037 8283 -913 1253 7836 -8314 1480 796 -6768
645 -6768 9941 1048 -1269 6191 -9984 -1659 1841 -5438 9316 704 -4235 3591 -11090 -1960
659 -1960 4586 -4313 9872 1358 -7134 2898 -8929 -582 8554 -1858 8815 311 -8884 3486
673 3486 -6567 1066 11055 -2175 5549 -1048 -11098 3306 -3439 1270 10572 -4809 1318 -2427
687 -2427 -11309 4416 -1223 1002 10115 -6146 -1720 -988 -9667 6470 2361 433 8545 -6684
701 -6684 -1934 1389 -7216 8190 4177 -2024 7228 -7014 -3348 3783 -4991 7290 2839 -4731
715 -4731 4871 -7002 -3448 5085 -5444 5292 2586 -7024 3816 -5296 -2891 6800 -5046 3721
729 3721 2542 -6847 5167 -2258 -2508 7326 -4406 2522 3674 -6510 5660 -409 -3007 6457
743 6457 -5280 304 4136 -5822 5018 -897 -5537 5202 -5468 -792 5245 -5566 3886 -585
757 -585 -6914 4360 -3753 335 7272 -5214 2564 -152 -7131 5869 -822 836 8236 -4973
771 -4973 736 50 -7174 6574 1098 10 6622 -7186 -1704 530 -6326 6907 1771 -2185 5134
786 5134 -8186 -3352 2052 -4701 7615 2716 -3790 3730 -7756 -2483 5217 -2649 7479 3093
800 3093 -5445 2976 -6233 -1431 7411 -1732 5963 1687 -7727 1968 -4298 -1203 8151 -2611 2774
815 2774 237 -9105 1893 -2351 -933 8205 -3371 234 169 -8370 3390 597 -850 8137 -3357
830 -3357 -1040 1818 -6742 4880 2397 -1399 6833 -3991 -2004 2851 -5599 4461 2675 -3478
844 -3478 5260 -4589 -3223 3732 -5089 3251 2085 -5193 4124 -3678 -2928 4836 -4600 2474 2509 -5387
860 -5387 4571 -1486 -2084 6021 -4108 1607 3283 -4721 5163 295 -2792 5384 -4477 -234 3387
875 3387 -4757 4511 353 -4625 3775 -4628 -1299 4382 -4005 3560 351 -5569 3171 -3734 -875
890 -875 6476 -3206 2834 960 -6257 3200 -1543 217 7118 -2726 1630 587 -7066 3901 144
905 144 -313 6892 -4165 -1275 44 -6697 3878 1315 -950 5583 -5105 -2766 579 -5771 5193
920 5193 2785 -2185 4823 -5010 -3343 2824 -3128 5229 3442 -2658 3731 -5004 -2941 4855 -2376
935 -2376 4831 3592 -4957 1716 -3884 -2714 5180 -2170 3087 2185 -6660 1307 -2603 -2803 6026 -2047
951 -2047 1191 1542 -6672 2205 -443 -1771 6335 -1951 -196 2388 -5493 2699 1172 -1514 6175
966 6175 -2342 -1203 2962 -4913 2545 1710 -3079 4438 -2351 -2229 2704 -4729 1970 1755 -4147 3393
982 3393 -2165 -2461 4154 -3836 1158 1954 -4669 4060 -529 -2092 4816 -2962 595 2424 -4221 3913
998 3913 955 -1993 4371 -3805 -1095 2821 -3677 3626 1122 -3368 3171 -3902 -2263 2994 -3467
1013 -3467 3576 1579 -4463 2142 -3368 -1632 4740 -2161 2972 1688 -4873 2476 -1994 -1429 5896
1028 5896 -1244 1925 1382 -5517 1943 -412 -865 5957 -2119 -50 927 -6079 1663 438 -1243 5423
1044 5423 -2569 -1885 461 -5652 2834 2114 -1344 4714 -2822 -2467 1907 -3999 3097 3333 -1373 3831
1060 3831 -3045 -2902 3045 -2567 3245 3443 -3194 2381 -2606 -3322 3444 -2129 2045 2950 -4351 1233
1076 1233 -2293 -3079 4038 -1649 1125 2618 -4733 1436 -570 -2614 4406 -1019 431 2536 -4193
1091 -4193 1920 1011 -2162 4493 -1211 -967 2813 -3727 1531 1286 -2841 3622 -1677 -1803 2599 -3827
1107 -3827 1070 1445 -3671 2692 -1272 -2009 3793 -2755 742 1744 -3660 2661 -182 -1638 3960
1122 3960 -2091 29 1938 -3676 2664 965 -1290 3954 -2332 -1206 1884 -3509 2272 1365 -2089
1137 -2089 3046 -2949 -2131 2250 -3074 2186 2086 -2778 2168 -2613 -2249 3102 -1911 2371 2536 -3185
1153 -3185 1731 -1878 -1708 4223 -914 1846 2282 -4019 1065 -957 -1774 4251 -691 736 1341 -4820
1169 -4820 871 -412 -1621 4453 -1343 -975 914 -4683 1101 1160 -1537 3938 -1005 -1532 1250 -3838
1185 -3838 1603 2179 -1132 4013 -1320 -2360 2076 -2790 1577 2846 -1834 2556 -1229 -2585 2040
1200 2040 -2460 1155 2465 -2723 1507 -1226 -2991 2872 -1669 470 2294 -3031 1259 -496 -2177
1215 -2177 3234 -1229 145 2559 -3050 1164 673 -2031 3269 -802 -483 2298 -2789 1095 1055 -2479
1231 -2479 2565 -1179 -1545 2304 -2644 696 1111 -2757 1812 -1175 -1502 2889 -2011 450 1427 -3226
1247 -3226 1655 45 -1255 3288 -1246 271 1632 -3259 1573 546 -1188 3463 -1203 -988 1382
1262 1382 -3237 1198 1412 -1417 2530 -1548 -1904 1020 -2663 1446 1895 -1912 2162 -1742 -2331 1889
1278 1889 -2065 1822 2350 -1859 1825 -1305 -2101 2685 -731 1513 2320 -2494 1057 -1170 -2138 2834
1294 2834 -658 637 1805 -3174 313 -679 -1961 3222 -717 -417 1430 -3488 33 231 -1542 3068
1310 3068 -383 -595 1506 -2927 657 1288 -1116 3088 -389 -1468 1701 -2324 562 1765 -1395
1325 -1395 2147 -389 -1882 1410 -2204 187 1970 -2065 1713 -473 -2254 1970 -1599 261 1926
1340 1926 -2418 1309 -153 -2005 2302 -1021 -291 1739 -2012 1194 700 -1775 2447 -799 -829 2018
1356 2018 -1989 914 950 -1994 1778 -1101 -1358 1722 -1892 688 1190 -2312 1366 -843 -1724 2199
1372 2199 -1354 610 1532 -2262 1181 -312 -1377 2654 -651 262 1473 -2477 749 221 -1324 2751
1388 2751 -445 -648 1247 -2783 467 647 -1376 2408 -923 -1460 994 -2634 515 1254 -1326 1869
1404 1869 -893 -1703 1239 -1702 927 2009 -1087 1790 -831 -1682 1663 -1029 1006 2240 -1488
1419 -1488 1287 -833 -2152 2007 -651 840 1940 -1993 321 -403 -2028 1921 -581 -45 1516
1434 1516 -2354 4 -5 -1680 2109 -148 -233 1601 -2087 34 766 -1342 2273 -7 -829 1725 -1751
1451 -1751 77 1345 -1289 1882 -475 -1240 1468 -1635 40 1309 -1446 1182 -163 -1740 1303
1466 1303 -1338 -98 1571 -1933 1033 220 -1516 1897 -692 -287 1627 -1712 954 559 -1182 1869
1482 1869 -748 -662 1369 -1363 793 803 -1373 1516 -818 -1166 1219 -1580 411 1126 -1519 961
1498 961 -647 -1281 1599 -1026 561 1361 -1639 716 -298 -1256 2102 -385 467 1237 -1678 636
1514 636 -33 -1155 2233 -164 -142 1101 -2204 142 199 -1050 1955 -458 -740 699 -2224 189 741
1531 741 -863 1787 -136 -970 958 -1710 290 1365 -828 1655 -246 -1298 969 -1204 477
1546 477 1644 -665 1215 -13 -1663 1093 -847 407 1666 -1370 485 -348 -1974 1342 -514
1561 -514 -147 1394 -1655 167 -65 -1471 1629 -119 -229 1392 -1362 2 532 -1034 1609 144
1577 144 -432 1372 -1480 181 910 -1263 1283 -169 -804 1093 -1109 63 955 -1393 663 -275
1593 -275 -1228 1141 -970 -8 1174 -1511 590 -36 -1370 1568 -641 -302 1464 -1382 424 701
1609 701 -837 1554 -168 -495 1054 -1259 452 768 -1016 1308 -381 -984 781 -1189 67 980
1625 980 -1263 871 -356 -1221 964 -1120 344 1144 -1130 715 -312 -1233 1136 -403 384 1357
1641 1357 -1258 577 -53 -1214 1416 -97 -17 1196 -1354 -34 85 -1220 1493 -120 -541 906
1657 906 -1540 -178 483 -785 1529 44 -884 688 -1366 -61 955 -624 1459 -83 -868 957
1673 957 -860 121 1377 -603 1141 88 -1264 871 -799 190 1280 -860 643 -69 -1312 857
1689 857 -489 -67 1333 -944 337 130 -1280 884 -388 -177 1254 -872 3 392 -986 1200
1705 1200 25 -365 1277 -945 208 817 -995 1052 117 -627 916 -1054 -88 616 -1208 720
1721 720 -82 -870 746 -827 -56 809 -1085 315 19 -1123 977 -291 -38 905 -1081 426 223
1738 223 -712 1202 -293 -389 923 -922 360 830 -972 1067 -305 -577 873 -1019 1 836 -750
1755 -750 798 -192 -1009 754 -863 91 948 -760 683 31 -1108 1042 -582 318 1239 -784 419
1772 419 -90 -852 874 -15 94 944 -1000 189 -226 -1143 1024 -315 -209 1043 -1193 -124 185
1789 185 -1056 936 -94 -398 646 -1072 -21 632 -705 1045 295 -562 835 -942 80 853
1805 853 -548 995 -21 -700 678 -789 -22 1014 -691 585 52 -1179 784 -508 -235 895
1821 895 -1004 363 -21 -1134 832 -190 -179 1173 -734 180 367 -836 745 -245 -436 1217 -876
1838 -876 192 447 -997 916 -145 -595 869 -839 73 602 -928 374 -54 -1007 973 -574 -59
1855 -59 859 -827 314 11 -746 906 -105 48 1050 -748 354 365 -700 1178 -3 -267 826
1872 826 -1058 157 341 -855 724 98 -518 603 -921 -13 703 -618 780 59 -920 463 -587
1889 -587 26 866 -656 561 -210 -1072 597 -648 22 1092 -709 457 41 -950 931 -372 -12
1906 -12 1070 -916 201 -111 -1126 798 -38 -221 877 -728 15 80 -966 770 -20 -309 954
1923 954 -874 15 312 -836 983 15 -613 644 -604 -159 575 -572 654 281 -464 730 -558
1940 -558 -382 735 -808 509 169 -866 625 -594 -454 631 -660 317 246 -1020 705 -265 -273 603
1958 603 -821 370 448 -894 778 14 -348 898 -700 148 555 -707 798 -54 -652 710 -625
1975 -625 120 605 -740 406 -14 -530 694 -385 -8 375 -796 555 -53 -863 767 -374 -206
1992 -206 967 -698 363 192 -645 878 -104 -201 677 -711 -89 401 -744 1065 -52 -410 536 -851
2010 -851 -175 407 -713 662 -168 -684 573 -850 -274 543 -754 630 -86 -867 528 -632 6
2027 6 634 -330 582 -9 -801 716 -411 -109 622 -514 237 64 -733 632 -293 -199 802 -701 37
2046 37 -37 -900 484 12 -438 761 -799 46 263 -699 802 54 -163 685 -543 -179 476 -561 693
2065 693 206 -628 842 -429 -36 567 -637 370 235 -871 424 -307 -421 530 -677 218 50 -840
2083 -840 613 -166 -332 654 -573 224 391 -689 847 -134 -130 525 -485 244 462 -393 794 -143 -652
2102 -652 829 -633 144 585 -631 507 -129 -653 663 -518 -16 588 -642 242 36 -885 549
2119 549 -413 -12 606 -584 322 187 -654 628 -122 27 804 -592 112 183 -577 602 -55 -81 507
2138 507 -630 -77 272 -534 776 -35 -334 517 -705 -175 461 -524 575 17 -506 626 -507 -87
2156 -87 566 -400 395 -18 -466 697 -335 128 856 -357 262 142 -808 543 -335 -197 627 -696 192
2175 192 159 -628 230 46 -422 745 -650 -68 94 -631 424 -29 -268 636 -287 -6 590 -627 529
2194 529 11 -240 574 -620 -174 571 -587 474 199 -598 562 -348 -267 483 -621 248 17 -599 377
2213 377 -169 -203 720 -481 266 319 -539 676 -1 -173 677 -524 186 323 -409 650 -19 -352 415
2232 415 -707 -65 415 -405 445 5 -465 424 -592 -300 302 -639 422 -78 -385 415 -217 -79 645
2251 645 -340 171 17 -611 539 -367 15 758 -431 119 149 -525 421 -105 -106 579 -487 -57 156 -712
2271 -712 586 -20 -458 522 -454 -216 321 -668 534 187 -415 336 -233 -195 333 -381 476 282 -392 482
2291 482 -393 -58 688 -325 71 86 -562 459 -279 -249 756 -336 219 256 -642 497 -109 -106 736 -474
2311 -474 19 200 -539 356 -44 -250 503 -239 253 442 -663 364 -10 -370 678 -215 -39 590 -443
2330 -443 504 79 -348 426 -272 -388 393 -566 272 278 -530 498 -149 -73 418 -455 33 201 -440 336 11
2351 11 -175 483 -136 -111 251 -466 523 133 -303 696 -308 36 390 -480 384 84 -484 278 -296 -182
2371 -182 259 -462 426 155 -442 516 -304 -158 509 -465 93 134 -556 442 -168 -116 665 -210 172 355 -456
2392 -456 511 165 -273 464 -437 -30 187 -521 244 17 -347 240 -601 -195 295 -523 254 81 -298 450
2412 450 -339 -127 273 -277 304 324 -429 511 -323 -283 342 -410 435 140 -301 408 -281 -298 455 -253 143
2433 143 90 -549 385 -137 -86 455 -126 134 319 -488 159 -111 -372 445 -154 -183 469 -424 207 96 -230
2454 -230 325 -315 38 420 -265 323 -23 -449 376 -351 -198 518 -233 233 130 -506 292 -223 -278 382
2474 382 -346 103 265 -722 491 -112 -178 485 -254 -252 286 -370 307 141 -159 622 -360 -196 222 -391 190
2495 190 93 -339 375 -302 -23 240 -408 500 132 -289 336 -410 -120 529 -310 333 236 -465 275 -130 -148
2516 -148 607 -320 -5 199 -445 393 -204 38 449 -166 155 216 -505 83 -159 -96 585 -364 225 172 -441
2537 -441 257 -116 -187 276 -278 -197 221 -349 268 176 -328 518 -354 -89 529 -278 17 211 -325 263 -307
2558 -307 -318 227 -309 216 15 -334 257 -198 -259 408 -248 87 253 -354 308 -49 -332 475 -307 58 233
2579 233 -353 362 -104 -231 262 -194 100 258 -454 317 -181 -306 497 -439 -92 465 -488 95 38 -376
2599 -376 298 -247 -212 228 -314 -47 3 -294 555 -301 -220 302 -387 116 291 -504 196 -45 -245 461 -334
2620 -334 144 -42 -609 366 95 -79 322 -337 -52 30 -236 198 81 -344 43 -315 -193 291 -345 245
2640 245 247 -283 188 -201 -119 416 -217 324 231 -220 337 -162 -90 303 -176 41 135 -458 161 -17 -66 216
2662 216 -214 -161 47 -578 163 228 -355 375 -153 -110 286 -229 152 229 -385 244 -176 -60 81 -224 227
2683 227 123 -288 417 -486 -171 29 -237 299 -52 -371 403 -162 -159 239 -236 227 -25 -485 182 24 -140
2704 -140 313 -557 119 458 -294 283 85 -174 417 -183 97 190 -305 226 33 -79 275 -250 43 203
2724 203 -256 179 -145 -394 523 -294 -83 425 -206 34 139 -100 368 -193 -103 396 -375 116 115 -309 462
2745 462 102 -138 321 -351 25 49 -455 261 -39 -263 96 -217 22 222 -236 191 119 -107 192 -261 -153
2766 -153 39 -248 109 -107 -60 153 -142 -178 326 -118 268 183 -403 153 -161 19 156 -414 140 296 -420
2787 -420 193 -131 -217 342 -291 93 -5 -292 128 3 -129 189 -166 104 159 -384 153 202 -98 262 -140
2808 -140 -157 110 -252 295 45 -445 193 -184 94 457 -200 115 25 -414 183 13 -38 183 -171 -32 58
2829 58 -245 141 -70 -19 440 -194 85 13 -303 229 273 -53 356 -162 184 292 -61 338 -118 -284 223
2850 223 -294 -4 302 -265 231 -122 -457 348 -243 -64 170 -241 42 82 -272 17 -13 94 234 -82 129
2871 129 105 -324 142 -118 -212 284 -226 -54 117 -294 33 -182 -154 274 -133 -260 129 -487 351 -101 -90
2892 -90 312 -230 174 150 -214 212 102 -170 202 -147 -8 224 -356 204 100 -104 240 146 -186 153 -152
2913 -152 121 -30 -291 260 -193 -178 326 -312 5 61 -190 241 -69 -24 -6 -86 -35 234 -308 267 139 -128
2935 -128 336 -165 -32 403 -374 87 149 -209 300 -58 115 165 -305 141 67 -222 180 -191 -277 244 -381
2956 -381 110 47 -160 238 -80 -109 293 -169 -66 -123 -232 334 137 -300 218 -384 -111 90 -175 370 141
2977 141 -96 289 -306 -243 30 -307 171 152 -72 70 -75 -159 195 -351 174 202 -224 238 64 68 139 -180
2999 -180 326 -95 -212 402 -172 -195 266 -375 66 28 -298 -55 -43 -171 438 -242 -82 133 -332 288 -160
3020 -160 -196 439 -234 -44 171 -380 77 156 -91 230 -95 -176 167 -330 54 5 -215 338 -239 -175 410 -259
3042 -259 47 215 -330 59 -76 -151 16 -218 203 124 -169 298 -156 -238 245 -79 49 218 -247 140 -130
3063 -130 -19 457 -81 -15 400 -381 71 1 -249 136 -291 103 163 -279 307 -172 -106 227 -302 22 73 -96
3085 -96 35 43 -100 194 -40 -134 292 -272 -72 237 -285 331 -36 -86 276 -88 89 125 -171 75 55 -202
3107 -202 156 -313 26 110 -254 269 -128 -90 212 -139 -132 163 -77 255 85 -354 179 -136 -59 97 -296 138
3129 138 185 -225 157 -47 -117 314 -163 115 7 -241 131 136 -186 271 -252 133 182 -328 195 -88 -78 286
3151 286 -190 -49 164 -89 155 96 -173 236 -103 109 258 -291 349 5 -186 267 -68 -40 116 -220 160
3172 160 163 -224 151 -129 43 183 -186 59 -225 -350 283 -28 -236 110 -199 -190 8 -63 236 -92 -212 322
3194 322 -303 -256 168 -431 196 -39 -73 339 -250 85 -107 -287 253 -208 -236 278 -418 132 126 -321 138 10
3216 10 -292 206 -117 4 305 -276 72 178 -275 226 -21 -106 365 -189 118 13 -205 228 148 -100 200
3237 200 -327 163 -47 -457 275 91 -77 235 -112 -188 42 -319 39 -141 -14 264 -295 57 122 -99 161
3258 161 22 -43 165 -265 116 341 -285 310 -7 -320 226 -126 25 268 -117 69 156 -244 193 -51 -116
3279 -116 170 -162 -213 60 -151 43 -120 -107 136 -131 1 235 52 113 68 -111 456 -197 76 82 -323 91
3301 91 -144 -503 144 -94 -155 302 -321 4 24 -167 249 -134 -20 253 -367 104 -20 -137 180 4 -331
3322 -331 155 -52 -5 233 -298 281 141 -18 184 -165 -125 79 -261 -89 -92 -175 119 -313 21 298 -93 142
3344 142 110 -233 322 -218 -213 299 -130 46 91 -223 99 1 -45 464 -316 -47 178 -170 363 -104 -41 164
3366 164 -186 -68 -44 -299 293 -28 -153 363 -314 75 197 -284 145 -96 -97 67 50 70 229 -98 140 206
3388 206 -68 82 -190 166 34 -140 58 21 -317 232 -99 -98 169 -228 291 221 -337 331 -202 -145 113 -62
3410 -62 14 -26 -133 47 -113 -145 137 -154 79 268 -135 319 92 -235 206 -140 -162 179 -332 -25 71 -282
3432 -282 148 -339 -34 407 -255 112 97 -333 3 14 12 403 -309 -32 182 -73 251 -45 -107 161 -263 210
3454 210 228 -59 106 -1 -196 226 -192 -182 45 -218 18 112 -397 155 -343 -92 14 -155 123 -136 -289
3475 -289 149 -36 -153 193 -110 -22 22 -271 156 -56 -189 345 -44 -68 -97 -180 38 -14 -62 321 -349 222
3497 222 40 -300 95 -66 -112 -49 62 -117 29 -184 84 -231 -201 -79 12 10 134 -235 116 146 -196 279
3519 279 -254 5 94 -144 242 42 -173 191 24 -42 256 -184 38 79 -257 223 -107 -1 141 -308 202
3540 202 76 -301 230 55 -206 47 -164 3 -69 -262 36 48 -258 198 -76 -169 63 -227 184 137 -172
3561 -172 172 -386 -39 152 -24 47 97 -114 77 -130 -185 318 -118 115 -27 -264 101 -119 17 249 -475
3582 -475 140 -23 -257 134 -169 -140 177 27 70 100 -134 185 -45 -418 143 -186 -85 16 -377 185 -9
3603 -9 -398 353 -151 -70 426 -187 149 80 -88 430 -197 35 236 45 -29 69 -240 261 100 -162 300 -358
3625 -358 287 2 -271 279 -126 -115 -18 -184 -48 58 -238 -33 -133 -140 372 -68 -38 -129 -426 210 47 -407
3647 -407 -147 -22 63 -39 -31 -64 -20 -303 274 -34 -175 341 -266 119 54 -167 65 -156 -58 360 -227 63
3669 63 -78 -213 -22 -51 -80 323 -275 -67 436 -188 190 9 -160 164 -244 57 -25 -313 119 -269 -143
3690 -143 173 -78 -272 393 -206 -21 -44 -106 29 -156 11 162 -280 -82 49 -123 101 -74 -28 113 -101
3711 -101 151 141 -236 2 -135 44 175 -218 -80 209 -317 53 26 -175 144 -20 154 100 -146 -64 -145 -216
3733 -216 178 92 128 16 -288 61 60 -231 30 -296 -202 181 -271 -112 113 -276 205 116 95 238 -353 104
3755 104 94 -218 140 -95 -25 145 -192 114 141 -219 68 -189 -111 196 -103 -55 80 -302 118 -55 -129 202
3777 202 134 20 293 -116 124 -93 -161 61 109 -92 304 -38 -52 158 -327 296 -141 -12 222 -355 159
3798 159 42 -200 206 -91 -237 45 -420 130 201 -301 219 58 -44 293 -209 -82 110 -246 117 94 -153
3819 -153 264 -60 2 43 4 -172 16 -275 350 -93 -197 -30 17 100 57 -224 139 -141 -59 284 -168 -19
3841 -19 -7 -45 145 21 103 195 -156 -25 192 -151 277 48 8 163 -49 173 41 -207 153 87 -308 235
3863 235 -178 -133 180 -14 9 154 -84 193 39 -122 150 -81 5 -91 -133 48 -159 -28 254 -97 2 124
3885 124 -239 92 -95 -142 168 -52 126 -113 -332 102 -44 -97 57 -214 -57 199 -98 116 -115 -161 108
3906 108 -46 -114 85 -136 58 -34 -12 226 -38 -147 55 -165 185 -142 -413 271 -67 -139 45 -101 -4 -6
3928 -6 60 66 -148 -166 186 -141 0 110 -126 193 -42 -237 171 -199 -162 249 -135 177 -111 -189 87 -99 87
3951 87 -14 -242 258 -138 -185 231 -235 19 110 -292 -87 174 -141 81 -89 -181 86 -234 87 27 -278 412
3973 412 -90 -173 253 134 85 303 -102 179 97 -120 126 -80 -12 64 -105 194 -180 -149 217 -171 -140 164
3995 164 2 115 -108 -5 189 -101 -102 138 -113 225 -64 -195 112 -327 -200 164 -67 -52 189 -161 315
4016 315 -230 14 62 -77 -26 27 -313 -57 13 -120 123 -100 128 192 -67 85 11 98 184 19 160 84 -217
4039 -217 70 179 -248 46 56 -32 102 -57 282 12 -257 183 -233 -191 270 -19 -13 111 -254 131 -239 -2
4061 -2 133 -265 -37 45 -217 121 -185 37 105 -52 10 164 -125 280 41 -107 181 -137 -24 -79 -113 89
4083 89 21 -75 39 -100 -127 43 -172 146 -28 -130 97 -275 4 336 -119 87 16 5 93 -30 -289 215
4105 215 -128 72 12 -304 13 -77 -1 66 -145 18 -1 -202 199 82 -216 288 17 -125 66 -104 29 -31
4127 -31 -165 97 129 -85 112 -196 305 37 -52 230 5 -87 287 -116 75 299 -335 262 -123 70 107 -192
4149 -192 -21 131 -401 0 -134 -100 125 -8 -261 44 -292 106 -15 -308 212 -184 -101 207 30 124 46
4170 46 -243 275 -172 58 334 -102 -80 59 -77 68 -193 17 261 -401 93 274 3 74 15 -129 239
4191 239 -194 -54 116 -310 187 -122 -203 161 -199 -25 211 -333 116 -29 -125 184 -18 -74 46 -109 166
4212 166 -29 -187 116 -231 94 110 -292 86 48 -307 323 -64 -150 217 -248 -143 -18 -128 176 -33 -138
4233 -138 156 -193 124 43 -235 265 152 -23 219 -66 38 70 -134 127 103 -75 213 -149 100 279 -137
4254 -137 216 -129 -223 286 -155 -21 236 -226 76 246 -210 64 84 136 300 -364 162 209 -182 152 -103
4275 -103 -142 -7 -119 -129 132 -83 231 -184 -171 -59 -355 140 128 -83 100 -187 -227 -23 -122 -98 61 -84
4297 -84 144 -181 -158 189 -116 -16 276 -26 -163 35 -230 16 -128 -52 39 -304 54 38 -278 -9 -136 -224
4319 -224 160 -148 -129 -92 -124 -14 46 -169 143 -64 -94 162 -184 336 -76 -25 225 -198 -47 180 -118 244
4341 244 102 -184 140 -74 -176 53 -182 195 -65 -441 78 238 -178 143 -166 146 85 -150 215 -49
4361 -49 10 242 -180 136 185 -417 307 139 -114 126 -98 -129 -93 -121 53 99 -201 306 -180 -109 148 -182 100
4384 100 -107 -115 314 -188 -159 230 -245 141 -18 -10 45 14 -86 167 -158 124 96 -265 82 -118 -184 411 -97
4407 -97 -108 255 -155 187 -254 77 33 -118 -25 286 -12 213 -33 -143 248 -165 -16 3 -294 -24 1 -22
4429 -22 219 29 -127 246 -168 131 44 -116 158 -160 -82 -48 -280 30 67 -205 66 -174 -115 284 -113 -5
4451 -5 -53 -41 215 -169 -114 200 -94 -4 52 -150 38 87 82 227 -98 -3 214 -229 58 63 -159 254 -27 67 122
4476 122 -156 144 -52 -61 248 -174 -2 210 7 -53 83 -146 125 -7 67 407 -189 98 88 -196 123 -40
4498 -40 -123 89 -86 4 -9 -206 425 -14 -242 114 -286 27 117 -83 175 1 -52 104 18 -112 12 -151
4520 -151 124 -108 -84 252 -139 104 245 -133 -44 -114 -258 87 -85 -123 191 -237 -58 55 -90 152 -213
4541 -213 91 150 -170 55 163 -114 48 79 -7 220 -61 57 253 -73 118 -77 -149 0 68 38 162 -137
4563 -137 -45 12 -97 -85 20 -106 154 97 -10 -13 -267 141 90 -229 233 -25 17 148 -75 -80 55 39 172 -16
4587 -16 36 78 -380 192 61 -96 179 9 -8 128 -205 -7 90 -211 102 93 10 160 -269 -83 -52 -262 130
4610 130 162 -6 185 -364 -19 -88 -307 149 -104 -88 99 -285 -12 -5 -21 305 31 -185 164 -292 34 133
4632 133 78 48 57 -246 29 -62 157 290 -216 65 -53 -237 187 -20 52 37 -156 120 75 -188 89 85 47 162
4656 162 -338 141 -42 -65 10 -114 -74 145 -6 69 -51 -85 21 -198 -218 158 3 -33 -6 -185 18 35 -38
4679 -38 168 -78 -112 94 -205 -34 -100 -208 12 -197 77 17 -202 166 -2 -181 193 -115 49 63 -167 22
4701 22 -37 -230 -8 -20 -366 213 -159 -170 111 -55 48 276 -197 297 -193 -35 133 -186 -52 -1 -125 24
4723 24 9 -26 92 -190 169 179 -84 200 -142 -143 243 -37 32 -52 -243 139 76 -116 115 -65 71 93 27 -1
4747 -1 -65 -25 107 11 36 8 -131 206 -98 -71 98 -278 -100 82 -146 192 -57 -142 207 -96 -58 46 -154
4770 -154 44 143 -89 268 -56 -81 64 -211 198 45 -1 295 4 47 109 -118 86 63 -115 45 14 46 238
4793 238 71 -32 79 -40 232 37 -73 -33 -302 -207 154 -146 114 -37 -46 251 -192 -16 -7 -171 -46 123
4815 123 84 161 -156 -21 294 -58 146 217 -164 -78 156 -92 116 58 102 28 -4 127 72 -212 185 -143 68
4838 68 198 90 -80 9 3 -88 -100 38 184 -246 166 -18 -149 -20 30 -12 130 -41 87 -81 -191 150 -135
4861 -135 43 103 -48 -148 176 -144 -64 27 21 26 -176 164 -28 -112 -81 -33 -39 19 -23 101 -49 -56 81 50 -8 -101
4887 -101 -9 39 117 -97 -28 -146 -91 61 -148 62 151 -261 -6 -25 -252 252 -112 88 106 -82 46 89 52
4910 52 249 -116 -111 91 -9 -8 -74 -10 66 -175 49 64 -176 139 -43 -71 -128 -9 -144 42 -231 -148 346 -117
4934 -117 40 189 -225 -11 -58 63 10 -150 198 -88 -11 43 -65 -158 239 -183 8 -96 -22 231 -231 -69
4956 -69 61 -5 33 101 -74 86 148 18 86 -153 -1 39 -158 201 -216 -158 -105 -36 -113 84 -139 45 -47 -10
4980 -10 131 -77 39 200 -197 69 -64 -194 148 -96 -26 -57 -124 3 -5 -59 182 194 110 133 -134 137 37
5003 37 -317 37 -14 130 116 -14 -177 -113 -141 157 -78 -143 97 -81 86 138 -174 -119 122 -258 32 36 -90
5026 -90 128 -420 -7 48 -283 -69 -74 -27 149 -236 18 61 -195 208 -135 17 287 -157 -83 89 -155 10
5048 10 81 -119 30 -128 -25 -180 -73 178 -3 -198 151 -185 -60 68 -32 212 -120 130 133 -24 34 -52
5070 -52 -145 -12 109 -56 79 -5 1 69 -115 82 12 28 198 -25 -129 318 -46 109 -37 -175 -17 -118 199
5093 199 239 -147 -134 28 -233 185 -111 -96 70 -212 100 230 -222 -14 -183 101 17 122 -10 191 28
5114 28 52 -122 -51 127 -248 -163 -78 -61 -108 51 -143 240 -24 -238 181 98 -105 -93 -45 138 12 172 24
5137 24 0 132 43 -352 -176 -16 -130 12 -126 -69 22 -116 56 -83 -44 223 -21 -5 -10 -169 -150 -65 -203 33
5161 33 -132 -23 12 -37 181 154 -48 194 -32 -50 107 -188 91 72 -69 109 -196 16 154 -94 70 218
5183 218 29 129 77 -107 -9 -179 -77 52 -305 175 34 -221 165 -20 -154 359 -38 106 98 -74 122
5204 122 -82 -14 51 -190 -55 -201 -263 25 -90 -158 205 -32 -241 132 -64 146 51 -161 239 -217 -214 42
5226 42 37 -82 -63 -240 31 -49 -146 135 67 -43 123 -82 42 -199 -82 167 -214 -72 -76 -117 -105 -49 -120 257
5250 257 -56 1 98 -22 52 -50 73 238 -255 -12 112 -177 -90 91 -77 154 98 -68 60 -127 39 212
5272 212 -133 99 -104 33 31 -41 -2 -273 -32 -58 -88 -337 121 -230 112 104 -143 101 -115 -85 153 -211 -4
5295 -4 -166 -214 105 122 -37 200 -183 -162 36 -77 118 31 -7 165 -31 55 272 -74 -87 -53 -141 53 -176 -154
5319 -154 150 39 19 -43 -93 -34 75 -61 126 17 -127 -25 127 79 -185 -165 30 6 -185 122 -75 64
5341 64 -70 -71 -39 -150 106 96 -212 -97 -108 59 121 -179 108 26 -115 56 -79 -217 -49 -110 36 36 -25 31
5365 31 -108 -223 137 106 -53 144 -159 52 -138 -176 84 -82 -110 14 -117 144 -68 -276 10 -21 -211 156
5387 156 -96 31 51 26 -15 16 -176 193 -41 -9 175 -33 91 -63 -207 -81 -339 -57 207 -135 18 140
5409 140 -139 -201 -120 -15 161 87 43 109 -202 154 -2 40 183 -237 157 -52 -3 77 154 -37 -2 -90 288 43
5433 43 -237 -43 114 -56 56 -82 94 102 18 204 55 -52 -5 -113 -107 259 -103 -108 -85 44 230 -26 -9 143
5457 143 -289 -136 -63 106 -37 -162 63 103 -117 53 54 23 -24 -102 -2 -104 -101 65 59 -132 -15 -153 -6 -15
5481 -15 -52 -50 44 156 90 168 -267 -16 111 83 90 80 62 82 96 241 -39 -107 59 -177 37 199 -17 62 156 -90
5507 -90 96 -13 13 73 -203 60 56 -163 90 -80 -25 -52 -273 -16 64 -84 25 -51 0 -41 6 208 55 -206
5531 -206 3 28 -101 91 -108 145 183 54 30 130 59 90 47 62 -6 -353 64 -79 -105 -195 -11 -53 124 -220
5555 -220 45 11 -23 220 32 -91 -44 68 -21 -117 -107 42 -67 -2 127 44 16 10 -29 289 -188 -2 77 -118
5579 -118 -65 22 -16 -9 -141 -155 191 56 -61 -4 -29 125 -61 158 102 -129 -165 50 -126 20 120 -146 -40
5602 -40 -95 77 -26 -70 113 -1 -122 -41 -55 -135 -28 -150 -70 7 -143 18 -204 -51 198 -33 6 -164 -52
5625 -52 247 -11 -373 199 169 57 -46 -261 -137 182 -82 31 -64 93 80 -132 96 100 7 55 -107 -257 36
5648 36 -116 64 53 5 199 65 95 151 -20 172 106 -73 178 -4 9 245 -254 194 253 86 -235 -169 -37
5671 -37 87 -90 -56 -57 -64 140 -24 17 173 -47 95 16 -144 229 158 -198 57 160 121 62 -179 26 -40 -47 -53
5696 -53 87 -40 -134 -107 62 -127 -113 44 -119 -149 -50 -210 26 34 -378 31 -2 -146 93 -165 181 160 -218
5719 -218 102 8 18 81 -81 49 129 -72 150 -42 -99 -45 -2 117 -19 -171 234 -70 -282 195 -23 -11 83
5742 83 -294 -52 -52 -104 52 -20 100 -16 50 -5 126 -107 25 29 97 144 -203 61 117 -58 -230 -10 -101 57
5766 57 -8 -87 113 80 41 126 74 194 -34 8 49 -30 147 69 -87 -65 10 -17 142 -30 122 -119 -166 60 -210
5791 -210 -152 33 -14 77 106 -191 -264 -86 -125 -14 269 -14 1 -59 -132 -94 -34 -62 135 -1 -27 -151 37 13 -101
5816 -101 -17 6 41 177 -63 51 44 -139 -26 -46 -155 42 -38 63 73 -129 124 -202 52 6 31 148 -198
5839 -198 -245 -40 41 -91 -34 -89 -198 145 58 149 -175 -23 -3 108 -46 130 -26 188 -117 2 -10 -177 -26
5862 -26 67 -35 -73 35 39 -148 2 21 65 -145 -84 226 90 19 -76 4 144 109 -233 -150 -197 20 -162 2 -76
5887 -76 15 133 -26 -195 189 180 -129 73 33 35 -5 -13 58 99 55 30 -185 -44 266 -46 148 138 -26 -30 122 105
5913 105 -100 176 122 29 -182 50 32 55 96 42 122 -167 -88 -20 -35 79 162 -208 172 -191 -145 -50 -86 -35 -129
5938 -129 37 -45 215 -234 -32 64 -29 -57 46 29 151 -106 -30 63 -28 80 21 -16 104 65 26 27 -107 -122 12
5963 12 -1 -109 -224 -105 114 -7 -132 71 219 19 9 224 164 -23 -41 -1 -45 48 -31 87 117 -214 117
5986 117 55 -113 -30 -29 120 -16 -138 51 43 118 115 -76 216 55 22 39 -4 -79 -150 -160 -25 -121 27 -159 -23
6011 -23 -180 149 -47 -43 -19 -14 124 -119 -17 -32 -158 112 -92 -161 142 149 -129 48 -83 125 -18 -27 -24 156 3
6036 3 -162 -65 -135 36 31 26 -139 1 194 -2 -65 257 -118 84 113 -119 21 -51 -204 57 56 -68 62 51 153
6061 153 113 -14 -32 -62 68 -100 69 -137 151 50 240 -165 21 -87 97 69 177 -8 -59 132 -353 62
6083 62 -195 74 -36 -86 -22 115 -173 103 28 24 160 -62 165 5 -201 40 -157 52 106 -123 -77 -101 -16
6106 -16 27 -42 16 124 55 -19 33 35 -39 107 4 103 -170 25 69 -102 -42 -133 -103 70 24 37 58 97 142 -38 52
6133 52 -140 -24 111 42 -37 -63 -96 60 233 -243 -22 226 -25 -29 -68 27 -4 63 34 53 63 -45 153 61 215
6158 215 113 -14 18 14 -68 22 -131 -19 72 -68 199 138 95 -107 157 -13 -243 -112 87 -57 24 100 -63
6181 -63 24 -92 -93 114 -20 -78 72 69 61 71 -85 285 -50 -232 86 -100 86 -188 -29 -99 -60 81 117 -20
6205 -20 -97 99 188 -21 -171 -47 109 -32 -100 -78 48 84 26 54 58 159 45 272 -84 -3 3 -185 61 40 229
6230 229 -119 -177 138 34 -76 112 75 -67 297 -84 401 34 -71 3 94 -76 179 -31 174 222 49 -24
6252 -24 93 79 18 269 -194 42 32 -8 17 -122 -162 -114 65 80 -39 40 52 -143 85 -70 -184 -92 -66 122
6276 122 110 -49 -49 -175 105 -31 -9 30 314 -1 110 -211 18 85 216 109 -52 45 -111 -10 -145 10
6298 10 -121 -195 106 -3 -42 31 -29 43 -258 -44 43 6 -143 -56 -51 126 -126 101 328 -275 144 67 -98 138
6322 138 30 -172 150 145 -246 153 84 -16 -36 -34 -10 -108 -5 4 -190 -22 -37 104 109 27 179 89 -312 -40 1
6347 1 -40 -142 -50 -71 194 -46 -28 70 -19 44 -26 101 62 -18 277 -176 -15 -131 -105 46 15 -36 12 -42 5 -89
6373 -89 -87 -5 -21 -124 2 29 229 72 -50 137 146 86 41 76 120 23 7 -27 -61 35 -117 152 -151 100 -145 13
6399 13 -87 -173 93 63 34 44 155 -110 50 -113 -116 162 33 -37 68 -158 17 43 135 36 14 57 158 -52
6423 -52 -89 -12 -142 73 19 -125 -25 -7 -4 -116 -198 294 -82 53 84 -95 68 136 -158 76 -153 -110 92 -84
6447 -84 14 42 46 35 -140 30 -24 -218 93 -166 31 67 180 30 102 132 83 42 27 33 -133 -12 -190 -161 152
6472 152 -93 -44 -27 95 -56 -65 -92 -111 -126 -68 -82 -15 -111 -38 -45 -105 161 -80 -63 35 150 -123 -18 150 0 -23
6498 -23 151 62 157 -81 -13 25 -91 -15 15 69 -185 7 6 -105 -74 -137 78 10 48 -12 69 -76 81 -89 -80 46
6524 46 -58 183 -3 -117 30 231 234 181 -218 240 -29 41 102 -106 140 -12 -126 -50 -82 -149 -229 -106 93
6547 93 93 -24 -21 63 -184 -74 0 0 60 47 -47 44 175 13 -140 117 68 49 -125 -111 23 103 48 63 110 159 123
6574 123 -67 42 -124 107 -61 150 -28 -114 193 -103 134 112 -14 122 161 128 -16 -75 107 -79 -80 189
6596 189 103 129 162 -82 178 -87 113 -27 -52 41 238 40 29 44 -38 -35 64 90 31 78 -119 -23 -58 48 -32 -52
6622 -52 201 136 -34 -43 -126 -42 -1 13 -66 24 -188 -22 60 -5 99 65 -23 115 -26 91 -37 198 16 47 -134
6647 -134 98 -169 -29 -168 -225 166 -22 18 -39 136 56 55 34 112 5 -33 22 -231 -71 -129 19 248 -211 199
6671 199 23 28 -30 -210 276 40 7 25 116 -129 -21 64 -50 62 -29 50 86 33 -35 210 -270 100 -222 -210
6695 -210 -201 -53 48 132 -150 -79 32 35 239 12 134 -42 72 -50 -163 218 9 97 -7 84 -138 1 -250
6718 -250 -33 43 -100 -6 -80 -7 41 -135 144 195 -70 153 43 -131 80 -30 -107 66 -168 -38 47 -151 -22
6741 -22 37 -22 -96 58 222 -3 -132 -14 175 -92 130 13 -38 -6 -156 -37 -28 34 -71 -48 -124 -20 -199 58
6765 58 32 64 -135 -188 6 71 -1 -73 153 -23 27 28 9 50 72 78 122 -128 -187 12 43 125 26 112 -181 -116 27
6792 27 202 92 80 18 -72 150 -73 13 86 -88 76 33 -14 34 -58 -45 46 -53 3 -261 -50 42 -197 -83 -203
6817 -203 14 -39 -27 -53 51 -122 -44 61 85 103 136 26 156 -18 -71 -10 -211 -86 3 -167 -123 -84 -149 81
6841 81 -22 39 -6 -80 -72 208 0 116 26 -122 154 139 -94 122 -144 -51 177 -173 193 -73 184 61 -79
6864 -79 171 66 140 49 193 -85 -188 9 -73 -25 116 175 -2 -23 14 169 -16 23 -23 9 -75 -21 -18 19 -37 -1
6890 -1 -224 -130 -36 -31 -110 -125 4 -226 48 173 23 -24 -106 -14 37 50 51 136 -80 -70 155 -85 -54 46 -64 111
6916 111 -198 -4 275 -84 13 189 22 34 -84 124 98 140 -62 -287 79 25 -77 180 44 -105 57 135
6938 135 -66 54 34 -105 -81 26 39 20 -50 147 -130 88 34 96 -13 130 31 160 17 3 91 14 -9 -117
6962 -117 12 112 -120 26 -53 4 18 -15 -132 139 245 -216 25 151 -168 233 -102 -78 264 21 77 -1
6984 -1 227 -154 -2 -86 120 -6 2 5 -11 -22 169 144 152 -34 -119 -54 -192 107 -39 -2 -227 64 -4 12 80 105
7010 105 75 -197 190 -100 -208 32 -100 66 99 -108 22 -15 18 84 -41 108 -38 -91 61 29 126 192 -21
7033 -21 22 -40 -2 62 26 36 -61 176 20 -30 -72 -15 -115 -56 -73 -114 148 -81 -114 39 95 -6 38 34 135 252
7059 252 -115 120 58 -25 178 -101 109 100 68 55 -67 -21 19 33 -113 151 -7 68 15 47 80 -15 -227 -72 116
7084 116 3 -96 11 2 -48 -102 62 -111 -178 -38 -57 -90 -142 -96 143 22 11 79 -4 42 -53 83 201 -91 103
7109 103 112 -391 -71 -21 -179 112 -167 22 73 -211 -137 59 204 200 -136 -109 47 104 -52 41 53 -46 2 45 260
7134 260 -158 195 -94 -116 40 -125 112 73 60 -118 -8 -143 -25 4 -33 -56 -19 -56 -42 80 -21 -189 20
7157 20 -40 164 97 63 -135 34 -185 18 -56 -35 37 -46 21 -168 -49 -159 -11 2 -70 162 7 -56 -2 82 -56
7182 -56 47 -27 -45 59 -116 187 -112 150 192 -60 74 -72 -66 -121 -49 198 -42 -19 89 -32 -28 -214 -261 -38
7206 -38 -42 -16 177 -117 -27 247 -122 38 55 36 -111 129 -37 -50 -217 81 -51 -167 -79 -82 -65 19 141 -110
7230 -110 14 86 -88 82 -6 -19 32 -185 -82 189 84 -10 -20 -16 74 -11 74 -40 196 48 -184 -6 74 -72
7254 -72 -97 -115 95 48 25 -73 26 88 -105 89 -57 4 55 -145 41 -97 69 -16 235 138 -116 123 -54 -42
7278 -42 217 -53 -66 -39 -151 219 -102 36 -111 -66 93 91 119 58 -69 130 131 120 251 3 170 -5 259 -58
7302 -58 57 -28 -41 153 -3 168 -149 -43 73 147 -228 15 -10 1 28 -123 -109 78 224 3 -21 -55 122
7325 122 13 -20 -138 150 44 15 121 16 -27 -16 -16 -56 11 -15 14 134 78 -203 -62 -32 -51 -90 94 13 -155
7350 -155 13 141 32 -120 19 130 62 -170 -62 3 -177 68 153 239 -37 88 -15 -74 -80 -31 -170 -262 125
7373 125 -83 123 -68 -36 34 -38 9 -58 -124 -61 -57 39 54 -48 -64 10 53 54 12 155 107 -144 -99 -134 -102 -201 -83
7400 -83 -44 -178 -95 34 132 1 197 -12 16 12 22 -22 48 107 -221 24 -27 103 286 -7 71 208 63 105 50
7425 50 62 -148 -194 21 -130 14 195 108 16 184 53 66 -45 -49 82 2 -89 6 65 -116 38 54 71 -113 84
7450 84 141 -102 -212 -32 71 -117 -160 -114 -122 240 -24 90 -45 -163 53 -16 -153 34 -81 -13 -7 40 231 -19
7474 -19 8 189 -238 -79 26 12 -65 -111 -78 -305 -140 -79 134 43 -34 -81 -41 -59 11 75 8 44 140 40 -116 -30
7500 -30 117 33 -67 -115 -18 31 68 75 -42 14 0 -5 -91 36 -139 201 12 180 -55 -146 -110 -337 1 132 66
7525 66 -114 -22 -172 -187 -135 54 117 -50 -246 78 -14 117 -14 -49 184 -279 7 210 -181 -137 -57 141 43
7548 43 -25 30 -171 -121 40 -126 65 -14 -76 -29 -118 -159 -91 -191 2 -215 -147 123 34 7 -90 87 3 325 95
7573 95 32 51 68 23 -144 -252 108 41 -161 -58 150 -4 -68 -20 -8 158 -54 -12 106 117 15 -124 -97 -34
7597 -34 -109 -7 -44 -126 -142 -149 -43 -216 -10 67 -149 40 62 -104 67 61 12 -86 -143 -142 -101 16 -43 59 262 -4
7623 -4 -40 134 114 -45 -233 31 61 -169 87 33 -110 28 91 -27 -94 54 81 -93 127 -99 55 -38 -79 -25
7647 -25 76 -8 95 -34 -109 16 -91 3 -147 -9 65 -169 58 16 -135 -97 -70 -5 173 189 -174 51 54 -47
7671 -47 63 -165 29 50 -126 44 -61 -199 98 78 125 9 -23 -12 -140 276 118 92 -37 58 -61 9 103
7694 103 -114 158 -169 -149 -39 -182 -6 23 -84 -163 32 231 -4 241 263 -100 -67 -24 134 178 -56 89
7716 89 -11 320 137 181 28 298 109 22 185 -19 -209 -18 -95 101 123 -206 -40 106 -107 24 14 -8
7738 -8 213 28 -95 -25 239 -62 197 62 15 -90 47 -101 -93 -253 45 -216 1 -182 100 15 -113 -61 148
7761 148 158 42 30 -139 6 21 98 101 -120 51 -40 107 -10 -39 -212 -125 -95 33 136 -102 -43 159 48 -173
7785 -173 -34 -65 -104 -35 -15 -114 -53 117 158 -97 -56 -13 -234 -57 -211 -74 74 -175 -3 3 -78 -108 -132 -76 -67 -98
7811 -98 31 158 -70 9 83 -95 -105 224 67 -82 113 -24 -124 60 95 -55 115 89 59 -34 116 116 -106
7834 -106 11 -31 27 -113 -63 -301 -30 -17 -13 206 -48 120 161 -22 60 -11 -72 -13 3 136 -130 152 -89 23
7858 23 75 -2 -178 -12 -32 -41 92 6 -173 179 -40 -368 256 -47 -111 -1 -178 183 -147 -10 -85 -45 49 -89
7882 -89 -155 100 58 14 21 60 17 64 -50 148 -123 70 81 71 30 186 -8 123 -16 33 -80 -140 2 -160 78
7907 78 -55 106 -54 54 -142 -70 -164 187 -50 29 -78 47 -31 -42 -42 -67 91 -43 33 -213 -115 36 15 -127
7931 -127 -32 24 -114 -43 -96 76 4 5 63 -185 -15 -91 143 14 179 20 79 150 -119 94 89 42 131 -9 -207
7956 -207 -204 -222 -101 15 36 -4 -23 34 52 90 68 75 -60 -134 71 -128 109 -126 27 139 -91 22 -36 -86 76
7981 76 52 57 17 32 -5 48 -104 -36 15 22 49 -8 -6 -159 24 43 294 34 29 15 32 63 -70 -70 -171 -43 148 48
8009 48 -227 -35 62 87 -209 -151 0 -22 16 43 57 -2 136 -69 138 82 -9 116 -5 -70 -19 -91 -213 140 31
8034 31 21 -243 -116 -141 -82 -82 -7 -58 233 -3 -139 -136 -56 55 -63 108 -62 -38 126 209 -213 83 9 3 -53 -59
8060 -59 114 143 -312 43 -56 50 -125 -146 112 67 -87 100 104 -103 -29 171 134 111 -245 -24 167 -75 -6 51
8084 51 2 33 53 12 -167 -84 63 30 35 -60 19 19 121 -137 201 15 -100 62 -95 -200 28 15 -141 239 -171
8109 -171 103 0 -31 103 -14 -41 20 -234 42 31 46 36 -208 -54 -39 -93 -104 -26 -120 125 152 -100 51 36
8133 36 214 55 17 19 -29 108 12 -171 172 132 -23 -8 63 -45 -77 -241 51 -38 -1 44 186 138 74 -106 49
8158 49 -166 -59 83 68 -84 204 102 -97 -71 -83 58 -111 -28 -7 -288 -82 -54 -91 69 -47 -156 6 -10
8181 -10 -31 101 145 177 -149 -19 -7 253 -114 49
8191D9
##END NTUPLES=NMR FID
##END=
