##TITLE=1H_61-2021
 CDCl3, 8 sc, 
 30.07.2021
##JCAMPDX= 6.0         $$ Bruker NMR JCAMP-DX V2.0
##DATA TYPE= NMR FID
##DATA CLASS= NTUPLES
##ORIGIN= UXNMR, Bruker Analytische Messtechnik GmbH
##OWNER= root
$$ XWIN-NMR		Version 3.5
$$ Fri Jul 30 09:46:16 2021 Russian Standard Time (UT+4h)  she@DPX200
##.OBSERVE FREQUENCY= 200.131506
##.OBSERVE NUCLEUS= ^1H
##.DELAY= (6, 6)
##.ACQUISITION MODE= SIMULTANEOUS
##.ACQUISITION SCHEME= undefined
##.AVERAGES= 8
##.DIGITISER RES= 18
##SPECTROMETER/DATA SYSTEM= spect
##.PULSE SEQUENCE= zg30
##.SOLVENT NAME= CDCl3
##.SHIFT REFERENCE= (INTERNAL, CDCl3, 0, 15.7039)
##AUDIT TRAIL= $$ (NUMBER, WHEN, WHO, WHERE, WHAT)
$$ ##TITLE= Audit trail, XWIN-NMR		Version 3.5
$$ ##JCAMPDX= 5.01
$$ ##ORIGIN= Bruker BioSpin GmbH
$$ ##OWNER= she
$$ F:/spectra/data/she/nmr/H-F/1/audita.txt
$$ ##AUDIT TRAIL=  $$ (NUMBER, WHEN, WHO, WHERE, WHAT)
(   1,<2021-07-30 09:44:42.79 +0400>,<she>,<DPX200>,
      <created by zg, POWCHK disabled, PULCHK disabled
       configuration hash MD5:
       00 E9 B6 7A A2 85 ED C7 34 08 36 98 17 FE 4E 26
       data hash MD5: 16K
       F1 73 D9 A8 38 E4 5C FF CF 05 29 DD 42 45 B3 B6>)
$$ ##END=
$$ 
$$ hash MD5
$$ 08 F5 80 20 74 D0 96 C6 3D B5 51 F0 DF BF 7C 4E
##$RELAX= 
##$RELAX= 
##$RELAX= 
##$RELAX= 
##$RELAX= 
##$RELAX= 
$$ Bruker specific parameters
$$ --------------------------
##$DU= <F:/spectra>
##$EXPNO= 1
##$NAME= <H-F>
##$PROCNO= 1
##$TYPE= <nmr>
##$USER= <she>
##$AMP= (0..31)
100 100 100 100 100 100 100 100 100 100 100 100 100 100 100 100 100 100 
100 100 100 100 100 100 100 100 100 100 100 100 100 100 
##$AQSEQ= 0
##$AQ_mod= 1
##$AUNM= <au_zg>
##$AUTOPOS= <>
##$BF1= 200.13
##$BF2= 200.13
##$BF3= 200.13
##$BF4= 200.13
##$BF5= 200.13
##$BF6= 200.13
##$BF7= 200.13
##$BF8= 200.13
##$BYTORDA= 1
##$CFDGTYP= 0
##$CFRGTYP= 5
##$CHEMSTR= <none>
##$CNST= (0..31)
1 1 145 1 1 1 1 1 1 1 1 1 1 1 1 1 1 1 1 1 1 1 1 1 1 1 1 1 1 1 1 1 
##$CPDPRG= <>
##$CPDPRG1= <>
##$CPDPRG2= <>
##$CPDPRG3= <>
##$CPDPRG4= <mlev>
##$CPDPRG5= <mlev>
##$CPDPRG6= <mlev>
##$CPDPRG7= <mlev>
##$CPDPRG8= <mlev>
##$CPDPRGB= <>
##$CPDPRGT= <>
##$D= (0..31)
0 1.2 0 0 0 0 0 0 0 0.06 0 0.03 0 0 0 0 0.0002 0 0 0 0 0 0 0 0 0 0 0 0 
0 0 0 
##$DATE= 1627623882
##$DBL= (0..7)
120 120 120 120 120 120 120 120 
##$DBP= (0..7)
150 150 150 150 150 150 150 150 
##$DBP07= 0
##$DBPNAM0= <>
##$DBPNAM1= <>
##$DBPNAM2= <>
##$DBPNAM3= <>
##$DBPNAM4= <>
##$DBPNAM5= <>
##$DBPNAM6= <>
##$DBPNAM7= <>
##$DBPOAL= (0..7)
0.5 0.5 0.5 0.5 0.5 0.5 0.5 0.5 
##$DBPOFFS= (0..7)
0 0 0 0 0 0 0 0 
##$DE= 6
##$DECBNUC= <off>
##$DECIM= 32
##$DECNUC= <off>
##$DECSTAT= 4
##$DIGMOD= 1
##$DIGTYP= 9
##$DL= (0..7)
0 120 120 120 120 120 120 120 
##$DP= (0..7)
150 150 150 150 150 150 150 150 
##$DP07= 0
##$DPNAME0= <>
##$DPNAME1= <>
##$DPNAME2= <>
##$DPNAME3= <>
##$DPNAME4= <>
##$DPNAME5= <>
##$DPNAME6= <>
##$DPNAME7= <>
##$DPOAL= (0..7)
0.5 0.5 0.5 0.5 0.5 0.5 0.5 0.5 
##$DPOFFS= (0..7)
0 0 0 0 0 0 0 0 
##$DQDMODE= 0
##$DR= 18
##$DS= 0
##$DSLIST= <SSSSSSSSSSSSSSS>
$$ [...]
##$SUBNAM2= <"">
##$SUBNAM3= <"">
##$SUBNAM4= <"">
##$SUBNAM5= <"">
##$SUBNAM6= <"">
##$SUBNAM7= <"">
##$SUBNAM8= <"">
##$SUBNAM9= <"">
##$SW= 20.0188882624521
##$SWIBOX= (0..15)
0 0 2 0 0 0 0 0 0 0 0 0 0 0 0 0 
##$SW_h= 4006.41025641026
##$TD= 16384
##$TD0= 1
##$TE= 0
##$TE2= 300
##$TE3= 300
##$TEG= 300
##$TL= (0..7)
0 120 120 120 120 120 120 120 
##$TP= (0..7)
150 150 150 150 150 150 150 150 
##$TP07= 0
##$TPNAME0= <>
##$TPNAME1= <>
##$TPNAME2= <>
##$TPNAME3= <>
##$TPNAME4= <>
##$TPNAME5= <>
##$TPNAME6= <>
##$TPNAME7= <>
##$TPOAL= (0..7)
0.5 0.5 0.5 0.5 0.5 0.5 0.5 0.5 
##$TPOFFS= (0..7)
0 0 0 0 0 0 0 0 
##$TUNHIN= 0
##$TUNHOUT= 0
##$TUNXOUT= 0
##$USERA1= <user>
##$USERA2= <user>
##$USERA3= <user>
##$USERA4= <user>
##$USERA5= <user>
##$V9= 5
##$VALIST= <valist>
##$VCLIST= <CCCCCCCCCCCCCCC>
##$VD= 0
##$VDLIST= <DDDDDDDDDDDDDDD>
##$VPLIST= <PPPPPPPPPPPPPPP>
##$VTLIST= <TTTTTTTTTTTTTTT>
##$WBST= 1024
##$WBSW= 4
##$XGAIN= (0..3)
0 0 0 0 
##$XL= 0
##$YL= 0
##$YMAX_a= 399352
##$YMIN_a= -340334
##$ZGOPTNS= <>
##$ZL1= 120
##$ZL2= 120
##$ZL3= 120
##$ZL4= 120
##$ABSF1= 10
##$ABSF2= 0
##$ABSG= 5
##$ABSL= 3
##$ALPHA= 0
##$AQORDER= 0
##$ASSFAC= 0
##$ASSFACI= 0
##$ASSFACX= 0
##$ASSWID= 0
##$AUNMP= <proc_1d>
##$AZFE= 0.1
##$AZFW= 0.1
##$BCFW= 1
##$BC_mod= 2
##$BYTORDP= 1
##$COROFFS= 0
##$CY= 11.3945322036743
##$DATMOD= 1
##$DC= 2
##$DFILT= <>
##$DTYPP= 0
##$F1P= 2.36226072786647
##$F2P= -0.459571619588291
##$FCOR= 0.5
##$FTSIZE= 0
##$FT_mod= 4
##$GAMMA= 1
##$GB= 0.15
##$INTBC= 1
##$INTSCL= 1
##$ISEN= 128
##$LB= 0.24
##$LEV0= 0
##$LPBIN= 0
##$MAXI= 10000
##$MC2= 0
##$MEAN= 0
##$ME_mod= 0
##$MI= 1.114404
##$NCOEF= 0
##$NC_proc= 0
##$NLEV= 6
##$NOISF1= 3.799351
##$NOISF2= 2.8
##$NSP= 1
##$NTH_PI= 0
##$NZP= 0
##$OFFSET= 15.70392
##$PC= 1
##$PHC0= -13152.45
##$PHC1= 10.00099
##$PH_mod= 1
##$PKNL= yes
##$PPARMOD= 0
##$PSCAL= 0
##$PSIGN= 0
##$REVERSE= no
##$SF= 200.130013532006
##$SI= 16384
##$SIGF1= 3
##$SIGF2= 2
##$SINO= 400
##$SIOLD= 16384
##$SREGLST= <1H.CDCl3>
##$SSB= 0
##$STSI= 0
##$STSR= 0
##$SW_p= 3612.71676300578
##$SYMM= 0
##$S_DEV= 0
##$TDeff= 0
##$TDoff= 0
##$TI= <>
##$TILT= no
##$TM1= 0
##$TM2= 0
##$TOPLEV= 0
##$USERP1= <user>
##$USERP2= <user>
##$USERP3= <user>
##$USERP4= <user>
##$USERP5= <user>
##$WDW= 1
##$XDIM= 8192
##$YMAX_p= 0
##$YMIN_p= 0
$$ End of Bruker specific parameters
$$ ---------------------------------
##NTUPLES= NMR FID
##VAR_NAME=  TIME,          FID/REAL,        FID/IMAG
##SYMBOL=    X,             R,               I
##VAR_TYPE=  INDEPENDENT,   DEPENDENT,       DEPENDENT
##VAR_FORM=  AFFN,          ASDF,            ASDF
##VAR_DIM=   8192,          8192,            8192
##UNITS=     SECONDS,       ARBITRARY UNITS, ARBITRARY UNITS
##FACTOR=    0.0002496,     1,               1
##FIRST=     0,             0,               0
##LAST=      2.0444736,     0,               0
##MIN=       0,             -340334,         0
##MAX=       2.0444736,     399352,          0
$$ Real data points
##PAGE= N=1
##DATA TABLE= (X++(R..R)), XYDATA
$$ [...]
1155A680l207o56K798K041k121m247M070K442n856M302K685r611L972Q505q219
$$ 1680 -1527 -2183 615 2656 535 -3712 358 2800 -3056 1246 3931 -5680 -1708 6797 -1422
1170a422k781P773l377m635Q390m32r975O092N921q123J470M235n679J158M405
$$ -1422 -4203 3570 193 -4442 3948 3516 -6459 -367 5554 -2569 -1099 3136 -2543 -1385 3020
1185C020j940k695j26K917Q63l118O09J714k736K76N226k948o734O949L684r242
$$ 3020 1080 -1615 -1741 1176 2039 -1079 -470 1244 -1492 -1216 4010 1062 -5672 1277 4961 -4281
1201d281M175N345j0653L036R991q728m315Q686j690n466O232J112q448L390O594
$$ -4281 -106 5239 -5414 -2378 7613 -1115 -5430 3256 1566 -3900 2332 3444 -5004 -1614 4980
1216D980n430j881L240j136n36J074J421j700m138M986L560p294O79N641n082
$$ 4980 -450 -2331 909 -227 -763 311 1732 32 -4106 880 4440 -2854 -2175 3466 -1616
1231a616j497P713l158q035P751M377j0039L239O382r081J196Q728o304m303O146
$$ -1616 -3113 4600 1442 -6593 1158 5535 -4504 -1265 5117 -3964 -2768 5960 -344 -4647 1499
1246A499Q09m138J557K426l694p60M849o46m074L84L692n24l837L595J367p194
$$ 1499 2308 -1830 -273 2153 -1541 -2301 2548 1902 -2172 -1788 1904 1380 -2457 1138 2505 -4689
1262d689M599O354r230j041Q442m247l922P355j410p980N999N608q597J66O430
$$ -4689 -90 6264 -2966 -4007 4435 188 -3734 3621 2211 -5769 230 5838 -2759 -2593 3837
1277C837n302p90N919k921l846K570K867j495k674K270O28l064K469K672m390
$$ 3837 -1465 -2255 3664 743 -3103 -533 2334 839 -1835 435 1063 -2001 468 3140 -1250
1292a250k130N399Q08n774K777L461o906K451O704p345k293P195j949l782M047
$$ -1250 -3380 2019 2827 -2947 -170 3291 -3615 -1164 5540 -1805 -4098 3097 1148 -2634 1413
1307A413L57m910K302M751m451k337M147p89j433J666p2j557j004L147J349n045
$$ 1413 1770 -3140 -838 3913 -538 -2875 1272 483 -950 716 644 -913 -1917 1230 2579 -2466
1323b466R04M044l489k87M026l057l333M971K017n910J076M386m774L53N466m689
$$ -2466 -1562 2482 -1007 -1294 2732 -325 -3658 1313 3330 -2580 -1504 2882 -1892 -1539 3927 -762
1339g62k757N172q5k773R76J126j870l9L221j532k963K094J523j120p67P12K73
$$ -762 -3519 1653 1568 -1205 -229 897 -973 -1012 2209 677 -2286 -192 1331 211 -556 156 429
1356D29j991K000K490m768k79M669k402j573L040j307k634K881K316m080q44M075
$$ 429 -1562 438 2928 -1840 -2119 2550 148 -1425 1615 308 -2326 555 2871 -1209 -2053 2022
1372B022j993j410L466j980k367K704J259j594j385J377O94j810J675Q41l237
$$ 2022 29 -1381 2085 105 -2262 442 1701 107 -1278 99 793 -1017 658 1499 -1738
1387a738N29K895p12k267Q73J535k261O00L290l965j443M737j143k578K038K88
$$ -1738 -1209 1686 974 -1293 -420 1115 -1146 -546 2744 -1221 -2664 2073 930 -1648 390 678
1403F78k268J288K632k666k327L753L9k533K002j0k190J144K012p78k645J264
$$ 678 -1590 -302 2330 -336 -2663 1090 1129 -1404 598 588 -1602 -458 1554 776 -1869 -605
1419f05K268k511K97K096k731m35L180k12k812L38K630j942o83L343k646k337
$$ -605 1663 -848 -551 1545 -1186 -1621 1559 1347 -1465 -1127 1503 -439 -1122 2221 -425 -2762
1435b762M358J17l135J030J316j351k89K447j237k990L041J373k904O68J082j388
$$ -2762 1596 1713 -1422 -392 924 -427 -716 1731 494 -2496 545 1918 -986 -318 764 -624
1451f24P7J705o4k725O87K995k176q51K203j597r70K591K21k673j32K809j105
$$ -624 -547 1158 1094 -1631 -944 2051 -125 -976 1227 -370 -1340 1251 1472 -1201 -1333 1476 371
1468C71j553K627j388k290L443M14k765L91J396n03o79J457l80k527K170J765
$$ 371 -1182 1445 57 -2233 1210 1624 -1141 -750 646 143 -536 921 541 -1986 184 1949
1484A949k612j08J157n38j51Q53L12k178J59L014j660j544K113r07r40K010J22
$$ 1949 -663 -771 386 -152 -303 550 862 -1316 -1157 1857 197 -1347 766 -141 -1081 929 1051
1501A051k206j29K536p16j804K042o82j911K766L63k432K59J335j04p29O22K07
$$ 1051 -1155 -1284 1252 536 -1268 774 92 -1819 947 1310 -1122 -863 472 368 -361 261 468
1518D68j970J382J918k295n91J540j82n82O29M90j880J8L106j719j923K384n88
$$ 468 -1502 -120 1798 -497 -1088 452 270 -312 317 807 -1073 -1055 2051 332 -1591 793 205
1535B05j154J959rk201J32K404n35j893J502m1j645J982O61k255l7J416M84j399
$$ 205 -949 1010 1001 -1200 -1068 1336 801 -1092 410 369 -1276 706 1367 -888 -925 491 975 -424
1553d24J05J244j970N32K584k232j409K002L89j280L11J096j737m35L201j297
$$ -424 -319 925 -1045 -513 2071 -161 -1570 432 821 -459 -148 948 -789 -1224 1977 680
1569F80k626K216M68j376R53M21j397n66K016N75k598N58J652j515L19J318j332
$$ 680 -1946 270 738 -638 315 736 -661 -1227 789 1364 -1234 -676 976 -539 -220 1098 -234
1586b34j244J495J696k288p94K463j393r00K880j383k328K081J227j483n88J358
$$ -234 -1478 17 1713 -575 -1369 1094 -299 -1199 1681 298 -2030 51 1278 -205 -793 565
1602E65o68j097K370j81k557J068J403o04o79L38M48j332P64K134k557j236L016
$$ 565 -103 -1200 1170 989 -1568 -500 903 299 -380 -42 406 -926 -162 1972 -585 -1821 1195
1619A195m15j743J414L31k111Q64K642k218k024L179l84j876K140l21k113J165
$$ 1195 780 -963 451 782 -1329 -465 2177 -41 -2065 1114 730 -1146 994 673 -1440 -275
1635b75J611p92j578P61J182j374N63J070j875m09J937M19k057j50K167j488p07
$$ -275 1336 544 -1034 -273 909 -465 98 1168 -707 -1116 821 1240 -817 -967 1200 -288 -995
1652i95K865j927k393L499M72k661R06J154j727J82K360j501k270K474N97j724
$$ -995 1870 -57 -2450 1049 1521 -1140 -234 920 -807 -625 1735 234 -2036 438 1035 -689
1668f89Q43J1q46M05Q14L66j707m51K367p60j199J419n03j432J504J579k382j020
$$ -689 154 165 -681 -276 538 904 -803 -1254 1113 353 -846 573 70 -1362 142 1721 -661 -1681
1686a681K982r05j917K814q77k643K828R91k484J43J406p03m98J356l61j930J443
$$ -1681 1301 396 -1521 1293 416 -2227 601 1592 -892 -749 657 -46 -544 812 451 -1479 -36
1703c6J261j340m61N42J58k45J59R95j675q27K960o61k062J637M5j521J502J126
$$ -36 1225 -115 -576 -34 124 -121 38 1033 -642 -1469 1491 830 -1232 405 450 -1071 431 1557
1721A557k288p22K663m64j736J835o36j743K319M44j757n0O80L04l75J21K05j163
$$ 1557 -731 -1453 1210 746 -990 845 209 -1534 785 1229 -528 -578 102 406 31 152 357 -806
1739h06L93J503o58j253L72J165p66m04J466j395j286L115m74k573J820M51j576
$$ -806 -413 1090 432 -821 -449 716 -50 -454 1012 -383 -1669 1446 972 -1601 219 670 -906
1756i06J060J046j982n45K389l88j828J421J9j278J483L80j409k38Q09P44p92
$$ -906 154 1200 -782 -1327 1062 674 -1154 267 286 -992 491 871 -538 -776 33 777 -15
1773a5n49R35q05j10J717p54j665Q67J309r10o37J416j208r61K737m15k475J456
$$ -15 -564 371 -434 -544 1173 419 -1246 -379 930 20 -617 799 -409 -1370 1367 952 -1523 -67
1791f7P46j073N41N26j111n21J541N08j716J13R21n48J54M36l02r28L47J815j125
$$ -67 679 -394 147 673 -438 -959 582 1090 -626 -513 408 -140 14 450 148 -780 -433 1382 257
1810B57j540J967l17j262J740J8k130P54J937j242j270J653l27j400K038J92k394
$$ 257 -1283 684 367 -895 845 863 -1267 -513 1424 182 -1088 565 238 -1162 876 1068 -1326
1827a326Q75J377p30m91L76M2p85P18J213j683q09J781M9r79L19M77j039j24K158
$$ -1326 -451 926 196 -295 81 123 -662 56 1269 -414 -1223 558 607 -372 -53 424 -615 -739 1419
1846A419j052k102K049N37j647J050M35j728L83J756n14j765R47R40j256O31P48
$$ 1419 367 -1735 314 851 -796 254 689 -1039 -656 1100 586 -1179 -232 708 -548 83 831
1863H31j495k38J392L45j302l58J437o43o33J760r35j726J819R13j628j73J283
$$ 831 -664 -902 490 835 -467 -825 612 -31 -664 1096 161 -1565 254 1167 -461 -634 649
1880F49p40p74J913l54k323J582J270j670J75P22p44k37J118K32j708K13J642
$$ 649 -91 -865 1048 694 -1629 -47 1223 -447 -272 450 -294 -531 587 819 -889 -676 966
1897I66p94n98R48n82n61Q17R96j403r67J917j33j410J440j47j728J328J114j358
$$ 966 172 -426 522 -60 -621 196 1192 -211 -1178 739 606 -804 636 489 -1239 89 1203 -155
1915a55p01J124J89r47Q34L31j714O86J377q87o85M09L79m21J27Q85j240o67J855
$$ -155 -856 268 457 -490 344 675 -1039 -353 1024 137 -548 -139 240 -181 -54 831 -409 -1076 779
1934G79j57j340N50M10o19K71R73r07j323J760N47j685P27M42j255P40R72q58
$$ 779 622 -718 -168 242 -377 -106 867 -40 -1363 397 944 -741 -14 428 -827 -87 885 27
1952B7r36P29Q80q96JN38r07J58J118l27r72O6R13j07p33R13m14j093J601L55
$$ 27 -909 -180 700 -196 -195 343 -564 -406 712 385 -587 -521 392 285 -448 465 51 -1042 559 914
1972I14j609K10Q83l64k48O89l26j187J224Q31j476J09O36n88L84M52l84o61J39
$$ 914 -695 -485 398 34 -214 475 149 -1038 186 1017 -459 -350 286 -302 82 534 150 -511 -372
1991c72J183n38p93P09j21m11P81J29j072j40J229m3j164Q18J43j174J264N14
$$ -372 811 273 -520 189 68 -343 438 567 -505 -645 584 541 -623 195 338 -836 428 942
2009I42j646J95R28k37l85L92j14p93Q55Q10j274k05O63j48J11Kq5l25j31J220
$$ 942 -704 -509 419 182 -203 189 75 -718 137 947 -327 -532 131 -17 94 96 11 -314 -445 775
2029G75l81j274Q60L39o71N75K38j041j34J394l6j489Q41L79j147J123L66j469
$$ 775 394 -880 -20 319 -352 223 461 -580 -714 680 644 -845 -4 375 -772 351 717 -752
2047g52K37R65j83m07P2O3m00M72O59r91l50P36J58j37l00K41j32l93J140j60
$$ -752 -515 450 267 -140 -68 -5 -405 67 726 -265 -615 121 279 142 -158 83 -49 -442 698 538
2067E38j531R39P16r94M40L62r15j07J317j72j353P00N27r29P96K91j345L40R04
$$ 538 -993 -54 662 -332 108 470 -445 -552 765 593 -760 -60 467 -462 334 625 -720 -380 524
2086E24j64l90k84M11m2pM85n74o33P49M89m20o11N86jo20J094%j711J031J004
$$ 524 360 -30 -314 97 55 48 533 -41 -674 75 564 144 -467 119 118 -502 592 592 -1119 -88 916
2107I16j277J76N60p75p6J125j62j316N42Q21p60K79L28q57J67O56J09n71n40
$$ 916 -361 -185 375 -400 -476 649 487 -829 -287 534 -226 53 381 -476 -309 347 456 -115 -655
2126f55P02K75o47N54j46q78O96Q99q17o94Q35J88q79R55J47j707J101J078j304
$$ -655 47 322 -325 229 83 -795 -99 800 -17 -711 124 312 -567 388 535 -1172 -71 1007 -297
2145b97j6N67n14p9Q49r6j089K85R54m68k04J37j81O8J69M27l76r99J087N22j207
$$ -297 -313 254 -260 -339 510 414 -675 -390 564 96 -108 29 -152 -84 85 512 136 -863 224 746 -461
2166d61N05M12j147N48J107r63r05J200K87j091Q39L07j554Q64J000j127j84M66
$$ -461 44 456 -691 -143 964 1 -904 296 583 -508 331 638 -916 -52 948 -179 -363 103
2184A03j00n8K84Q4o08k16R08L5o72m2M29p2k85O73k46j276J306P48j626L26Q94
$$ 103 3 -55 229 313 -295 -511 397 432 -240 -282 147 75 -210 463 217 -1059 247 995 -631 -305 589
2205E89j158K76J176r81q21J089L72r01L84K37r39N83P94p37k96K6L96K94o13
$$ 589 -569 -293 883 -98 -919 170 542 -359 25 262 -677 -94 700 -37 -333 -307 89 383 -230
2224b30K20J80p22O64O16j044l32R69L9q60P77J33j446J100J080j772J62J082
$$ -230 -10 170 -552 112 728 -316 -648 321 360 -500 277 410 -1036 64 1144 -628 -466 616
2242F16r20J27Q64p22o07O97N44o72j57L26k29K05J88j09k66l00O11N91j255J84
$$ 616 -304 -177 687 -35 -642 55 599 -73 -230 96 -133 72 260 151 -115 -415 196 787 -468 -284
2262b84Q30r38L63R40j178n44J341K7j076N86L30j184Q62R48j469o2R14m14P1
$$ -284 546 -392 -29 911 -267 -811 530 557 -519 67 397 -787 75 1023 -446 -508 406 -8 63
2281F3K44m94j00K29M20n3p43Q8N73J6l76K61J9r00R18Q10j607M4J317j088qJ236
$$ 63 307 -187 -287 -58 362 309 -434 -346 227 243 -133 128 147 -753 165 975 -632 -588 729 -359 -367 869
2303H69j139n56J309Q8j100M37M92r59N15P14j003j55P26j85J00k02j87L76k86
$$ 869 -270 -826 483 571 -529 -92 400 -559 -44 670 -333 -488 238 53 153 -49 -236 140 -146
2322a46L44K51q47j09R58j33p11M64J49q70Q73P90j714J32J373j022l4R42r88
$$ -146 198 449 -398 -507 451 318 -393 71 220 -650 223 1013 -701 -569 804 -218 -252 690 -298
2341b98l49J121j1p08J17L06l18K23K70n25q9K95J98K00p46l9Q29n89P4P55j124
$$ -298 -647 474 463 -245 -128 178 -140 83 353 -172 -261 34 232 432 -314 -353 476 -113 -39 716 -408
2362d08j91J355l71q79O60J06q75P75O46j444J25J198p34k08O59p54r1P30j5m38
$$ -408 -599 756 385 -494 166 272 -603 172 818 -626 -501 697 -37 -245 414 -340 -431 299 284 -154
2382a54j69K75K44j44j22k0p7j1M40J60r54J30R93p89o9Q63j004j51J191l45q16
$$ -154 -323 -48 196 52 -70 -90 -167 -178 262 422 -532 -402 591 -198 -267 596 -408 -559 632 287 -529
2403e29M79K50n23M51M04r94J3R38m23j01J04l65L16J58j27J00m82O2P32l49m03
$$ -529 -50 200 -323 128 532 -462 -449 489 66 -35 69 -296 20 178 51 151 -331 -269 463 114 -289
2424b89L23lk84N24K48j046R9J163p84k34P64p87j08J037l80o43M07J38k03K02
$$ -289 34 31 -253 271 519 -527 -428 735 -49 -283 481 -306 -414 623 243 -400 7 145 -58 144
2444A44J10n02K6N50j84p3j64j75N59j02k35K93n24m2R27m65n40L95J45l23L31
$$ 144 254 -248 -222 328 144 71 -93 -268 291 189 -46 247 -277 -319 608 143 -397 -2 143 -180 151
2465A51J36q14J79R27n75k96N52n79Q9P24m54l42K06R6J97l3k79p1l0L07Q0j05
$$ 151 287 -527 -348 579 4 -292 260 -319 -230 494 40 -302 -96 0 197 164 -115 -186 -216 91 171 66
2487F6l95J05O27l38l01L83m75K0Q77m80o16N50Q2k27L60j11o19K91O91m80j97
$$ 66 -329 -224 403 65 -236 147 -328 -308 569 89 -527 23 105 -122 238 127 -492 -201 490 10 -187
2508a87L27l59K06M63m65j77J40LL59k36k62J12J32J2J15p5m87K11O82n66k16
$$ -187 140 -219 -13 450 -15 -192 -52 -49 310 74 -188 -76 56 68 183 108 -379 -168 514 -52 -268
2529b68N38m99nQ44n72n60P21j1k06L05k26m21K36N32l58k61K07j04K03K04m44
$$ -268 270 -229 -234 610 38 -522 199 188 -18 287 61 -360 -124 408 50 -211 -4 -108 95 299 -145
2550a45N4m2P7N23m66m10M66K9j51L41k44m86L95O17o24k84N85m55QP42n86n19
$$ -145 -91 -133 -56 467 1 -409 57 86 -65 276 32 -454 -59 558 -66 -350 235 -220 -212 530 -56 -575
2572e75O47P4j24O5j88j65K79K89j55m06Q0J89K43j64k49J33j38Q6O79o49m93
$$ -575 72 146 22 87 -101 -266 13 302 147 -259 -179 10 253 89 -160 -27 -165 -79 600 -49 -542
2593e42P57k0l38L55j89m94M94N44o60k78N02j68k8N01m64m03M79J94p4j79j89
$$ -542 215 195 -143 212 23 -471 23 567 -93 -371 131 -37 -65 436 -28 -431 48 242 168 -11 -200
2614b00K59J5L1J02m03j59N26K65n00j80L37j95j3P14o99n11R31j8m46K90j31
$$ -200 59 74 105 207 -196 -355 171 436 -64 -244 93 -102 -115 599 -100 -611 320 302 -144 146 15
2635A5l63M24L53n10k79L32J83j19J31l06j42K82J62J07m62k15O13j3l56L66l09
$$ 15 -348 76 429 -81 -360 -28 155 36 167 -139 -281 1 163 270 -192 -407 206 193 -163 203 -106
2656a06l38N67L29p06j05N63k60o8N55n58m96Q59N5m49J27j07p3K30J65j29l25
$$ -106 -444 123 452 -254 -359 204 -56 -124 431 -127 -623 236 291 -158 -31 -138 -211 19 184 55 -270
2677b70J73K59m6j27k50K50L5Q3K41m57l30P05Km36L20j65l62O27K08p02j06N65
$$ -270 -97 162 116 -11 -261 -11 24 107 348 -109 -439 266 268 -168 152 -13 -375 252 460 -242 -348 217
2699B17j64p5L22m96j82O08O6l03k4j72K24J96j63j6j59p4N20l3m26q7K78j2K5
$$ 217 53 -22 300 -196 -378 230 296 -7 -31 -203 21 217 54 38 -121 -195 325 292 -134 -221 57 45 70
2722G0K18m91k51Q71q8n78L32j37j69M80M3n04n4L43L9p6qk17k4M30q9j18j45
$$ 70 288 -203 -454 417 329 -249 83 -54 -223 257 300 -204 -258 85 124 48 40 -177 -201 229 140 22 -123
2745a23j65M75J13m05N5q3j67N95Ro33P8M40p8j13J06l48j00P12j64m61K44j00
$$ -123 -288 187 300 -105 -50 -133 -300 295 304 -329 -251 189 111 -2 104 -244 -344 368 204 -257 -13 -113
2767a13L1M05k16l49N9K29K08j06l08l7J87J76l3p1k43r9N91mn65K65nk17O38
$$ -113 -82 323 107 -242 -183 46 254 148 -160 -197 -10 166 133 62 -181 -280 311 307 -258 7 2 -215 423
2790D23j83n79J74M64j78j15N3k51m2O00j25m73J85r6J99K73l69j30J19J6L19
$$ 423 240 -339 -165 299 121 6 59 -192 -234 366 241 -232 -47 -143 56 329 -40 -170 -51 -35 284
2811B84j10m97J61L47j12J1j9l11j0O80j46o24L41L6j07L73l9p13L04L48n0j41
$$ 284 174 -323 -162 185 73 84 65 -246 -256 424 278 -346 -5 31 -76 297 258 -455 -151 197 147 6
2833Fr2o9Q7L22j15l59N6R7K47K0m51J35J20j51M74j19o93L09M78k73r6J15l06
$$ 6 -86 -155 -68 254 139 -220 -164 -67 180 200 -251 -116 4 -147 327 208 -485 -176 302 29 -67 48 -258
2856b58N3N99k32o07M20J54k17L56j88m44K95K31L3j99k01J34J43J52j61j32j22
$$ -258 -205 394 162 -445 -25 129 -88 268 80 -364 -69 162 195 -4 -205 -71 72 224 63 -69 -191
2877a91J68L78j71n12K51J98k03L66p7p02M03M47l17j18R0j61P3M81l18m35K27
$$ -191 -23 355 184 -328 -77 121 -82 284 207 -495 -92 355 38 -80 10 -151 -78 403 85 -350 -123
2898a23K58n1O4k44j07K11J90n3j52l46L41L32l03k4n1j27J51M16k84m96L98J54
$$ -123 135 84 148 -96 -203 8 198 145 -7 -353 -12 320 17 -7 -58 -185 -34 382 98 -398 0 154
2920A54k55K95j13n90N15L28k81j57N2n1J17J79j88l07J54K78L7j19l70J51K73
$$ 154 -101 194 81 -509 6 334 53 -104 -52 -103 14 193 5 -302 -148 130 167 48 -322 -171 102
2941A02k1O7j78m65M91L65l95j40J14q5J29M19l53n46N18K26l05J39l7l30L77
$$ 102 81 148 -30 -495 -4 361 -34 -174 -60 -145 -16 403 50 -496 22 248 -57 82 45 -285 92
2962I2L03l09k07j0J70J63p6j83q6l0L39J21l15k42K39K42j49R5j16m85N19M06
$$ 92 395 86 -121 -131 39 202 126 -57 -143 -173 166 287 -28 -270 -31 211 62 157 41 -444 75 481
2984D81n96o7J72j9J05K21k78l96L96K23j71p9j35p3L68O3j99j26j37L29K26l37
$$ 481 -115 -182 -10 -29 76 297 19 -377 19 242 71 -8 -143 -216 152 215 16 -110 -247 82 308 -29
3006b9p7J2P3J07K39l75l87M46K99l14L2l0m43N42L18n38j26K64k6J72l1l02p4
$$ -29 -106 -94 -21 86 325 -50 -437 9 308 -6 26 -4 -447 95 413 -125 -251 13 -13 159 128 -174 -248
3029b48K23L09k45j34r5R1K60n8r6j42j36L87K15m54j65L32m6P9J69l57k15M03
$$ -248 -25 284 39 -95 -190 -99 161 103 7 -135 -271 116 331 -123 -288 44 -2 77 246 -111 -326 77
3051G7K26l17m4kq5L62J28n16l9K68MJ42j72k75J86J29J30q1k69q5L20J86k75
$$ 77 303 -14 -58 -60 -145 217 345 -171 -210 58 62 204 32 -243 -57 72 202 121 -148 -233 87 273 -2
3074bj05M3k04M56J33n30k0L49q0K4N1l02q9L62K29m07k6j2P0K36O1l99j1J44
$$ -2 -107 -64 -268 188 321 -209 -229 120 40 64 115 -187 -276 86 315 -92 -118 -130 -60 176 237 -162 -173 -29
3098b9J90N0l17r1K15L4J20m7k95j19M70N1l32m9J42q9K35J50n22j3L68n9OKk39
$$ -29 161 211 -106 -197 18 52 172 125 -170 -289 181 232 -100 -149 -7 -96 139 289 -233 -246 122 63 69 71 -168
3123a68QK78M9k01j71J26J06J45j22k09O7P4J42J30m60o4M05j12N8K9l21m8M58
$$ -168 -160 118 167 -34 -205 -79 27 172 50 -159 -92 -18 124 254 -206 -270 135 23 81 110 -211 -259 199
3146A99Kl13K5J14p4K42P9n15L1L64l9Mj05k21J84J30M8j14k02K7K20J06k52j07
$$ 199 201 -112 -87 27 -47 195 274 -241 -210 154 115 119 14 -207 -23 107 155 41 -161 -134 86 192 -60 -167
3170a67J37j6K10P2m44m8M77n0j07m3k76J60M13j43l56P1Q9O9J14j22l57J59L08
$$ -167 -30 -46 164 236 -208 -256 221 171 64 21 -255 -95 318 175 -181 -110 -21 48 162 40 -317 -158 150
3193A50n2N3l00j02L36N6q9k3j98M6K98J4l33p0K42L0Q0J5m84J72L36q8j18Lj88
$$ 150 98 151 -149 -251 85 141 52 29 -169 -123 175 189 -144 -214 28 58 138 153 -331 -159 177 89 -29 -26 -214
3218b14J76L05j92k51M4R8J51Q6k09j97K11R0nN1l33P3K81j0j74Mj68J22L50j85
$$ -214 -38 267 75 -176 -132 -34 117 203 -6 -203 8 98 93 144 -189 -116 165 155 -19 -15 -183 -61 289 104
3242A04k50L9J78l0J09p9l66K03L88j84j43l8r8K02K04j97j79K4R7K03p9j94n6
$$ 104 -146 -107 71 41 150 71 -295 -92 296 112 -31 -69 -167 35 239 42 -137 -113 -16 187 108 -86 -142
3265a42J35J06N8j41k77J36L04j25j59J25k17J84L73k79l21J93J24NJ6q7k91K39
$$ -142 -7 99 157 16 -261 -125 179 54 -105 20 -197 -13 360 81 -240 -47 77 82 98 11 -280 -41
3287d1L14k61q6m6o9L28K6k45l4p6K16J65j18k42L7J40L0L4m1k75J39L61j80k39
$$ -41 273 12 -74 -120 -189 139 165 -80 -114 -190 26 191 73 -169 -132 8 38 72 31 -244 -105 256 76 -163
3311a63J54j09J04K86k56k36J60J66M8p2k18p6K37J49j54j4j11J8L10o5k12PN
$$ -163 -9 -118 -14 272 16 -220 -60 106 154 82 -136 -212 25 174 20 6 -105 -87 223 158 -54 -47 -42
3334d2M9K79k98j99J97J66q5mr8j69J99L02k27k43J52j18K53J70l77j45K63M4
$$ -42 7 286 -12 -211 -14 152 67 63 -35 -204 -5 297 70 -173 -21 -139 114 284 -93 -238 25 69
3356F9R8j55j40N6J02J46o8k31l6J33K32j59k22J22j12K13J61k60j98K28J50j46
$$ 69 167 12 -128 -72 30 176 108 -123 -159 -26 206 47 -175 -53 -165 48 209 -51 -249 -21 129 -17
3378a7Q3j72j18K09K19j53k78J68P1R6M8j95j61J37J63J20k90j74K57J40l7q0
$$ -17 66 -106 -224 -15 204 51 -227 -59 12 108 156 -39 -200 -63 100 220 -70 -244 13 153 116 36
3400C6j45q6K11K56l06j95K61%L3J78l53j43L59J04j49r6q8K4K26N7j38j52MJ72
$$ 36 -109 -195 16 272 -34 -229 32 32 65 243 -110 -253 106 210 61 -35 -123 -99 127 184 46 -106 -102 70
3424G0J51j76j81P0R2P3M7k53p5K83M1j25l2l0j23K55J23k05k39J46J66n6J77
$$ 70 221 45 -136 -66 26 99 146 -107 -182 101 142 17 -15 -45 -168 87 210 5 -234 -88 78 22 199
3447A99k83j53K95N8o2j52r9J59J35O1k25q1O0J73P9j59j97J08J12K9N5k39j51
$$ 199 -84 -237 58 116 54 -98 -197 -38 97 158 -67 -148 -88 85 164 5 -192 -84 28 57 112 -127 -278
3470b78L97N2j96j0p6P8J73O6k98q4J92O3k7oj80j5K01j8k2j49l9K62Q9j43j04
$$ -278 119 171 -25 -35 -111 -33 140 206 -92 -176 16 79 52 46 -134 -149 52 34 12 -137 -176 86 175 32 -72
3495g2q2M5K39L6k21j35K47P2q4Qj94n6L71K2j83j23nO3J53N3j95j61J72J76n1
$$ -72 -154 -109 130 166 -55 -190 57 129 45 53 -141 -197 174 196 13 -110 -115 -52 101 154 -41 -202 -30 146 95
3520I5o8j75J06J65L6j05j62m8L09O1k79j4j8N0J95M8k83j77L00R0j50N8j18p5
$$ 95 27 -148 -42 123 159 54 -108 -156 153 214 -65 -79 -97 -47 148 196 -87 -264 36 126 -24 34 -84 -159
3544a59K63j1j39p2M0J33J41j73j30l4J69J07k8j94j10K24N5n9m1j35M3K49k0
$$ -159 104 93 -46 -118 -78 55 196 23 -107 -141 28 135 107 -87 -197 27 82 23 -18 -153 -110 139 119
3567A19j94q1O1J01J34q9j48o0K22P3n5j56q6P5K28m7j21o9l1K37O4k01o2k6J49
$$ 119 -75 -156 -95 6 140 51 -97 -157 65 138 83 -73 -159 -84 144 97 -24 -93 -124 113 177 -24 -86 -112 37
3592C7J11j35j58J4K19K7j27J1j14M1K87j14k15O9K2Q6J18j43j83Q2J96j6r5o5
$$ 37 148 13 -145 -131 88 115 -12 -1 -115 -74 213 99 -116 -47 -25 61 179 36 -147 -65 131 115 20 -45
3616d5p5J38J14l2j76k4QK39j9k44j3J11N5Q1q1j90L4J70O9k12M5q5R0J55m4j78
$$ -45 -120 18 132 100 -76 -100 -92 147 128 -116 -129 -18 37 118 37 -153 -119 51 120 -92 -47 -132 -42 113 69 -109
3642a09J6P1J24mj37j14P9J96k9j04j60Q9J40N5j28p1J1P0J51m7k10NQ8O7J2q3
$$ -109 -93 -22 102 98 -39 -153 -74 122 93 -11 -171 -82 58 113 -15 -86 -75 -5 146 99 -111 -106 -18 49 61 -22
3668b2j66R2J77jj10k0L3O4J29j23k18Q3J10N6k9j00r6J44O9N1j49j27P7K00l1
$$ -22 -188 -96 81 80 -30 -50 -17 47 176 53 -165 -82 28 84 55 -45 -141 3 72 123 -26 -153 -76 124 93
3693I3j45k0l4J41J94j40k15O7J67K9l3j62o2R3K03m9j81n7L8J53M0j13j35L4
$$ 93 -52 -72 -106 35 229 89 -126 -59 108 137 104 -58 -120 -27 176 127 -54 -111 -73 80 120 7 -128 -94
3717i4J68N4o0j74MJ92P8n3j64j43J46J71k3j91j9P2R7P4j75j65J75O7M4j7k06
$$ -94 74 128 68 -106 -102 90 168 115 -49 -192 -46 125 102 -89 -108 -36 61 135 -40 -205 -30 37 81 64 -142
3742a42L5J47J03j02r4q3J72J71n1j74j17O7P7J21j66j22Q5J74j7l2j35m4J71
$$ -142 -107 40 143 41 -53 -136 36 207 156 -18 -135 -68 9 130 -36 -158 -73 101 84 52 -83 -127 44
3765D4J25j51j54R7K1M8J9j05j01J10J55j2l8j83kK13J9j54k3m1K02J11j42j18
$$ 44 169 18 -136 -39 -18 30 49 -56 -157 -47 108 96 58 -125 -127 86 105 -49 -72 -113 89 200 58 -60
3789f0l6N3J96J8k33r5J59J26k2j01j13%J69J33j97j13J6J09R5j7k10j8J33P7
$$ -60 -96 -43 153 171 -62 -157 2 128 106 5 -108 -108 61 194 -3 -116 -100 9 104 87 -123 -141 -8 69
3813F9j9j24j03J82J97j46j13r0J03J06J13k13p8L8N5J25k6j58k9J25J23p0m7
$$ 69 50 -74 -177 5 202 56 -57 -147 -44 62 175 -38 -116 -78 -23 102 76 -82 -111 14 137 67 20
3836B0j07k1K66o8n0j44M1J05O7p5j23PM5J83m3j77o0J21J44j01n2j00M0K05K1
$$ 20 -87 -108 158 90 40 -104 -63 42 109 34 -89 -82 -37 146 103 -74 -134 -13 131 30 -22 -122 -82 123 144
3861A44k00o3N6J74L7q7j77l3K39L6p7j61L9P1R2mj07r3R6J11M1j58j01O2J37
$$ 144 -56 -119 -63 111 148 61 -116 -149 90 126 49 -112 -73 -2 90 86 -21 -114 -18 93 134 -24 -125 -63 74
3886G4M0l9j35n9J74J06j17j28j0P1J54oj81k5N6J09N9j91m3L3J07O8r3j04JJ33
$$ 74 114 75 -60 -119 55 161 44 -84 -94 -23 131 125 -56 -81 -25 84 143 -48 -91 -58 49 117 24 -80 -79 54
3912E4K7j4j58k9J20J26l9j37o3P8R7O3p4j89L3J94M7j91r7J30P6R4n0k00l1J71
$$ 54 81 67 -91 -120 0 126 87 -50 -113 -35 62 125 51 -138 -105 89 136 -55 -152 -22 54 148 98 -102 -133 38
3938C8J26r4m6j45J01J33j8p4j69M5J98J7j27j04pJ21J30k0j64k1J00N3l4m2j27
$$ 38 164 70 24 -121 -20 113 95 21 -148 -103 95 112 -15 -119 -126 -5 125 105 -59 -80 20 73 39 -3 -130
3963a30J07J25M0j81m6Q4M3Q4m8j87P1P2J22j15n5o7J53J7J7j27j01R1J10K6j16
$$ -130 -23 102 142 -39 -85 -1 42 126 78 -109 -38 34 156 41 -14 -81 72 89 106 -21 -122 -31 79 105 -11
3988a1l0M9O0Ko3p5JJ05J8mj80N8P1J12j9j55j8Q6O5o3po9k0J35O7r9r9OJ59j0
$$ -11 -41 8 68 70 7 -68 -67 38 56 52 -128 -70 1 113 94 -61 -79 7 72 9 2 -67 -87 48 115 16 -83 -77 82 72
4018G2Rj78nR8J03l2q4q1J20N5L9q2j61J07J48m4o6o1o3J25P0m4j81%J38J15o4
$$ 72 81 -97 -102 -4 99 67 -17 -98 22 77 116 34 -127 -20 128 84 18 -43 -106 19 89 45 -136 -136 2 117 53
4045E3q5m8M9J13Rj27n1L4J45r2kq0N8P0J06j08j39mJ24K1M8j44n7J20J00o3j20
$$ 53 -32 -80 -31 82 91 -36 -87 -53 92 0 -2 -82 -24 46 152 44 -95 -99 25 46 94 -50 -107 13 113 50 -70
4072g0K0Q7J4R9j10r0KJ35l5j6m2n4P0J12m1j55p4J20J41q1q1m6J17M6k0o6j16
$$ -70 -50 37 51 150 40 -50 -48 87 52 36 -6 -60 10 122 81 -74 -148 -28 113 32 -49 -95 22 68 48 -18 -134
4099a34N0J34J0j1j74L8N7J00n1p2k6P2M9mm1k4m3J02R7j14j56R8Q1N0j02%n4
$$ -134 -84 50 60 49 -125 -87 -30 70 19 -53 -79 -7 42 38 -3 -27 -70 32 129 15 -141 -43 38 88 -14 -14 -68
4126f8P0O7j5n3p9J01Q2l4j32J2M1K3N8q3kr4J21N0l4o7k3Q6P7p5n7m5K1J26L
$$ -68 2 69 54 1 -78 23 105 71 -61 -49 -8 15 73 -10 -12 -106 15 65 31 -36 -59 27 104 29 -28 -73 -52 74 77
4155G7q0r9M8R7KNj20L9R5N4q5q2pQ2N1k9o4m2P0J14r4m8o7RJ86k2r4r7OJ63M
$$ 77 -3 -102 -54 43 45 50 -70 -31 64 118 33 -49 -56 26 77 48 -16 -58 12 126 32 -16 -83 -74 112 90 -4 -101 -95 68 72
4186G2j08j2J5k9J76m9j60k1Q6J24j6j05l2L8J08lj34j1j3R9O7q2j01P4JP5Kj26
$$ 72 -36 -48 -33 -62 114 65 -95 -116 -30 94 78 -27 -59 -21 87 84 -50 -61 -74 25 92 10 -91 -17 -16 59 61 -65
4214f5K2L4P9j0n5o0m2J29J1r0k2M0O6K5j11l4J2M0R2k1p7J8rR5J1r2n3N3Q9l1
$$ -65 -43 -9 70 60 5 -55 -97 32 43 -47 -69 -29 37 62 -49 -83 -71 -31 61 40 -37 -19 -28 67 78 -14 -67 -14 75 44
4244D4m2p5Q4J5K4k0o9m2Q7Q9k2q8m9N8R5Rr7j14J15P3l4k9q6qQ2O3l8j13M7O5
$$ 44 2 -73 11 26 50 30 -39 -81 6 95 73 -15 -64 -6 89 98 1 -113 2 75 41 12 -74 -82 0 63 25 -88 -41 24
4274B4K9Lj50N4L2Q2l3j03j0R0j7M4p8k8M1M7K0J1n9l5N5J7n7Pp2P6Q9m0qj21
$$ 24 53 56 -94 -40 -8 74 41 -62 -72 18 1 45 -33 -61 -20 27 47 58 -1 -36 19 36 -21 -14 -86 -10 79 39 31 -90
4304i0J20K2Mlr9M2kQ7m0j06M8L8Krk7n1N8j3N1j13P2m7P9N0r5l0K4O5J3k9n0
$$ -90 30 52 56 53 -46 -4 -6 81 41 -65 -17 21 23 14 -13 -64 -6 -19 32 -81 -9 -56 23 73 -22 -52 -28 37 50 21 -29
4335b9j1N1O6o5p5pN7P1k5Jj28O7P8K2p2l6K1J01J5j36l8J8O6M1l5n5oN1P2n5
$$ -29 -40 11 77 12 -63 -70 -13 58 33 34 -94 -27 51 73 1 -35 -14 87 102 -34 -72 -54 12 53 18 -37 -43 8 80 25
4365B5q7J9j3R6k6n9QJ2k5P7m5k3m2M0J30m7p2m0J17J9qo5K0l1L9K3Lr6N3Q7K1
$$ 25 -62 -43 -56 40 14 -45 -37 -25 -50 27 -18 -41 -83 -43 87 40 -32 -72 45 64 56 -9 11 -20 19 42 45 -51 2 89 110
4396A10q6n5L0J1Q1l9r6j1M3P6Rj07n1M0J19n3l4l3L4N0J9q1k8K2N6N6k8j39j0
$$ 110 24 -31 -1 10 91 52 -44 -55 -12 64 73 -34 -85 -45 74 21 -13 -46 -12 38 57 -24 -52 -30 26 82 54 -85 -95
4425i5P1Q0j9jr1Q3J0%qj03M1J08k5rp9mN4N7J8j42J9j4L9J3Mm1k2J23n1m9m6
$$ -95 -24 56 37 36 -55 28 38 38 30 -73 -32 76 51 42 -37 -41 13 70 88 -54 -35 -49 -10 3 7 -34 -56 67 16 -33 -79
4456g9M3L0Q0l2q5j5Q2NJ1l7m4M9M1%r7K7n7J30Oq8K0K4O8l6o1Rl5P2NN2j23K4
$$ -79 -36 -6 74 42 -43 -58 24 29 40 3 -41 8 49 49 -48 -21 -78 52 58 -30 -10 14 82 46 -15 -6 -41 31 36 88 -35 -11
4488a1J8N7m5q5L5o6J58K5j71M1K4O6j0k1o8j6N6M2K9p0%K0L6Mj17OM9O0J2m0
$$ -11 7 64 19 -66 -31 -97 61 86 -85 -44 -20 46 36 15 -53 -69 -13 29 58 -12 -12 8 44 48 -69 -63 -14 46 58 18
4518A8j10L3P7J7O2j03k9O4L4j9o9k8L8O5Mo4j9J0N9L9j45P3rM6Om6Mn7O0J6m9
$$ 18 -92 -59 18 35 97 -6 -35 29 63 44 -25 -53 -15 50 54 -10 -29 -19 40 79 -66 7 -2 44 50 4 8 -49 11 27 -22
4549b2l8jQ9K0jr6L8L4om0j3rJ8M1Oq4N8o8R3M8o0l6J9N8J5p3K7p2j8J21Nn7m7
$$ -22 -60 -61 28 48 47 -49 -11 23 17 -23 -36 -45 -27 14 20 -64 -6 -74 19 67 7 -29 -10 48 63 -10 17 -55 -73 48 53 -4 -51
4582e1M8R2qj42J4L1M6J3nq7j7R6m4L0p4j9O0M8m9N0o4j1O8Q5r2o8K1M1KM1j00
$$ -51 -3 89 81 -61 -47 -16 30 43 38 -49 -66 30 -14 16 -58 -77 -17 31 -18 32 -32 -43 25 110 18 -50 -29 12 14 55 -45
4613d5OK2Q7q9j7j5L7K9kK2k6k0J7J18j74L0j7k2J42r6l1L2L6J1k0k0l9O1K9k3
$$ -45 -39 -17 70 -19 -36 -51 -14 15 13 35 9 -11 6 124 -50 -20 -37 -59 83 -13 -44 -12 24 35 15 -5 -44 17 46 23
4643B3r2N9m4O5J5n0q6J21ORPj02K0O3K4n7pn4P9J05r6l3m7N4KO5l2m0J9K1L9
$$ 23 -69 -10 -54 11 26 -24 -110 11 17 26 33 -69 -49 14 38 -19 -26 -80 -1 104 8 -25 -72 -18 -16 49 17 -23 -4 17 56
4674E6jo5j5L3K8N2p8k4M4M6n5j01L8K0N0K0m0o3L4K3lpk9K9nN3l0o1J2N4L2P
$$ 56 55 -10 -25 8 36 88 10 -14 30 76 21 -80 -42 -22 28 48 8 -55 -21 2 -1 -8 -37 -8 -13 40 10 -51 -39 15 47 54
4706E4r9M0j3O8N0m3j53N2L9M9%m8k2M9J7Qq8J2L7j3M4r2l1J36j2J3o7K2o1N8
$$ 54 -45 -5 -18 50 100 57 -96 -44 -5 44 44 -4 -26 23 40 48 -40 -28 9 -4 40 -52 -83 53 41 54 -13 9 -52 6
4736FJ0k8j0K1M3l7K8l1k3J2P9l3j0q6P5K8l4j6J3p8R7Pj9j8j5K2R7o3l9m7O7
$$ 6 16 -12 -22 -1 42 5 33 2 -21 -9 70 37 27 -59 16 44 10 -6 7 -71 26 33 14 -4 -19 3 100 37 -2 -49 18
4767A8K3q4j3MN1J7k4j2rl7Q1k2k8l7N2J1L9j0n6l2R3j3PJ5k7jK3Pj9n4K6L3K0
$$ 18 41 -43 -56 -52 -1 16 -8 -20 -29 -66 15 -7 -35 -72 -20 -9 30 20 -36 -68 25 12 19 34 7 6 29 36 17 -37 -11 22 42
4800D2ln8M1k7J2rj8J7M2L4q6J3qJ2L5L2q7o3N4O4n3L7p5N7oNj2j01P0L4O6m0
$$ 42 39 -19 22 -5 7 -2 -20 -3 39 73 -13 0 -8 4 39 71 -16 -79 -25 39 -14 23 -52 5 -1 4 -8 -109 -39 -5 61 21
4832B1j0l1Pl6L2K3m4P6L7l9k9K2k2M0k7j3j3n2N8M7n5J5NJ9M0j1q5o6O4nP0k1
$$ 21 11 -20 -13 -49 -17 6 -38 38 75 36 7 29 7 47 20 7 -6 -58 0 47 -8 7 12 31 71 60 -25 -91 -27 -32 38 17
4864A7p5L5K9n1k4J12n8l4J18m5n4j9O3L6o2j1kKK3L1m3K8%K8o4O2n1l7O2kN5
$$ 17 -58 -23 6 -45 -69 43 -15 -49 69 24 -30 -49 14 50 -12 -23 -25 -23 0 31 -12 16 16 44 -20 42 -9 -46 16 14 69
4895F9p2m7%P5j4l6lJ0M9Ok6n6QM8N3n4p5M1J9P3l6n9M1m7P9j6p6k2R4m6O2n7
$$ 69 -3 -50 -50 25 11 -25 -28 -18 31 37 11 -45 -37 11 64 10 -65 -24 -5 68 32 -27 14 -33 46 30 -46 -68 26 -20 42 -15
4927a5Rm5k2J05j4k3j1KJ6J3lMm9R7j25L3N7l1PP1j03J1J3rL3K4j28J05j4N1l9
$$ -15 -6 -51 -73 32 18 -5 -16 -14 2 15 12 16 -33 64 -61 -28 29 -2 5 76 -27 -16 -3 -12 21 45 -83 22 8 59 20
4958B0l6L3n5J02p7k5J8J8M0m7Q3p4lO5nl6m7j5O7J6l5m6j3O9l8Pnj7M6OkJ8o4
$$ 20 -16 17 -38 64 -13 -38 -20 -2 38 -9 74 0 -3 62 57 21 -26 -41 26 42 7 -39 -52 17 -21 -14 -19 -36 10 16 14 32 -32
4991c2O9k2k6j5J5qL5L7o3L8l8j4O4j2o3k5N4K3ll4mO4j3Nm2Qnj5M9l4kl7M3O2
$$ -32 37 15 -11 -26 -11 -19 16 53 -10 28 -10 -24 40 28 -35 -60 -6 17 14 -20 -24 40 27 32 -10 -2 -7 -22 27 -7 -9 -46 -3 59
5025E9l4m4K0K9j9J8L5p5n0R3lM5q8J7lK4lqo3J08o1L4j3oJ0r0M8L8j6J5k6K8
$$ 59 25 -19 1 30 11 29 64 -11 -61 32 29 74 -14 3 0 24 21 13 -50 58 -3 31 18 12 22 -68 -20 18 2 17 -9 19
5057A9Nj1JJrL0o0k2P8j2l1Qj9L7nk8K8NJ5n7Q2n7o0K9J06Lj09qK4J3N9n3mm8
$$ 19 24 13 14 15 6 36 -24 -46 32 20 -11 -3 -22 15 10 -18 10 15 30 -27 55 -2 -62 -33 73 76 -33 -41 -17 -4 55 2 -2 -50
5091e0M1L2Nqm9M0L2n0K3o0ON2l5L6l9Q6o9J9k0j6JLO8j11P2Lmj8j8O1n1k1O1
$$ -50 -9 23 28 20 -29 11 43 -7 16 -44 -38 14 -21 15 -24 62 -7 12 -8 -24 -23 -20 48 -63 9 12 8 -10 -28 33 -18 -39 22
5124B2K8p0N9n2NM8mp3O3j6N1p9K2%j7N4l5m1RL0kj4M0%j5k9M9l9o5N3K4N9o9
$$ 22 50 -20 39 -13 -8 40 36 -37 26 10 61 -18 4 4 -13 41 6 -35 -26 4 2 -12 28 28 13 -16 33 -6 -71 -18 6 65 -4
5157dJ1j5qL8Ol1M8o0l2N7jJ4n8L8L5m5K0Lp7J11l4qm3J1M8k3K3k2k0L3qJ8j8
$$ -4 7 -8 -16 22 28 -3 45 -15 -47 10 9 23 -35 3 38 -7 13 16 -61 50 16 8 -35 -24 24 1 24 2 -18 15 7 25 7
5190GL7o5J6mk4Kj0P6o6K0k5QJ4L2jmn4L7N7p5o5J39p0jR1n7j5n5P0lPmK5o2O6
$$ 7 44 -21 -5 -9 -33 -31 -41 35 -31 -11 -36 -28 -14 18 17 13 -41 -4 53 -22 -87 52 -18 -19 72 15 0 -55 15 12 19 15 40 -22 44
5225D4k3l5J8k9M1k1K8jN0j4l7Nm4Kj2O9l9m4Q5k5K9rn5K6qj7N3l0k8L2J2k9k4
$$ 44 21 -14 4 -25 16 -5 23 22 72 58 21 26 -18 -16 -28 41 2 -42 43 18 47 38 -17 9 1 -16 37 7 -21 11 23 -6 -30
5258c0jO8l0J2k5pk8J16l8n9K5k4K8J1K3n5oK3M7k5m4K0l0K0J8Ml8K0l3N0L1n6
$$ -30 -31 37 7 19 -6 -13 -41 75 37 -22 3 -21 7 18 41 -14 -20 3 50 25 -19 1 -29 -9 9 13 -25 -5 -38 12 43 -13
5290a3j0R0m1no2J6N4J7k5p3P2%JJ6Jm4rJ2P5k1l9pP2n2J0Qn6L0O5n0o1L6K4n9
$$ -13 -23 67 26 21 -41 -25 29 46 21 -52 20 20 21 37 38 -6 -15 -3 72 51 12 5 77 25 35 43 -13 17 82 32 -29 7 31 -28
5324b8P7l9p3L5N0M2o5l4%N1mm1k6M2N9m9lj2m0K8K7l7mJ4K5j8L0%o7Q9m1J5O1
$$ -28 49 10 -63 -28 22 64 -1 -35 -35 16 12 -29 -55 -13 46 -3 -6 -18 -58 -30 -3 -40 -44 -30 -5 -23 7 7 -60 29 -12 3 64
5357F4l0p2L2L0Jk8kj3rL3L3n1J3N4j3q4M0nNl5nJ1m3J02M1p3J3L2l8K2NL1o5
$$ 64 34 -38 -6 24 25 -3 -5 -18 -27 6 39 -12 1 55 42 -42 -2 -7 -2 -37 -42 -31 -74 28 69 -4 9 41 3 25 30 61 -4
5390dk1K5K0l7L9lL2l9Mn6L6k6R1n5ln7L1Q1l8n1M4K4l0J0K1n1K8k4K4m9Qj3J1
$$ -4 -25 0 20 -17 22 19 51 12 16 -40 -4 -30 61 6 3 -54 -23 58 20 -31 13 37 7 17 38 -13 15 -9 15 -34 -26 -39 -28
5423b8R2m2l5K5j6J8N4p3n7J3R7l4m3%KJ01j12L6m7Q8m6Q1p9l0K7K7O4p7K4l3
$$ -28 64 22 -13 12 -4 14 68 -5 -62 -49 48 14 -29 -29 -27 74 -38 -2 -49 39 -7 74 -5 -35 -8 19 83 6 30 -3
5453ck5R1l6n4Q6q7oO7k0k7Qp7J09m1kJ5qK3Mk4l3L0MJ1m2K6j2J1O8Kj45O6J8
$$ -3 -28 63 27 -27 59 -28 -34 33 13 -14 -6 -83 26 -15 -17 -2 -10 13 17 -7 -40 -10 -6 5 -37 -11 -23 -12 56 58 -87 -21 -3
5486cPj5M1m5L4jK5o5J06o5j1N4q3J1J1%j6P6o0m8Q1j9mK2ko9Q5m6q7Q5O2r1L2
$$ -3 4 -11 30 -15 19 18 43 -22 84 19 8 62 -21 -10 1 1 -15 61 1 -47 34 15 11 33 31 -38 47 1 -86 -1 61 -30 2
5519Bm5OJ9kK0P5o3on4M1M7j06M2L6L5j0q9L6K6k6M1j8o1Q7J8m8j9Rj2M9MK4p2
$$ 2 -43 -37 -18 -20 0 75 12 6 -48 -7 40 -66 -24 12 47 37 -52 -16 10 -16 25 7 -54 33 51 3 -16 -7 -19 30 34 58 -14
5552a4MOL6M7p7m0N8knk6j9N1J7q0J7m3K5O8rl1l4N2O1p1KJ6n5M7j0Qo3N3K0k0
$$ -14 -10 -4 32 79 2 -38 20 18 13 -13 -32 19 36 -44 -27 -70 -45 23 14 -17 -51 1 62 -9 -7 9 -46 1 -9 -1 -64 -11 9 -11
5586a1K3J4p8Q0j4l3P3p0M0n0P1q6K7LK1P2j12P3m3M6ron0M6j5K7o5Q8l4j5k4
$$ -11 12 26 -52 28 14 -19 54 -16 24 -26 45 -41 -14 -11 10 82 -30 43 0 46 37 31 -19 27 12 39 -26 62 28 13 -11
5617a1L6j22R5qJ8oK4l7M6J7j2j2p1O3OK4o4j8N2r2J51j3q8r%J3M4j5n9kL1Q6
$$ -11 25 -97 -2 -10 8 2 26 -11 35 52 40 28 -43 20 26 50 -14 -32 20 -72 79 66 -22 -31 -31 -18 26 11 -48 -50 -19 67
5649F7o4Lj7NR0l1l1m3J3P2K6q9n2M0K5N2o1K7Onm6KK7l0k7L7L7l1j3M3j6L4J5
$$ 67 3 6 -11 -6 84 53 22 -21 -8 64 90 1 -51 -11 14 66 5 32 38 33 -13 -11 16 -14 -41 -4 33 2 -11 32 16 50 65
5682F5r2m5J17n2J6n0N4MM1k3j8k8j8R7n1n2L8L1l0J2MJl4J8K3o3qO0q8O1Nk6
$$ 65 -27 -72 45 -7 9 -41 13 17 58 35 17 -11 -29 68 17 -35 3 34 4 16 20 21 -13 5 28 -35 -43 17 -71 -10 -5 -31
5714c1O1j5q2P6j9o0R1k3M3k7l1LL4L9n5k1P8p3O5j7j01O3M0l3O0l9j4o7M1k7
$$ -31 30 15 -67 9 -10 -70 21 -2 41 14 -17 -14 20 59 4 -17 61 -12 53 36 -65 -2 38 5 65 26 12 -55 -14 -41
5744d1K5mJ2n5O1J8o8O5L9m4k9N7n5M2m9L5M2q1KN8k3J1m3K3k9P1l0j07R0N6q1
$$ -41 -16 -20 -8 -63 -2 16 -52 13 52 8 -21 36 -19 23 -26 9 51 -30 -28 30 7 18 -25 -2 -31 40 10 -97 -7 49 -32
5775c2Q4j6o4M8J3L6l8l3k4N0QJ4r3k1J11j3Nr6L5K7m2M5j1n5M4M1J8m9mmpO5
$$ -32 52 36 -28 20 33 69 31 -2 -26 24 32 46 -47 -68 43 30 35 -61 -26 1 -41 4 -7 -62 -18 23 41 -8 -12 -16 -23 42
5807D2l9j4pJ01m4l2M3j09P2k0L1j0p2N9J4K1n4J5K5on3M4qKO2q1O5p8lL8NPj3
$$ 42 3 -11 -18 83 39 7 50 -59 13 -7 24 14 -58 1 15 36 -18 -3 22 16 -37 7 -1 1 63 -18 47 -31 -34 4 9 16 3
5840CNm7L7J6N0r5L6N2p8lN8m2PK9n0M7o5O8J0n7K5j4L3j2j3L3l9l4N4j0Kl2k7
$$ 3 8 -39 -2 14 64 -31 5 57 -21 -24 34 -8 -1 28 -22 25 -40 28 38 -19 6 -8 25 13 0 33 -6 -40 14 4 6 -26 -53
5873e3K3J24n1o7j2K0K8Nk2l9K3l0J8K5k2M9P9o8m2j7j5k0J12k6n1K9RJ8Qk1q2
$$ -53 -30 94 43 -24 -36 -16 12 17 -5 -44 -21 -51 -33 -8 -30 19 98 30 -12 -29 -44 -64 48 22 -29 0 9 27 35 14 -68
5904f8R9Jl4JM1j4k4K4p5P4n0jO2l5J7K7pm9J9Nm9O4k5%o9M4M8n6P1n9n3N7L6
$$ -68 31 32 -2 -1 40 26 2 26 -49 25 -25 -26 36 1 18 45 38 -11 8 13 -36 28 3 3 -66 -22 26 -30 41 -18 -71 -14 22
5937B2j5m3J3K6pM2p9JM5l6L6j6l1P5n5rL0ln1J11n5N3o5j7L7nP0j4n1K8m5K6
$$ 22 7 -36 -23 3 -4 38 -41 -40 5 -31 5 -11 -42 33 -22 -31 -1 -4 -55 56 1 54 -11 -28 9 4 74 60 9 37 -8 18
5969A8J06j67L2M0qL1ln5k8L1L9n0o1O6j4L5Ql8N4j3%nK6o2M5nn0J8K9j4k6N3
$$ 18 124 -43 -11 29 21 52 49 -6 -34 -3 36 -14 -75 -9 -23 12 20 -18 36 23 23 18 44 -18 27 22 -28 -10 19 5 -21 32
6001C2Lm6M1l2L7M7q4l6Q3OJ8m5pk5K9l6NJ6m1K9M7m6j0J9L4o2R1o9j29N5Q9n5
$$ 32 35 -11 30 -2 35 82 -2 -38 45 51 69 24 17 -8 21 -15 -10 6 -35 -6 41 -5 -15 4 38 -24 67 -2 -131 -76 13 -42
6033d2N0j0Ok1N8l0m6R8l1l7P8q3j1M2l9K8j6k5N8j5QNo2mP9mo5p0J28j2Kj1j4
$$ -42 8 -2 4 -17 41 11 -35 63 32 -5 73 -10 -21 21 -18 10 -6 -31 27 12 20 25 -37 -41 38 34 -31 -101 27 15 17 6 -8
6066hj6N8p4N5Rm9k4ON3n5rR1m6m5K2K8k7O7j8J3l4n9J14m1k6J8q2Q0j8L1J3m4
$$ -8 -24 34 -40 15 24 -25 -49 -43 10 -45 -54 37 -9 -54 -32 -4 -31 36 18 31 -3 -62 52 11 -15 3 -79 1 -17 14 27 -17
6098a7Q4J8j26Q5p1J1J04m8q1nM6M7m2M4m6k3P6m1qk4k7mR6j09J06j03o0J42n0
$$ -17 67 85 -41 44 -27 -16 88 40 -41 -46 0 47 5 49 3 -20 56 15 7 -17 -44 -48 48 -61 45 -58 -118 24 -26
6127b6j2L8%K1po2J6o2O8K3k3P6m3j31J76l3k5j7j8O9m4K7K6n6MO3J4m1l2J4l
$$ -26 -38 0 0 21 14 -48 -32 -94 -26 -3 -26 50 7 -124 52 19 -6 -23 -41 28 -16 11 37 -19 -15 48 62 21 -11 3 0
6158@j0K6J3q6J01n9m8J13j00K5Q3n4K1j4L5m3l2P3r0k0J52p4k1n7L4Q5o2k2P3
$$ 0 -10 16 29 -57 44 -15 -63 50 -50 -25 58 4 25 11 46 3 -29 44 -46 -66 86 12 -9 -66 -32 53 -9 -31 42
6187D2m0pQ8o4n6M7LM0n6lj0l9J48l9r0P6j39P4mJM8l2PM0o4N9j8K4l7kl9K1M0
$$ 42 2 -5 83 19 -37 10 13 53 -3 -6 -16 -55 93 54 -36 40 -99 -25 -29 -28 20 -12 -5 35 -29 30 12 36 -1 -3 -42 -21 19
6220A9Kj5lK1o2LO7K3r6KR8Jq2Q7m3n6M3N6q6M7k2kL7m2M4oj5jRr1M7J8K0n1J3
$$ 19 21 6 3 24 -38 -35 32 55 -41 -39 59 60 -22 65 22 -34 9 65 -21 26 4 2 39 -3 41 35 20 19 28 -63 -16 2 22 -29 -16
6255a6mo0J26k0r7J13k4j9K6k9mn2P1k9j3J3O3r6RL6j5M3m3O0J6j39J50l0l2N8
$$ -16 -20 -80 46 26 -71 42 18 -1 25 -4 -8 -60 11 -18 -31 -18 45 -51 -42 -6 -21 22 -21 39 55 -84 66 36 4 62
6285F2p0p3O3N7j1m9Qk4N8K0j1m4l9M2l3N2K3q7M2K5M5j39Q7K1n2O0J2m9j3qK9
$$ 62 -8 -81 -18 39 28 -21 -13 -37 21 41 30 -14 -53 -11 -44 8 31 -56 -14 11 56 -83 4 25 -27 33 45 -4 -17 -25 4
6316Dj6l6L1K8k6O8p0n3L9O9q6L9j7NO5RJ2j39K1O2o1M7J6j9K3p6J11p8l5N1M8
$$ 4 -12 -48 -17 11 -15 53 -17 -70 -31 38 -48 -9 -26 -21 44 53 65 -74 -53 9 -52 -5 11 -8 15 -61 50 -28 -63 -12 36
6347C6o1m4K7O9mK3q6o7P6M2l6P0m4n2J17pq7l9K8N6Q%rj00J13N4m8jq1J3K3M4
$$ 36 -25 -69 -42 27 23 46 -40 -107 -31 11 -25 45 1 -51 66 59 -28 -67 -39 17 25 25 16 -84 29 83 35 34 -47 -34 -11 33
6379C3kn4oP1n1ln4O2N1r2L8M6p1N9J9j14M0L7o0N0LoJ8l1PRM0m5J7mKp2O5kK2
$$ 33 31 -23 -29 42 -9 -12 -66 -4 47 -45 -7 39 -32 27 46 -68 -28 9 -51 -1 2 -4 14 -17 -10 -1 39 -6 11 7 9 -63 2 0 22
6414B2Qj03R0%o6P7rj10P1K8j9J5L1o2k0K5J09j33M5J1lj8Ln5O0Jj3M2j4l9k3
$$ 22 30 -73 17 17 -49 28 19 -91 -20 8 -11 4 35 -27 -47 -22 87 -46 -1 10 7 -11 -8 -63 -3 -2 -15 27 13 -26 -49
6445d9P6j9m9J3L1m7P5n3K9M3o5K1O6n0o8P1kl3PK2q9N4O3n6k0J7M4J9j1p6M3
$$ -49 27 8 -41 -28 3 -44 31 -22 7 50 -15 6 72 22 -46 25 23 -10 -3 19 -70 -16 47 -9 -29 -12 32 51 40 -36 7
6476Gj8M4K8r1M1pj5K7k5J9o1J8Q9j06M5K5p9L7O9n7J4M9p8KKM8k3NO7p3J2k1
$$ 7 -11 33 61 -30 11 4 -11 16 -9 10 -51 -33 56 -50 -5 20 -59 -22 47 -10 4 53 -25 -23 -21 27 4 9 76 3 15 -6
6508fj0N8j2l1K5p8L3N1p6K5O7k7jop3N6K3N3j34N4koN7j3o1j2J05q9Q6j09R5
$$ -6 -16 42 30 -1 24 -54 -21 30 -46 -21 46 19 18 12 -61 -5 18 71 -63 -9 -11 -17 40 27 -34 -46 59 -30 56 -53 42
6539D2j5Nl9k9oK5K2O0p0n5J17j00P7K3o2N2J7p9M8k2l4J2jQ6j32O3J2k8oM0o3
$$ 42 27 32 -7 -36 -42 -17 5 65 -5 -60 57 -43 34 57 -5 47 64 -15 33 11 -23 -11 -12 74 -58 5 17 -11 -17 23 -40
6570d0P6l6k5O5m9L7M3q6M1Oq3J24p8L6npl4k9K8L5j19P5P3o6J6k7j6L0o1M2N9
$$ -40 36 0 -25 40 -9 28 71 -15 26 32 -51 73 -5 31 26 19 -15 -44 -16 19 -100 -25 48 -18 -2 -29 -45 -15 -76 -34 25
6601B5l1RpK6k7l4Q5m9M7Lr0K9ML0l7J7J5J9Pl8k8n7R9Jj2O6j19J9M7l1J2j0j5
$$ 25 -6 3 -4 22 -5 -39 46 -3 44 47 -43 -14 -10 20 -17 0 15 34 41 3 -25 -82 17 18 6 72 -47 -28 19 -12 0 -10 -25
6634b5kL1Qm7K9kPl7J8j5O6k0MO9j12M1N7p8k0O9o9L9O7n0J3q0N5k6J4L9p1K7
$$ -25 -27 4 12 -35 -6 -8 -1 -38 -20 -35 31 11 15 84 -28 13 70 -8 -28 41 -28 11 78 28 41 -39 16 -10 4 43 -28 -1
6666aO6r5k3Q7m4Q2j04Q7k6r7Q2j2j9l5R2j3o2K0L1m8O8m3k7J4K1O4k4J3m1m0
$$ -1 65 -30 -53 34 -10 72 -32 55 29 -68 14 2 -17 -52 40 27 -35 -15 16 -32 36 -7 -34 -20 1 65 41 54 13 -27
6696b7PR9o4k5m2J9j4O3lk3o6J27q2M9%L6r1L5M5p3k5R9k1j9n3M3oO1k4j3k3k0
$$ -27 -20 79 15 -10 -52 -33 -47 16 13 -10 -76 51 -31 18 18 54 -37 -2 43 -30 -55 44 23 4 -49 -6 -12 49 25 12 -11 -31
6728c1JK6qn0K6k5J0K1jnL6j8K9L8m0mJ3R3j54L8K2j21Q1J07p8o4P3K1L1o2K1
$$ -31 -30 -4 -12 -62 -36 -61 -51 -30 -31 -36 0 -18 11 49 9 5 18 111 -43 -5 17 -104 -23 84 6 -58 15 36 67 5 26
6759B6l8j6J28p0j5lk1R4q8j9M2j4m0P2o3K7m3M8j1Jl4RQ2Mn2KL1k4PLr7Q8k2
$$ 26 -12 -28 100 30 15 12 -9 85 -3 -22 20 6 -34 38 -25 2 -41 7 -4 -3 -37 -28 54 58 6 8 39 15 22 25 -72 16 -6
6792fJ1J8j3l7MN6N4j25L5m6N9qJ3k0L2jm3K3mj3K9M9r8M2l7J3qN4o7K3%k6K9
$$ -6 5 23 10 -27 -23 33 87 -38 -3 -49 10 2 15 -5 27 26 -17 6 2 -11 18 67 -31 11 -26 -13 -21 33 -34 -11 -11 -37 -8
6825hK8n1N6n8N9k2k1M5L2j02O5N5q3j9%K1l0J0O8o2M5qkm9Q9l6o4L5qL1k9N0
$$ -8 20 -31 25 -33 26 4 -17 28 60 -42 23 78 -5 -24 -24 -3 -33 -23 45 -17 28 20 18 -31 58 22 -42 -7 -15 16 -13 37
6857C7j4m8PK4kk3l5R8m2%%j5M2j8n7L5M4n5K9k4N0n4JK5j3j6Q6j08J9O7K7j2
$$ 37 23 -25 -18 6 4 -19 -54 44 2 2 2 -13 29 11 -46 -11 33 -22 7 -17 33 -21 -20 5 -8 -24 62 -46 -27 40 67 55
6889E5n7J2l0L9J5j2j0n5L7Lj4L2K1o7OP5r6l7J29lq0L4J2KJ5j8K1r5P3Pjp7L
$$ 55 -2 10 -20 19 34 22 12 -43 -6 -3 -17 15 36 -31 -25 50 -46 -83 46 43 -37 -3 9 11 26 8 29 -66 7 14 13 -64 -61
6922f1L2L2k1M6Mk0Oom2K5j2J2K2L0o6L7mrj4L9p6O4J1k3l1J7k3K5Lj4j3KR3n5
$$ -61 -29 3 -18 28 32 12 18 12 -30 -5 -17 -5 17 47 -19 18 14 5 -9 30 -46 18 29 6 -25 -8 -31 -6 -3 -17 -30 -28 65 10
6956A0k4j0k2M8L4l1k3Lk2L6J3q0Q8oK3l3n2J5pQ0l4j9L4m1jR0p9j8J1oO7o3Q
$$ 10 -14 -24 -46 2 36 5 -18 -15 -37 -1 12 -68 20 14 37 4 -48 -33 -40 40 6 -13 21 -20 -21 69 -10 -28 -17 -23 44 -19 -11
6989a1j4J9k9lj2L9J3p5R3m9L0k7N0k4j9k4N5j3J2pj7M4j07P2l0lK8k7N5l4J4
$$ -11 -25 -6 -35 -38 -50 -11 2 -73 20 -29 1 -26 24 0 -19 -43 12 -1 11 4 -13 31 -76 -4 -34 -37 -9 -36 19 -15 -1
7020aK5l6o8J28m3n7L5l8M1J6n7M9RK2On1mL1o1L8K7l2L4j6M8p9K5K8l3J8L1j0
$$ -1 24 -12 -80 48 5 -52 -17 -55 -14 2 -55 -6 3 25 31 -20 -24 7 -54 -16 11 -21 13 -3 45 -34 -9 19 -14 4 35 25
7052B5j6jo9O2n0M3K6k3J5Nn2lRO2nk4Mk4lN9q2M5j8m8J13n0m8O7j0j8J5k2M7
$$ 25 9 8 -61 1 -49 -6 20 -3 12 17 -35 -38 -29 33 28 4 8 -16 -19 40 -42 3 -15 -63 50 0 -48 19 9 -9 6 -16 31
7085C1q4O2J8o9J9K3m0L9k3K7l1J8M1p2K3M1nJ5p5J8j9j7J2J28q6KkJ0Knl5L4
$$ 31 -53 9 27 -42 -23 0 -40 -1 -24 3 -28 -10 31 -41 -18 23 18 33 -42 -24 -43 -60 -48 80 -6 -4 -6 4 6 1 -34 0
7117@J8m4P5q7K1M8l3o8Q1l3M5m8K3k8Pj5j6M0j8J2K6j1l6O9m6N1l7M7rr2L8M9
$$ 0 18 -26 49 -38 -17 31 -2 -70 11 -22 23 -25 -2 -30 -23 -38 -54 -14 -32 -20 6 -5 -41 28 -18 33 -4 43 34 -58 -20 29
7149B9p1Q8l9j8N1l5kO3r0J17r8%M4m6j4KO4jl3K3l1J9Pr7O5J6Om3M0n2M0K3q6
$$ 29 -42 46 7 -11 40 5 3 66 -24 93 -5 -5 39 -7 -21 -19 45 44 11 34 3 22 29 -68 -3 13 19 -24 16 -36 4 27 -59
7182e9N6m1n8J73q1K8J2m7k6Q7k9j1m2L9M0j10J01k9pL3k3rj7j1J7K5m6M9j6O6
$$ -59 -3 -44 -102 71 -10 18 30 -17 -43 44 15 4 -38 1 41 -69 32 3 -4 29 6 -3 -20 -31 -14 11 -35 14 -2 64
7212F4p8OM7q1J4M3Ljp2RN1oL5k4LK3j01O4o4L2Q7n4o0Q1omK1l4KMj2RkpK3r0
$$ 64 -14 -8 39 -42 -28 15 18 17 -55 -46 5 -1 34 10 13 36 -65 -1 -65 -33 54 0 -60 21 15 11 32 -2 0 4 -8 1 -1 -8 15 -75
7248g5J28n3NO3n9pMrj6J1l0JM6l4MK0J2o0P9l4L7q5P5l9K8lo7J08l9k0j3O4l6
$$ -75 53 0 5 68 9 2 6 -3 -19 -8 -38 -37 9 -25 -21 -1 11 -49 30 -4 33 -52 23 -16 12 9 -58 50 11 -9 -22 42 6
7281FK0l0j7PJ3L7l0rN4Ok4o2jN8l1KLk8QjO4k3l2rj0J9j5K6l8Q2rJ5r1M4m0N9
$$ 6 26 -4 -21 -14 -1 36 6 -3 51 57 33 -29 -30 28 -3 -1 2 -26 -18 -19 45 22 -10 -19 -29 -10 -25 1 -37 45 36 51 -40 4 -36 23
7317B3k5k1K2j4J7pnrM0n9mO4q9J6L3m6M6k1O5l5J0M3l5j9J1L1q3J16l8n5M4m7
$$ 23 -2 -23 -1 -15 2 -5 -10 -19 21 -38 -42 22 -67 -51 -18 -64 -18 -39 26 -9 1 44 9 -10 1 32 -51 65 27 -28 16 -31
7349c1M0J9o0M8m1%L3k4%mJ5Ok2J6j3%J3n1P1J4q2P3k0o9N4j5kJ2L7OK4j4J6o3
$$ -31 9 28 -32 16 -25 -25 8 -16 -16 -20 -5 1 -21 -5 -18 -18 -5 -56 15 29 -53 20 0 -69 -15 -30 -32 -20 17 23 47 33 49 -14
7383a4L3l6N9p3N8j3k9K7qL4r1P6m3M3J8n5N6j8K3r5J6K8L3Km3nk7P5l8J5J3m
$$ -14 19 -17 42 -31 27 14 -15 12 4 38 -53 23 -20 23 41 -14 42 24 47 -48 -32 -4 29 31 -12 -17 -44 31 -7 8 21 17
7415A7J8j2o4O5l3lJ3K7m2M9jl2lN0j9p5O5N7l5p9M7l4P4m4Rn1N8M6r1K8l8K0
$$ 17 35 23 -41 24 -9 -12 1 28 -14 35 34 2 -1 49 30 -45 20 77 42 -37 10 -24 50 6 15 -36 22 68 -23 5 -33 -13
7447a3k1J5K7J5j22R9lm6M0NJ2J1J9n0k7K1M6l4L3l5kO3Kp7J4k3k4R8k1N4n1K5
$$ -13 -34 -19 8 23 -99 0 -3 -49 -9 -4 8 19 38 -12 -39 -18 28 -6 27 -8 -10 53 55 -22 -8 -31 -55 43 22 76 25 50
7479E0Kq0m1Q3K7m4J2n4L9l2R1Mr5N2m1J2J01j46N4j2L6J3n3j1M0OL6o7mJ7l1
$$ 50 52 -28 -69 14 41 -3 9 -45 -6 -38 53 57 -38 14 -27 -15 86 -60 -6 -18 18 31 -22 -33 7 13 49 -18 -22 -5 -36
7510c6L0Jn3P4m2k6N3KmM5n2M1k7mjk9O1J8j3L7r2j4O0m9KN2m5O1r2M0L7l2no
$$ -36 -6 -5 -58 16 -26 -52 1 3 -1 44 -8 33 6 2 1 -28 33 51 38 75 -17 -31 29 -20 -18 34 -11 50 -42 -2 35 3 -2 -8
7544h%j8M8k3J3m9J7K4l9M7j8pJ2J2m8O5l5J5qJ1k4jqK1m4J12p5JL5m1J14r7k3
$$ -8 -8 -26 22 -1 12 -37 -20 4 -35 12 -6 -13 -1 11 -37 28 -7 8 0 11 -13 -14 -22 -1 -45 67 -8 -7 28 -13 101 4 -19
7577a9K0J5K3k8j3ko1J4P7l0kjj5L3jp1K5N1l3J7m7K5L0L5qn3mJj5RN1l7M4p7
$$ -19 1 16 39 11 -2 -4 -65 -51 26 -4 -6 -7 -22 11 10 -61 -36 15 -18 -1 -48 -23 7 42 34 -19 -23 -22 -37 -28 23 -14 30 -47
7611d7N2Rm4N3q7N2L2l1J0OK3j2qm7R4Omp7M1j6QLj5n6O4jJ7m4l6N0M9p0%nJ6
$$ -47 5 14 -30 23 -64 -12 20 -11 -1 5 28 16 8 -39 55 61 57 -20 21 5 13 16 1 -55 9 8 25 -19 -55 -5 44 -26 -26 -31 -15
7646a5Q6j04k5O7m1Q1l1k1l5O1K2j6Pjj9kj2M0m8j9k7O3l3oO5%%Nj1k0pj0L8o3
$$ -15 71 -33 -58 9 -32 49 18 -3 -38 23 45 29 36 35 16 14 2 42 -6 -25 -52 11 -22 -28 37 37 37 42 31 11 4 -6 32 -31
7680c1Rk4N7nj7K8L1p8K3l5N8n1K1LM7l9lj3MN2q5j5L4O4l0K3j6Lm5O4qpPj5q
$$ -31 -22 -46 11 6 -11 17 48 -30 -7 -42 16 -35 -14 -11 36 -3 -6 -19 -15 37 -48 -63 -29 35 5 28 12 15 -30 34 26 19 26 11 3
7715CL5o4N3N4q9N8k5j3K2m3LL9k6k0JJ7k3JK4LL3om4K6Rn6N1j9l9L7m7PlO0j4
$$ 3 38 -26 27 81 -8 50 25 12 34 -9 -6 33 7 -13 -12 5 -18 -17 7 10 43 37 -7 19 28 -28 23 4 -35 2 -45 -38 -41 19 5
7750EO1k0r1L0Qql6O6MK2m6j1O9j6j9k1RJK2k7K6n9NR3l8l1j6K1jM4o7L1J1k2
$$ 5 66 46 -45 -15 -7 -15 -51 15 19 41 -5 -16 53 37 18 -3 6 7 29 2 28 -31 -26 67 29 -2 -18 3 2 46 -21 10 21 -1
7784aL3j8m1j9K8K3l3O6n5M1mK0n7M9j8m5J3L3l1N7J5kl3pK3nQj9PJ0o3P3ml6
$$ -1 32 14 -27 -46 -18 5 -28 38 -17 24 20 40 -17 32 14 -31 -18 15 -16 41 56 54 21 14 37 32 40 21 28 38 -25 48 44 8
7818HO0j32Q5j0n0M2Pm1M6J4m6J7l1O5l0m9Q6%n1rK6k3J3L8k0j8pL7PoJ8ok9J7
$$ 8 68 -64 21 11 -39 3 10 -31 15 29 -17 0 -31 34 4 -45 41 41 -10 -19 7 -16 -3 35 15 -3 -10 27 34 28 46 40 11 28
7852B8rm1K6J4n1O6K8m5q1N4k1N8l1O4n5Q5q7kKRp5O9j1m0M6k9J8M7q6J7lP4l9
$$ 28 19 -22 4 18 -33 33 61 16 -65 -11 -32 26 -5 59 4 89 2 0 2 11 -64 5 -6 -46 0 -29 -11 36 -50 -33 -36 38 -1
7885ak1MJ0M1o4P7l9MmmN1r2mR6l1m3l8L7j5M4O2n9J6K4p1L1J4k2jm3l3O8Mk2
$$ -1 -22 -18 -8 33 -31 46 7 11 7 3 54 -38 -42 54 23 -20 -58 -21 -36 8 70 11 27 51 -20 11 25 3 2 -41 -74 -6 -2 -24
7919b4J3K0NQo2J0L9J0k4LL4l3OkM0m8Pm3R4o3N1K2k5k1j6K7jkl1l4J01m0m5L5
$$ -24 -11 9 14 22 -40 -30 9 19 -5 -2 32 -1 5 3 43 -5 2 -41 53 -10 41 63 38 17 1 28 27 25 -6 -40 61 21 -24 11
7953A1M6o6j1M9n6L7l8j6R1q0L0l0J3K4Rj8k3M5p8L3j2K6mnP0m1K4k9m2N0ok8
$$ 11 57 -9 -20 29 -27 10 -28 -44 47 -33 -3 -33 -20 4 13 -5 -28 17 -61 -28 -40 -14 -18 -23 47 6 30 1 -41 9 3 -25
7985b5J10o4k1K7l7J8km6N3JK9J8k6ok8oN4k5K2l5n8K7m3R0j0o3O6l6k4O8q0M9
$$ -25 85 21 0 27 -10 8 6 -40 13 14 43 61 35 29 1 -5 49 24 46 11 -47 -20 -63 27 17 -46 20 -16 -40 28 -52 -3
8017cK4jk6l8J6K0J0l7N1KJ1L1o5J4J6j7K2o6L1N0l8jJ4J8m1l1K7K3Nk9lJ8J1
$$ -3 21 20 -6 -44 -28 -8 2 -35 16 18 29 60 -5 9 25 8 30 -36 -5 45 7 6 20 38 -3 -34 -7 16 21 -8 -11 7 18
8050A8k4M3j5m2j1O8m7l9O5j4j4N1J9r2O5k5j0L6k6J8m9Q8p6J2M3n9kL1J7j6q
$$ 18 -6 37 22 -20 -31 37 -10 -49 16 2 -12 39 58 -34 31 6 -4 32 6 24 -25 63 -13 -1 42 -17 -19 12 29 13 5
8081EoL7o7M3j3KmM4m5KOj1J1N5j07O6j10L7L4l0K7R4o7o6O0kl5N2NpL2l2k8L5
$$ 5 -1 36 -31 12 -1 1 -3 41 -4 -2 4 -7 4 59 -48 18 -92 -55 -21 -51 -24 70 3 -63 -3 -5 -40 12 17 10 42 10 -18 17
8115A7k7k2L5jL1o2K4pKm8K6K7m0J0M5oj1K0L5l0n6O1O0q9K8l2j4M7k3K3n8N2
$$ 17 -10 -32 3 2 33 -29 -5 -12 -10 -58 -32 -5 -45 -35 10 4 -7 13 48 18 -38 23 83 -6 22 -10 -24 23 0 23 -35 17
8147A7Lk9P7o2l5N3pk2k7K9J6n2P6L1m3m0NJ5k8J02k8k4jm2N6k8l4kL8M4q6M2
$$ 17 20 -9 68 6 -29 24 17 -5 -32 -3 13 -39 37 68 25 -15 -10 5 -23 79 51 27 26 -16 40 12 -22 -24 14 58 -28 14
8179A4m9JQ5l1L0j2l3Okl2N5l2
$$ 14 -35 -34 51 20 50 38 5 11 9 -23 32 0
8191@
$$ Imaginary data points
##PAGE= N=2
##DATA TABLE= (X++(I..I)), XYDATA
0@%%%%%%%%%%%%%%%%oJ4j6J6j6J6j6J6k1K8l1L2l6M2m9N5n7O4p2Q0r1R8j05J16
$$ 0 0 0 0 0 0 0 0 0 0 0 0 0 0 0 0 0 -6 8 -8 8 -8 8 -8 8 -13 15 -16 16 -20 22 -27 28 -29 35 -37 43 -48 50 -55 61
40F1j30J43j54J66j82K02k22K42k64K89l19L52l87M31m84N44o14P01q11R48j125
$$ 61 -69 74 -80 86 -96 106 -116 126 -138 151 -168 184 -203 228 -256 288 -326 375 -436 512 -613
61f13J362j691K168k892M075o212J0706k3148J07498K47440o21894J15718N66835
$$ -613 749 -942 1226 -1666 2409 -3803 6903 -16245 91253 338693 -283201 -167483 399352
74C99352m78270k08564N09878j49759k93113L31117J3455k94110J38470J54950
$$ 399352 -78918 -287482 222396 72637 -220476 110641 124096 -170014 -31544 123406
84A23406j09822o7393M262J03506l884j59225J63678P4234l38887J74212L26853
$$ 123406 13584 -53809 -49547 53959 50075 -109150 54528 128762 -210125 -35913 290940
95B90940m18305p9838M64712k63390k53487M92641j08516m65091M17052J87431
$$ 290940 -127365 -207203 257509 -5881 -259368 233273 124757 -340334 76718 264149
105B64149m84257J64519K78828l62900K9957L16803k16335j38500J99587R29q0732
$$ 264149 -220108 -55589 223239 -139661 -109704 207099 -9236 -147736 51851 52780 -27952
116b7952K5214N639O697l8316l931J34525q9076j79072K35733P1567l07589J62267
$$ -27952 -2738 2901 9598 -28718 -32649 101876 12800 -166272 69461 141028 -166561 -4294
128d294J87789l54605Q7613L42021l34244j24512L84763j46160k23530L05757
$$ -4294 183495 -171110 -83497 258524 -75720 -200232 184531 38371 -185159 120598
138A20598l0115k84849K21819J25321k48731N0036J23745j19722K4970O9986o5489
$$ 120598 90483 -194366 27453 152774 -95957 -45921 77824 -41898 -16928 53058 -12431
149a2431m903o331K2996P7598j06538n1835J58047o1854j07160J79818l7485k09821
$$ -12431 -17334 -23665 -669 76929 -29609 -81444 76603 14749 -92411 87407 49922 -159899
161a59899J99210J07183k68478Q1134J77147k26479K4740K23506j91417r1836
$$ -159899 39311 146494 -121984 -40850 136297 -90182 -65442 158064 -33353 -125189
171a25189K14799n3156j12760J19474j6246r8056Q6361L6231o9252N553q98J1393
$$ -125189 89610 36454 -76306 43168 26922 -71134 15227 51458 -17794 -12241 -13139 -1746
183a746M5094o2440n153O9017q5531J2346J28086j27046o8274J75754n0977j15681
$$ -1746 43348 -19092 -24245 44772 -40759 -28413 99673 -27373 -95647 80107 29130 -86551
195h6551J44598j4257j56435J37044P9991j80917L9340J14968j20117J3158J08288
$$ -86551 58047 43790 -112645 24399 104390 -76527 -37187 77781 -42336 -29178 79110
206G9110j03528l4739R7021k0729l0008J9765k2334P485K4130j7249J0278p318
$$ 79110 -24418 -59157 37864 17135 -12873 6892 -15442 -7957 16173 -1076 9202 1884
218A884m6159N6895M4693r7399J1265Q0450q4952N914J07709j03836n3676J36171
$$ 1884 -44275 12620 57313 -40086 -28821 51629 -33323 -27409 80300 -23536 -77212 58959
230E8959l0863q4592Q4466m778q5625P6351M6830r7300O176O1285l8852L020L0470
$$ 58959 28096 -56496 27970 23192 -62433 13918 60748 -36552 -30376 30909 -7943 -4923 25547
243B5547m0740l581K5572K105R506l1639j6802N2983r269l4579L9382j3669m9933
$$ 25547 -15193 -18774 6798 8903 18409 -13230 -30032 22951 13682 -20897 18485 4816 -45117
256d5117O4209L1623r0049J3903O8264o1585K43P1567p0810l3425R0084j5220
$$ -45117 19092 50715 -39334 -25431 42833 -18752 -18509 53058 -17752 -51177 38907 23687
268B3687n3276L6363J077l1254L2755J9280m1230r312K7626N038k955j0420r054
$$ 23687 -29589 6774 7851 -23403 9352 28632 -12598 -21910 5716 10754 7799 -2621 -11675
281a1675J3627m201O098K0381m2223j1964N8658j4753l5988L2734p268l2078M3407
$$ -11675 1952 -2249 3849 24230 -17993 -29957 28701 13948 -22040 10694 3426 -28652 14755
294A4755J9437n9847J972M8743k5678j0058L3109l2572j7684M6582l09k9204J921
$$ 14755 34192 -25655 -23683 25060 -618 -10676 22433 -10139 -27823 18759 18450 -10754 -8833
307h833O558L009M623K019r451j3698J1413K0606o707k2469K216J8005p854J689
$$ -8833 -2275 734 5357 7376 -2075 -15773 -4360 16246 9539 -12930 -10714 7291 -563 1126
321A126J4580l1188o302M4451j0551k7866J6996j409j1282K2242O596l2016l471
$$ 1126 15706 -15482 -21784 22667 12116 -15750 1246 -163 -11445 10797 17393 -14623 -18094
334a8094L0770m013j3395R962j1895o215K4280J952j7793p495Q438J2691m699
$$ -18094 12676 8663 -4732 5230 -6665 -12880 11400 13352 -4441 -11936 -3498 9193 4494
347D494l776j367j1533J0849J8253j2549j6492N641J1890j882j03K651j8994K105
$$ 4494 718 -649 -12182 -1333 16920 4371 -12121 -6480 5410 3528 3425 6076 -12918 -10813
361a0813K9089j0146j8514Q731n44J47J2435k744j8450j465K1641J421j4886L135
$$ -10813 18276 8130 -10384 -1653 -2197 -2050 10385 7641 -10809 -12274 9367 10788 -4098 -963
375i63l171l283J6883J635j7167o320J2351J0766r282k938J103j1148J2568J6190
$$ -963 -4134 -7417 9466 11101 -6066 -12386 -35 10731 1449 -1489 -386 -11534 1034 17224
389A7224j8454j2017J1112O970k108L19j451j3886N983K2810j1773j6009Q788
$$ 17224 -1230 -13247 -2135 4835 2727 3046 1595 -12291 -6308 16502 4729 -11280 -2492
402b492J566J522P114m963j1896r26J7968M023j7962k9N765l101Q637L963j4141
$$ -2492 -926 596 7710 2747 -9149 -10075 7893 11916 -6046 -6075 -310 -3411 5226 9189 -4952
417d952q830J5004J3022j5731n203R574j0577O352J8280j8147j4669J5878Q974
$$ -4952 -13782 1222 14244 -1487 -6690 2884 -7693 -1341 16939 -1208 -15877 1 8975
430H975p459k216K056r596L324J9665r344j7424P860P643P47j230l214l383m637
$$ 8975 1516 -700 1356 -8240 -4916 14749 5405 -12019 -4159 3484 4231 3001 -213 -3596 -8233
445h233J3195J0384k1481o058J7413j968m337Q017p122j4487J5572J7894k2166
$$ -8233 4962 15346 -6135 -12193 5220 3252 -1085 6932 -190 -14677 895 18789 -3377
458c377q465J8254r193o74J8427j6098j4733J7494Q327q233m437O40j990L380
$$ -3377 -11842 6412 -2781 -3455 14972 -1126 -15859 1635 9962 1729 -2708 -2068 -4058 -678
472f78R735n407j1814J244R783P171j0976o571J0181p232K523J8789k0508j5141
$$ -678 9057 3650 -8164 -6920 2863 10034 -942 -7513 2668 -4564 -2041 16748 -3760 -18901
486a8901K6370J880j6476J0135P74j8600J4302K0416k5056r514K2378q264l475
$$ -18901 7469 9349 -7127 3008 3782 -14818 -516 19900 -5156 -14670 7708 -556 -4031
499d031J6288j5599j0095J7157L120m842l868m917N767O129k763j766k582o672
$$ -4031 12257 -3342 -13437 3720 6840 1998 -1870 -6787 -1020 5109 2346 580 -2002 -8674
513h674R478J4399j8914r562K1841r119o706K4185j8728j9764L1815K562k3132
$$ -8674 804 15203 -3711 -13273 8568 -551 -7257 16928 -1800 -21564 10251 12813 -10319
526a0319J1840L355j7544J4900J5401k4607m931J9233p510N70Q776j7388J302
$$ -10319 1521 4876 -12668 2232 17633 -6974 -11905 7328 -182 388 9164 -8224 -6922
539f922J3972o042L513l511j4182J5891R572j7165L059O655j5364R610K0728k5812
$$ -6922 7050 1008 4521 1010 -13172 2719 12291 -4874 -1815 4840 -10524 -914 19814 -5998
553e998j1234L0149j0944j2536K6530j7102k0335L3192N34k3794J2887J557j3002
$$ -5998 -17232 12917 1973 -10563 15967 -1135 -21470 11722 12256 -11538 1349 2906 -10096
566a0096J5553N982k0185K460J0818o405P088n85j7894J3754Q090j5015J2688
$$ -10096 5457 11439 -8746 -6286 4532 -1873 5215 4630 -13264 490 8580 -6435 6253
579F253l120k1709K4597J0133k8522R015J2637k1088J0852K0669k9174p098L0963
$$ 6253 3133 -18576 6021 16154 -12368 -3353 9284 -11804 -952 19717 -9457 -16555 14408
592A4408j2781j0959K2271j7648j1317K9688p475j5410J2908p634j859J8155j0588
$$ 14408 1627 -9332 12939 -4709 -16026 13662 6187 -9223 3685 -3949 -5808 12347 1759
605A759j2038J3277l359m282J7897j3089j9046K7924Q73k3206K2721l828k7822
$$ 1759 -10279 2998 -361 -4643 13254 165 -18881 9043 9916 -13290 9431 5603 -22219
618b2219L1309R519l5015J3764J4201k3326J2529J6964k8727j125K6075j4096
$$ -22219 9090 18609 -16406 -2642 11559 -11767 762 17726 -11001 -12126 13949 -147
630a47n311J6066j8635j118K4012j5268n885J3193j5599O236J9031k2383m568
$$ -147 -5458 10608 -8027 -9145 14867 -401 -6286 6907 -8692 -2456 16575 -5808 -10376
643a0376K0212j3132k404K1726j9710j5225L2538n163k3422K4301n554k3625L1273
$$ -10376 9836 -3296 -5700 16026 -3684 -18909 13629 8466 -14956 9345 3791 -19834 11439
656A1439L001l1491J6504Q819j8048J4731N503k3200P603J5229j2569K348N639
$$ 11439 14440 -17051 -547 8272 -9776 4955 10458 -12742 -5139 10090 -2479 -131 5508
669E508j7230J0036J5386j9812L198R430j8871J4288J4776k8192L433J9353j7495
$$ 5508 -11722 -1686 13700 -6112 -2914 6516 -12355 1933 16709 -11483 -8050 11303 -6192
682f192L154J8152k3303o735K9649j0186j6796K1365r402j5056K8732m678k4105
$$ -6192 -3038 15114 -8189 -14924 14725 4539 -12257 9108 -294 -15350 13382 8704 -15401
695a5401J8060J779j2298J6260l650j7294J3280O280j0434O802j445j3525J5399
$$ -15401 2659 4438 -7860 8400 4750 -12544 736 7016 -3418 3384 1939 -11586 3813
708C813P405j9591Q256N589j7358J7424Q620k7809R210J5687j7922O677J2061
$$ 3813 11218 -8373 -117 5472 -11886 5538 14158 -13651 -4441 11246 -6676 1 12062
721A2062k2150P65K3407j2156j0843J5581q901o912K1660q552j5921J4949j262
$$ 12062 -10088 -9323 14084 1928 -8915 6666 -2235 -9147 12513 3961 -11960 2989 1727
734A727n091J1809r596q268J3414r46m813O546q000n916J6989r98j5645J0662
$$ 1727 -3364 8445 -1151 -9419 3995 3049 -1764 4782 -3218 -9134 7855 6857 -8788 1874
748A874R01j3336J8468K301k4804J2584J1846j6151P594O755j8246M888J6694
$$ 1874 2775 -10561 7907 10208 -14596 -2012 9834 -6317 1277 8032 -10214 -5326 11368
761A1368j0780p075R429n550j204J2942q902q431J0339k568P52O716j2848m95
$$ 11368 588 -6487 2942 -2608 -3812 9130 228 -8203 2136 -432 320 7036 -5812 -6307
775f307J2659o457j046O268j0952q71J6395n567j2994J0746N38r853J4553J33
$$ -6307 6352 -105 -1151 5117 -5835 -6706 9689 4122 -8872 1874 2412 -7441 7112 7245
789G245j9616J0730J0168j1509L671K660j0063N021Q814n516n191J942N61L041
$$ 7245 -12371 -1641 8527 -2982 689 3349 -6714 -1693 7121 1605 -3586 -1644 -1083 1958
803A958K801o929j282M712k909N476J893j4370N406J1528j0009N25O208j0938
$$ 1958 4759 -2170 -3452 1260 -1649 3827 5720 -8650 -3244 8284 -1725 -1200 5008 -5930
817e930J193J4275o278j1583Q679L069p469Q077Q95j3596O280R092o176j304m00
$$ -5930 -4737 9538 3260 -8323 356 3425 -4044 4033 4928 -8668 -2388 6704 528 -776 -1176
832a176j694L922J441o81k875m066M853O127m728n869M408J593m113P222J01j4341
$$ -1176 -2870 1052 2493 1812 -1063 -5129 -276 5851 1123 -4746 -338 1255 -2858 4364 4465 -9876
848i876P558J1516j1317q37O764q065N09J1186m284j0908N650O814n576R04K832
$$ -9876 -2318 9198 -2119 -2956 3808 -4257 -3748 7438 3154 -7754 -2104 4710 -866 38 2870
863B870p645J585Q107j683n351k149M501K991l922K000p14o774O466P321q131
$$ 2870 -4775 -3190 4917 3234 -2117 -4266 235 3226 -696 1304 590 -6184 282 7603 -528
878e28n367O850J493m869N536O36j2093O314J1309j0061l574O652l650p39O906
$$ -528 -5895 955 2448 -2421 3115 3751 -8342 -2028 9281 -780 -4354 2298 -1352 -2091 4815
893D815j588r030K183R187l448m690L539k166j454N938J013o490l537P622L303
$$ 4815 3227 -5803 -3620 5567 2119 -2571 968 -1198 -2652 3286 4299 -2191 -5728 1894 5197
908E197p506K008K228p098N307P506q676n502P561K914n653K440K249q976L702
$$ 5197 -2309 -301 1927 -5171 136 7642 -1034 -6536 1025 3939 -1714 726 2975 -6001 -2299
923b299J0490p855n936O080O50j911K691M74o357n77R736j362q424L345K502k945
$$ -2299 8191 336 -5600 480 1130 -781 1910 2384 -3973 -4550 5186 3824 -4600 -1255 1247 -1698
939a698K949K645n950m306Q733L735r733J465M862o497L384P084q086n368P862
$$ -1698 1251 3896 -2054 -6360 2373 6108 -3625 -2160 2702 -3795 -411 6673 -1413 -6781 1081
954A081L698o143j24L684n765J236R071n670p181N409L926k708j340K395l069
$$ 1081 4779 -1364 -1488 2196 -3569 -2333 6738 1068 -6113 -704 3222 514 -826 1569 -1500
969a500l126R094R38j1008K725O785m163o50M370m337n304Q793M616j1228K90
$$ -1500 -4626 4468 5406 -5602 -2877 3908 -255 -905 3465 -872 -6176 2617 7233 -3995 -3705
984c705P597n435M47O441o035n265O801M855o083l317N409j843k441O956j842
$$ -3705 3892 -1543 -1096 5345 -690 -5955 846 5701 -382 -3699 1710 -133 -2574 4382 2540
999B540q188L349P381l076o006M778R64o633P373M323j2686J019J0693m667m533
$$ 2540 -5648 -2299 5082 2006 -4000 778 1742 -4891 2482 6805 -5881 -4862 5831 1164 -3369
1014c369N543j394o309O804N980j0786j994R320k705l204M344j705m644K791O716
$$ -3369 2174 780 -5529 1275 7255 -3531 -5525 3795 1090 -2114 2230 525 -4119 -1328 5388
1029E388l790p822O267L765o654L214L789q368n33J0607k002j0373N776N311q981
$$ 5388 1598 -6224 43 3808 -2846 368 4157 -4211 -4744 5863 3861 -6512 -736 4575 -4406
1044d406M357P034j1745j108J1693l188o558L995J591m555K787N407o486m358
$$ -4406 -49 6985 -4760 -5868 5825 2637 -3921 74 1665 -2890 -103 5304 -1182 -5540
1058e540P238K034m549p52K564j266k630O488Q05j0987M204R205q068j754P465
$$ -5540 1698 3732 -817 -1569 995 -271 -2901 3587 4392 -6595 -2391 6814 -1254 -3008 4457
1073D457n764m143J0231L98j1426L910P861p570M60O665p637j929Q280p77n003
$$ 4457 -1307 -5450 4781 5179 -6247 -2337 5524 -2046 -1586 5079 -2558 -4487 3793 3016 -1987
1088a987j79L023K30k056K576m26n068K799N852l719n675M914K787o459M226M546
$$ -1987 -2166 857 1087 -969 1607 1181 -3887 -1088 4764 1045 -4630 284 3071 -3388 838 5384
1104E384j1195K018J1235p548m563P583k832m146P138P97q604J888O854l845j599
$$ 5384 -5811 -3793 7442 -106 -4669 2914 82 -4064 3074 3871 -4733 -2845 4009 164 -1435
1119a435K979l123k11L241M65j558m011K586N164m994r60M535m818j008Q039k549
$$ -1435 1544 -1579 -1790 1451 1916 358 -3653 -1067 4097 -897 -1857 2678 -2140 -3148 4891 2342
1135B342q374N694N123p997K452O083r841O25J0737o536m907O553j312k911M095
$$ 2342 -6032 -338 4785 -3212 -760 5323 -4518 -3893 6844 308 -4599 1954 642 -2269 1826
1150A826M55m885L24M781p23k917K64Q60O13r77J599R15o383K921P638p828k404
$$ 1826 2281 -2604 -2280 2501 1778 -1139 -875 -15 598 -379 1220 2135 -4248 -1327 6311 -1517 -3921
1167c921Q110n170k919R163k946q865O786N217q327J479N875p964M36Q818n299
$$ -3921 4189 -981 -3900 5263 2317 -6548 238 5455 -2872 -1393 4482 -3482 -3046 5772 473
1182D73m359M557M8q02O99j77q25j708K402L168m047k984M647J333n095L085L447
$$ 473 -3886 671 719 -83 616 439 -386 -2094 308 3476 -571 -3555 1092 2425 -2670 415 3862
1199C862q814K459R938r101l923J0276m516n132R040j330q773N426N952p260r48
$$ 3862 -4952 -2493 7445 -1656 -5579 4697 181 -4951 4089 2759 -6014 -588 5364 -1896 -2844
1214b844O020m300j755O046j855m040J322K761P28l921O67L643m664N67O561n372
$$ -2844 3176 -1124 -2879 3167 1312 -2728 -1406 1355 2083 -1838 -1171 2472 -2192 -1625 4936 -436
1230d36n133P939J588p860L512M892q840J609J0046q334m908R640k115n113N792
$$ -436 -5569 2370 3958 -3902 -390 4502 -4338 -2729 7317 -1017 -5925 3715 1600 -3513 2279
1245B279o6n893K326N167k880l864L130J135k265J018J786j978l204L950M107
$$ 2279 2213 -3680 -1354 3813 933 -2931 199 1334 -931 87 1873 -105 -3309 641 4748
1260D748p111q20P567n398k515Q598m111p030P860L065q315J784O019o643q54
$$ 4748 -2363 -3183 4384 -1014 -3529 5069 958 -6072 1788 4853 -3462 -1678 4341 -2302 -3156
1275c156Q491n008n398O844N20m062J655J174j868r59L149J080m922L66M542j789
$$ -3156 5335 327 -5071 1773 2293 -1769 -114 1060 -808 -1767 1382 2462 -2460 -2094 2448 659
1291F59k769K998M61m548K753N318o845k212Q052l378l982O529j993n547N071
$$ 659 -2110 888 1349 -3199 -446 4872 -1973 -4185 3867 489 -3493 3036 1043 -4504 567
1306E67L239n364r54M546j975k120M270j285l912K675K215j220k107P15K087k362
$$ 567 3806 -1558 -2512 2034 59 -2061 2209 924 -2988 -313 1902 682 -1425 -710 1377 -985
1322i85L04L715m210k171N738k53m560K190K343m135R25N236m872l293O778j100
$$ -985 -681 3034 -1176 -3347 2391 2138 -2422 -232 2111 -2024 -1099 4137 -735 -4028 2750 1650
1338A650m185L887k36l504K497K445k552k281K715R72k238J225N80k317N09K174
$$ 1650 -2535 1352 1116 -2388 109 2554 2 -2279 436 1408 -830 395 975 -1342 -833 1341
1354A341K73k935l17L605j887j560L767k485k804M664O18m069P09K595j982p23
$$ 1341 1614 -1321 -1638 1967 80 -1480 2287 -198 -3002 1662 2280 -1789 -1080 1515 -467 -1190
1370a190L564k226l447M440R17l515J195P76j305L92J484j77k860R21L060k062
$$ -1190 2374 148 -3299 1141 2058 -1457 -262 514 -791 -399 1085 908 -1952 -1031 2029 -33
1386c3j168J718o87j031J688J389l078j091M279j105k974L374p88l044L394J452
$$ -33 -1201 517 -170 -1201 487 1876 -1202 -2293 1986 881 -2093 1281 493 -2551 843 2295
1402B295l507n97K881l07k117K360q2l375K537K249k930p11J602K64r65N42J224
$$ 2295 -1212 -1809 1072 765 -1352 1008 926 -2449 88 2337 -593 -1304 298 562 -403 139 1363
1419A363k632l25L881j499k517K084M37j586Q39J823k397j886M219o6l783K411
$$ 1363 -1269 -1594 2287 788 -1729 355 792 -794 45 1868 -529 -2415 1804 1738 -2045 366
1435C66P96k774J789J881k577j437K677R84k901J033J513k928J147K570k087j642
$$ 366 1162 -1612 177 2058 -519 -1956 721 1705 -1196 -163 1350 -1578 -431 2139 52 -1590
1451a590J538J105j204m36J684j761j035L587p92k890J549J223j380J1J570j423
$$ -1590 -52 1053 -151 -587 1097 -664 -1699 1888 1096 -1794 -245 978 -402 -391 1179 -244
1467b44k006L354P56l744J484J502k177J043J434j837j189J858J411k408m4J730
$$ -244 -2250 1104 1860 -1884 -400 1102 -1075 -32 1402 -435 -1624 234 1645 -763 -807 923
1483I23j828M14K069j538j531J198J439r43j200J724q51j379K967m42k874J451
$$ 923 -905 -491 1578 40 -1491 -293 1146 203 -997 727 -124 -1503 1464 1022 -1852 -401
1499d01J437j062l64J061p38j600K566R39l395R99J640j665O36Q85j210q98J398
$$ -401 1036 -26 -390 671 -67 -1667 899 1838 -1557 -558 1082 -583 53 938 -272 -1170 228
1516B28J443k073o69J915j025l25J757j140j491J128J652j067j523J802l10j591
$$ 228 1671 -402 -1071 844 -181 -506 1251 111 -1380 -252 1400 333 -1190 612 302 -1289
1532a289K674k44l054J638J648j347n46J002m46j299J978R35l085O07J986j214
$$ -1289 1385 1141 -1913 -275 1373 26 -520 482 36 -1263 715 1650 -1435 -828 1158 -56
1548e6j78P06n67q81Q83J728j868j488K558l01j457J654k69j869Q56K106j186
$$ -56 -234 472 -95 -976 -93 1635 -233 -1721 837 536 -921 733 464 -1405 -549 1557 371
1565C71k158K101M50k060J985N00k836R17K049q71j362O67Q30j314O32J673k302
$$ 371 -1787 314 764 -1296 689 1189 -1647 -730 1319 448 -914 -247 583 -731 -99 1574 -728
1582g28q61K522l3j549K48J018j069l74K538j363k639K929P50k385J039P08j600
$$ -728 -1589 933 900 -649 -401 617 -452 -826 1712 349 -2290 639 1389 -996 43 751 -849
1599h49K01K047o40k435J422J600j830L83R49j430j48J448M79j739q14K441n57
$$ -849 -648 1399 759 -1676 -254 1346 -484 -101 848 -582 -730 718 1197 -542 -1356 1085 528
1616E28j565K126o68k289K257J519k386r40K357m92j685K479k40l285K319J882
$$ 528 -1037 1089 421 -1868 389 1908 -478 -1418 939 447 -1238 1241 1001 -2284 35 1917
1632A917k486j45J095n09l75R57O40k213l3K440p31j433Q90L07r13L25J687j570
$$ 1917 -569 -714 381 -128 -503 454 1094 -1119 -1152 1288 557 -876 14 321 -592 -267 1420 -150
1650a50k107L266M11l084J894P32k606J490J989k194j359K336K81j956J347M80
$$ -150 -2257 1009 1420 -1664 230 962 -1644 -154 1835 -359 -1718 618 899 -1057 290 770
1666G70k295J299J573j395p14M18Q06j74p70J083p24j305K287M91k434J50J926
$$ 770 -1525 -226 1347 -48 -762 -344 462 288 -482 601 -123 -1428 859 1350 -1084 -934 992
1683I92q91r74K028p11k771L105J247l482J004J572k074O78J801j534j505J689
$$ 992 101 -873 1155 444 -2327 778 2025 -1457 -453 1119 -955 -277 1524 -10 -1515 174
1699A74J162j674J8R49j194K97J297n82j172o8J626p9j655J379q7j834K142Q47
$$ 174 1336 -338 -320 629 -565 -268 1029 447 -725 -793 833 754 -901 478 391 -1443 699 1546
1717A546k750L52J984r53r88J718o77j971K463Q72k868P86J242j241N33O41r70
$$ 1546 -1204 -852 1132 179 -809 909 232 -1739 724 1596 -1272 -486 756 -485 48 689 -281
1734b81o20P94J170j013r93J002J35m24N32Q7j153l06K178j43k393J515O43k072
$$ -281 -901 -107 1063 50 -943 59 194 -230 302 389 -764 -1070 1108 965 -1428 87 730 -1342
1752a342J879R01k818L60K171p97j151J172j73j522J905R32k562K42J440p09J15
$$ -1342 537 1438 -1380 -1020 1151 354 -797 375 202 -1320 585 1517 -1045 -803 637 -72 43
1769D3J41l26l59J18J495o81j697J395N74j093M93M98j193k96K056k81k286J433
$$ 43 184 -142 -501 -383 1112 431 -1266 129 703 -390 103 601 -592 -888 1168 887 -1399 34
1787C4R73j978J317P06k118M15J678m59j143L30P08q03M20R38j392n78J283N58
$$ 34 1007 -971 346 1052 -1066 -651 1027 568 -575 -245 463 -340 80 1018 -374 -952 331 889
1805H89q41p50R15K2j013J777j60k530J505J605j769j72J163r41p43K008J31k668
$$ 889 48 -702 213 235 -778 999 839 -1691 -186 1419 -350 -522 641 -300 -1043 965 1096 -1572
1823a572J058J721j712K54J056j401k36J389L15j380m53J540l06q73J176m01j277
$$ -1572 -514 1207 -505 -251 805 -596 -832 557 872 -508 -961 579 273 -600 576 175 -1102
1840a102J047J228j187j260J557L76j636J433M64k450J157J813j535p86J087J04
$$ -1102 -55 1173 -14 -1274 283 659 -977 456 920 -1530 -373 1440 -95 -881 206 310
1856C10r60R65O90j927k5K129p58j036O02J84m25J85J025q81j561J970O83j884
$$ 310 -650 315 1005 -922 -947 1182 424 -612 -10 174 -251 -66 959 78 -1483 487 1170 -714
1874g14O05P66j297K73J637r08j789J512J208j954N19J109j882K91J920r12j244
$$ -714 -109 657 -640 -367 1270 362 -1427 85 1293 -661 -142 967 -915 -624 1296 384 -860
1891h60O92R09p23l36J043j055o48J780Qj465Q7R36j01p18J044k72j753J558J282
$$ -860 -168 741 18 -318 725 -330 -978 802 810 -655 -568 368 267 -451 593 321 -1432 126 1408
1910A408k091M4J192p61j49R82k78j483P59J579j350n18J048o77j45R70j11j040
$$ 1408 -683 -639 553 -208 -357 625 347 -1136 -377 1202 -148 -666 382 -295 -440 530 419 -621
1928f21j79J399l0j343Q51J67j107J117P17j485m03J356K39j204N31N24j588R56
$$ -621 -800 599 569 -774 77 244 -863 254 971 -514 -917 439 678 -526 5 529 -1059 -103
1946a03J481j798l81J173j81k47K58L4q22K30J320o65j058Q40J68l22K21J44m89
$$ -103 1378 -420 -801 372 191 -56 202 236 -586 -356 964 299 -759 81 249 -73 148 292 -197
1965a97n36J328L59j681L95R80j046M74P44j141m61J141N11j225MP95r03L48J129
$$ -197 -733 595 954 -727 -332 648 -398 76 820 -321 -782 359 870 -355 -351 444 -459 -111 1018
1984A018j166o31R41L22l58l92L43q8l80J077j66j358N31Q20l68m10M08n8q52
$$ 1018 -148 -779 162 484 126 -266 77 -11 -391 686 520 -838 -307 513 145 -265 143 85 -767
2003g67J138O32j875K43J300q75k6P80q59m42R93N05j050l36R31m36NO98p85m21
$$ -767 371 1003 -872 -629 671 -204 -230 550 -309 -751 242 747 -303 -639 292 -144 -139 559 -226 -647
2023f47N74N47k04q31M38M24p00P36J67j367M93J076n44o12M70J44q06Q90O95
$$ -647 -73 474 270 -561 -123 301 -399 337 504 -863 -370 706 162 -450 20 164 -642 248 943
2042I43j791K86J360q56j46N88o67j43Q53J99q73l35Q16k3k72M05m14l62M47N38
$$ 943 -848 -562 798 -58 -204 384 -283 -426 427 626 -247 -582 234 211 -61 344 -70 -432 15 553
2062E53j72j115O00P77r65M53N37j397K71J361o89q53O20L19p24P03N32j619K60
$$ 553 381 -734 -134 643 -322 131 668 -729 -458 903 214 -639 -19 300 -424 279 811 -808 -548
2081e48J398p84l09L72m30J22L63K21n41n34P71L80o21M6J48k90K6O87j30j209
$$ -548 850 66 -243 129 -301 -179 184 405 -136 -670 101 481 -140 -94 54 -236 -210 477 347 -862
2101h62O17J054j225K08P93j330K32J448o85j020O65M85o37K40N18j183J94J209
$$ -862 -245 809 -416 -208 585 -745 -513 935 250 -770 -105 380 -257 -17 501 -682 -488 721
2119G21n36n68K66J2J80o0K08j90p73Q32P32j028k25P13k97k59Q28j91j368Q87
$$ 721 185 -383 -117 -105 75 15 223 33 -740 92 824 -204 -429 284 -13 -272 556 365 -1003 -116
2139a16J211j373m8J014j231K10J318q26q23O75M28m40n5L94o34q4R02j65o35
$$ -116 1095 -278 -326 688 -543 -333 985 159 -664 11 439 -1 -56 338 -296 -380 522 357 -278
2158b78o6L99M78o69J29L88j087O35J129j332m51J167k19o41P93L2j353P28J346
$$ -278 -344 55 533 -136 -7 381 -706 -71 1058 -274 -725 442 223 -418 375 407 -946 -218 1128
2177A128j421k93J053p33m1J031o45o54L44N28J3o75K73J00k71L90L35n98o39
$$ 1128 -293 -586 467 -266 -307 724 79 -575 -231 297 310 -365 -92 8 -263 127 462 -136 -775
2196g75R43N14j155J51R14j297M77J384j429o64J457k12p71O55Q1j037N82J115
$$ -775 168 682 -473 -322 592 -705 -228 1156 -273 -937 520 308 -463 192 273 -764 -182 933
2214I33j086m89Q83l16P7L19m47o1j28N05M88j013j28Q97l47l10O24k79r08Q88
$$ 933 -153 -642 241 -75 2 321 -126 -187 -315 190 678 -335 -463 434 87 -223 401 122 -786 102
2234A02R57j459j78J312j072J3J379j250p13J354Po79K09J74m69K25O99n31n56
$$ 102 1059 -400 -578 734 -338 -325 1054 -196 -909 445 452 -227 -18 156 -313 -88 611 80 -476
2253d76L66L08J33l92j94M84m72J79R34j197n16J469l55p67Q85j48j019Q27R39
$$ -476 -110 198 331 -61 -255 229 -243 -64 870 -327 -843 626 271 -496 389 241 -778 49 988
2272I88j437l11J389p98j76J019q63m94R59K6l23j43o3K95l4J7P5l51k04O48L51
$$ 988 -449 -760 629 -169 -345 674 -189 -683 276 302 -21 -164 -227 68 34 51 126 -225 -429 219 570
2293E70j023q7J126p78j93J300j237p28J789k81j136Q14J19q47O82P39j134l73
$$ 570 -453 -540 586 -192 -385 915 -322 -1050 739 458 -678 136 255 -592 90 829 -305 -678
2311f78J164m18k58N40n00k18N09J38rn22j67Q61l02l42N62l66m93P90M58j258
$$ -678 486 68 -190 350 -150 -368 141 279 270 -252 -419 442 140 -202 360 -6 -499 291 749 -509
2331e09pJ152q05k19J229j105o27J644l48r65O06R7m65M39L88o56l26O36P2k16
$$ -509 -516 636 -169 -388 841 -264 -891 753 405 -560 46 143 -322 117 505 -151 -477 159 231 15
2351A5j3k36K36O8j01M10p22k85J303m55p86Q22j59p63R72L50j283Q1J200p17
$$ 15 2 -234 2 70 -31 379 -343 -628 675 220 -566 256 97 -666 306 656 -627 -546 654 -63
2371f3l57J002q20m99J295j82p77K88R5p8J71L5k53k06K74M35k20m36J4N15k11
$$ -63 -420 582 -238 -737 558 376 -401 -113 -18 -96 75 110 -143 -349 -75 360 140 -296 -282 233 22
2392B2j77O19p60l27J315l35r95Q34j6o25P41J87r60Q9R58m14m60N69l77k46Q17
$$ 22 -155 464 -296 -623 692 357 -638 196 180 -445 296 483 -477 -388 570 156 -304 265 -112 -358 459
2413D59k61l61l2P1M66j33m48L78k20j65P09j34p96K48P14m24l14P11p06l06J232
$$ 459 198 -163 -195 -124 342 209 -239 139 -81 -246 463 329 -467 -219 495 71 -243 468 -238 -544 688
2434F88l80j023Q47Jm01N92k9p02J27N73q1l20J43k02O4M23l15o9j07j12O92j58
$$ 688 308 -715 132 133 -268 324 295 -407 -280 293 212 -108 35 -167 -103 320 5 -64 -171 -283 409 251
2456B51o99M70L0l24O45r0p71K21O77l72l51N48m38k23R03k86p39N51M0j23L38
$$ 251 -448 22 52 -272 373 283 -488 -267 410 38 -313 235 -203 -426 477 191 -548 3 43 -80 258
2477B58k46k71J00K74J40k67k51J66K81J6k41K6j11j72Q21l07p34N99K3l66O93
$$ 258 12 -259 -159 115 255 -12 -263 -97 184 200 -41 -15 -126 -298 523 216 -518 81 104 -262 431
2498D31k34p04L91N90l65k82K97k08j13P04l73o29M94jJ16Q6m07L8K22RK16k94
$$ 431 197 -507 -116 474 109 -173 124 -84 -197 507 134 -495 -1 -2 114 200 -207 -169 53 62 278 -16
2520a6l36L07L23j81k21K02k17r0P72m31o86P08N3l90M95k61n51M78M50l94l23
$$ -16 -352 -45 278 97 -124 78 -139 -229 543 112 -574 134 187 -203 292 31 -520 -42 408 14 -309
2541c09K52J5mL82l29m38M33O6R8j7n31K99J54j32L12k39n04N01L95m74j60L07
$$ -309 -57 -42 -46 336 7 -431 2 68 166 149 -382 -83 71 -61 251 12 -492 9 404 -70 -230 77
2563G7k56k0P67n27o67P98Q3m13L48j46m41M39K73k17l43K0L54j00J82j89k30
$$ 77 -179 -199 568 41 -626 172 255 -158 190 44 -397 42 315 98 -245 -225 129 29 211 22 -208
2584b08R1J58L92m36m40N06K60m74M20j79p00P85L12o53r5L74q1j15N07l04p04
$$ -208 -117 41 433 -3 -443 63 323 -151 269 90 -610 175 487 -166 -261 113 32 -83 424 120 -584
2605e84O72K37l98J13j38j23L68Q6j27k30j88M99R7l63LQ6j53J52M00n29m86Q14
$$ -584 88 325 -73 40 -98 -221 147 233 106 -124 -312 187 284 -79 -76 10 -143 9 409 -120 -606 208
2627B08R8n98M60j33n48O10M14p00r8L22J3j14K60k08m29M15K74k31j47j25K36
$$ 208 306 -292 168 35 -513 97 511 -189 -287 35 48 -66 194 -14 -443 -28 246 15 -132 -257 -21
2648b1K50k35R6k33l37P02K40o85j1K77j36Q8M24n03n49Q90K15p29L36k5m42N65
$$ -21 229 -6 90 -143 -480 222 462 -223 -234 43 -93 -5 419 -84 -633 257 472 -257 79 54 -388 177
2670A77K20n18j92K22K07M2j24p5j36K32K02n8k97k51N04J49m64K33m0m03O55
$$ 177 397 -121 -313 -91 116 158 34 -41 -177 55 257 199 -98 -349 155 304 -160 73 33 -370 285
2691B85K46q42R2M26j95K2K29m15l02P26N9m88J31pk11N10n4m09J1J6L86P7n02
$$ 285 531 -311 -219 207 12 34 263 -152 -454 272 331 -157 -26 -33 -244 266 212 -197 -186 -170 216 293 -209
2714b09N1J45l7J75L8l35k52O13J42n70K51ql33N81J39q04J44L39p0P1Nk34p4
$$ -209 -158 -13 -50 125 163 -172 -424 189 331 -239 12 4 -329 252 391 -413 -269 70 0 71 76 -158 -232
2737b32L99Q5l90l4L2K14K16k70j84J09j29L83J76p30J56L54j48J05O3m44l4O50
$$ -232 167 252 -138 -172 -140 74 290 20 -164 -55 -184 199 375 -355 -199 155 7 112 175 -269 -303 347
2759C47j1n80K07Q7k48N60j8o25J57K47m8R2k45p6M9K43R8j86k12K6L28P3m12
$$ 347 336 -244 -37 50 -198 362 344 -281 -124 123 75 167 -78 -154 -105 138 236 50 -162 -136 192 265 -147
2782a47K9J46k32N36j5p71K15O07l79O5Q7m14K0N96p2m88O5K02j14L58k31l72
$$ -147 -118 28 -204 332 317 -454 -239 368 -11 54 141 -273 -253 343 271 -217 -152 50 -64 294 63 -309
2804c09J70J90P9ml88O6L32p7L4j08l18J32N26q7o05K60J54k18M78m1p93L81N14
$$ -309 -139 51 130 126 -262 -196 136 59 93 -15 -333 -201 325 238 -367 -107 47 -171 307 266 -527 -146 368
2827C68l27o9M8l10J49M50j25l95k5K39N6Q4j28k66J97J29J05J4n51K05N46l80
$$ 368 41 -28 20 -290 -141 309 184 -211 -236 3 59 143 15 -251 -54 75 180 194 -357 -152 394 14
2849A4j9P7l54J38N60k42n24K97J67k13L72j07o21L56M58l16j5l6j30K26J84j81
$$ 14 -5 72 -282 -144 416 174 -350 -53 114 -99 273 166 -455 -99 359 43 28 -8 -138 88 272 91
2871I1k77l9L01J82j52k98R3J39n8K54j1o76L19N67l99j04M3k53J91M86k95n06
$$ 91 -186 -225 76 258 106 -192 -99 40 -18 236 225 -451 -132 435 36 -68 -25 -278 -87 399 104 -402
2893d02L21K60j50J03j22l36K78K85j14k02j72J89L17j53j75l6k22L10L78l90
$$ -402 -81 179 29 132 10 -326 -48 237 123 -79 -251 -62 255 102 -73 -109 -331 -21 357 -33
2913c3k48K30J52j62K76j53n41M58N05n85o7J38k17K54L61l37l59K95K01nr9j89
$$ -33 -281 -51 101 -61 215 62 -479 -21 484 -101 -168 -30 -247 7 368 31 -328 -33 168 163 64 -125
2935a25j30L26J56j15j86k43L10L98l74j79J44k05K72M14m98l63M07K17k46J33
$$ -125 -255 71 227 112 -74 -317 -7 391 17 -162 -18 -223 49 463 -35 -398 9 226 -20 113
2955A13p4m17L52N22m96k39K14l4K14Q4k99j43J45K07J41l29j26J00J61N6j08
$$ 113 39 -378 -26 496 0 -239 -25 -59 155 239 -60 -203 -58 149 290 -39 -165 -65 96 152 44
2976D4r9k69K97M21m21j53K10k29K47L32m75l10M96J25j78o9j4k28K95K79l55
$$ 44 -55 -324 -27 394 -27 -180 30 -199 48 380 -95 -405 91 216 38 -31 -45 -273 22 301 -54
2997e4j76J69lL00k01k33Q9k6K76J08m41p4L77Q9j60n3pk73L32L66n09k81M50
$$ -54 -230 -61 -64 236 35 -198 -109 -135 141 249 -192 -266 111 200 40 -13 -20 -293 39 405 -104 -385 65
3020F5r1Q5K27n02r7M23J89k27j42n2K7K15J28k79j55O6K03K47l49j88J93N0J06
$$ 65 -26 59 286 -216 -313 110 299 72 -70 -122 -95 120 248 -31 -186 -120 83 330 -19 -207 -14 36 142
3043A42J80m82j33M05R2j73p9Rj40K96K26m83j40L78q3J24l3l05L6K55J18j09
$$ 142 322 -160 -293 112 204 31 -48 -39 -179 117 343 -140 -280 98 15 139 106 -199 -163 92 210 101
3065A01k30m6K44J73j38j15q8l6J84J96l62k53M25qJ8J60m42j34N36P5l57K5k0
$$ 101 -129 -175 69 242 104 -11 -99 -135 49 245 -117 -370 55 47 65 225 -217 -351 185 260 -97 -72 -92
3088i2m6L22R0m87l4K99M6l5m0k99K25J87p1P8k97q5L87L5k10o4l0j5K89J23m57
$$ -92 -138 184 274 -213 -247 52 98 63 23 -276 -51 136 65 143 -154 -239 148 183 -27 -91 -121 -136 153 276 -181
3113a81j21M68l7j24J52l54%M60o0k16j49P5Q0J56K1l85N3K42J13L9l03j60K78
$$ -181 -302 166 129 5 157 -197 -197 263 203 -13 -162 -87 -7 149 170 -215 -162 80 193 232 -71 -231 47
3136D7R3l5K5l01j5M35l3k80l0J49j30K59Mm29qM15Nj10jl00J67L02r0k22j09
$$ 47 140 105 130 -171 -186 249 216 -64 -94 55 -75 184 188 -241 -249 166 171 61 60 -240 -73 229 139 -83 -192
3161a92R0K00R3k00j41P1Q5J49Rl78n1M23o6j47J61l15p0M98o5l49J20P1K5J99
$$ -192 -102 98 191 -9 -150 -79 6 155 164 -214 -265 158 92 -55 106 -209 -279 219 154 -195 -75 -4 21 220
3185B20j37l40O5L36mj32m9j80K71J92j60j15j56N7L73n5k80p1J61KJ52n4l31
$$ 220 83 -257 -192 144 140 8 -41 -221 50 242 82 -33 -189 -132 241 186 -94 -165 -4 -2 150 96 -235
3208b35Q3L68r2j79R2j72J0M42j51l61J12R1Q7R0j92k03J42K21j7j50j50p8L49
$$ -235 -152 216 124 -55 37 -135 -125 317 166 -195 -83 8 95 185 -7 -210 -68 153 136 -14 -164 -242 107
3231A07Q2k11o4m0L5M15k01l70J18K08l9J46p7l54J04L89j35j78P0j51J07L49
$$ 107 189 -22 -86 -126 -91 324 123 -247 -129 79 40 186 109 -245 -141 248 113 -65 5 -146 -39 310
3253C10l00j76J12%J64R6l02q5J75J41Jj44j97J4L60o9j94M0p2L4L20j67l18J83
$$ 310 10 -166 -54 -54 110 206 -96 -181 -6 135 136 -8 -205 -191 169 100 -94 -54 -126 -92 228 61 -257 -74
3277g4N6Q6J20k43j99K07K66j05k11ok6J92J72k39j80J55QK18q3k36KJ68L0L3
$$ -74 -18 68 188 -55 -254 -47 219 114 -97 -103 -129 63 235 -4 -184 -29 -21 197 114 -122 -120 48 78 111
3301A11j10j77J41K44j27j26L1o2N2L05j96l72L29N7l2J04k40j44K26J97j75j58
$$ 111 1 -176 -35 209 82 -44 -13 -75 -23 282 86 -286 43 100 68 172 -68 -212 14 211 36 -122
3323a22OP2J66P3k74p7K05mJ93j71l03J98J24k7Q2k14j78K53K50k29j80J05j7
$$ -122 -116 -44 122 195 -79 -156 49 45 238 67 -236 -38 86 59 141 -73 -251 2 252 23 -157 -52 -69
3346f9Q3K51k97k03J98J34m2oj71m4K36N5o0j50j02K28J76q6k59M6M8M3K06k51
$$ -69 14 265 -32 -235 -37 97 55 49 -122 -166 70 125 65 -85 -187 41 217 131 -128 -82 -34 9 215 -36
3370c6k64L40P3j45Q8k13l6L00J22k26j84J19J07QJ70k66j87K30R5M3j33j72J10
$$ -36 -300 40 113 -32 56 -157 -193 107 229 3 -181 -62 45 53 223 -43 -230 0 95 138 5 -167 -57
3393e7J75l0J1k13j1K03J56k22j92J26R5L9J98l26k05L22O6j08L4j73j9K68R0
$$ -57 118 88 99 -114 -125 78 234 12 -180 -54 41 80 278 -48 -253 69 135 27 61 -112 -131 137 227
3416B27k47j18P0J27L9J2j95q2J54J16J8j53k47K51K83j95p1n1j67L24J36l15
$$ 227 -20 -138 -68 59 98 110 -85 -167 -13 103 121 -32 -279 -28 255 60 -11 -62 -229 95 231 -84
3438h4p5R9Q0K1J26k70j64L27J44k34q0m9M4K59j9j95q4KK14N7q7j77k0K44K6
$$ -84 -159 -60 20 41 167 -103 -267 60 204 -30 -110 -159 -115 144 125 -70 -154 -152 62 119 32 -145 -165 79 105
3463A05oj79j65K90K06k83L3j35N6K10J0k19n2J37J39m4p9j82lK33J44j65r6l1
$$ 105 99 -80 -245 45 251 -32 1 -134 -78 132 142 -77 -129 8 147 103 24 -158 -161 72 216 51 -45 -76
3487g6J12J17p8q8k2j6J79R7k88j05J41J58o4N4k36m9K62J06k03n9N1m0J97k0
$$ -76 36 153 75 -13 -35 -51 128 225 -63 -168 -27 131 67 121 -115 -164 98 204 1 -58 -7 -47 150 130
3511A30j76j41J83J12jj37j20P2J73Q5j54j15q4J70J87j94j05J5Q6J76ok22o5
$$ 130 -46 -187 -4 108 107 -30 -150 -78 95 180 26 -89 -173 -3 184 -10 -115 -100 -14 162 156 -66 -131
3534a31J11R0l1pk36M5K75O5k56j00R4P6J92j30k00J7J49Q5k0j63p4P4J90J1j56
$$ -131 -20 70 39 32 -204 -159 116 181 -75 -175 -81 -5 187 57 -143 -126 23 108 88 -75 -149 -75 115 126 -30
3559c0m7n2K82K9k88NN6N9J78o5k05n0J30J42q0p5r3L0J88R4l28kQ3R8R8j22j47
$$ -30 -77 -129 153 182 -106 -101 -45 14 192 127 -78 -128 2 144 64 -11 -104 -74 114 208 -120 -122 -39 59 157 35 -112
3586a12L7J68K2o3j09r1K29j3K8j30q3P4J80K2j81q3M5P6P0Mk46K1K58J2m8j11
$$ -112 -75 93 115 52 -57 -148 81 68 96 -34 -117 -43 137 159 -22 -105 -60 16 86 90 -156 -135 123 135 87 -24
3612b4p0J02J33q6j06p4Q0J13R3k29j32J67L7J30r0k06O5K21p2L0j92LK5K97j44
$$ -24 -94 8 141 55 -51 -125 -45 68 161 -68 -200 -33 4 134 44 -162 -97 124 52 82 -110 -107 -82 215 71
3637G1k22L7J40M5M6r7k69J44K01k2n7j19j4K01P8p5j16r1J76O5m2j70k3Q1J20
$$ 71 -151 -114 26 71 117 20 -249 -105 96 74 17 -102 -116 85 163 88 -28 -119 57 122 80 -90 -113 -32 88
3662H8O0j10k37J29K06j4j24q3m4J53R9n5k29Q9J06J06n4j32r6R6J77j7m8k44
$$ 88 148 38 -199 -70 136 122 -2 -85 -129 24 123 68 -161 -72 34 140 86 -46 -142 -46 131 114 66 -178
3686a78J28J15N9j38j22NJ64J37j48k04J07J48K6mp9k17J20K04jj71m2P0J00J04
$$ -178 -50 65 124 -14 -136 -131 33 170 22 -182 -75 73 99 95 16 -201 -81 123 122 -49 -91 -21 79 183
3710A83j92j14L2J88l9n4j20m3J38J32oj38j23J51Q6K9j95m3P6N4J30j23j92J29
$$ 183 -9 -123 -91 97 58 4 -116 -159 -21 111 105 -33 -156 -5 81 110 -85 -128 -52 2 132 9 -183 -54
3734e4J57Op5j12r5J32K03p4k16KJ09P9N1j66q1P4J40L8r0k04Q6J81lo4n9j06
$$ -54 103 109 34 -78 -173 -41 162 88 -128 -126 -17 62 113 -53 -134 -60 80 118 28 -176 -90 91 88 24 -35 -141
3760a41J82J31j39j03pK8J19P2j80j33J69P6k4k5j12k6J59J02p2j43l7R5J04J1
$$ -141 41 172 33 -70 -77 -49 70 142 -38 -171 -2 74 50 25 -87 -113 46 148 76 -67 -104 -9 95 106
3784A06j81oJ8J31K8j15q9M9K07j0j73o2j3K23K8j33j17JJ21J11J4k32m3K11L7
$$ 106 -75 -81 -63 68 96 -19 -108 -59 148 138 -35 -97 -110 113 141 8 -109 -108 13 124 138 -94 -137 74 111
3809A11m4j19p5P3J35L5q5j31o9J93J53j44j83P6R8Q9k9j78n9J40J60k0j43p9
$$ 111 67 -52 -127 -54 81 116 31 -100 -169 24 177 33 -150 -74 24 113 84 -94 -153 -13 147 127 -16 -95
3833i5mK23oj59j01P6J02J38p1k52K1J68Q8o7j23p9J56J39q3j21l1J4J42Q4j43
$$ -95 -99 124 118 -41 -142 -66 36 174 103 -149 -128 40 128 61 -62 -141 15 154 71 -50 -81 -67 75 159 16
3858A6j43J01Q6N9qj65j13K43J1kj64l1J1K22qj46j32J43Q2O0n9k03Q4J18R1j36
$$ 16 -127 -26 60 119 111 -54 -167 76 87 85 -79 -110 -99 123 115 -31 -163 -20 62 122 63 -140 -56 62 153 17
3884A7j45%J95P7j39n5j06J01J60j7j09p6Q8Q2J2o0j13j5J55M5o8k04J02P6Q0
$$ 17 -128 -128 67 144 5 -50 -156 -55 105 88 -21 -97 -9 73 85 25 -88 -103 52 97 29 -175 -73 3 83
3909H3p1p4l6P3J25j7j49l6J3J46N1r1j92Q5J26N8p7j32K4Q0J33k1j71p3K26K8
$$ 83 12 -62 -98 -25 100 83 -66 -102 -89 57 108 17 -175 -90 36 94 17 -115 -91 -11 122 101 -70 -143 83 111
3935A11k0q3q7J0K28n8j25r7L8J43Q4j53j30P0J20O3l8j64o6J76J13o8q9r7R3
$$ 111 91 8 -79 -69 159 101 -24 -121 -83 60 144 -9 -139 -69 51 114 76 -88 -154 22 135 67 -22 -119 -26
3960b6J99j06q5m7jJ36Q7j36j10N4P8Q1m2j17p8J51P8m4r4n7J04K9Po1p9N5J04
$$ -26 173 67 -18 -65 -66 70 157 21 -89 -35 43 124 82 -35 -113 38 116 72 -22 -79 25 54 61 0 -79 -24 80
3987H0Ko1j67N7J29P1o4r7o9J20J58j8j97n1M8J02P1j50o5L3J13R5r8j06O8M6
$$ 80 82 21 -146 -89 40 111 47 -50 -119 1 159 141 -56 -107 -59 43 114 -36 -101 -68 45 140 42 -64 4 50
4013E0M2J0j58r3J84J02J5j98k1N8J06L0j33j68J42J06J9r6n6j9J01P4r6p7l7
$$ 50 92 102 -56 -149 35 137 152 -46 -67 -9 97 127 -6 -174 -32 74 93 -3 -59 -78 23 97 1 -76 -113
4038a13J85pK1j16n2K9J00P4j35p7J9J51P3j13j31K0Q8J03q0q2l0P0J40j27m9
$$ -113 72 65 86 -30 -82 -53 47 121 -14 -91 -72 79 152 39 -92 -72 16 119 39 -43 -73 -3 137 10 -39
4063c9l3R9J33p8r1j42R9R7R5j17p4k3J27Q2j23p1n0J33O1m6n1p0L5J28Nj18m
$$ -39 -72 27 160 82 -9 -151 -52 45 140 23 -51 -74 53 135 12 -59 -109 24 85 39 -12 -82 -47 81 86 -32 -36
4090c6m0J31N5j15j33J05O4O8l7j13KK0J86j06j15k4N6Q8Kn9j17N4R7M6j11l8
$$ -36 -76 55 110 -5 -138 -33 31 99 62 -51 -49 -29 157 51 -64 -88 -32 56 58 -1 -118 -64 33 79 -32 -70
4116g0J4P5Q9l3j07k2K3J51q9j9m5K7N3Q0j38p8Q1L1M2k1n9l6Q9Q0m8j06r7J44
$$ -70 -56 19 108 75 -32 -54 -31 120 31 12 -33 -6 47 127 -11 -89 -8 23 65 44 -15 -51 38 118 70 -36 -133 11
4144A1N2J8j33p6J16R5Qj21m5j4J37O6j04n9K7J9R3m6j13L9K5J25q8l8j05R8N4
$$ 11 63 81 -52 -128 -12 83 91 -30 -75 -89 48 114 10 -49 -22 -3 90 44 -69 -30 -5 120 32 -6 -111 -13 41
4171D1L1j13n0O5P3P1r2j23M5J12K6k1j15k4J07nJ5l5r6R5N6J8q2j08N7Q4Q4j10
$$ 41 72 -41 -91 -26 47 118 26 -97 -52 60 86 65 -50 -74 33 28 43 8 -88 7 63 81 -1 -109 -52 32 116 6
4199Fp4K3R9pj9o8m8J03R7r1l3n2R2P0j6m0r0L6N9J7n5l6j8O4N1k8r9j7R2Q2r0
$$ 6 -68 -45 54 47 28 -40 -88 15 112 21 -12 -64 28 98 82 42 -48 -12 47 64 9 -27 -45 19 70 42 -57 -74 18 100 10
4230A0k2j8l4J69l4o1r1O7J13k6l1r1k0J08O2l9j47j6J53K7n7j00j4J00L0p1J0
$$ 10 -12 -30 -64 105 71 10 -81 -14 99 73 42 -49 -69 39 101 62 -85 -101 52 79 22 -78 -92 8 38 -33 -23
4257b3l8L1L9P1j05m2l0J04j6O3r7J7QP1J1m6k9k7Q4l0j6j01O9M8M5m2l7j09J60
$$ -23 -61 -30 9 80 -25 -67 -97 7 -9 54 -43 -26 -18 53 64 18 -11 -38 46 16 0 -101 -32 16 61 19 -18 -127 33
4286C3J21j72m8kK0J01l4j8m4L3N6L3l8l5p3J12Pl3n9J5N5R2j12j3j38J35P8k1
$$ 33 154 -18 -66 -68 -48 53 19 1 -43 -10 46 79 41 6 -67 45 52 19 -40 -25 30 122 10 -3 -141 -6 72 51
4314E1r2j9P0M8pr8L1L2M9L3j09k1JQ6LOj21jN0R6m0j36O2J1R7o3k1j9k5Q1J7
$$ 51 -41 -60 10 58 51 -47 -16 16 65 98 -11 -32 -31 55 58 64 -57 -58 -8 88 48 -88 -26 -15 82 19 -2 -21 -46 35 52
4345E2k5q4j6M9Q5o8l7RO3Q5n8j04m0R9nnk7k4rJ22j0m6l8%P0N5p0n5MMJ11l4
$$ 52 27 -57 -73 -24 61 -7 -44 -35 28 113 55 -49 -89 10 5 0 -27 -51 -60 62 52 6 -32 -32 38 93 23 -32 -28 -24 87 53
4377E3j29M3L4J6N2l8r2K4P8k2J2o3m7J25J9l0k8k0M8R8r1q6rL7J01k9l9k3m3
$$ 53 -76 -33 1 17 69 31 -61 -37 41 19 31 -32 -79 46 65 35 7 -13 35 133 42 -44 -53 -16 85 56 17 -6 -49
4406d9L5P2n9m9M8P4pp5l5QO7k9J2J7m7M5LM8j29K0J4P5Qq9J5j6O4O5m2q9m5P3
$$ -49 -14 58 -1 -50 -2 72 65 -10 -45 -37 30 1 13 30 -17 28 31 79 -50 -30 -16 59 67 -22 -7 -23 41 106 64 -25 -70 3
4438CQ4r0k8Qj9J35p7J1m2L1LJ01j03l1k3M7J01r7o2jJ05K2q5om2O9L3j9m8k9
$$ 3 87 -3 -31 -23 -42 93 16 27 -15 16 19 120 17 -14 -37 10 111 14 -48 -49 56 78 -7 -13 -55 14 47 28 -20 -49
4468d9Q8l4J9%l7K0k9O5nj07N5N4Pl1lp1N1R8n9p5l6O0Q2K2j34mM3O8Mn2o3l3
$$ -49 39 5 24 24 -13 7 -22 43 38 -69 -14 40 47 16 13 -58 -7 91 32 -43 -79 -19 63 85 -49 -53 -10 58 62 10 -53 -86
4500h6J14J1J1n4k4rQ9l1nl7J2K3N5p0J0l8P8m4Ok9m9L2J30o4j17N2L3J00n6p1
$$ -86 28 39 50 -4 -28 -37 52 21 16 -21 -9 14 69 -1 9 -29 49 5 11 -18 -67 -35 95 31 -86 -34 -1 99 43 -28
4530b8LpO2On5%j6N1P8l8j34M5O7j3k1nq6J16J7l5ln4M1J0J0j2m3K9M1J7%j02
$$ -28 -25 -32 30 36 -19 -19 -35 16 94 56 -78 -33 34 21 0 -5 -91 25 42 7 4 -50 -9 1 11 -1 -44 -15 26 43 43 -59
4562e9L3M5K3m5k1j2Q6J0L3j34pJ3N0N4p1m6PR9n4K9p3M2mO0j9l8j7L4pj9o1N8
$$ -59 -26 19 42 -3 -24 -36 50 60 93 -41 -48 -35 15 69 -2 -48 -41 58 4 33 -40 2 -2 58 39 1 -16 18 11 -8 -69 -11
4594a1k2R0M4j38M9l6J0R7n4n5k9M2P4o7j6J2K3J4po2K7oM6P2j09kj4P9m6kk6
$$ -11 -33 57 101 -37 12 -24 -14 83 29 -26 -55 -13 61 -6 -22 -10 13 27 20 -42 -15 -21 25 97 -12 -14 -28 51 5 3 -23
4625b3RMN6j8p8J3M4J3j4k5L1n5Q3j8n3J0nM8j0O3j07j4k0J39k4o1m0O6J2j0J
$$ -23 -14 -10 46 28 -50 -37 7 20 6 -19 12 -43 40 22 -31 -21 -26 22 12 75 -32 -46 -66 73 49 -12 -52 14 26 16 17
4656A7o2K4Q2jp0nN0k6M3jp1mR6m0j0Kj8j2O4n6l8N2j7L9Mm0q3L8Q2km0j2k0J08
$$ 17 -45 -21 61 60 -10 -15 35 9 52 51 -20 -24 72 32 22 24 6 -6 58 2 -36 16 -1 38 42 2 -81 -43 39 37 -3 -15 -35 73
4690G3q8N7q7K5rP6l3mm9L9P0q3L4n9J5J01l4o2k0M0N2n0M0n3NJ8N8n0n5k4Q0
$$ 73 -15 42 -45 -20 -29 47 14 10 -39 0 70 -13 21 -38 -23 78 44 -18 -38 2 54 4 44 -9 -4 14 72 22 -33 -57 23
4721B3qKj9Jl8O9k0J1n5K0M4j6K1o6N3k9M3L0n4Qj9P9p6q8N4K1Q5l4q3K7l8R0
$$ 23 15 17 -2 -1 -39 30 10 21 -34 -14 30 14 35 -31 22 -7 36 66 12 20 1 80 4 -84 -30 -9 76 42 -41 -14 -52 38
4753C8Ok7m2OJ6M5j02N2j1j6J06k6q3J1K6J5K1j5j09J06K1J2l4K0o7O6k3nq3N1
$$ 38 44 17 -25 -19 -3 42 -60 -8 -19 -35 71 45 -38 -27 -1 14 35 20 -89 17 38 50 16 36 -31 35 12 7 -76 -25
4783b5P7l6L3n6j9%O5lJj06O7K1j9l0K5m5N5J3J8q5M1OJ7n6L2m4QP8L8k6n9L3
$$ -25 52 16 49 -7 -26 -26 39 36 37 -69 -2 19 0 -30 -5 -50 5 18 36 -49 -8 -2 15 -41 -9 -53 -45 33 71 45 -14 19
4815A9K9Ql3p8L0qP7j8q6%N3N8l6Qo1N9JM1m2l8jM9JJ0j54Q8L4K0P2j48N8M8K0
$$ 19 48 56 23 -55 -25 -33 44 26 -60 -60 -7 51 15 23 -38 21 22 63 21 -17 -18 31 32 42 -112 -24 10 30 102 -46 12 60 80
4848H0k9K4j23J8L2M8r2K7k1R5j0nm5k6O8%N5j36J6K7O6k6j13j1Q5N4n5P6r7K4
$$ 80 51 75 -48 -30 2 50 -42 -15 -36 59 49 44 -1 -27 41 41 96 -40 -24 3 69 43 -70 -81 4 58 3 79 -18 6
4878FM6K4r8j7k2P1J2k1Np6j6Q7L7p5K7J8J1k3j5n8O7qQ6j06MJ2kL3j7L6l6QO2
$$ 6 52 76 -22 -39 -61 10 22 1 6 -70 -86 1 38 -37 -10 8 19 -4 -19 -77 -10 -18 68 -38 -34 -22 -24 9 -8 28 -8 0 62
4911F2j08O0k7J3J9qm5J6J09j27M3M4r5N6J7m5P6j20J18k8J6l0l6n0J23j1k1m5
$$ 62 -46 14 -13 0 19 11 -34 -18 91 -36 7 51 -44 12 29 -16 60 -60 58 30 46 16 -20 -70 53 42 21 -24
4939b4K2k6J04qq9K5NnPm2o5R1j9M2L9r4k6O7K3K0j2q2oN4K8npp2J07n3k2N1o4
$$ -24 -2 -28 76 68 -21 4 9 4 11 -31 -96 -5 -24 18 57 -37 -63 4 27 47 35 -47 -53 1 29 24 17 -55 52 -1 -23 28 -36
4972c6M7K0Lrk1Q4p4K7l3j7N4L6k2m9m3kK9O6j11K9J8M7q8P6l8m8j4NJ02k6j9
$$ -36 11 31 34 25 4 88 14 41 8 -9 45 81 59 10 -33 -35 -6 60 -51 -22 -4 43 -45 31 -7 -55 -69 -64 38 12 -7
5003gJ4M5k3j1o5L3O7J4q2Jk8O5j1l4JO1n0L8l2p0O5K4K9o1P2n1KpqM9Jo4J3Q6
$$ -7 7 52 29 18 -47 -14 53 67 -15 -14 -42 23 12 -22 -21 40 -10 28 -4 -74 -9 15 44 -17 55 4 6 -1 -9 40 41 -23 -10 76
5037G6l5o9mJ13k9jp3L4n1M3M5n3j6N2m3O2j04J8L1M4J2l3m5K6J2L8klo1K7K8
$$ 76 41 -28 -32 81 52 51 -22 12 -39 4 49 -4 -20 32 -11 51 -53 -35 -4 40 52 19 -26 0 12 50 48 45 -16 11 39
5068C9j7j1l8K0J9K8l7j4JL2J0l0l5kN8m0M8lk2lN6l2pM1o7L8J0k8k9j6N3M0o7
$$ 39 22 11 -27 -7 12 40 3 -11 -10 22 32 2 -33 -35 23 -17 31 28 6 3 59 27 20 61 -6 32 42 14 -15 -31 22 62 -5
5101eJ8Nl6L3O7o7MoJ2nm3N9Mlk1J1k6K4l9nj9M2p8J8J06M5j42J00p2J8O7p5l
$$ -5 13 18 -18 15 82 15 19 13 25 20 -23 36 40 37 16 27 1 25 -14 -19 -38 4 -74 -56 50 95 -47 53 -19 -1 66 -9 -12
5134a2K1k1O3k9o1J00l9k5P2j24L9L4k7M2Kl2K1l6Q6n4p0O1M5k4m4j03P8P0k3
$$ -12 9 -12 51 22 -39 61 22 -3 69 -55 -16 18 -9 33 35 3 24 -12 74 20 -50 11 56 32 -12 -115 -37 33 10
5163A0Nrk5O2k9L4o4L0m1L8K5l0lj8oP1j9n6J6j8J05k6k5p7P6l5M2o0m0J15J3
$$ 10 15 6 -19 43 14 48 -16 14 -27 11 36 6 3 -15 -21 50 31 -25 -9 -27 78 52 27 -50 26 -9 33 -27 -67 48 61
5194F1k2Mo6jJ6P8j0p4Ol5J02k8r3O0j4jP4p9J1J7J2jk5K3J6j9J9kq1M2Q5p0j
$$ 61 39 43 -23 -24 -8 70 60 -14 -8 -43 59 31 -62 -2 -16 -17 57 -22 -11 6 18 17 -8 15 31 12 31 29 -52 -10 75 5 4
5227Dm7L0mO1j3l8l2P5l3Lm2K9K9j9J3m2m3P6L9l5K7n7lJ3Rj1j7JL1M7l4lq5J00
$$ 4 -43 -13 -17 44 31 -7 -39 36 3 6 -36 -7 22 3 16 -26 -69 7 46 11 38 -19 -22 -9 0 -11 -28 -27 4 51 17 14 -71 29
5261B9K7m1l9n8O5jL3Rn8K2O8qj5n2m1P1N1j06nk6O1N3l6R0j48Q8k8Q0o5l6J7
$$ 29 56 15 -24 -82 -17 -18 15 24 -34 -12 56 48 33 -19 -60 11 62 -44 -49 -75 -14 39 3 93 -55 33 5 85 20 -16 1
5292AM5n7J3K3q3M3M0J4o3O3r2Q9o0Q2l2k8oM0rn3O9m2M3j6l3q9J20J9n2k9R1
$$ 1 46 -11 2 25 -58 -15 25 39 -24 39 -53 36 -24 58 26 -2 -8 32 23 -30 39 -3 40 24 -9 -98 22 41 -11 -40 51
5323E1l4k4L3oj9JQ2n6j2l7N9j6k0No2M4M8J8l9m3j8N4k9N6m4m5%L9P4m2q1L1
$$ 51 17 -7 26 20 1 2 84 28 16 -21 38 22 2 7 -55 -11 37 55 16 -27 -45 9 -20 36 -8 -53 -53 -14 60 18 -63 -32
5355c2L5L9k9Qn3N9l7j8M7l3j1R2%o7k7L5N4l3J0l4J2J4ll0M3lo3P4J4q7J2RL
$$ -32 3 42 13 21 -32 27 -10 -28 19 -14 -25 67 67 0 -27 8 62 29 39 5 17 31 28 -2 41 38 -25 49 63 -24 -12 -3 0
5388@L2q5N6Lk1Q2j03m8N6mJ9L2rKm9N6j0%j4RRrRq4O2N4Rk4o2N8pKOo4j6J24
$$ 0 32 -53 3 6 -15 67 -36 -84 -28 -32 -13 19 10 12 -37 19 9 9 -5 4 13 4 13 -71 -9 45 54 30 -32 26 19 21 27 -37 -53 71
5424G1p6J6l6J1m3M6J05j01j9J8k0j2K6pL0n9N2m3pN6K0l4QK8p4L5N7p0K1l6K9
$$ 71 -5 11 -25 -14 -57 -11 94 -7 -26 -8 -28 -40 -14 -21 9 -50 2 -41 -48 8 28 -6 2 30 -44 -9 48 -22 -1 -37 -8
5455hl3j1P1k5M8J4k3q0J05jo0M1jn1l3K4L8L5k7j6J5q6R7l9pj1J6j9O9k2Lk0
$$ -8 -41 -52 19 -6 42 56 33 -47 58 57 -3 38 37 -14 -47 -23 15 50 23 7 22 -64 33 -6 -13 -24 -8 -27 42 20 23 3
5487CM6L2j09oJ6M8K7k4m3L4n6M0M6j06K5K2J4l0L8n1L8L3l5Ko4J20k6PMp9O9
$$ 3 49 81 -28 -34 -18 30 57 33 -10 24 -32 8 54 -52 -27 -5 9 -21 17 -34 4 37 2 4 -60 60 34 41 45 -34 35
5518C5qm2K9jo1N6J5K2l4k8M0LO4j33K7M1Ml0O3o9K2M1p0J9M3j12O1Q4j45OM6
$$ 35 27 -15 14 13 -48 8 23 45 11 -17 23 26 90 -43 -16 25 29 -1 62 -7 15 56 -14 5 48 -64 -3 81 -64 -58 -12
5549a2M6l6J1N4n8k9R4j49J41q7L2K6o0nJ7m4M1L8N3j25M1P6q1J01r1m8N3M2j7
$$ -12 34 -2 9 63 5 -24 70 -79 62 -25 7 33 -27 -32 -15 -59 -18 20 73 -52 -11 65 -16 85 -6 -54 -1 41 24
5578B4Mmm1L5K7j16N3L1NN1p3l0O5m1P1n0J0j26Q6K1J9J3np4Q2J3n7p6J62p3j5
$$ 24 28 24 -17 18 45 -71 -18 13 18 69 -4 -34 31 -10 61 11 21 -105 -19 2 21 34 29 -45 37 50 -7 -83 79 6 -9
5609iK3pn1P2N6q9L5J7q6M9L9mp0J6J10r7OJ0j0m0R1m7j1n7LJ05j09k1J19o1L9
$$ -9 14 7 -44 28 84 -5 30 47 -39 10 49 45 -25 -9 101 4 10 20 10 -30 61 14 3 -54 -51 54 -55 -76 43 -18 21
5640B1O6j27K1J8Q2p6j2oo9J17N3l5j10N9J0l5Q1j04N7j9K4N6j19K9K3J6m3M2
$$ 21 87 -40 -19 -1 81 5 -7 -13 -82 35 88 53 -57 2 12 -23 58 -46 11 -8 16 72 -47 -18 5 21 -22 20
5668B0n9M5k7J51j82l5Q7mL9J4p6NL4N5j09O6n7k6N3k3LNL3pm8J4M7l4l2OJ27
$$ 20 -39 6 -21 130 -52 -87 0 -4 35 49 -27 -22 12 67 -42 24 -33 -59 -6 -29 -26 -21 12 5 -43 -29 18 -16 -48 -42 85
5699H5j24m6J43k3o8O3q9N8k2P2j17L1J03o2J8K9o4j9J08o5K4k3r0P2J1j5J0k
$$ 85 -39 -85 58 35 -33 30 -59 -1 -23 49 -68 -37 66 4 22 51 -13 -32 76 11 35 12 -78 -6 5 -10 0 -2
5727bj2OKj5J8kJ7l4J5pNP8m2m4k9N6o9R7J9q4KM2J2nop5L0K4K8J3o0n0N1K4K
$$ -2 -14 -8 -6 -21 -3 -5 12 -22 -7 -14 -9 69 27 -17 -46 10 -59 38 57 -27 -25 17 29 24 18 -57 -27 -3 25 38 -22 -72 -21 3 5
5762El0l9R1Oj5k2rO8n0j1K1l8MO5m2m5J8k1L7jJ8o4N6JJ3qq1j4J24l1mM1p4N
$$ 5 -25 -64 27 33 18 -4 -13 55 5 -6 15 -23 -19 46 4 -41 -23 -44 -7 -8 10 -54 2 3 16 8 -73 -87 37 6 2 43 -31 -26
5796b6mk5Q4qo2P9L3j00l1KR9j3k2L7q4MO2n0L5m9K8P9r7M1J7n1J04j16rJ9j9
$$ -26 -30 -55 29 21 -41 38 71 -29 -60 -58 41 28 6 43 -41 -37 25 -25 10 -39 -11 68 -29 12 29 -22 82 -34 -43 -24 -43
5827d3P3J4k6j2o5M8R2q3n0N2J8m4m9M7k2N4J3l9K4N4q9k5J10l4j0Qo1O7k1l5
$$ -43 30 44 18 6 -59 -11 81 -2 -52 0 18 -26 -75 -28 -50 4 17 -22 2 56 -33 -58 52 18 8 16 -45 22 1 -34
$$ [...]
8191H2
##END NTUPLES=NMR FID
##END=
