##TITLE=1H_60-2025-Bay
 200.13MHz, CDCl3,
 8 sc
 
 9.6.2025
##JCAMPDX= 6.0         $$ Bruker NMR JCAMP-DX V2.0
##DATA TYPE= NMR FID
##DATA CLASS= NTUPLES
##ORIGIN= UXNMR, Bruker Analytische Messtechnik GmbH
##OWNER= pz
$$ XWIN-NMR		Version 3.5
$$ Mon Jun  9 14:08:16 2025 Russian Standard Time (UT+4h)  she@DPX200
##.OBSERVE FREQUENCY= 200.1313
##.OBSERVE NUCLEUS= ^1H
##.DELAY= (6, 6)
##.ACQUISITION MODE= SIMULTANEOUS
##.ACQUISITION SCHEME= undefined
##.AVERAGES= 8
##.DIGITISER RES= 18
##SPECTROMETER/DATA SYSTEM= spect
##.PULSE SEQUENCE= zg30
##.SOLVENT NAME= CDCl3
##.SHIFT REFERENCE= (INTERNAL, CDCl3, 0, 14.3821)
##AUDIT TRAIL= $$ (NUMBER, WHEN, WHO, WHERE, WHAT)
$$ ##TITLE= Audit trail, XWIN-NMR		Version 3.5
$$ ##JCAMPDX= 5.01
$$ ##ORIGIN= Bruker BioSpin GmbH
$$ ##OWNER= she
$$ F:/spectra/data/she/nmr/H-C/1/audita.txt
$$ ##AUDIT TRAIL=  $$ (NUMBER, WHEN, WHO, WHERE, WHAT)
(   1,<2025-06-09 14:05:59.06 +0400>,<she>,<DPX200>,
      <created by zg, POWCHK disabled, PULCHK disabled
       configuration hash MD5:
       00 E9 B6 7A A2 85 ED C7 34 08 36 98 17 FE 4E 26
       data hash MD5: 16K
       7A 20 9D 3C 09 58 15 3C B8 9D 4C B1 2F DC B5 41>)
$$ ##END=
$$ 
$$ hash MD5
$$ 2D 23 9D A4 86 2E EC 35 CB C6 62 1B D9 E4 B2 2D
##$RELAX= 
##$RELAX= 
##$RELAX= 
##$RELAX= 
##$RELAX= 
##$RELAX= 
$$ Bruker specific parameters
$$ --------------------------
##$DU= <F:/spectra>
##$EXPNO= 1
##$NAME= <H-C>
##$PROCNO= 1
##$TYPE= <nmr>
##$USER= <she>
##$AMP= (0..31)
100 100 100 100 100 100 100 100 100 100 100 100 100 100 100 100 100 100 
100 100 100 100 100 100 100 100 100 100 100 100 100 100 
##$AQSEQ= 0
##$AQ_mod= 1
##$AUNM= <au_zg>
##$AUTOPOS= <>
##$BF1= 200.13
##$BF2= 200.13
##$BF3= 200.13
##$BF4= 200.13
##$BF5= 200.13
##$BF6= 200.13
##$BF7= 200.13
##$BF8= 200.13
##$BYTORDA= 1
##$CFDGTYP= 0
##$CFRGTYP= 5
##$CHEMSTR= <none>
##$CNST= (0..31)
1 1 145 1 1 1 1 1 1 1 1 1 1 1 1 1 1 1 1 1 1 1 1 1 1 1 1 1 1 1 1 1 
##$CPDPRG= <>
##$CPDPRG1= <>
##$CPDPRG2= <>
##$CPDPRG3= <>
##$CPDPRG4= <mlev>
##$CPDPRG5= <mlev>
##$CPDPRG6= <mlev>
##$CPDPRG7= <mlev>
##$CPDPRG8= <mlev>
##$CPDPRGB= <>
##$CPDPRGT= <>
##$D= (0..31)
0 0.7 0 0 0 0 0 0 0 0 0 0.03 0 0 0 0 0 0 0 0 0 0 0 0 0 0 0 0 0 0 0 0 
##$DATE= 1749463558
##$DBL= (0..7)
120 120 120 120 120 120 120 120 
##$DBP= (0..7)
150 150 150 150 150 150 150 150 
##$DBP07= 0
##$DBPNAM0= <>
##$DBPNAM1= <>
##$DBPNAM2= <>
##$DBPNAM3= <>
##$DBPNAM4= <>
##$DBPNAM5= <>
##$DBPNAM6= <>
##$DBPNAM7= <>
##$DBPOAL= (0..7)
0.5 0.5 0.5 0.5 0.5 0.5 0.5 0.5 
##$DBPOFFS= (0..7)
0 0 0 0 0 0 0 0 
##$DE= 6
##$DECBNUC= <off>
##$DECIM= 32
##$DECNUC= <off>
##$DECSTAT= 4
##$DIGMOD= 1
##$DIGTYP= 9
##$DL= (0..7)
0 120 120 120 120 120 120 120 
##$DP= (0..7)
150 150 150 150 150 150 150 150 
##$DP07= 0
##$DPNAME0= <>
##$DPNAME1= <>
##$DPNAME2= <>
##$DPNAME3= <>
##$DPNAME4= <>
##$DPNAME5= <>
##$DPNAME6= <>
##$DPNAME7= <>
##$DPOAL= (0..7)
0.5 0.5 0.5 0.5 0.5 0.5 0.5 0.5 
##$DPOFFS= (0..7)
0 0 0 0 0 0 0 0 
##$DQDMODE= 0
##$DR= 18
##$DS= 0
##$DSLIST= <SSSSSSSSSSSSSSS>
$$ [...]
##$SUBNAM0= <"">
##$SUBNAM1= <"">
##$SUBNAM2= <"">
##$SUBNAM3= <"">
##$SUBNAM4= <"">
##$SUBNAM5= <"">
##$SUBNAM6= <"">
##$SUBNAM7= <"">
##$SUBNAM8= <"">
##$SUBNAM9= <"">
##$SW= 18.0517328524113
##$SWIBOX= (0..15)
0 0 2 0 0 0 0 0 0 0 0 0 0 0 0 0 
##$SW_h= 3612.71676300578
##$TD= 16384
##$TD0= 1
##$TE= 0
##$TE2= 300
##$TE3= 300
##$TEG= 300
##$TL= (0..7)
0 120 120 120 120 120 120 120 
##$TP= (0..7)
150 150 150 150 150 150 150 150 
##$TP07= 0
##$TPNAME0= <>
##$TPNAME1= <>
##$TPNAME2= <>
##$TPNAME3= <>
##$TPNAME4= <>
##$TPNAME5= <>
##$TPNAME6= <>
##$TPNAME7= <>
##$TPOAL= (0..7)
0.5 0.5 0.5 0.5 0.5 0.5 0.5 0.5 
##$TPOFFS= (0..7)
0 0 0 0 0 0 0 0 
##$TUNHIN= 0
##$TUNHOUT= 0
##$TUNXOUT= 0
##$USERA1= <user>
##$USERA2= <user>
##$USERA3= <user>
##$USERA4= <user>
##$USERA5= <user>
##$V9= 5
##$VALIST= <valist>
##$VCLIST= <CCCCCCCCCCCCCCC>
##$VD= 0
##$VDLIST= <DDDDDDDDDDDDDDD>
##$VPLIST= <PPPPPPPPPPPPPPP>
##$VTLIST= <TTTTTTTTTTTTTTT>
##$WBST= 1024
##$WBSW= 4
##$XGAIN= (0..3)
0 0 0 0 
##$XL= 0
##$YL= 0
##$YMAX_a= 104295
##$YMIN_a= -98845
##$ZGOPTNS= <>
##$ZL1= 120
##$ZL2= 120
##$ZL3= 120
##$ZL4= 120
##$ABSF1= 10
##$ABSF2= 0
##$ABSG= 5
##$ABSL= 3
##$ALPHA= 0
##$AQORDER= 0
##$ASSFAC= 0
##$ASSFACI= 0
##$ASSFACX= 0
##$ASSWID= 0
##$AUNMP= <proc_1d>
##$AZFE= 0.1
##$AZFW= 0.1
##$BCFW= 1
##$BC_mod= 2
##$BYTORDP= 1
##$COROFFS= 0
##$CY= -3
##$DATMOD= 1
##$DC= 2
##$DFILT= <>
##$DTYPP= 0
##$F1P= 0
##$F2P= 0
##$FCOR= 0.5
##$FTSIZE= 0
##$FT_mod= 4
##$GAMMA= 1
##$GB= 0.15
##$INTBC= 1
##$INTSCL= 1
##$ISEN= 128
##$LB= 0.25
##$LEV0= 0
##$LPBIN= 0
##$MAXI= 10000
##$MC2= 0
##$MEAN= 0
##$ME_mod= 0
##$MI= 1.114404
##$NCOEF= 0
##$NC_proc= 0
##$NLEV= 6
##$NOISF1= 3.799351
##$NOISF2= 2.8
##$NSP= 1
##$NTH_PI= 0
##$NZP= 0
##$OFFSET= 14.38212
##$PC= 1
##$PHC0= -1551.418
##$PHC1= 6.992201
##$PH_mod= 1
##$PKNL= yes
##$PPARMOD= 0
##$PSCAL= 0
##$PSIGN= 0
##$REVERSE= no
##$SF= 200.129724274929
##$SI= 16384
##$SIGF1= 3
##$SIGF2= 2
##$SINO= 400
##$SIOLD= 16384
##$SREGLST= <1H.CDCl3>
##$SSB= 0
##$STSI= 0
##$STSR= 0
##$SW_p= 3205.1282051282
##$SYMM= 0
##$S_DEV= 0
##$TDeff= 0
##$TDoff= 0
##$TI= <>
##$TILT= no
##$TM1= 0
##$TM2= 0
##$TOPLEV= 0
##$USERP1= <user>
##$USERP2= <user>
##$USERP3= <user>
##$USERP4= <user>
##$USERP5= <user>
##$WDW= 1
##$XDIM= 8192
##$YMAX_p= 0
##$YMIN_p= 0
$$ End of Bruker specific parameters
$$ ---------------------------------
##NTUPLES= NMR FID
##VAR_NAME=  TIME,          FID/REAL,        FID/IMAG
##SYMBOL=    X,             R,               I
##VAR_TYPE=  INDEPENDENT,   DEPENDENT,       DEPENDENT
##VAR_FORM=  AFFN,          ASDF,            ASDF
##VAR_DIM=   8192,          8192,            8192
##UNITS=     SECONDS,       ARBITRARY UNITS, ARBITRARY UNITS
##FACTOR=    0.0002768,     1,               1
##FIRST=     0,             0,               0
##LAST=      2.2672688,     0,               0
##MIN=       0,             -98845,          0
##MAX=       2.2672688,     104295,          0
$$ Real data points
##PAGE= N=1
##DATA TABLE= (X++(R..R)), XYDATA
0 0 0 0 0 0 0 0 0 0 0 0 0 0 0 0 0 0 0 0 2 -7 8 -8 8 -8 8 -13 16 -16 17 -22 24 -28 31 -35 39 -45 50 -55 62 -69 76
41 76 -85 94 -104 116 -127 139 -155 171 -188 206 -227 251 -277 307 -340 380 -422 474 -536 612
61 612 -707 827 -987 1211 -1550 2101 -3170 5928 -28287 -37328 53272 34588 61543 104295
75 104295 49475 49557 45908 -6234 15970 -23197 -69093 -31125 -60013 -52577 18714 -7287 11958
88 11958 55121 24812 59996 69825 17989 33654 -2701 -42468 -3508 -38275 -52205 -11992
100 -11992 -47613 -26056 23187 -369 26767 29653 -7380 27127 7987 -19112 17008 -28362
112 -28362 -45782 761 -25317 -10759 17955 -17852 7388 15202 -11064 31344 12037 -22725
124 -22725 14666 -7423 -9082 26784 -8603 1140 16774 -23225 12154 19926 -25763 176 -9173
137 -9173 -26567 12714 -3899 1151 30931 -7119 16879 49077 6389 19981 19289 -19516 -715
150 -715 -15724 -28150 -351 -39081 -35524 11757 -15549 -81 29148 -2253 12841 16108 -2624
163 -2624 24897 -3687 -27293 6599 -20411 -22809 11824 -16012 -8408 7589 -14046 19225 19193
176 19193 -11647 18993 4723 -14228 19542 -259 -6045 10641 -19289 1534 18530 -14350
188 -14350 10479 11338 -17688 12476 6365 -6273 15452 -13202 -10964 13565 -16989 -1658 12079
201 12079 -22759 -1372 5266 -12478 14492 722 -10404 16138 -5184 156 22281 -10723
213 -10723 -680 10444 -16749 6732 6563 -17403 4608 -7457 -14116 13136 -8808 -6020 13394
226 13394 -14481 2376 18203 -7626 10007 7307 -10457 14101 221 -7885 14274 -12683
238 -12683 -11346 11731 -11173 181 7990 -13859 8036 4860 -9786 17667 518 -12499 12241
251 12241 -4942 -3472 10892 -11751 2883 6524 -15011 12026 7697 -15746 7187 -2308 -10915
264 -10915 7344 -9592 -3592 7094 -16153 5296 14316 -10989 8637 8404 -8375 9686 -1461
277 -1461 -4775 10149 -13178 -4436 12409 -11007 2276 10421 -9063 7552 3664 -7069 11757
290 11757 -6046 -10524 10046 -9733 -5144 9591 -8773 3931 7605 -6605 13740 4828 -8614
303 -8614 11991 -3467 -9351 7979 -9407 -5484 3939 -13294 2993 5049 -11886 9119 2587
316 2587 -9710 11559 -1072 -4895 10072 -6884 -209 8039 -10062 4505 4669 -12237 7459
329 7459 1096 -9221 9690 -2269 -4157 9899 -5953 1808 8628 -9648 5346 5220 -10941
342 -10941 7105 1347 -6936 9328 -2400 -1470 11019 -6494 1520 8243 -11078 686 868 -12714
356 -12714 2305 -4615 -9331 7483 -6177 -2941 13012 -4523 2019 9528 -6247 4352 1779
369 1779 -8545 6960 -4270 -9077 10345 -3417 -2978 10944 -3386 2487 6360 -6492 6321
382 6321 93 -11267 6447 -2750 -8614 8877 -2157 -996 9358 -3134 6047 7830 -7939
395 -7939 4877 304 -11884 3286 -4927 -10281 2345 -8575 -3138 7375 -6238 3733 8022
408 8022 -5719 7863 6143 -4033 7659 -2572 -5686 6487 -7260 -3290 5898 -9498 222
421 222 5967 -5110 7050 3688 -4443 8654 -1589 -3055 8712 -6928 -3951 5808 -7590 1828
435 1828 5702 -5167 6243 2239 -3455 10174 -2353 -6095 5053 -9711 -6273 2516 -9569
448 -9569 -1258 430 -7262 7711 3467 -2599 10877 -446 -3320 8157 -4395 -1811 2214 -10012
462 -10012 707 2314 -6642 7232 2494 -4819 7966 -31 -620 6676 -6600 -1218 3842 -7775
476 -7775 4146 5591 -5730 6090 2991 -1522 8785 -2225 -2879 4089 -10179 -3124 3377 -10152
490 -10152 -1410 439 -6843 5880 1677 -1893 8192 -3529 -1806 8483 -4793 -510 4113 -7589
504 -7589 1827 2474 -4569 6228 -1507 -5421 6582 -3034 -1887 6170 -6104 -643 4219 -4602 5640
519 5640 3571 -5430 5744 -444 -4206 6761 -3656 -3736 3330 -6251 1707 5224 -5290 4187 1743
534 1743 -6196 5750 -302 -6067 2508 -6637 -3871 3986 -5577 2590 5160 -4638 7136 6900 -1673
549 -1673 7400 -181 -4404 3147 -6502 -3807 1499 -10385 -1820 3412 -5359 5628 4916 -2098 7284
564 7284 1331 142 7936 -4368 -3210 2723 -7862 -795 2021 -6799 1785 -370 -4015 7229
578 7229 -183 -2831 5700 -4078 -1860 4730 -4225 1155 1440 -5719 5281 2736 -3102 7036 -469
593 -469 -3096 5532 -2567 -545 2408 -7128 213 1375 -6082 4519 1122 -4934 5140 -126 -1119
608 -1119 5579 -4065 -1348 2199 -6644 1444 2161 -6088 3023 892 -3016 6902 254 -1018 4704
623 4704 -4395 -364 3672 -6058 124 835 -5931 3886 1947 -1476 6985 -432 179 6932 -2341 141
639 141 2634 -7062 -1195 -552 -6086 2268 -1536 -4270 5232 -757 125 6768 -2702 -299 2701 -4475
655 -4475 1444 -217 -5769 2983 -1184 -3151 6629 -19 -1016 4985 -2543 941 2917 -4969 1004
670 1004 -947 -6544 3249 -194 -3011 4558 -1012 238 5750 -1516 2582 3471 -5158 2136 957
685 957 -4984 2431 -1737 -4160 3441 -2387 -288 4646 -3483 932 3409 -3470 2757 1156 -4262
700 -4262 2417 -1653 -2730 4117 -2997 -1544 3795 -3487 1126 3264 -3245 1992 71 -3872 3555
715 3555 -1549 -3008 3568 -3052 -1093 4199 -2192 1676 2909 -2671 3640 1499 -2698 4339 -1539
730 -1539 -3210 3474 -2716 -1383 2719 -3988 432 1805 -3410 3230 816 -3284 3633 -940 -1998
745 -1998 3679 -2646 -447 2541 -3732 1640 2037 -4050 2382 246 -3169 3242 -1255 -1788 2804 -3481
761 -3481 20 3168 -3215 1485 2311 -3118 2795 1028 -2021 3403 -1684 -1315 3852 -2648 231 3190
777 3190 -3690 757 1390 -3345 2197 -534 -2951 2933 -2191 -1598 3359 -2560 -366 2737 -2652 1952
793 1952 1506 -2919 2791 -810 -2927 3135 -2077 -1652 2537 -2815 322 2415 -3184 2113 1110 -3234
809 -3234 3170 81 -2092 3220 -1438 -874 3269 -2403 1077 2389 -3372 1692 1111 -3484 2153 -758
825 -758 -2704 2372 -2158 -915 2724 -3016 971 2141 -3119 2177 1308 -2414 2743 -130 -1355 3343
841 3343 -1938 -254 2807 -3108 470 1976 -3451 1435 183 -2723 2558 -1068 -1507 3414 -1620
856 -1620 -299 3261 -2452 760 1710 -3001 1940 217 -2765 2982 -925 -1952 2953 -1915 -624
871 -624 2208 -2868 983 961 -3036 2315 438 -2586 3275 -163 -1129 3378 -1441 309 2110 -3081
887 -3081 1126 867 -3847 1602 -198 -2982 2356 -1135 -1183 2873 -1787 630 2521 -2621 1561 1989
903 1989 -2751 1848 160 -2056 2676 -931 -709 3351 -2022 280 2582 -3089 886 729 -3155 1472
919 1472 -770 -2379 2462 -1532 -1120 3288 -1945 375 2519 -2415 1294 620 -2929 1788 -866 -2613
935 -2613 2279 -1995 -1551 2526 -2149 240 2098 -2153 1894 1433 -1969 2830 -20 -1976 2924 -984
951 -984 -824 2367 -2037 877 1816 -2327 2175 598 -2770 2285 -506 -2100 1952 -1555 -1012 2302
967 2302 -2216 1014 2213 -2273 1865 873 -2135 2412 -642 -1769 2313 -2399 -1060 1988 -3077
982 -3077 108 1404 -3043 1299 561 -2141 2112 -1201 -1588 2624 -1633 -508 2586 -1818 796 1775
998 1775 -1810 2022 722 -1929 2325 -668 -1607 2599 -1731 -550 2154 -2106 1111 1860 -1504 2282
1014 2282 1052 -1343 2621 -372 -1370 2339 -1924 -532 1232 -2722 -3 522 -3132 1171 -27
1029 -27 -2461 1640 -1043 -1514 2126 -1776 -531 1702 -2387 687 1386 -2303 1755 357 -1885 2145
1045 2145 -673 -854 2491 -2016 191 2150 -2179 1039 1469 -1764 2060 512 -1166 2917 -491
1060 -491 -483 2689 -1185 589 2418 -1819 788 1069 -2158 1607 -517 -2341 1781 -1396 -1449 1591 -2008
1077 -2008 -492 1312 -2090 762 728 -1932 1703 -160 -1770 1833 -876 -944 1646 -2176 -292 1082
1093 1082 -2216 953 936 -2030 1946 332 -1057 2345 -507 -121 2283 -1252 956 2228 -1915 1258
1109 1258 1083 -2133 1590 -193 -1652 1600 -1386 -749 1819 -2004 247 1333 -2111 832 706 -1740
1125 -1740 1396 -273 -1472 1941 -1293 -555 2008 -1743 264 1444 -1835 1030 600 -1792 1519
1140 1519 -364 -1229 1939 -1103 -464 2171 -1297 709 1320 -1390 1491 677 -1696 1890 -358 -1503
1156 -1503 1764 -1312 -724 1068 -2311 272 584 -2201 1112 435 -1836 1718 -208 -629 2011 -715
1172 -715 -190 1675 -1519 620 956 -1951 1216 41 -1799 1273 -511 -910 1556 -1528 -330 1399
1188 1399 -1523 505 967 -1698 1203 216 -1174 1574 -506 -809 1697 -1340 -155 1213 -1804 419
1204 419 747 -1603 1080 15 -1322 1550 -577 -852 1632 -1074 -161 1536 -1072 892 720 -1312
1220 -1312 1549 17 -1302 1590 -628 -867 1343 -1739 -322 880 -1686 697 482 -1537 1469
1235 1469 152 -1049 1713 -444 -460 1740 -1415 195 1084 -1650 588 499 -1649 1129 -55 -1102
1251 -1102 1321 -803 -513 1364 -1128 -79 1181 -1458 860 500 -1254 1353 105 -777 1536 -877
1267 -877 -473 1222 -1437 -317 904 -1673 536 189 -1525 1200 -279 -844 1590 -522 -88 1763
1283 1763 -1048 441 879 -1322 922 152 -1470 961 -363 -884 1402 -864 -492 1186 -1281 235
1299 235 913 -1376 902 458 -982 1427 -166 -737 1473 -730 -133 1158 -1155 429 590 -1631
1315 -1631 1009 34 -1340 1176 -327 -690 1215 -898 -279 1418 -1188 552 800 -1315 1048 -17
1331 -17 -1146 1231 -536 -580 1130 -909 -275 1052 -1334 141 431 -1310 747 -41 -1101 1241 -432
1348 -432 -361 1545 -740 165 1226 -918 612 668 -1181 1039 -76 -1252 1300 -848 -793 1123 -1021
1365 -1021 -129 849 -1270 758 695 -1027 1472 268 -567 1419 -645 -586 1002 -1132 -93 695 -1196
1382 -1196 246 298 -1228 1100 -42 -622 1046 -301 -346 1301 -973 94 933 -1091 535 717 -931
1399 -931 989 -179 -682 1363 -597 -318 1103 -1052 153 684 -1208 500 238 -1282 652 -321
1415 -321 -1037 1212 -460 -221 1238 -1052 315 761 -972 751 -78 -1238 716 -561 -1137 867
1431 867 -903 -485 842 -820 672 847 -759 1220 540 -727 1296 -136 -701 1115 -718 -175
1447 -175 783 -1120 180 516 -1243 809 236 -731 1140 -218 -461 920 -712 -90 698 -947 35
1464 35 639 -1160 833 -81 -938 814 -402 -821 836 -815 -360 656 -1463 89 360 -1137 794
1481 794 141 -753 1017 -118 -345 1032 -579 117 973 -953 570 596 -1117 638 0 -837 1085
1498 1085 -222 -350 1001 -710 -23 940 -828 521 617 -847 782 -56 -582 919 -346 -677 856
1515 856 -797 -69 440 -1314 302 131 -1066 712 -209 -924 1029 -496 -62 1155 -553 31 522
1532 522 -827 377 396 -758 650 -96 -679 1049 -402 -490 1033 -939 275 708 -914 457 311
1549 311 -554 907 210 -505 805 -426 -198 1139 -864 95 525 -936 245 227 -1005 512 -477
1566 -477 -922 801 -393 -294 1013 -614 208 739 -654 790 289 -910 871 -301 -389 964 -544
1583 -544 -137 470 -759 -50 349 -884 272 258 -771 881 -25 -579 1015 -258 151 883 -580 211
1601 211 633 -1118 430 -73 -1044 436 -443 -625 691 -577 -50 749 -620 186 576 -622 545
1618 545 178 -679 710 -192 -493 738 -627 -80 828 -648 354 319 -847 349 123 -775 684 -367
1636 -367 -517 532 -514 -110 745 -621 389 610 -641 730 225 -689 687 -472 -647 553 -806
1653 -806 -124 326 -766 21 532 -832 713 223 -501 829 -132 -235 885 -586 -138 404 -709 198
1671 198 182 -819 390 -30 -646 817 -159 -264 754 -535 137 767 -748 334 234 -711 389 110
1689 110 -383 752 -312 -450 688 -455 -106 614 -763 476 64 -904 310 -88 -616 717 -381
1706 -381 -280 787 -780 237 543 -628 353 372 -531 466 -208 -557 533 -379 -405 335 -376 146 436
1725 436 -821 574 363 -557 730 -139 -232 712 -610 -199 567 -696 158 497 -550 551 207 -513
1743 -513 534 -200 -337 397 -399 -392 476 -536 -81 625 -546 398 355 -409 599 -67 -318 575 -712
1762 -712 -23 534 -583 -31 127 -773 531 155 -310 632 -110 -108 847 -348 173 312 -522 136 395 -612
1782 -612 310 44 -652 424 -149 -411 541 -439 26 751 -424 346 524 -532 580 34 -383 769
1800 769 -427 -292 533 -482 -125 632 -619 297 185 -496 279 23 -542 823 -341 -465 694 -442
1818 -442 21 604 -486 209 259 -626 404 -40 -403 546 -138 -331 533 -603 -110 308 -788 151 162
1837 162 -518 561 -8 -490 691 -230 -5 689 -457 176 703 -619 308 -18 -776 282 -190 -487
1855 -487 515 -386 -232 561 -577 189 364 -440 330 -7 -387 296 -384 -325 537 -390 -357 658 -321 48
1875 48 487 -525 212 -78 -550 539 -350 -254 566 -251 -4 720 -433 45 648 -444 249 118 -751
1894 -751 423 -186 -617 391 -449 -174 348 -680 184 205 -548 462 296 -308 439 -60 -305 587 -244
1913 -244 -225 628 -466 229 245 -572 271 314 -351 511 -163 -303 552 -409 -153 463 -490 53 409 -326 344
1934 344 153 -472 539 -53 -289 363 -290 -79 332 -615 231 234 -483 614 187 -490 478 -91 -314 573
1954 573 -514 -38 345 -479 408 329 -256 299 129 -654 348 -368 -343 133 -638 -198 431 -565 566 470
1974 470 -324 460 -91 -484 476 -155 -183 429 -771 -150 317 -409 300 220 -347 382 51 -316 418 -276
1994 -276 -251 307 -629 -259 192 -759 186 166 -371 487 -21 -286 656 -267 -175 299 -546 -54 200 -573 154
2015 154 283 -662 321 -181 -134 721 -50 -20 544 -101 94 288 -434 286 -173 -421 326 -239 -349 497 -188
2036 -188 -31 659 -150 286 352 -163 576 202 -487 448 -178 -424 312 -356 -402 541 -543 126 353 -221
2056 -221 353 -9 -432 509 -197 -510 495 -670 -267 459 -690 116 324 -377 524 178 -306 586 103
2075 103 -344 266 -244 -125 191 -646 -49 172 -334 559 352 -160 557 -87 -32 685 -176 -126 318 -522 79
2096 79 42 -708 102 -41 -761 386 -332 -361 387 -277 145 556 -302 113 198 -587 444 9 -377 420 -254
2117 -254 -220 374 -202 -105 372 -325 6 309 -477 302 137 -464 476 -291 -118 361 -214 51 472 -454 226
2138 226 400 -151 404 -23 -496 354 -387 -146 273 -364 81 374 -297 58 188 -310 540 101 -294 459
2158 459 -88 -389 533 -411 -103 120 -610 141 -30 -285 452 -3 -279 456 -197 -99 382 -110 -94 344 -364
2179 -364 441 297 -193 335 215 -448 385 -221 10 204 -373 -9 -80 -468 50 226 -226 303 401 -233 458
2200 458 -244 12 488 -452 120 95 -462 290 62 -301 379 3 -261 213 -278 -211 335 -191 221 446 -230
2221 -230 298 217 -352 431 24 -395 486 -181 8 289 -297 -25 300 -295 175 138 -447 520 -236 -135 363
2242 363 -373 23 236 -216 227 42 -240 402 3 -260 380 -38 -174 400 -319 -119 208 -419 142 124
2262 124 -315 121 63 -153 336 -90 -121 192 -441 -160 204 -164 -27 104 -616 200 -91 -464 327 -192 -19
2283 -19 252 -310 81 382 -370 401 322 -156 326 -41 -282 473 -260 -277 374 -290 136 101 -297 133 15
2304 15 -133 390 73 -446 143 -247 -179 428 -277 104 308 -401 133 116 -443 306 -114 -340 224 -95 -182
2325 -182 298 -330 24 -31 -291 179 -122 -219 24 25 -180 405 -209 55 309 -353 -101 254 -367 137 -84
2346 -84 -164 351 -43 -267 565 -132 59 303 -71 -34 290 -425 177 59 -288 341 78 -277 206 -218 4
2367 4 260 -288 226 188 -265 147 -94 -181 208 -84 -18 602 -173 -131 444 -294 -107 140 -351 284 -29 -28 482
2390 482 -47 -322 358 -155 23 289 -201 -70 127 -190 141 -34 -290 289 -288 7 157 26 46 137 -126
2411 -126 141 25 -259 32 -12 -293 81 5 -88 370 -138 -144 113 -449 147 280 -310 174 40 -393 116 -244
2433 -244 -190 274 -3 -19 160 -37 -20 34 -302 280 84 -345 413 -93 -322 279 -131 84 110 -389 156 184
2455 184 -275 295 24 -319 398 -124 1 147 -384 -196 246 -26 322 282 -281 255 18 -241 54 -224
2475 -224 -63 200 -109 38 299 -70 232 188 -451 248 -83 -242 124 -58 -239 39 -177 87 143 -101 145
2496 145 64 -491 181 42 -179 -74 -315 -15 262 -304 115 132 -304 136 167 -245 139 -73 -144 232 -146
2517 -146 7 323 -273 -133 -1 -309 74 145 57 307 -117 -248 200 -160 -67 357 -235 -204 365 -157 24
2538 24 5 -239 242 -76 -347 267 159 -90 239 -385 172 318 -379 136 -3 -182 233 -53 -198 322 12
2559 12 -14 176 -143 -211 269 -152 53 47 -70 132 -175 -228 151 -122 1 250 -219 54 182 -407 328 82
2581 82 -31 357 -24 -100 123 -162 -162 271 -293 111 189 -88 298 86 -196 385 -144 -27 330 37 72 73 -247
2604 -247 22 117 -331 34 -201 -190 251 44 -111 98 -108 -95 187 -86 -23 120 -318 386 132 50 52 14 48
2627 48 469 81 118 261 -147 146 45 -302 130 -183 -74 98 225 -88 141 -76 60 292 -120 128 223
2648 223 -305 98 327 -83 115 130 -90 68 -74 -202 102 -140 196 158 -232 99 -79 -74 211 -179 52
2669 52 343 -258 23 -49 -184 108 145 -127 86 -120 -76 218 -13 -184 184 -148 -170 136 -252 -4 77 -175
2691 -175 182 -98 -255 288 -202 -164 91 -165 -187 217 -123 -31 88 -163 320 39 -124 16 -175 -61 265
2712 265 -42 -25 219 -102 194 113 -220 -78 -247 -279 180 -163 23 25 -160 -66 182 -152 85 95 -192 26
2734 26 -208 -28 170 -155 -171 302 -133 81 41 -119 122 123 -125 263 87 -278 29 -11 -56 371 -139 -170 111
2757 111 -295 230 -2 -195 189 83 54 154 -60 -33 263 -267 -152 -7 -208 226 163 106 195 -286 208 -12
2779 -12 -284 -126 205 4 28 49 -319 22 73 -300 134 7 76 168 -122 -174 -63 -149 -240 25 -287 136 -72
2802 -72 -73 79 -163 133 71 29 -35 2 -212 91 -67 -276 149 11 -169 286 -43 -101 -39 -281 -7 82 -238
2825 -238 -21 -10 -251 138 126 36 98 73 -4 -81 -93 -120 199 -320 95 -35 -106 134 29 -111 212 -94 -264
2848 -264 -27 -227 114 62 -176 29 280 -172 279 18 -72 -59 -107 -90 58 -117 -137 139 -230 -1 -159 -199
2870 -199 96 -237 -81 233 114 -193 208 15 148 -23 -230 335 -17 -116 68 18 14 303 -204 73 161 -126
2892 -126 123 219 -13 296 -86 -147 232 -103 71 21 -33 82 124 43 152 74 -316 343 98 -227 132 -121
2914 -121 -26 93 -43 -174 -73 -286 58 140 -130 177 -150 -193 273 -73 26 283 -282 -227 98 -7 362 154
2936 154 -27 -101 -73 -153 249 -70 -23 169 -99 -47 141 -28 -69 27 -55 47 -76 -62 170 -11 -161 7 -162
2959 -162 -71 79 -200 176 159 -113 -45 51 -46 84 -62 -13 212 101 54 33 -248 125 -78 -277 -54 -110 -43
2982 -43 1 -30 -1 221 28 89 -35 -34 -26 -76 -22 83 146 -144 64 68 90 275 -36 205 73 50 66 52 -40 142
3008 142 -84 -14 196 -258 -16 54 -82 -72 170 -106 121 26 -214 78 163 99 137 8 134 316 -260 -124
3030 -124 84 -146 45 -60 -191 -143 -150 -46 105 -41 -29 200 -24 194 -97 -220 -81 19 39 192 -141 -61
3052 -61 148 27 -89 123 29 -232 -69 -150 -23 102 155 216 77 -270 258 -159 -77 41 0 68 93 -38 -108
3075 -108 -19 -96 263 -237 -310 104 -15 -1 -37 -56 48 -160 -292 2 -162 -146 242 56 187 313 -94 -34 13
3098 13 19 170 70 112 142 -158 -22 159 -274 93 27 -123 59 45 -100 148 152 -19 58 -53 -138 79 -170 45
3122 45 131 -274 -35 266 -193 -41 98 -187 -6 -46 -26 100 -62 67 186 -358 42 202 -138 -22 -20 -126
3144 -126 12 -50 -199 110 -86 11 148 -221 50 0 34 7 -21 20 45 -175 41 309 -215 -106 186 15 -72
3167 -72 40 -51 -40 -92 12 -91 -192 -261 96 1 -4 99 98 72 72 9 88 15 -131 -98 -123 -171 78 -77 137 183 -158
3194 -158 126 -155 -56 -48 -76 -41 100 -190 209 132 -55 147 236 -73 146 73 34 116 76 59 -67 22 15 120 -138
3219 -138 -220 148 38 178 50 -187 37 171 -116 242 -140 96 104 -96 -49 88 16 96 52 -26 -19 49 -134 238
3243 238 -238 -76 198 73 -96 66 17 90 -144 -103 172 36 24 187 -10 -165 187 27 -34 15 -17 43 -12
3266 -12 -238 62 -33 -63 35 -49 77 155 -74 103 0 -142 194 -55 -167 151 -189 -82 229 -107 -90 -65 -63
3289 -63 123 79 -114 153 206 -82 20 -45 -89 231 94 -174 116 -287 -100 137 -147 4 -91 -104 33 -101
3311 -101 -125 193 -106 -17 -128 -120 80 -101 -199 24 172 184 86 93 48 242 94 -2 45 32 -104 -32 16 -17 -21 -86
3337 -86 49 -56 -103 130 -23 -140 234 -194 4 303 151 5 -40 3 80 -1 -114 217 -61 104 6 -65 80
3360 80 93 59 48 -245 -196 4 -126 215 271 -28 51 9 -285 -10 85 -50 31 10 -228 173 156 -20 79 -53
3384 -53 97 89 -110 101 83 -7 66 -93 -254 370 -43 -7 44 -250 69 251 15 136 123 -185 109 5 -230
3407 -230 127 -256 14 -57 -154 -3 84 52 92 -49 -41 114 -228 -125 133 -112 -22 -13 -17 171 69 -32 250 8
3431 8 1 135 84 -149 323 -21 -96 288 75 54 85 -67 148 54 -102 162 -190 -174 46 36 -73 55 -79 33
3455 33 95 -115 178 132 -248 191 88 -283 109 -265 -41 8 -149 -157 68 -164 -102 1 48 90 31 -60 102 -36
3479 -36 -85 380 -65 -16 -23 -240 90 11 124 220 -116 113 108 -160 35 196 -182 171 -67 -93 140 -2 -95 77
3503 77 192 25 168 -270 85 250 -74 16 189 -191 243 -78 -61 -6 39 -141 161 50 -207 123 -78 -108
3525 -108 -70 -111 163 -61 -154 30 -217 -62 -273 104 90 68 -39 180 -14 -31 56 -178 160 450 4 22 251
3548 251 -154 -98 113 -168 14 33 -112 184 -100 -268 -6 -39 -116 136 -71 175 -53 54 4 -105 -92 136
3570 136 -147 -146 14 -237 22 155 -111 40 200 -140 -92 -48 -212 -59 -21 -292 99 -9 54 160 -165 -104
3592 -104 133 -149 48 -44 -162 85 -31 -220 230 -9 -26 92 -139 -26 239 30 102 15 -31 139 -196 81
3614 81 -33 -20 64 -166 -136 -35 -9 -157 53 142 -49 23 83 -3 200 -125 219 7 33 136 218 -136 25 -91
3638 -91 -162 106 78 53 7 73 -65 108 -210 -57 65 118 17 -58 -43 167 41 63 125 -64 87 40 -1 -65 35
3663 35 -282 -7 69 -23 179 69 -49 225 -115 -38 -17 -243 12 66 129 -109 -80 -54 -72 142 -265 47 50 -217
3687 -217 -122 21 -16 -88 -132 76 37 149 144 -111 166 210 -146 -8 -68 -115 121 -149 -219 40 128 -40 206 -2
3711 -2 -255 160 25 -36 193 79 131 143 36 -63 35 -60 146 14 56 184 51 -174 17 -42 252 80 -26
3734 -26 -258 -16 -181 -85 -18 54 173 -104 -110 -53 11 125 62 -39 15 -59 -55 113 -105 12 -53 19 130 38 2 -9
3760 -9 -49 -214 33 0 -131 207 -29 171 255 -93 144 -124 -228 202 -185 -31 56 36 110 -82 -20 -32 16 -117
3784 -117 -10 -77 -141 28 170 32 19 105 -172 -49 43 -202 90 -174 50 7 -154 -27 -42 -28 52 -96 -9
3807 -9 156 -119 -69 -121 -173 54 -84 105 -98 116 -48 147 -117 -94 -94 -215 236 107 78 96 9 -196 -118 100
3831 100 31 157 -180 -111 12 -154 -39 147 52 160 155 24 -11 285 11 -101 103 141 -109 -167 -146 -62 -163
3854 -163 -5 -80 -119 226 92 -152 10 131 -54 67 -173 -112 7 4 135 118 -129 161 -21 -8 257 106
3876 106 -316 130 -14 -34 -136 -125 53 -75 -58 149 -35 -90 -41 22 -167 -6 9 98 138 -91 20 230 -69
3899 -69 -24 -72 -25 74 -10 119 -28 62 160 82 76 26 14 113 80 -195 -99 221 -45 26 -129 -9 -4 156 -127 -102 14
3926 14 -131 34 -222 -9 40 2 -244 150 -284 44 -108 -268 -38 -6 66 158 -231 -192 200 -300 179 77
3948 77 -290 -106 -137 20 15 -43 -130 143 -34 -144 -3 -244 -166 -173 -17 6 118 76 -13 37 -2 107 -26 -76 -101
3973 -101 -46 126 53 -36 78 -31 16 186 46 118 82 -234 -107 97 106 -90 46 114 -173 51 -53 87 14
3996 14 -26 -30 -188 -56 95 -153 159 53 176 8 -56 6 -26 -134 35 234 -12 -105 -92 88 -78 -118 -209 103
4020 103 108 -59 21 150 -79 329 -225 62 179 -236 -46 163 -45 113 69 -206 -69 -70 -163 65 -91 5 -124
4043 -124 -84 -74 28 12 -99 50 -50 88 153 75 92 -60 -214 -158 -340 10 15 23 -141 4 -8 -88 -131 -45 -71
4068 -71 173 -97 -16 -48 -67 249 79 133 -32 -203 75 19 81 -18 147 130 -73 217 82 -49 -69 65 76 -43
4092 -43 -101 -13 83 19 113 -66 109 161 93 108 -27 -191 199 -7 -252 -235 -237 142 -8 -84 126 -111 -56 63 0
4117 0 227 163 -38 -72 -254 -127 61 47 -83 -11 -292 -112 95 -79 79 -41 106 51 -102 -1 17 -94 -86
4140 -86 -6 -6 -71 210 -47 95 183 -172 162 260 -3 23 -210 132 192 -126 -223 51 51 -11 140 -53 -50 6 -7 50
4166 50 -18 -38 -6 12 188 67 5 55 102 -152 49 206 -247 -19 -121 -134 -180 20 -79 88 -1 64 75 -87 201
4191 201 -178 -70 279 -17 17 17 157 38 59 -305 140 79 -227 -22 64 163 76 8 -88 -59 -77 141 46 -111
4215 -111 244 82 -67 273 -19 -128 29 -98 89 176 -1 26 -51 -218 86 -62 182 51 -118 51 20
4236 20 -31 -255 -56 -72 -81 12 5 268 -85 -30 351 -111 -186 28 -33 -98 213 -155 -69 84 -79 71 -357 102
4260 102 -12 -40 -43 38 -141 -130 -68 -154 18 76 -67 23 155 44 40 -34 -30 43 79 184 120 -9 -200 -12 48 -160
4286 -160 55 -41 92 -168 -113 193 69 -12 101 -72 205 125 165 83 -100 -96 -64 15 -47 54 69 -7 208 -107
4310 -107 -206 4 65 -105 -16 39 -29 82 -133 49 -32 -71 159 -99 77 -22 34 108 118 143 -74 0 -101 -181 -149
4335 -149 -84 7 45 111 -93 -107 -67 -135 -13 72 -219 270 251 -81 -3 245 -5 105 -107 -182 -8 165 95 147
4359 147 50 38 130 13 42 149 28 -36 -27 174 80 18 79 1 -18 66 32 40 90 174 -251 -34 -65 -109 26 101 -164
4386 -164 103 -18 -64 87 39 -42 301 -37 201 55 -212 -20 -174 -10 191 -183 -115 53 -343 55 -33 -146
4408 -146 -84 53 -62 118 -135 142 -48 -103 -3 46 45 -134 -5 -89 7 27 -64 54 -166 -95 62 -121 9
4431 9 197 -211 75 20 90 106 184 -80 332 200 22 116 -199 -119 -104 -61 -103 -100 -10 210 22 55 23 22 -98 18
4457 18 -79 27 159 -124 99 -82 232 166 87 6 160 37 -49 25 -9 99 -127 -13 143 164 -70 -41 -156
4480 -156 64 70 -66 -83 8 43 -175 -58 -100 -20 90 -116 -12 90 -22 45 -73 14 355 -227 103 51 -59
4503 -59 -57 7 96 19 -27 -11 268 -113 107 -4 -94 -145 173 -82 107 120 15 42 58 -11 -32 -12 -93 22 12 23
4529 23 -6 105 330 121 -100 79 -101 -7 -64 70 -28 -34 65 10 134 8 -59 17 -57 19 -89 -122 98 -29 28
4554 28 -45 -24 203 -38 25 -117 -47 64 16 4 -1 74 -2 22 74 -75 -234 -141 -91 85 0 84 85 -55 17 -28 97
4581 97 108 0 78 -130 -57 85 -11 -30 -153 500 -57 -138 74 -195 103 204 110 -32 -138 -31 -92 150 25
4604 25 180 138 18 317 31 -24 -15 42 -9 -12 -118 16 146 -246 51 -41 -36 19 -57 -8 -121 -279 271 34 3
4629 3 2 -70 -13 99 -29 -137 152 -25 4 48 110 202 198 -292 0 11 -36 -14 -80 87 -73 -99 13 192 -291 13
4655 13 217 -81 178 102 60 213 168 22 319 182 28 -76 -33 -157 95 -203 106 -99 -147 -18 -29 -71 205
4678 205 19 -149 20 -184 -52 -21 2 -75 112 43 140 99 -47 -73 111 105 224 -216 92 95 -13 99 -45 149
4702 149 -74 152 -89 64 113 35 -115 -233 27 -224 -167 -62 -255 -21 76 53 61 141 -201 -77 63 -55 -152
4725 -152 188 50 108 -41 -162 -142 31 -114 110 152 -137 -87 14 -34 0 -90 -7 112 -110 154 145 -56 97
4748 97 -164 -110 -162 -57 -63 96 28 13 -62 -146 232 -42 -15 23 136 12 -2 -154 88 -30 140 348 -91 15
4772 15 145 78 6 100 -17 120 153 -67 69 -27 -56 62 -51 46 2 -20 31 81 39 13 -268 66 -200 1 -23
4797 -23 88 -10 63 64 -135 93 230 -63 -66 192 -22 21 -29 26 68 -60 -24 174 -64 -215 -94 -242 -142 136
4821 136 260 37 -95 126 141 -36 -135 -160 90 105 105 -26 -24 -5 208 64 -102 -98 188 46 15 184 17 -100
4845 -100 -59 59 -50 -12 -101 -40 108 -94 -64 -1 49 -82 -31 81 46 -70 -134 148 -21 143 -183 -5 -35 -71
4869 -71 30 -17 -96 -40 -115 111 61 -44 35 224 -90 -12 48 30 171 116 -41 -189 -9 -323 150 4 86 15
4893 15 165 -100 -78 -189 -121 190 65 -30 66 -208 31 110 -169 24 -65 18 354 92 -4 34 84 -63 110 30
4917 30 115 45 -21 -143 75 -137 -7 125 164 48 -86 30 113 47 -217 -25 -234 -29 -55 28 180 -40 69
4940 69 123 -58 78 -29 24 -72 7 -53 137 -127 85 231 33 197 69 -131 68 63 -58 62 329 -2 32
4963 32 182 27 -203 109 -146 117 63 126 31 -218 193 18 102 221 -150 80 198 -91 -173 21 57 -25 -1
4986 -1 -3 -51 12 155 123 -64 71 232 73 97 -162 -16 -100 47 78 54 -3 262 147 -28 -24 115 4 70 59
5011 59 -204 -138 53 -2 65 -85 -37 6 -221 -61 70 -118 202 -46 -180 117 74 -40 -41 136 191 153 -32 23
5035 23 -49 -20 -39 -18 145 109 48 45 69 -88 106 -140 -63 -241 86 116 -221 14 -84 -180 -46 -63 155 162 -81 139
5061 139 27 -255 12 11 -38 71 -175 -62 -25 4 -26 79 -13 -156 135 97 -25 -132 -19 221 51 -73 2
5084 2 -176 -136 -49 -138 59 87 -62 -61 -91 -112 69 -76 8 231 -97 37 -179 -36 72 -131 6 289 78 -33
5108 -33 303 48 30 -147 -75 195 4 -136 -80 -146 204 31 -35 32 -149 75 64 -20 58 -124 -245 -223 168 -18
5132 -18 -43 224 -19 -157 85 151 157 -16 -33 20 167 -7 63 28 -100 -175 -164 55 -98 -139 19 192 -57 -142
5156 -142 -222 -95 99 161 147 79 -21 -48 51 -176 -122 -116 81 -108 21 -43 30 -75 -35 -109 -138 4 125 -169 -7
5181 -7 -63 137 123 -2 -57 74 -184 -52 -169 51 57 -132 -90 -119 244 26 150 -330 -277 -133 220 87 1 -150
5205 -150 23 -175 -116 -86 -8 180 -21 -1 -196 77 -114 -246 229 -92 -57 -12 159 233 -176 9 26 86 -24
5228 -24 107 -138 -204 -33 -43 -155 230 118 26 212 -104 -3 -62 71 108 88 -137 -173 -129 7 150 68 -45
5251 -45 142 -97 109 133 43 -33 9 22 -210 -1 -68 246 119 -147 126 -90 -44 -46 -109 4 130 151 160 92 51
5276 51 54 -11 -25 -14 -74 35 -55 95 -106 -54 226 93 -158 -8 172 -107 170 -109 148 178 53 216 108
5299 108 76 -14 -37 148 128 124 33 106 30 -265 -258 26 -146 -114 -110 -24 211 67 162 114 -27 -86 -171 29 168 -132
5325 -132 41 49 125 -46 12 57 -71 -90 122 64 -29 -4 216 -30 64 -8 -182 235 -4 69 -9 96 135 48 -75
5350 -75 8 31 83 -80 6 200 -26 -139 -251 299 -181 -186 238 8 -60 40 -66 57 16 -207 -96 -244 -65
5373 -65 19 -14 -63 89 10 -221 -15 -62 -15 -16 -64 -53 -105 -85 83 10 -85 -19 -10 -137 -41 -268 100 8 -250 -96 41
5400 41 26 -95 0 -52 -113 -99 -30 -32 47 -126 223 143 -95 -104 210 66 82 -228 202 -85 -76 -183 -72 -83 -45 165
5426 165 -163 -148 121 -238 -21 -54 10 -156 -46 84 22 63 14 -7 -51 -124 -112 107 117 177 -175 -239 -173 170 -190
5451 -190 -131 -114 -167 29 128 -68 -12 -51 67 108 180 -72 130 23 79 56 -197 52 -136 -17 -49 45 -76 -25
5475 -25 5 98 174 -35 -256 -30 -233 -47 171 -136 -21 -85 -103 -38 6 116 -87 13 -116 139 -2 -123 -53
5498 -53 -92 -33 -115 -84 81 -223 19 -68 118 103 213 -65 213 -46 43 105 10 -169 60 44 -91 271 -61 -115
5522 -115 -105 -36 -35 -91 158 -67 -71 -138 17 -119 -78 -69 59 113 -85 -93 -1 -51 -140 -192 -81 -244 -105 7 101 -169
5548 -169 -60 158 30 98 -77 87 -167 -26 109 40 86 -133 -135 -146 -76 -197 36 168 61 -29 113 -166 -55
5571 -55 -44 -26 -2 88 -172 -85 8 137 -52 -120 -7 154 -2 124 67 43 1 -137 132 9 60 27 151 140 -60
5596 -60 -80 -53 -87 103 41 -23 -73 24 23 -157 -19 151 164 107 -57 195 171 92 3 36 74 277 -72 -85 -11 101
5622 101 234 -136 35 -100 -169 61 -196 76 -46 25 -143 -127 -128 -79 -124 -10 40 65 -84 135 -129 57 -61
5645 -61 -45 135 -81 -88 -55 3 -147 6 26 -74 -178 -84 -30 12 36 -22 -2 29 7 22 107 -40 135 193 -82 -252
5671 -252 -184 -10 102 -108 -61 -10 34 -63 261 31 -57 -17 96 12 -95 -39 -119 -164 110 138 -124 -20 -101 -122 6
5696 6 -252 -27 -12 -57 -31 125 -76 16 114 -64 25 214 85 -165 61 50 38 -219 -77 129 33 70 211 273
5720 273 -75 157 -205 332 -94 -59 -25 -96 -38 -83 77 152 187 -153 -29 -13 94 -26 -178 -109 111 92 -73
5743 -73 10 303 29 106 -161 -15 0 20 -179 -72 76 196 191 -58 -27 -113 -115 117 -46 105 41 -111 -2 120
5767 120 113 -52 -35 86 208 47 102 8 -22 196 11 12 -214 150 -88 13 -87 30 99 -52 155 -10 -156
5790 -156 -118 40 -129 73 112 4 30 -60 -88 75 -6 -24 -23 -57 197 -115 7 -7 52 -67 -102 -24 -218 32 62
5815 62 -81 96 60 -141 -3 -96 187 -143 17 16 -174 -157 -14 140 -49 105 -10 -37 -108 -85 118 -95 -12
5838 -12 37 -122 -32 -47 -21 -44 -24 -16 117 -93 132 -78 0 -68 44 201 232 293 -76 174 7 60 92 -79 -13
5863 -13 -65 75 64 21 -75 120 -61 -25 -25 -67 59 84 -36 -48 -66 -17 118 26 0 -37 -133 75 -138 -47 -138 57
5889 57 -71 -172 51 41 72 7 -81 -164 149 -48 1 -144 -30 12 -32 -130 70 -138 -27 85 13 -65 71 -100
5913 -100 146 -64 -89 282 -84 -4 61 -22 18 18 27 110 85 -48 47 -8 -128 -99 -31 -62 11 122 -133 -22 -24 65 114
5940 114 26 171 99 3 33 -37 42 -41 105 35 -82 68 181 74 -17 -110 -76 -85 -63 122 18 -55 -61 77 262 -4
5966 -4 9 138 38 58 24 195 11 -179 -35 -260 6 6 -213 -1 38 45 91 189 71 -46 -10 7 -18 -110 -55 90
5992 90 42 -41 -111 42 -161 123 -46 50 46 -109 26 85 199 142 -204 -17 36 22 17 -16 24 -28 7 -47 2 116
6018 116 232 -145 -176 -36 13 89 -167 122 66 49 173 -144 75 104 -44 22 -10 -110 83 -47 -253 38 37
6041 37 16 -122 -110 57 165 133 -302 106 56 334 -190 42 67 -135 -38 -82 64 -18 9 14 124 -188 -30 -85
6065 -85 126 -87 125 -104 -189 203 -13 -66 92 -3 44 -160 -91 262 53 16 -11 231 -92 120 -28 56 -85
6088 -85 -34 -146 64 -165 143 20 -91 23 -66 188 -146 63 -9 112 19 -99 -40 2 -44 -36 -137 100 49 75
6112 75 -25 21 160 56 -51 -38 15 -34 -157 -54 -57 150 -28 -90 -14 51 37 104 172 42 88 63 51 -9 52 -212
6138 -212 -24 8 -262 -43 -113 85 8 64 31 -97 206 144 3 79 -163 33 -85 -5 2 95 -53 38 -72 -54
6162 -54 40 -73 198 -59 -49 -125 -47 81 -3 53 -105 -94 51 3 282 97 49 6 1 65 -44 32 -213 -101 -153
6187 -153 -167 -35 9 105 126 -7 -7 200 59 -71 -183 121 144 62 -69 25 27 253 -208 -195 -79 52 -63 90
6211 90 19 -44 57 61 -155 -46 21 154 113 29 299 -143 -135 107 -70 45 247 -115 -177 -22 113 -82 -38 -166
6235 -166 113 -255 -174 39 -20 -4 36 -211 210 -142 26 45 -223 25 -145 -2 -118 138 74 92 51 249 212
6258 212 46 -6 -171 7 -254 -33 -27 -64 -175 -19 138 0 -130 256 -82 6 -77 78 151 68 -79 -60 75
6281 75 211 29 304 -45 39 -185 136 97 -187 -303 -8 87 -117 168 -90 -175 -88 -155 -82 117 -138 87 -140
6304 -140 -158 130 100 -71 94 -125 -14 205 -1 82 150 -206 -114 49 3 116 155 -65 160 -92 -7 92 8
6327 8 11 -14 -98 -249 30 -61 -23 -5 65 -225 124 87 56 -161 144 -117 54 -53 115 -5 24 142 -2 205
6351 205 -180 19 -84 -151 -88 180 -50 -22 200 -8 -28 -25 -198 -123 36 -81 22 11 -51 -283 68 -4 19 -49
6375 -49 48 175 97 156 29 -61 -57 1 -62 -87 24 87 99 -17 -128 14 -138 58 -80 -28 146 228 102 -150 31
6400 31 -120 56 -70 -33 -143 -12 33 15 -147 -69 -100 77 82 -70 -38 -161 156 -106 -41 198 44 -16 -4 -132
6424 -132 87 64 65 -5 96 -59 -217 83 119 17 286 47 -17 -74 60 -196 -158 -96 123 62 59 -133 -167 -82 -52
6449 -52 -142 20 -9 130 113 -95 -122 -61 -187 -78 -115 -69 124 58 -47 -126 -115 112 123 -141 87 -146 -81 65
6473 65 147 40 -114 -80 -139 5 62 194 -3 67 39 -214 -31 -3 241 -63 -27 -98 166 13 -163 -12 71 -167
6497 -167 -19 114 45 -22 -12 -181 -29 28 151 -36 -65 -107 -79 115 -200 220 46 -17 -85 -66 26 -40 16 94 17
6522 17 74 -4 -38 168 128 -55 75 92 192 68 -192 41 -16 9 90 -64 88 -98 94 174 -160 -10 -119
6545 -119 -39 -84 14 -5 -101 -57 -133 -14 72 -32 130 151 68 195 -102 -31 -267 125 176 155 -23 -204 135 4
6569 4 -21 -44 199 -165 106 -131 245 18 -7 -99 113 66 -46 159 102 11 -120 -149 -11 95 24 86 -30 -223
6593 -223 137 -101 -137 57 74 94 -58 -244 30 167 -8 -172 -73 -60 167 4 19 157 -232 253 45 30
6615 30 21 -67 26 68 7 6 -1 19 240 22 -111 -40 -10 27 -49 -125 76 154 92 117 100 3 -130 142 -64 -96 125 -234
6643 -234 118 66 110 -34 -74 43 17 -117 139 -70 -156 200 -103 -97 -150 -100 17 7 -56 -96 26 -94 82 72
6667 72 -3 135 -133 -183 2 -28 -102 -4 -13 -43 5 122 -25 210 -163 45 -183 -5 19 23 -171 35 -111 14
6691 14 -70 -112 -50 148 -89 49 143 112 18 -61 25 -152 -112 -119 96 208 125 87 9 2 -110 98 86 165 -96 -87 -148
6718 -148 -4 77 -23 127 -152 -101 129 88 -14 103 160 64 81 -21 19 -30 76 95 48 -172 -88 84 -172 142
6742 142 -80 210 -132 -31 245 19 -153 3 -15 5 -3 41 122 -20 133 -17 -75 116 -150 5 -14 -56 91
6765 91 23 19 -195 223 75 94 54 45 15 52 -42 -165 -96 57 -203 -72 177 -10 183 -68 -30 -20 78 -10 193
6790 193 -28 150 -113 15 83 -91 31 -46 -40 -16 29 40 174 -50 -103 -90 121 60 200 41 -3 -58 103 33
6814 33 193 16 -144 4 80 -12 -14 -36 43 -320 60 70 137 -147 -55 138 103 -127 124 19 50 204 -101 -91
6838 -91 -146 14 -114 -43 -20 -122 102 56 44 61 43 -23 -128 97 -190 82 -57 4 42 62 21 0 -239 57 182
6863 182 -13 199 12 32 -84 20 -225 165 22 31 -27 -243 -129 -75 -209 -53 -68 46 92 150 -18 47 60
6886 60 85 -21 -118 55 48 -136 29 71 217 207 63 12 62 173 78 44 -15 29 -246 -191 68 -32 -11 -116 -109 -165
6912 -165 110 -100 -14 113 153 69 -181 -11 -33 -220 -196 -109 76 49 -21 92 -95 196 -120 83 2 -211 -118
6935 -118 -24 107 166 73 -79 108 -12 30 50 -154 -38 -157 42 57 -251 -11 126 -81 -135 22 -185 24
6957 24 -71 -233 -42 -161 40 57 -134 -97 -44 -57 -44 -36 -9 32 189 25 -158 -275 48 -81 61 -21 2 -41 104
6982 104 50 20 -28 -44 23 -117 41 -163 99 -9 141 39 50 48 153 -100 79 -29 -210 -173 -64 128 0
7005 0 80 35 130 -99 36 -95 -101 112 -35 -23 -46 157 -84 -18 -53 152 197 -4 192 -17 23 21 39 146 68 -82
7031 -82 55 122 113 44 205 -93 66 -17 62 -118 51 -3 47 129 -10 -67 -27 9 72 42 94 45 21 -44 28 -89 -211
7058 -211 111 -148 -71 240 24 -183 -275 60 96 -140 111 -72 31 85 59 -237 130 -228 150 61 -102 86
7080 86 -241 -37 106 -57 -52 19 -188 -148 -54 -146 257 97 69 113 -63 -51 -88 22 -68 240 -13 101 102 -114 -74
7105 -74 53 -52 106 -60 21 -112 14 -34 173 -70 -122 86 -81 135 -9 6 -156 10 47 -182 -220 98
7127 98 -75 -22 10 26 225 23 43 41 -79 95 -175 119 -99 -16 67 147 -45 -119 -56 -69 -5 19 -24 29 -51 28
7153 28 -35 -53 -46 -27 63 -61 4 26 143 67 -214 -54 -73 -106 -69 -148 -188 -120 136 -117 -52 98 -9 26 14 32 -106
7180 -106 10 -57 -13 -179 50 171 -107 -39 30 124 -132 20 135 72 94 -145 23 198 149 51 -140 39 31 -216
7204 -216 97 -5 -64 -183 43 -1 -2 -103 -121 153 191 -100 121 135 89 240 126 34 34 -131 -60 -134 -292 -77
7228 -77 -44 199 138 -7 -166 -152 90 -3 20 -47 95 192 -70 -31 149 -140 -4 -11 -44 252 231 140 110 74 17 -33
7254 -33 135 17 156 -24 164 171 -18 203 -60 -139 -69 -71 -69 89 -43 -65 259 -91 -40 -62 110 -8 -190 88
7278 88 -129 -156 20 208 -43 53 8 -87 -180 54 -155 139 -13 -11 168 248 30 55 38 106 128 -27 132 83 -60
7303 -60 -232 183 7 1 -81 -103 -30 -105 -71 -112 -118 71 15 294 -25 -192 -74 101 -77 -116 57 117 187 -77 236
7328 236 83 -28 138 83 34 -187 181 58 -27 -17 -45 -320 -82 -111 220 -2 -35 45 -223 257 -59 -73 -97
7351 -97 -32 17 30 -173 -132 -68 75 119 -126 66 60 -13 15 -161 135 62 26 -121 163 224 -41 88 197 -68 199
7376 199 -98 -162 67 9 -40 44 42 28 -87 -293 125 112 -9 -201 -75 34 256 -63 -142 -100 109 52 123 13
7400 13 211 37 18 106 0 -50 -164 81 -92 -48 -47 -137 -7 -141 -70 28 -83 -68 204 -143 -7 101 -56 -75
7424 -75 93 66 -56 59 6 66 -221 4 -63 -266 55 -48 -166 156 289 -10 88 146 -171 116 -27 -67 -137
7447 -137 9 -7 -313 -48 193 -63 -164 -44 -70 44 48 -22 163 -43 -60 179 -66 -181 174 59 123 247
7469 247 70 -47 -17 30 31 99 -104 49 -69 -38 -8 -80 22 4 -40 200 132 -117 29 231 -111 -51 82 112
7493 112 37 115 -31 138 -126 16 87 -84 89 241 -104 -197 53 -285 -67 47 69 -112 99 -84 98 303
7515 303 -50 -108 -48 99 40 -32 204 84 -185 -8 -3 -114 -5 99 -70 -25 82 149 -72 52 45 119 50 -129
7539 -129 -164 13 196 147 -24 201 -78 40 40 76 -184 125 242 -143 8 -125 -68 -158 -114 94 69 -57 151
7562 151 67 186 0 -88 72 130 99 39 -111 -17 98 -16 79 -2 253 51 -126 33 33 -133 39 59 -85 -130
7586 -130 23 32 122 -6 -108 84 98 99 24 142 -123 -52 -189 -37 34 -220 176 -63 -12 44 44 -1 81 222 84
7611 84 -1 13 79 163 -67 156 68 35 128 102 -15 -178 -144 118 7 14 48 -21 -51 260 -98 -13 -48 47 -35 88
7637 88 -159 -88 86 -278 22 -14 196 257 25 -59 -21 -22 70 -6 -93 -182 -78 131 -212 36 62 -26 -65 6 168
7662 168 91 -24 175 106 5 -49 -19 -4 20 147 74 49 -104 54 -252 70 51 -43 -23 -9 97 23 -192 57
7686 57 36 -51 -21 116 -146 -101 60 -70 14 -145 58 -3 15 74 -94 -133 388 -128 -350 -132 -71 -13 -83 -55 -212
7711 -212 69 -52 -17 33 -309 40 6 -18 19 141 -99 -14 198 -68 148 -258 -55 72 -180 30 147 0
7733 0 12 -36 -108 -86 -99 -72 -57 -136 -173 123 -273 -74 -25 -5 60 -160 25 36 23 -129 53 67 59 56 141 -213 -81
7760 -81 77 22 -20 59 111 -149 25 -41 -110 144 -135 -53 48 -166 -234 68 -103 -221 -63 62 -250 54 -67
7783 -67 -84 -22 -16 -94 135 -34 -1 344 -19 97 -55 -22 -125 -28 -31 -21 44 184 141 -55 -166 86 -77 -27 150
7808 150 9 -134 -40 38 -68 63 -154 116 -46 -5 -250 57 -395 -68 140 -117 30 -40 -35 -125 -99 36 40
7831 40 -9 -41 -67 -41 -132 172 191 -73 -65 -53 -93 -72 -213 -77 93 41 -66 -62 56 -94 143 -6 63 -62 25 215
7857 215 -83 16 -86 14 -23 129 -187 -146 -260 -89 -102 -131 110 -28 140 71 34 -77 108 -110 -25 -80 76
7880 76 12 55 171 61 118 70 -151 -191 -130 37 -58 -46 -46 22 -10 43 18 108 -54 111 -6 -22 -149 -34 -29 -20 -221
7907 -221 -11 -163 -8 -42 -73 250 -104 -4 -228 -178 1 -53 5 -68 -154 150 36 75 21 178 -51 -16 -15 70
7931 70 105 -14 -26 36 -137 -200 -25 21 -20 -85 -79 25 -115 80 5 40 -46 69 166 -75 -82 -93 -49 -17 -34 171 -9
7958 -9 -43 -27 -123 -80 26 65 5 39 -181 -160 98 -51 55 -88 -41 161 178 75 -69 -30 -24 32 19 -116 80 -53
7984 -53 -210 213 -23 -101 38 32 37 -37 -44 -77 -161 129 211 -16 -96 6 154 -26 -48 83 -74 -24 18 -122 -1
8009 -1 214 -10 -8 -66 0 135 -195 24 90 -2 86 -38 102 -32 -149 17 18 141 111 11 30 59 55 132 61 -39
8035 -39 176 78 -27 44 54 2 -95 39 10 -128 -80 -22 28 178 105 10 134 -17 -109 0 -140 -100 34 -24 -103
8060 -103 17 57 -222 -45 -30 1 60 60 29 133 -4 41 -72 13 25 31 -26 23 44 -68 -77 -27 141 202 61 -75
8086 -75 158 60 -74 61 96 46 -16 -35 -22 -19 110 147 -27 65 -177 -53 0 -50 15 41 -26 -131 -103 96 46 -103
8112 -103 17 117 68 -61 59 -93 83 45 -33 179 80 10 135 47 -135 68 22 64 16 -74 235 -75 93
8135 93 210 -46 124 -16 5 86 56 203 -148 -131 45 -114 -92 11 129 112 -34 -152 -184 -38 88 117 -141
8158 -141 -62 19 20 -192 201 -134 -15 123 -126 -90 -35 76 236 -28 61 170 -129 -45 3 192 -27 -5 47 -247
8182 -247 -97 5 297 143 -68 -73 -115 -68 -122
8191a22
$$ Imaginary data points
##PAGE= N=2
##DATA TABLE= (X++(I..I)), XYDATA
0 0 0 0 0 0 0 0 0 0 0 0 0 0 0 -7 8 -8 8 -8 10 -16 16 -23 24 -31 33 -40 48 -55 63 -72 81 -93 106 -120 135
35 135 -152 169 -192 214 -239 265 -295 327 -361 401 -443 489 -540 593 -656 720 -795 876 -967
54 -967 1070 -1184 1313 -1463 1635 -1838 2084 -2381 2758 -3249 3916 -4882 6416 -9245 16274
69 16274 -76175 -98845 -55327 -91405 -15245 -16403 17262 59097 41505 76677 83111 -4976 18134
82 18134 11652 -40557 -17911 -39010 -57675 -10840 -34913 498 58621 13508 29428 62353
94 62353 23374 48259 37314 -3296 19327 -20073 -37134 18104 -19254 -30249 5470 -23639
106 -23639 -2030 17950 -10792 22333 3257 -31827 22592 4239 -23128 13844 -20334 -26311
118 -26311 5421 -22248 -847 4999 -35975 2709 6350 -16200 28335 5969 -12877 26967
130 26967 1 5651 32819 -12864 -3752 5052 -27572 6970 -1371 -33930 3199 -13442 -20437
143 -20437 26148 3419 4990 27591 -1816 24637 35835 -2906 21332 6788 -26609 8011
155 8011 -8452 -23283 1471 -29428 -17750 14973 -13036 10866 24043 -10286 15289 15483 -3031
168 -3031 20581 -11267 -23224 8092 -24444 -16360 13531 -21332 -8973 6996 -9417 19043
180 19043 7923 -11764 19230 -6956 -15162 22132 -7579 -12021 7789 -14307 7276 13826 -9751
193 -9751 18871 5155 -15806 22174 4974 -9091 13375 -12933 -6612 11544 -14661 5537
205 5537 6931 -22958 6468 4554 -12596 13360 -4637 -9764 15380 -7023 5578 21774 -11987
218 -11987 3658 10952 -13698 8042 -466 -18311 3368 -14117 -11274 14694 -11960 -3660 14460
231 14460 -11322 7557 15249 -8015 9332 -954 -11599 14420 -5953 -7946 14309 -13112
243 -13112 -4517 14896 -8834 4289 5405 -13989 8319 -1234 -10564 14817 -6832 -9288 16264
256 16264 -4430 2811 14585 -9156 6076 5234 -12904 10716 -1460 -16200 8106 -6759 -7282
269 -7282 11517 -8791 290 8392 -13159 7372 7654 -13814 7161 29 -10250 10122 -4067
282 -4067 -2446 11073 -11296 1965 12278 -11696 4521 6396 -12003 6623 -519 -6952 9891
295 9891 -8494 -4773 11555 -10610 748 10248 -10832 4707 6237 -6361 11946 1052 -4882
308 -4882 13553 -5730 -3665 10981 -11291 -2979 4538 -13459 2810 1483 -10328 9378 -1225
321 -1225 -5985 13197 -3912 -2873 9961 -9079 376 4682 -11832 4683 774 -11050 9450
334 9450 -443 -6663 10763 -3622 -1729 7825 -8894 2439 4589 -11997 6497 3356 -9564
347 -9564 9705 2241 -2819 10881 -2569 2570 9372 -8604 4125 6286 -12419 2781 557
360 557 -10839 4079 -4625 -5942 7041 -8112 -244 10550 -8086 2984 7059 -8308 5101
373 5101 362 -7718 6657 -6337 -6304 9395 -5661 -599 9700 -5557 4216 5687 -6157 7051
387 7051 -1661 -10563 6733 -4510 -6320 8750 -3412 2079 9936 -1526 10243 7969 -6417
400 -6417 7186 -1550 -11637 2857 -8416 -11260 840 -9345 -334 7513 -4685 8232 7587
413 7587 -4775 10127 2592 -7401 4294 -7457 -7608 3807 -7624 241 5949 -6847 7075
426 7075 7070 -4400 8090 -300 -7642 4495 -6067 -4351 5490 -8619 500 7952 -3939 8255
440 8255 7522 -3929 7390 -436 -4552 6687 -7327 -6393 3899 -9234 -1016 5723 -6121 3618
454 3618 1577 -4675 8845 -603 -4797 7850 -5234 -3571 7923 -3684 1182 3335 -6656 4828
468 4828 1303 -6508 6544 -3621 -8157 5484 -3433 -2198 4932 -6365 1861 4487 -5483 7324
482 7324 2900 -6897 6362 -107 -2449 7302 -3719 -1255 4844 -7068 2478 4247 -8592 1457
496 1457 -465 -6353 6034 -1159 -2239 7309 -4070 1649 9735 -3381 2567 3643 -6939 2898
510 2898 189 -5705 4031 -5466 -5450 6167 -4171 -259 6229 -6077 999 3613 -4780 4418 -1264
525 -1264 -6994 4500 -3338 -3024 7303 -4146 -1052 6072 -3291 4590 4854 -4903 4262 -971 -5796
540 -5796 5785 -3455 -5712 3277 -6050 -788 5510 -3891 4451 4187 -3869 8399 4121 -2586 6216
555 6216 -3023 -4241 2979 -6933 -2263 659 -10129 467 2926 -4650 6478 2770 -2146 7058
569 7058 -164 877 6357 -6417 -1744 2714 -7531 1289 1893 -5994 2700 -666 -2155 6989 -2886
584 -2886 -2389 4502 -6231 -908 4415 -5514 918 1123 -3906 6577 1713 -1439 7070 -2415 -2067
599 -2067 5533 -4147 -573 1493 -6857 1996 1389 -4103 5713 -17 -3176 5779 -1579 -868 3917 -6202
615 -6202 -935 1405 -6133 3472 1662 -5351 4553 478 -1601 6545 -1889 -1158 2681 -6258 236
630 236 2250 -6541 1399 794 -4074 5822 2099 -509 6242 -1667 867 5789 -4101 898 1615 -7137
646 -7137 608 205 -4542 2897 -2086 -2700 5299 -2257 539 4659 -4943 -355 1966 -5131 2046 -724
662 -724 -5073 3567 -1520 -1220 6851 -1428 -47 4860 -2940 2066 2299 -4895 1686 -1660 -5079 4313
678 4313 -811 -2129 4998 -1358 1910 5581 -1854 3307 1936 -5336 2705 -325 -5371 2117 -2997
693 -2997 -3391 3144 -2635 793 3558 -4088 1775 2158 -4515 2635 -623 -4776 2419 -2033 -1189 4179
709 4179 -2869 631 4222 -2905 2913 2762 -3782 2405 -595 -3151 3355 -2632 -1783 3464 -3075 672
725 672 4330 -2313 2241 1964 -3194 3558 30 -2756 3793 -2760 -2583 3742 -3333 -518 1994 -4138
741 -4138 1221 563 -3624 3205 -938 -3244 4049 -1638 -1198 3873 -2463 297 2170 -3154 2823 851
757 851 -3753 2974 -453 -2765 3536 -1558 -1025 2546 -3303 765 2193 -4013 2010 955 -3439 3337
773 3337 -37 -1643 3681 -1773 -298 3553 -3116 916 2327 -4035 1572 706 -2973 2677 -1425
788 -1425 -2212 3279 -2597 -489 3343 -3313 498 2079 -2872 2396 403 -2603 3192 -1239 -1913 3541
804 3541 -2425 -1246 2452 -3427 448 1394 -3348 2250 112 -2437 3946 -659 -1432 3771 -1850 -136
820 -136 2600 -2581 1546 1405 -3132 2687 410 -2772 2796 -1308 -1958 2509 -2672 -744 1904 -3654
836 -3654 1106 1460 -3170 2654 440 -1903 3270 -911 -894 2983 -2581 123 2339 -3662 1313 1325
852 1325 -3307 1926 -209 -1946 2827 -1634 -874 3081 -3056 330 2649 -2847 1336 1200 -2331 2504
868 2504 -503 -1745 3166 -1746 -1189 2828 -2988 -336 1768 -3032 1377 617 -2579 2727 -483 -1791
884 -1791 3401 -1056 -700 3171 -2048 523 1669 -2921 1529 179 -3431 2044 -1030 -2657 2379
899 2379 -1820 -813 2510 -2706 962 2159 -3084 2014 826 -2466 2573 -327 -1273 2985 -1234
914 -1234 187 2926 -2379 1168 1990 -2989 1541 68 -2944 1849 -928 -1609 2553 -1821 157 3140
930 3140 -2139 1132 2114 -2579 1476 -13 -2639 1775 -1702 -2351 1963 -2538 -557 2181 -2510 1011
946 1011 1475 -2532 2232 -27 -2181 2832 -852 -1398 2602 -1357 46 2437 -1998 1548 1597 -2284
962 -2284 2369 108 -2535 2336 -1120 -1492 2332 -1729 160 2284 -2039 1741 1610 -2126 2594 576
978 576 -1859 2781 -1084 -1273 2217 -2107 -179 1821 -2929 822 978 -2776 1446 -183 -2449 1958
994 1958 -1573 -1248 2137 -2220 177 1916 -2646 1047 1185 -2242 2052 -408 -1742 2292 -1408 -1184
1010 -1184 2164 -2080 -105 1839 -1887 1669 1600 -1356 2967 544 -915 3133 -877 -573 2503 -1615
1026 -1615 -15 1661 -2372 977 337 -2579 2053 -445 -2076 2044 -1482 -1299 1803 -2265 -22
1041 -22 1045 -2606 1347 698 -2373 1866 -175 -1713 2058 -1336 -787 1829 -2511 252 1481 -2418
1057 -2418 1228 396 -2070 1925 -191 -1103 2547 -965 -199 2382 -1799 873 1829 -1791 1553 898
1073 898 -1810 1979 -563 -1298 2181 -1643 -686 2101 -1961 505 1396 -1765 1762 645 -1620 2402
1089 2402 -413 -1266 2171 -1568 -817 1365 -2312 -189 725 -2455 844 -379 -2208 1455 -863 -1465
1105 -1465 1853 -1389 -208 1775 -1865 763 1221 -1867 1641 416 -1625 2047 -448 -882 2054
1120 2054 -1213 140 2019 -1483 997 1403 -1668 1564 507 -1285 1939 -607 -472 2220 -1305
1135 -1305 234 1792 -1936 523 788 -1981 801 -293 -1868 1179 -1333 -1477 1406 -2069 -351
1150 -351 1354 -1997 727 918 -1483 1540 82 -1116 2098 -903 -661 2055 -1537 110 1457 -1708
1166 -1708 692 661 -1444 1654 -74 -1120 2129 -351 -265 2096 -1096 564 1523 -1555 1074 758
1182 758 -1511 1246 -317 -1592 1343 -1025 -919 1025 -1779 -85 1102 -2005 779 701 -1687 1424
1198 1424 124 -1235 1628 -970 -468 1384 -1590 68 1334 -1812 848 338 -1622 1293 -394
1213 -394 -1275 1672 -833 -487 1635 -1226 444 1222 -1329 1387 513 -1318 1569 -214 -1055 1651
1229 1651 -1054 -454 1208 -1618 84 566 -1649 936 230 -1384 1570 -277 -834 1924 -950 -193
1245 -193 1320 -1313 577 809 -1676 944 468 -1560 1433 -405 -843 1338 -949 -114 1044 -1324
1261 -1324 775 741 -1491 1247 366 -1175 1621 -41 -595 1426 -1000 -30 1140 -1793 380 346 -1764
1278 -1764 885 -250 -1273 1319 -392 -490 1562 -1152 117 1213 -1146 787 696 -1484 1283 -256
1294 -256 -1196 1310 -879 -809 1343 -1255 -227 944 -1381 534 585 -1296 1191 -34 -951 1445 -439
1311 -439 -499 1453 -908 198 835 -1143 711 447 -1415 1117 -330 -953 1235 -535 -533 1095 -911
1328 -911 164 918 -1244 975 535 -910 1167 -34 -861 1448 -910 -471 1289 -978 92 838
1344 838 -1230 638 226 -1342 1052 -331 -846 1356 -780 -34 1390 -770 606 977 -1100 992
1360 992 339 -866 978 -402 -1047 1117 -923 -714 864 -1341 7 666 -1126 677 504 -741
1376 -741 1480 -130 -730 1379 -850 -532 1010 -1360 -81 352 -1235 547 300 -1152 1180 -310
1392 -310 -669 1267 -839 -248 817 -1221 286 635 -1361 778 355 -788 1292 -294 -211 1363 -698
1409 -698 -41 977 -1031 335 460 -972 538 -45 -1114 977 -553 -294 1362 -756 199 1321
1425 1321 -805 582 818 -1106 750 -304 -1078 620 -1021 -823 756 -1113 -399 679 -861 730
1441 730 531 -803 993 223 -723 1169 -599 -460 991 -973 -112 703 -1272 766 684 -971 880
1458 880 -99 -793 986 -449 -78 1133 -729 75 839 -832 751 759 -913 1161 86 -564 1001
1475 1001 -527 -691 872 -969 -62 501 -1149 253 301 -1115 811 -346 -465 921 -569 -46 952
1492 952 -945 332 737 -962 439 268 -960 1060 -243 -715 934 -719 26 911 -680 199 709
1509 709 -765 836 278 -560 1101 -50 -513 931 -438 -364 695 -906 23 89 -1249 326 48
1526 48 -1042 729 34 -488 870 -435 -84 911 -596 385 550 -929 759 74 -750 898 -172
1543 -172 -323 858 -564 -342 819 -867 170 525 -984 749 158 -717 742 -31 -535 950 -436
1560 -436 -197 708 -987 55 465 -703 605 -47 -787 720 -395 -685 897 -540 -91 947 -894
1577 -894 74 592 -843 919 107 -487 952 -189 -213 987 -671 55 538 -892 217 438 -880
1594 -880 589 -48 -518 921 -210 -129 917 -467 134 858 -923 501 56 -779 627 -205 -677 505
1612 505 -429 -298 796 -472 -43 763 -678 471 327 -747 694 38 -662 600 -510 -308 649
1629 649 -664 218 517 -542 498 411 -722 575 -225 -733 685 -602 -646 398 -682 98 642 -418
1647 -418 515 547 -221 819 -75 -656 612 -544 -346 489 -831 -80 358 -805 469 106 -593 963
1665 963 124 -310 1120 -356 64 765 -810 -44 636 -1022 274 -35 -689 504 -258 -636 647 -385
1683 -385 -19 708 -647 269 483 -703 489 97 -749 846 -81 -122 739 -379 -62 530 -560 196
1701 196 447 -929 251 -4 -586 539 -270 -242 805 -314 -62 533 -445 288 447 -572 533 93
1719 93 -678 777 -470 -458 574 -696 -209 390 -647 166 217 -743 565 267 -459 504 -219 -224 702 -467
1739 -467 54 273 -567 300 373 -482 423 42 -453 699 -374 -198 732 -515 -151 359 -606 355 -70
1758 -70 -692 826 192 -262 703 -94 -347 671 -719 -46 125 -1031 249 -44 -815 408 115 -442
1776 -442 986 -228 -262 547 -262 13 480 -535 181 43 -846 335 -200 -589 341 -367 -337 642 -677
1795 -677 -3 365 -594 265 530 -439 706 44 -290 889 -197 -132 450 -507 11 276 -613 218 -70
1814 -70 -740 416 -156 -494 804 -230 -354 215 -745 19 326 -399 233 20 -547 428 -177 -380 701
1833 701 -505 -81 528 -729 175 203 -628 376 4 -441 603 60 -109 691 -384 132 708 -685
1851 -685 229 427 -605 311 -6 -679 443 -140 -366 707 -447 89 561 -415 253 351 -658 405
1869 405 -52 -752 632 -265 -254 654 -277 39 291 -459 170 300 -621 473 -87 -751 463 -315 -189
1888 -189 663 -399 -203 638 -414 414 502 -460 368 -131 -339 414 -407 -353 429 -584 45 331 -443 280
1908 280 378 -476 444 -78 -608 524 -524 -306 331 -471 6 461 -672 185 215 -459 407 -355 -405 677
1928 677 -251 -225 560 -416 15 580 -287 176 136 -579 449 -103 -304 493 -360 -98 391 -443 -62 298
1948 298 -435 153 143 -690 345 -211 -300 821 -359 54 454 -401 155 450 -394 395 40 -593 354 -148
1968 -148 -478 357 -374 -177 711 -496 178 420 -496 306 120 -355 352 -133 -100 485 -245 -244 419 -575 -23
1989 -23 452 -570 399 378 -385 410 235 -204 426 -150 -231 526 -458 103 181 -419 205 66 -571 629 -59
2010 -59 -355 625 -165 -31 432 -500 -188 6 -628 106 -184 -517 508 29 -139 706 -34 66 626 -289
2030 -289 143 277 -750 246 -203 -779 274 -252 -497 301 -175 -130 628 -281 344 168 -393 326 84 -209
2050 -209 417 -141 -489 481 -400 123 468 -401 364 374 -351 459 -170 -333 535 -418 -773 118 -458 -102
2070 -102 243 -280 191 229 -417 511 66 22 658 -99 -229 294 -501 -253 53 -789 119 -165 -549 231 177
2091 177 -275 653 -18 -50 622 -33 -75 164 -545 -51 100 -537 338 -204 -185 406 -50 45 655 -212 -10
2112 -10 402 -279 338 128 -541 391 -238 -552 272 -190 -31 260 -177 246 462 -435 360 116 -581 536
2132 536 -85 -241 402 -444 97 357 -387 147 299 -500 385 242 -495 339 -244 -329 434 -257 25 352
2152 352 -239 2 258 -407 448 353 -277 348 -77 -215 497 -164 -169 337 -421 166 288 -516 242 138 -435
2173 -435 499 -42 -139 142 -395 144 382 -366 230 343 -317 352 -59 -255 450 -36 31 482 -420 -82 110
2194 110 -436 171 196 -425 206 136 -303 351 -67 21 508 -146 152 599 -218 464 185 -529 247 -114 -167
2215 -167 479 -3 -161 644 -340 -264 224 -285 238 434 -527 214 -138 -171 395 -128 -405 356 -322 -231 340
2236 340 -268 246 189 -222 218 178 -231 464 -103 -142 401 -288 193 430 -416 140 62 -207 306 12 120
2257 120 488 -131 -264 323 -352 124 222 -493 342 35 -340 304 55 -75 505 8 159 428 -200 -21
2277 -21 263 -322 88 1 -439 149 97 -99 175 -41 -91 344 -402 226 229 -395 240 38 -210 281 -278 52
2299 52 358 -186 -152 175 -241 19 110 -365 300 178 -167 428 -98 -407 325 -260 -64 57 -457 172 331
2320 331 -359 229 29 -221 198 -17 -199 452 -140 33 159 -367 95 100 -445 71 149 -382 223 -20 -33
2341 -33 393 -35 -13 202 -331 222 -34 -412 240 61 -230 356 -159 -189 158 -303 -133 300 -230 263 58
2362 58 -251 166 -55 -48 112 -112 -173 282 -395 70 130 -173 -5 228 -146 251 47 -176 333 -76 -213 371
2384 371 -313 419 273 -477 94 129 -217 209 -186 -371 231 -112 85 432 -210 105 530 -278 235 -35
2404 -35 -311 360 -121 -324 328 -65 -189 154 -130 -47 358 -75 -30 281 -249 208 -154 -209 51 -77 61
2425 61 -7 -99 -67 328 -233 231 198 -39 342 153 -212 117 -345 -304 313 -188 19 350 -186 64 207 -324
2447 -324 217 -94 -332 163 -53 82 353 -389 74 156 -299 171 -16 -302 317 -108 -105 -23 -273 11 221
2468 221 -81 -236 213 -258 186 204 -132 409 35 -293 168 -231 -228 284 -305 -132 162 -257 138 230 5
2489 5 398 -175 -139 503 -111 -187 432 -97 54 132 -340 111 -32 -129 339 -217 45 298 -200 91 98 -264 -82
2512 -82 311 -104 249 335 33 329 85 -109 383 -68 131 194 -327 32 119 -208 255 -26 -1 203 -69 7
2534 7 263 -135 -317 80 -269 230 281 -315 142 266 -195 239 -60 -42 496 -156 -152 115 -355 155 95 -203
2556 -203 217 201 -417 122 87 -16 402 -346 -69 149 -257 -38 88 -210 -46 -182 -103 36 -110 -140 49
2577 49 -105 51 221 -218 153 102 -156 232 54 -213 274 -150 -119 58 -72 -27 152 -138 -241 42 -33 218
2599 218 -94 -156 196 87 -76 149 -58 76 38 -209 144 3 -283 176 -13 -69 63 -176 -138 131 -154
2620 -154 111 122 -248 73 253 -247 75 -122 -267 201 -239 -96 311 -36 -57 333 -94 36 87 -259 178
2641 178 -54 -78 94 -73 -94 270 -14 -18 243 -261 184 38 -314 110 41 20 258 -22 -51 59 -150 -74 185
2664 185 -74 -16 -9 -141 114 52 -19 168 -154 -1 117 -195 40 223 -319 25 -10 -82 112 -134 -60 274 -132
2687 -132 -95 226 -141 103 -137 29 121 36 -105 69 15 -31 268 -316 -83 95 -34 6 271 -229 239 -140
2709 -140 -216 180 -90 -274 438 -153 36 325 -92 -91 46 -61 90 -28 -124 76 -106 26 79 -169 -132 93
2731 93 -153 266 183 -114 121 -27 -15 155 -68 149 -13 -114 -135 -105 -100 272 235 -29 -110 -250 -214 252 -216
2754 -216 -36 10 -268 -134 152 -244 163 340 17 201 83 -112 68 -65 104 12 -98 163 151 -65 -49
2775 -49 -19 -80 274 -104 -83 263 -108 83 62 -195 -49 218 -88 39 146 -209 -96 -84 -81 219 -11 47 51 -150
2799 -150 -2 180 -318 138 142 -203 123 26 -46 235 -129 -16 -164 -71 180 -39 -363 149 38 -274 48 -36
2821 -36 -79 127 -133 18 292 65 94 53 -47 13 -68 -48 230 -7 21 148 -196 52 195 -148 -51 60 -344
2844 -344 -20 76 -50 243 105 5 58 -122 -54 224 -9 52 98 -190 97 -133 -124 60 94 -14 104 -183 -145
2867 -145 63 118 190 46 128 84 -255 -115 173 6 5 233 -220 85 106 -215 -48 31 140 72 -21 -259 -59
2890 -59 -96 -71 -37 -384 48 -13 -91 317 87 -96 73 -98 280 121 170 -93 42 -55 -56 152 -111 129 -88
2913 -88 -56 122 78 -262 120 -39 -54 107 -146 263 -25 -143 -104 138 -162 -67 13 132 98 -77 77 -43 -178
2936 -178 81 145 -185 -120 -71 -92 -50 82 -42 -33 -184 -34 220 -187 144 109 -277 -54 63 -229 65 28 240
2959 240 230 -146 175 115 -115 110 103 -50 35 91 -45 78 -42 -185 58 -150 -12 171 -81 -46 -63 -318 -52
2982 -52 112 -72 -15 160 -136 40 -122 130 0 -53 25 -8 -262 129 -79 -47 47 198 -142 -32 -38 267 205
3005 205 -272 -185 -1 -147 17 161 -108 195 -46 -185 -208 -146 40 186 -169 -66 -109 -86 115 255 -159 321
3027 321 -175 -36 204 -36 26 261 -36 312 54 58 208 33 -299 17 76 -292 -28 -28 90 -23 -289 -216
3049 -216 89 -83 86 -148 -204 84 23 -41 260 -147 91 243 -104 -24 -24 -95 22 -71 -138 122 -117 -41 106
3072 106 -179 344 145 -144 26 181 -241 150 -14 116 150 -241 188 58 37 244 -37 -146 14 -88 -58
3093 -58 194 -70 24 204 -69 56 -4 -196 30 38 -61 150 -22 -129 153 37 40 51 -231 88 -19 66 38 72
3117 72 -236 -98 26 -95 30 -161 -68 21 -56 64 144 -34 204 107 -60 -12 16 14 159 -193 -193 237 111 204
3141 204 57 -168 201 29 -206 109 -71 15 -97 -13 16 134 -107 67 -34 -87 166 -143 -186 -53 159 -232
3163 -232 -13 -44 -6 -24 -220 -299 0 -378 -43 -148 -42 46 17 -210 96 -152 22 320 -303 120 47 -324
3185 -324 -234 98 87 106 175 -6 232 -69 -21 108 -109 113 143 -211 268 -192 -15 241 117 -52 109 -62
3207 -62 147 73 -187 217 51 -239 -53 50 -199 244 -20 23 194 -121 -250 -83 -106 306 -33 -87 193 -179
3229 -179 61 -68 -184 25 90 -94 -193 44 -86 -281 160 -1 37 19 -46 104 -6 13 23 20 -39 -27 -215 206
3253 206 221 -161 91 -12 -122 0 -7 -18 3 -199 101 31 96 55 -32 -27 18 106 11 68 27 -79 281 -1 -5 169
3279 169 -11 238 -4 -76 40 -82 110 258 -148 74 370 -74 -30 59 -21 -55 392 -246 17 8 -189 -102 -111
3302 -111 -148 140 -29 -70 37 0 137 261 -148 12 85 -198 -32 193 12 237 78 257 165 -70 36 -30
3324 -30 44 -71 -218 23 88 -122 -230 190 -223 97 -13 -337 233 -25 -36 -17 17 -341 60 -37 58 132 -88
3347 -88 -21 179 -106 170 45 -327 164 -321 -142 241 -220 -50 156 -207 25 45 -193 102 -10 -68 60
3368 60 -122 114 189 -10 154 -59 -166 97 21 -50 10 113 -93 -22 -197 -80 196 -114 -35 236 -218 -34
3390 -34 9 -124 120 21 -42 94 33 120 -116 -2 290 -24 -211 86 -107 -188 185 -90 -154 156 -6 15 120
3413 120 -35 123 211 -34 124 64 27 28 92 -120 106 -121 13 240 -175 240 257 -58 -39 120 26 51 80 121
3437 121 47 -100 21 174 103 -108 -19 2 202 -97 -192 270 -74 -157 235 -57 -51 80 71 2 -14 -208 -25 22
3461 22 -56 211 -63 -6 191 10 -107 38 -198 42 79 -247 126 -54 -49 104 22 25 46 -43 170 64 -19 118
3485 118 156 -98 165 109 -88 205 20 -39 52 -253 43 139 24 166 51 18 75 -67 -254 130 -42 -297
3507 -297 297 -140 -64 257 -146 83 91 -10 47 32 -44 91 20 -124 -173 -103 -41 -3 -105 -25 210 -225 160 3
3531 3 -121 102 -177 103 144 -120 83 34 -182 72 -68 -127 363 8 99 114 80 -181 101 -159 -14 268 -349
3554 -349 -45 60 -138 162 -23 -91 -41 33 -84 181 -71 7 -212 -46 -145 111 -72 -63 174 58 9 -22 -21 -73
3578 -73 89 -129 43 -213 -88 -177 47 22 -57 -184 -68 -223 -13 -29 -68 -72 139 -25 4 163 5 106 -148
3601 -148 -278 72 -195 -70 98 -99 -42 215 -27 68 26 -147 287 99 -129 106 -86 -167 6 -57 95 48
3623 48 -244 102 -145 -91 153 2 -259 -17 80 9 105 68 69 155 106 142 146 -24 -41 -132 101 218 -87 48 117
3648 117 3 -150 -3 -150 23 33 2 -14 -25 -243 191 -239 -141 10 73 -84 60 -263 13 6 75 227 -46
3671 -46 -13 -14 26 -19 62 -25 87 131 101 -96 -118 -135 90 -67 18 216 -362 82 224 -143 -129 214 23 57 30
3696 30 -61 -21 103 -29 77 -79 -41 137 -73 -141 17 -65 -75 -28 1 312 5 -165 17 61 19 70 70 -67 -174
3721 -174 -62 -215 -17 123 177 -31 -74 183 22 -151 63 10 -17 15 -136 -121 -84 -70 73 -31 -72 36 152
3744 152 144 138 43 20 -91 117 18 67 -41 72 -123 -211 -82 -405 71 -179 -106 64 228 162 39 -22 -61 151
3768 151 135 8 -86 -8 37 165 -109 233 -165 93 204 -290 -124 -54 36 -94 94 -93 31 99 -149 -27
3790 -27 227 6 124 -191 -52 254 -224 -74 60 -80 28 69 -226 -18 -42 6 175 -20 144 303 122
3811 122 -47 -49 -30 161 -119 -173 112 -43 6 74 -19 -30 182 -105 -170 245 155 -33 -161 84 174 19 78 -106
3835 -106 -180 -121 175 40 -48 62 -26 34 -11 -225 105 20 -275 51 12 58 95 139 232 52 6 -85 -120 51 57 204
3861 204 14 122 -32 -119 122 -68 -122 -25 24 42 50 9 -73 224 -25 -26 62 -31 -107 23 108 107 -36 92 -48 -113
3887 -113 -21 -160 -66 10 -46 -315 11 -204 88 315 86 19 -100 85 117 -46 -207 44 -31 -43 -32 -26 -18 -9 -261
3912 -261 7 123 -147 91 -60 52 296 -54 -81 84 243 -32 -20 -18 110 -13 77 44 -78 304 125 -55
3934 -55 -81 2 -72 -63 220 -102 32 -10 -74 -88 -201 130 77 90 -78 -46 -87 110 -269 -18 251 50 -150 -59 84
3959 84 -56 23 -136 130 116 27 56 8 -43 -5 -8 -98 10 215 -103 -28 -30 -123 -79 -119 -38 -7 77 -63 -168 -168 260
3986 260 -150 136 90 -252 32 116 -130 103 24 27 -237 6 87 53 -74 -47 -80 109 -220 -42 -34 -62 119 -63
4010 -63 183 111 33 -73 78 22 -9 -151 -45 137 -124 38 93 0 -30 -5 -67 -126 -105 -214 28 -2 -44 193 50
4035 50 77 87 7 128 -10 -55 26 137 -34 -86 -203 -14 93 8 13 203 -48 129 264 -367 233 -99 168
4058 168 -13 -109 -96 -18 -74 -171 -119 -179 48 12 -125 163 -196 104 -63 -169 181 -301 27 -189 50 -9 206
4081 206 136 -189 -65 -7 -93 174 240 105 -9 -86 97 31 -40 213 -64 8 258 66 -134 66 20 2 87 -126
4105 -126 52 -76 -14 -47 56 -36 54 -95 75 225 115 -5 -26 -141 37 239 -12 134 -30 -6 142 -122
4127 -122 -40 20 -186 -66 197 -16 12 191 -196 157 -22 -134 130 -165 -18 -89 38 -204 -4 -141 -27
4148 -27 104 -57 -106 160 -254 142 -6 -61 -64 -70 55 5 -7 -214 -105 -87 161 78 194 -158 -88 -42 7 -74 97
4173 97 -316 -218 146 -105 -89 250 29 79 146 89 -130 12 -288 44 156 -213 259 -105 13 178 104 -93
4195 -93 32 -56 -124 199 -221 4 112 39 160 61 54 273 116 -152 185 -37 -42 -20 41 -138 176 81 -116 187
4219 187 -44 -29 -256 7 26 62 -20 160 -24 -193 127 -69 -3 50 -58 103 14 22 -19 -122 15 -29 -80 222
4243 222 214 -68 79 35 132 182 29 240 207 -141 -93 -22 -112 220 88 139 -66 -54 83 78 35 66 118 -183 -40
4268 -40 113 38 -81 18 -136 -160 65 91 -11 12 -51 -98 -13 143 -64 136 2 -119 -50 114 72 80 -64 46
4292 46 -98 44 -73 -141 93 69 161 131 -91 57 60 34 15 140 -12 -113 -47 -158 98 -277 -64 209 211 19
4316 19 -96 92 139 -146 20 -32 67 -38 104 -107 103 -5 -186 205 18 41 -69 24 24 123 -8 -44 121
4339 121 -214 -78 145 -78 38 9 -45 61 -83 98 -266 213 173 61 -145 2 -49 -162 86 -17 -163
4360 -163 111 -289 -32 18 133 -86 163 -150 161 23 -263 1 111 55 92 -56 -142 140 -164 -84 96 -73
4382 -73 46 253 63 47 227 1 61 -187 -53 -6 62 -36 159 -238 -2 -167 100 14 -133 -104 -85 64 -30
4405 -30 193 43 26 -25 169 -62 63 174 179 -82 -22 224 75 165 127 -30 -141 16 -146 70 -79 -227 85
4428 85 -178 -39 122 -142 -106 286 -55 24 -49 -298 43 -133 -19 52 -6 -69 51 30 -155 -84 182 -95 158
4451 158 -237 8 -81 -141 17 39 155 19 -212 -100 34 -97 86 55 -64 135 103 -46 -25 -131 22 -32
4473 -32 30 88 206 -228 17 -140 -107 -42 -35 -38 -122 -165 -45 145 82 159 -171 -144 -8 -121 -88 -46 -82 -106 114 47
4499 47 23 153 -11 -306 17 -79 44 80 90 -40 34 -284 82 -61 -87 166 103 83 74 -69 130 151 -112 208
4523 208 -133 63 212 -297 132 75 -71 3 192 110 49 -281 -65 85 -41 -168 13 168 -196 -74 -115 116
4545 116 131 -316 46 36 179 -45 -47 -353 -113 -31 -15 184 -8 43 -152 -62 113 17 -146 94 10 144 47 17
4569 17 -2 70 -78 187 212 4 168 121 -54 -79 7 70 218 -58 171 -22 43 19 70 21 18 -105 149 194 -52
4594 -52 -5 187 -235 -32 65 -156 -82 158 -85 44 -13 -111 -94 -149 -102 86 -22 233 124 -170 100 74 -34
4617 -34 76 110 -270 100 79 -191 231 19 47 111 -104 -65 -30 44 99 201 -77 98 -98 -106 136 90 -40 -275
4641 -275 -165 -50 217 15 183 234 -100 111 -40 -192 44 -27 -247 277 -46 81 -132 -91 73 -21 -199
4662 -199 29 127 -332 217 -31 0 56 31 -183 212 96 -45 148 63 212 -122 4 104 198 249 11 31 -148
4685 -148 87 146 97 -80 24 125 72 21 136 -96 -74 155 -150 71 19 -48 42 -35 -197 209 142 -120 -170 -120
4709 -120 152 142 -37 194 76 -12 -86 117 -89 191 10 35 45 -98 6 20 81 -18 -81 222 136 32 -76
4732 -76 -105 -25 104 -170 -49 13 -79 -9 249 -37 -177 177 126 -124 213 103 -18 -102 48 -181 80 -96 -2
4755 -2 -36 11 34 22 -58 90 204 -43 -159 127 168 9 -91 -43 26 -58 57 -45 243 -128 -31 90 9 138
4779 138 -126 251 -243 -22 -81 73 63 22 56 22 -63 -261 84 -191 -1 -32 61 2 73 -94 72 -91 39
4802 39 -182 127 -137 54 57 45 260 -9 72 98 -173 78 187 -89 312 -55 30 87 -126 284 -47 103 -304
4825 -304 -118 -36 -62 -93 44 10 2 124 87 5 -28 -52 -144 -92 -68 -153 32 12 -79 -141 -70 93 43 -45 -118 87 29
4852 29 -121 -187 -296 -34 -145 -170 -192 33 38 43 -10 -56 127 20 29 -43 -65 -22 18 29 51 -122 -95 3 -114 -155 24
4879 24 -112 118 -145 46 41 71 -43 14 -201 240 195 -10 109 9 -189 -237 140 -12 8 -106 67 79 130
4902 130 -20 122 115 -61 43 -23 166 -67 101 212 -42 108 95 12 -166 2 -170 -45 56 -79 -23 -57
4924 -57 -27 -161 -18 -164 165 3 84 309 12 12 14 -69 25 -14 67 139 138 -106 -42 50 44 53 189 161 84 -33 219
4951 219 29 -30 84 54 61 248 -61 58 8 -115 -48 -56 -39 63 -138 -165 153 -36 -107 -29 80 23 -71 -34 75
4976 75 208 6 45 -14 -74 312 94 20 -111 35 -122 3 -111 -96 150 -95 -116 -62 -235 75 -221 -266 -222
4999 -222 -160 -44 -62 -274 -47 -128 68 -108 -114 -43 -87 20 56 156 46 -109 12 -52 112 62 227 225 267 108
5023 108 55 -179 -35 176 -158 -31 35 -161 -224 -183 -266 -68 -72 132 128 -30 -78 107 -78 -32 -44 -93 54 112 89
5048 89 104 -73 -63 37 68 -4 46 -45 99 -105 137 121 -179 -77 271 -87 83 -157 -20 -58 13 54 71 17
5072 17 -152 79 35 -139 -210 -29 -73 60 143 36 227 -75 4 -61 -175 -161 19 -235 16 221 71 55 -75
5095 -75 146 168 -85 -99 19 23 198 -40 197 24 95 -210 -25 -110 133 222 -22 110 -31 192 103 -89 -223
5118 -223 8 -192 -145 42 -122 -139 -120 2 -64 125 -66 -81 -148 -130 -139 30 56 170 1 -110 -156 156 93 55
5142 55 138 -116 90 -382 -51 -96 -104 -8 -129 55 -185 -48 -28 132 9 194 34 -77 -74 -36 58 -54 220 -137
5166 -137 -52 -41 167 -169 78 113 26 -76 -52 -56 17 141 45 60 -126 -77 30 -126 -3 20 -77 -54 -134 0 249
5191 249 83 157 175 -50 -163 -93 36 -36 12 -116 65 -83 149 110 190 -197 78 -38 -127 -88 147 39 -30
5214 -30 138 -57 -8 83 136 -12 164 -56 60 173 64 -34 -44 156 9 -175 2 -67 -51 -122 -34 204 6
5237 6 -33 127 -13 -85 78 72 190 -59 -139 -48 -167 -12 100 -124 225 30 127 -182 47 67 -160 26 -32 -149
5261 -149 -19 -155 95 -44 88 -47 -47 -80 -83 51 -103 -12 -135 17 45 1 -75 2 -62 254 104 41 10 19 -20
5286 -20 -19 -333 5 -28 129 -115 -18 -218 38 -23 -32 -55 -24 -72 -153 34 94 6 -2 -64 20 115 108 120 -140 50 34 -3
5314 -3 10 101 84 37 93 110 25 182 169 -140 77 24 35 131 153 -14 93 5 -69 -85 -125 73 -60 52 -18 -105 66
5341 66 20 76 -68 -40 54 176 -199 -25 72 181 -37 -200 193 -124 70 15 39 -160 -5 49 -38 -146 -108 152
5365 152 -47 -140 -69 36 -76 12 -9 -25 129 -66 -55 59 74 -79 -53 -140 7 -10 -136 189 77 -227 206
5388 206 87 -1 94 -19 242 -87 -178 -24 211 -210 11 -44 106 45 66 113 71 36 77 -188 168 12 256
5411 256 -109 -21 86 41 292 39 -36 40 -104 14 -301 112 56 89 -50 48 -122 15 25 41 115 28 79 -139
5435 -139 -102 7 204 -11 -29 -49 -189 -76 -6 -23 -46 174 68 92 116 -69 41 -113 -74 120 54 282 211 96
5459 96 29 -91 43 134 102 -2 -5 -133 106 201 282 -161 -35 15 -10 33 83 -10 35 -1 -21 6 -19 55 -38 -23 -37
5486 -37 183 -101 213 11 140 143 -21 124 -59 -1 118 129 -102 -65 22 -145 -125 -65 26 -32 -78 193 -8 -6 -8
5511 -8 -22 202 34 44 48 -9 -162 -73 -227 -107 -15 -54 -4 132 -61 211 52 -160 -56 -6 -62 -52 -68 -83 113
5536 113 215 26 -8 -142 18 -24 -13 -49 -225 55 -26 -94 -234 114 -70 -102 5 -53 212 210 -51 107 48 -42
5560 -42 -15 54 -14 -73 136 -108 -156 -172 -19 56 19 137 19 -56 35 -90 -95 168 18 60 84 -36 55 62 -57 38
5586 38 64 -56 -24 6 -171 125 52 -19 -7 -207 -53 82 139 43 -136 -93 -103 -2 -130 -142 -28 6 -17 204 118
5611 118 18 -103 -204 50 -17 -154 109 84 101 159 -170 95 113 129 286 -33 -31 69 156 -22 44 -44 -58 -101
5635 -101 60 85 -102 41 -18 -12 -103 -155 -152 121 111 3 26 -62 -20 8 45 -130 -47 -4 -42 -161 -54 88 -184 22
5661 22 104 54 9 213 -175 -7 -59 -124 26 272 -123 12 154 -30 -53 123 118 -42 19 144 42 153 6
5684 6 -104 115 202 186 -148 -97 -86 -48 -141 245 15 214 -112 108 45 -2 13 -20 -118 114 133 44 179 -22 -141
5709 -141 -158 6 -14 148 180 46 44 25 61 144 39 19 -31 -3 -79 175 0 164 22 -120 26 17 -41 84 -92
5734 -92 -96 108 -12 55 4 3 150 -49 263 -23 73 -135 74 77 81 -205 27 -143 -19 143 -105 -54 -115 -131 90
5759 90 131 30 44 18 36 -36 12 133 199 -32 144 -56 -57 186 42 -103 37 -117 -161 -155 163 -17 41 41 101 224
5785 224 156 108 165 -138 -171 -119 -45 21 35 -188 -124 -228 223 44 -162 -221 78 -78 24 -206 60 94 -155 58
5809 58 190 -24 97 96 -24 -59 216 -41 17 46 -23 130 18 -44 30 107 -221 110 -39 -191 163 -99 28
5832 28 -176 74 275 72 -135 -181 -208 163 158 18 100 5 69 -59 -15 40 -191 -9 -171 168 28 -1 11 24
5856 24 141 58 -5 -248 106 -43 101 102 -57 -186 49 18 202 23 167 31 105 179 117 -63 81 -23 135
5879 135 54 -30 -143 -287 -19 -164 -19 44 19 -11 137 117 -57 -64 -33 -277 -86 188 -80 123 78 -138 -25
5902 -25 -218 102 19 47 -135 49 -97 93 -219 208 230 13 -49 -112 51 -37 14 -120 -5 -18 12 137 -37
5925 -37 240 49 -50 -69 63 -15 -22 -58 55 56 120 93 -59 -91 -117 85 185 100 27 -102 202 -67 173 24 32 59
5951 59 48 187 73 -85 -141 23 210 -100 55 188 141 33 -120 -72 -175 24 111 -45 -87 -109 -30 134 103
5974 103 -142 -108 -147 -89 -104 -13 135 77 -14 -82 129 -73 71 -84 -31 147 131 -17 21 22 13 -101 -169 64 -25 -165
6000 -165 -73 -38 -69 -62 -32 11 126 133 -46 102 1 44 29 -243 57 1 -139 -36 -38 174 -128 -11 -7 -205 67
6025 67 -13 -94 10 261 -179 -22 -290 -221 149 -185 102 63 71 -139 -28 183 14 -123 -66 -63 -36 2 68 -80
6049 -80 212 184 -94 -140 191 -152 190 102 229 208 71 22 -45 -103 -43 -187 -29 115 171 -263 13 -64 -42 -47 -120
6074 -120 285 -80 -20 99 -72 19 -10 -57 76 -94 -144 250 64 -222 37 141 -122 117 -103 55 -41 -131
6096 -131 5 -128 45 14 -33 -78 -35 58 -10 -26 126 -78 -75 -4 73 110 58 -31 48 -44 -67 242 54 3 31 -22 137
6123 137 -199 36 -44 -36 43 37 -55 219 -20 -116 121 -148 -52 -31 -50 112 50 -66 -88 26 -69 -114 -65 45 13 47
6149 47 -53 -57 -100 -153 -4 -242 -16 -2 43 27 -101 133 -14 21 47 25 26 -122 84 7 187 66 -122 62 -256
6174 -256 -46 92 134 -219 49 114 55 137 137 25 228 -34 -84 28 -170 17 76 -115 32 -79 -202 -154 83
6197 83 -68 -1 -19 45 47 -226 64 -93 -133 -77 89 42 48 -94 129 -69 19 -96 71 -173 19 -69 -26 -20 40 -49
6223 -49 -44 55 -111 22 -9 -116 -9 -124 -145 44 112 42 -44 -108 -64 -116 -111 194 -39 -188 -178 165 -73 197 23
6248 23 -28 124 -8 -26 3 -20 123 89 -56 188 171 209 38 0 -121 153 21 161 104 61 -82 151 -2 18
6272 18 8 -2 -146 -29 -126 -58 15 35 93 -42 204 -82 -23 -30 50 11 -170 76 -44 200 52 -104 23 73 -71
6297 -71 -30 -17 138 34 47 -12 -75 21 -42 66 58 -21 -56 119 -205 54 1 -60 -212 -21 15 -7 35 -138 -147 -150 -155 -98
6325 -98 -49 -42 104 -48 177 86 -10 270 5 49 82 207 23 29 -113 77 127 221 192 -140 -44 94 -207 87 -93
6350 -93 -64 64 72 30 13 128 197 -142 -270 67 96 -153 107 132 -143 129 35 73 -19 148 44 80 225 8
6374 8 40 -25 110 264 -54 -34 -5 20 139 82 -19 -136 93 -54 64 -50 -157 33 -208 -8 -212 -150 -135
6397 -135 -132 -6 -2 -79 225 356 23 111 83 -139 104 3 16 256 -20 85 -60 64 -61 -31 133 57 -199
6420 -199 31 -73 -220 11 163 43 63 45 -18 -31 18 103 129 108 5 72 -58 -71 34 -47 39 -13 -66 -127 26
6445 26 -12 -109 75 24 110 54 50 237 -264 168 41 -91 192 18 223 -160 134 25 -157 0 -141 -89 -162
6468 -162 80 54 123 167 -64 26 191 -1 -3 132 69 -29 -71 47 72 102 -58 6 266 -141 139 -28 -24 -132 126
6493 126 -323 -13 -128 27 144 -92 91 109 -236 -296 85 89 -41 25 -38 197 117 8 59 185 -166 100 -179
6516 -179 -2 120 32 235 41 166 -77 113 -107 -50 -55 121 63 139 -212 98 28 -114 170 -54 330 -89
6538 -89 35 50 5 -156 26 131 -1 35 67 283 -158 284 230 -222 -102 0 -71 134 -36 -86 -10 32 -142
6561 -142 -155 119 -52 -174 74 -100 -89 -71 18 -109 23 24 203 20 -100 -254 -226 66 -48 59 -124 3
6583 3 -92 -150 -26 -96 146 33 -47 -11 -85 206 -16 -22 44 -82 -40 -73 -111 -1 360 9 10 6 -20 193 74 36 33
6610 33 45 72 159 -144 105 335 17 89 173 -63 57 -2 -10 -45 -110 76 152 118 218 -133 58 264 133 -6
6634 -6 -13 -17 -270 -3 22 -3 48 -66 125 51 -38 30 -77 -106 -164 -56 28 82 -9 63 6 -71 -16 -1 -157 -206 -113 -60
6662 -60 82 25 -36 8 23 -83 59 38 -209 184 -55 -60 83 75 -6 178 -43 207 -173 -69 180 -12 -124 107
6686 107 72 35 -84 -51 60 -144 10 -5 -87 -118 86 65 98 -196 -13 -40 71 -28 2 -183 87 150 16 -2
6710 -2 78 95 -6 38 23 -84 -12 -33 136 -50 -181 108 -206 -71 -166 -80 80 -54 -73 -98 -34 -140 141 -111
6734 -111 -83 90 26 17 -219 33 -50 -110 110 194 -67 -123 51 54 -47 -118 14 145 -17 44 119 94 -27 -115 -47
6759 -47 -52 -2 117 163 78 74 -29 104 109 -204 -33 -74 75 23 50 -34 28 -96 -41 13 193 -22 -37 176 145 62 166
6786 166 75 -25 -33 -29 -10 143 98 -112 89 106 110 -91 141 -87 -355 -93 152 -67 302 -118 38 78 -175 -54
6810 -54 128 -217 104 214 141 104 5 -46 94 136 85 191 -100 82 -11 -50 -15 44 23 -106 108 -35 -13 216
6834 216 59 122 22 32 -1 -53 -37 -62 -92 -179 -109 10 95 144 -32 -5 41 -214 -92 28 2 179 77 22 -61
6859 -61 -199 -201 122 -82 -28 52 -12 52 -142 1 190 -173 34 140 9 118 -63 34 -31 80 58 -49 -40 45
6883 45 -88 323 -23 20 95 96 32 135 -147 39 -145 288 -77 -122 112 15 91 -107 18 -73 -102 -269 12 -90
6907 -90 -68 23 64 -40 7 193 19 -109 -302 -94 145 -150 -49 -28 -10 -81 -140 79 72 87 -5 114 95 72 -58
6932 -58 37 -47 40 -228 64 -48 -31 -73 190 74 176 -93 95 45 -106 73 32 -105 89 275 202 -60 23
6955 23 172 78 15 126 134 -120 3 188 141 -17 62 -136 -6 -29 -21 96 -61 74 29 -127 283 -105 -118 -94
6979 -94 -13 -91 16 -60 -174 96 36 -162 252 61 70 -233 227 -43 -130 -80 -14 6 89 94 -76 102 -11 148 37
7004 37 -202 44 199 -145 85 102 102 122 -97 -10 -51 -59 68 92 63 36 68 166 56 -17 -12 154 209 -103 23 101
7030 101 16 -82 -34 -157 -178 38 54 -128 -68 108 26 -35 58 -119 -6 19 -136 -66 -4 -118 -85 -78 -18 -152 -26
7055 -26 -295 77 162 -27 3 191 -104 210 80 30 -67 42 -86 -168 89 109 -106 -87 -101 127 -42 -73 -15 42
7079 42 -111 29 53 -228 -21 -64 205 57 8 154 120 26 20 -237 -53 75 33 -144 -194 104 8 -31 -92 57
7103 57 9 120 -181 -15 -126 152 -10 84 -57 26 73 -116 192 -112 55 45 -9 -48 14 40 -115 -154 -34 -183
7127 -183 -93 -192 86 63 99 71 -2 136 -85 68 -2 87 39 -77 -82 147 -183 61 16 81 -103 36 -55 -137 -53
7152 -53 -63 1 201 253 -334 -31 16 91 -23 -95 -56 -32 16 -150 115 -105 -114 87 70 113 -110 -141 -118 -85 114 47
7178 47 83 90 -260 -163 37 257 -75 18 -53 -215 -156 -54 159 -4 -166 -21 104 88 42 148 -34 111 -49
7201 -49 -52 -27 -24 -11 2 -145 -67 -119 -38 94 -266 -135 34 55 246 -95 -38 89 -13 -129 -200 247 -207 -171 -47
7226 -47 29 -130 30 -99 -206 183 33 427 -206 -25 76 -29 -173 -74 46 111 -98 -64 12 -22 -69 -69 190
7249 190 1 -133 -24 -95 -161 -112 -24 168 114 -86 -35 27 9 -26 -18 48 -121 110 -80 59 79 -259 65 120 -146
7274 -146 140 59 52 64 156 62 106 -116 -50 44 -15 48 -104 -120 93 36 185 -8 15 -38 -17 2 -105 50 108 -34
7300 -34 -112 -94 18 7 -29 75 -341 -80 -6 125 33 18 -237 24 -116 -168 -57 -222 69 -51 -76 -28 -63 15
7324 15 -166 31 -45 -303 -17 -55 -102 61 80 114 -29 -21 81 -63 -19 77 8 -50 1 127 4 -107 -109 -6 111
7349 111 67 -49 142 -4 -84 -120 -13 125 -119 55 -233 23 87 -96 -147 14 141 -225 164 71 -180 -77
7371 -77 -90 -36 68 34 64 -87 -74 234 15 84 204 48 66 7 -166 109 209 215 85 -173 48 91 80 163 142
7396 142 -108 8 57 -33 73 -16 20 -151 19 -53 112 132 171 112 -66 -73 57 -40 43 44 74 -76 -78 174 -56 -183
7422 -183 -126 -8 -151 -25 -37 22 -228 -13 -124 94 -141 -137 -149 235 -160 -175 44 -181 120 -131 -47 152 -124
7445 -124 202 -57 -181 -13 -21 34 67 -136 -77 137 42 113 -100 49 -76 -214 113 165 7 -77 30 -160 113
7468 113 -156 27 -163 162 -58 -71 -130 78 -233 -189 -38 5 -72 133 119 -77 -111 -191 164 -36 -59 93 15
7491 15 -174 81 -151 37 24 30 56 17 -54 37 -16 -72 35 9 77 -9 69 -113 53 34 -69 115 100 153 -63 14
7517 14 123 -16 180 -15 -102 85 -146 76 13 -36 0 109 120 161 211 -254 -125 46 186 54 -114 -180 88
7540 88 -135 12 95 29 101 148 -20 -22 -72 -42 -117 157 178 -80 156 -137 95 -121 94 -109 106 -49 98 87
7564 87 -136 45 6 -26 -165 219 -74 42 -33 7 137 47 -29 -137 40 -67 85 -56 -167 -41 78 -79
7586 -79 -134 -59 183 30 -126 -132 71 126 101 -24 154 188 -111 120 152 70 -112 0 209 192 -14 137 172 113
7610 113 75 20 -94 136 159 205 80 -90 180 2 -50 84 29 -49 -43 17 99 -28 -158 32 47 -99 174 39
7634 39 -140 41 -203 103 160 85 42 -15 -122 -165 77 45 92 114 96 -30 -73 -127 0 39 -36 -132 105 165 -70
7659 -70 -92 -161 -20 -20 -74 -113 -90 232 -82 -82 25 40 -26 -47 -268 34 -45 181 -123 110 -47 -5 -198 -48 34
7684 34 -169 58 64 -65 -165 -191 68 71 81 -3 -219 128 26 -48 62 -127 35 8 -67 93 -43 47 17 135
7708 135 60 -60 -263 -121 17 -85 37 9 20 -40 -78 -22 -241 -148 -21 11 -72 -165 18 -48 -72 67 216 131
7732 131 135 -61 -92 -1 89 90 -98 67 -151 13 207 -92 55 -65 83 -40 -122 -110 21 -83 214 -30 -242
7755 -242 54 49 -34 56 95 -109 -14 -66 -153 25 -113 -110 -191 -49 -61 167 -2 -119 -38 -118 156 69 84 -209 -57
7780 -57 -53 -18 75 71 -217 50 77 158 10 -76 138 -45 306 -41 -147 104 39 92 68 17 125 -57 -272 -75 165
7805 165 52 7 25 -78 -42 128 158 -86 -61 -89 -50 -27 -77 130 165 -73 -32 10 -6 102 -129 -104 135 8 -58
7830 -58 -271 81 51 66 173 51 93 -162 71 2 -88 -30 -72 -6 -112 46 -139 71 -69 98 -56 66 -12
7853 -12 42 -10 -37 -51 -158 25 117 84 129 59 -123 -60 178 38 -9 -73 -56 -62 -47 165 -65 -69 -6 63 179 57 -131
7880 -131 -56 -24 -97 -145 -20 -56 -95 126 -29 13 -101 12 -69 -5 -90 72 -178 162 52 -212 47 -119 207
7903 207 21 11 167 -147 -124 33 20 155 26 55 -184 -19 -14 59 -48 24 -162 -82 -108 -64 -53 -94 17 59 -107
7928 -107 156 73 21 72 3 119 -86 -6 -17 -359 -4 142 131 -215 106 -65 -150 162 54 -41 103 69 -107
7951 -107 195 -159 -92 -88 35 -116 -25 -68 43 -45 -37 58 -50 -177 67 -26 154 -242 -88 46 -235 -227 18 -47
7975 -47 86 86 -194 -134 -9 -94 -131 47 49 -22 -191 142 -88 -3 -58 -22 -68 -94 9 -45 94 102 262 -50 33 89
8001 89 -56 91 126 8 -2 -81 -22 91 5 68 -146 -25 -88 57 -146 37 -34 -167 -227 38 73 83 78 131 19
8026 19 148 25 -98 3 -14 108 -16 61 -19 -76 -158 -64 50 7 -65 -161 50 -76 -102 -286 -37 -24 -86 72
8050 72 -172 227 -78 -132 -79 167 -178 141 108 55 32 -44 -65 -16 -69 24 240 83 -44 -47 71 33 231 -191 57
8075 57 -147 -26 77 36 -10 -224 62 -138 -122 -90 3 91 32 -10 -54 -176 11 -169 182 -35 -116 -41 101 44
8099 44 90 155 -142 -141 -130 133 -152 172 36 -206 131 -13 -215 70 90 -92 96 97 9 -136 55 -9 -68 122
8123 122 -175 82 -4 -92 203 74 -228 -101 123 -150 -51 -1 131 61 -90 129 -90 88 97 -25 27 -182 -76
8146 -76 47 -45 104 217 173 -5 151 77 -51 -53 110 -67 12 126 81 3 -9 -71 5 88 -20 148 -78 -144 87
8171 87 287 229 234 84 257 -163 139 76 -92 128 37 17 16 75 -44 -118 76 -83 2 -175
8191a75
##END NTUPLES=NMR FID
##END=
