##TITLE=1H_60-2021
 CDCl3, 8 sc, 
 30.07.2021
##JCAMPDX= 6.0         $$ Bruker NMR JCAMP-DX V2.0
##DATA TYPE= NMR FID
##DATA CLASS= NTUPLES
##ORIGIN= UXNMR, Bruker Analytische Messtechnik GmbH
##OWNER= root
$$ XWIN-NMR		Version 3.5
$$ Fri Jul 30 09:37:25 2021 Russian Standard Time (UT+4h)  she@DPX200
##.OBSERVE FREQUENCY= 200.131506
##.OBSERVE NUCLEUS= ^1H
##.DELAY= (6, 6)
##.ACQUISITION MODE= SIMULTANEOUS
##.ACQUISITION SCHEME= undefined
##.AVERAGES= 8
##.DIGITISER RES= 18
##SPECTROMETER/DATA SYSTEM= spect
##.PULSE SEQUENCE= zg30
##.SOLVENT NAME= CDCl3
##.SHIFT REFERENCE= (INTERNAL, CDCl3, 0, 15.7039)
##AUDIT TRAIL= $$ (NUMBER, WHEN, WHO, WHERE, WHAT)
$$ ##TITLE= Audit trail, XWIN-NMR		Version 3.5
$$ ##JCAMPDX= 5.01
$$ ##ORIGIN= Bruker BioSpin GmbH
$$ ##OWNER= she
$$ F:/spectra/data/she/nmr/H-F/1/audita.txt
$$ ##AUDIT TRAIL=  $$ (NUMBER, WHEN, WHO, WHERE, WHAT)
(   1,<2021-07-30 09:34:29.26 +0400>,<she>,<DPX200>,
      <created by zg, POWCHK disabled, PULCHK disabled
       configuration hash MD5:
       00 E9 B6 7A A2 85 ED C7 34 08 36 98 17 FE 4E 26
       data hash MD5: 16K
       32 B5 37 22 3B 41 75 11 E4 A0 4D D6 56 BE 28 39>)
$$ ##END=
$$ 
$$ hash MD5
$$ 17 8E 13 4E BD 4B E8 03 AA 97 BA 76 38 8E 86 76
##$RELAX= 
##$RELAX= 
##$RELAX= 
##$RELAX= 
##$RELAX= 
##$RELAX= 
$$ Bruker specific parameters
$$ --------------------------
##$DU= <F:/spectra>
##$EXPNO= 1
##$NAME= <H-F>
##$PROCNO= 1
##$TYPE= <nmr>
##$USER= <she>
##$AMP= (0..31)
100 100 100 100 100 100 100 100 100 100 100 100 100 100 100 100 100 100 
100 100 100 100 100 100 100 100 100 100 100 100 100 100 
##$AQSEQ= 0
##$AQ_mod= 1
##$AUNM= <au_zg>
##$AUTOPOS= <>
##$BF1= 200.13
##$BF2= 200.13
##$BF3= 200.13
##$BF4= 200.13
##$BF5= 200.13
##$BF6= 200.13
##$BF7= 200.13
##$BF8= 200.13
##$BYTORDA= 1
##$CFDGTYP= 0
##$CFRGTYP= 5
##$CHEMSTR= <none>
##$CNST= (0..31)
1 1 145 1 1 1 1 1 1 1 1 1 1 1 1 1 1 1 1 1 1 1 1 1 1 1 1 1 1 1 1 1 
##$CPDPRG= <>
##$CPDPRG1= <>
##$CPDPRG2= <>
##$CPDPRG3= <>
##$CPDPRG4= <mlev>
##$CPDPRG5= <mlev>
##$CPDPRG6= <mlev>
##$CPDPRG7= <mlev>
##$CPDPRG8= <mlev>
##$CPDPRGB= <>
##$CPDPRGT= <>
##$D= (0..31)
0 1.2 0 0 0 0 0 0 0 0.06 0 0.03 0 0 0 0 0.0002 0 0 0 0 0 0 0 0 0 0 0 0 
0 0 0 
##$DATE= 1627623268
##$DBL= (0..7)
120 120 120 120 120 120 120 120 
##$DBP= (0..7)
150 150 150 150 150 150 150 150 
##$DBP07= 0
##$DBPNAM0= <>
##$DBPNAM1= <>
##$DBPNAM2= <>
##$DBPNAM3= <>
##$DBPNAM4= <>
##$DBPNAM5= <>
##$DBPNAM6= <>
##$DBPNAM7= <>
##$DBPOAL= (0..7)
0.5 0.5 0.5 0.5 0.5 0.5 0.5 0.5 
##$DBPOFFS= (0..7)
0 0 0 0 0 0 0 0 
##$DE= 6
##$DECBNUC= <off>
##$DECIM= 32
##$DECNUC= <off>
##$DECSTAT= 4
##$DIGMOD= 1
##$DIGTYP= 9
##$DL= (0..7)
0 120 120 120 120 120 120 120 
##$DP= (0..7)
150 150 150 150 150 150 150 150 
##$DP07= 0
##$DPNAME0= <>
##$DPNAME1= <>
##$DPNAME2= <>
##$DPNAME3= <>
##$DPNAME4= <>
##$DPNAME5= <>
##$DPNAME6= <>
##$DPNAME7= <>
##$DPOAL= (0..7)
0.5 0.5 0.5 0.5 0.5 0.5 0.5 0.5 
##$DPOFFS= (0..7)
0 0 0 0 0 0 0 0 
##$DQDMODE= 0
##$DR= 18
##$DS= 0
##$DSLIST= <SSSSSSSSSSSSSSS>
$$ [...]
##$SUBNAM2= <"">
##$SUBNAM3= <"">
##$SUBNAM4= <"">
##$SUBNAM5= <"">
##$SUBNAM6= <"">
##$SUBNAM7= <"">
##$SUBNAM8= <"">
##$SUBNAM9= <"">
##$SW= 20.0188882624521
##$SWIBOX= (0..15)
0 0 2 0 0 0 0 0 0 0 0 0 0 0 0 0 
##$SW_h= 4006.41025641026
##$TD= 16384
##$TD0= 1
##$TE= 0
##$TE2= 300
##$TE3= 300
##$TEG= 300
##$TL= (0..7)
0 120 120 120 120 120 120 120 
##$TP= (0..7)
150 150 150 150 150 150 150 150 
##$TP07= 0
##$TPNAME0= <>
##$TPNAME1= <>
##$TPNAME2= <>
##$TPNAME3= <>
##$TPNAME4= <>
##$TPNAME5= <>
##$TPNAME6= <>
##$TPNAME7= <>
##$TPOAL= (0..7)
0.5 0.5 0.5 0.5 0.5 0.5 0.5 0.5 
##$TPOFFS= (0..7)
0 0 0 0 0 0 0 0 
##$TUNHIN= 0
##$TUNHOUT= 0
##$TUNXOUT= 0
##$USERA1= <user>
##$USERA2= <user>
##$USERA3= <user>
##$USERA4= <user>
##$USERA5= <user>
##$V9= 5
##$VALIST= <valist>
##$VCLIST= <CCCCCCCCCCCCCCC>
##$VD= 0
##$VDLIST= <DDDDDDDDDDDDDDD>
##$VPLIST= <PPPPPPPPPPPPPPP>
##$VTLIST= <TTTTTTTTTTTTTTT>
##$WBST= 1024
##$WBSW= 4
##$XGAIN= (0..3)
0 0 0 0 
##$XL= 0
##$YL= 0
##$YMAX_a= 53196
##$YMIN_a= -93916
##$ZGOPTNS= <>
##$ZL1= 120
##$ZL2= 120
##$ZL3= 120
##$ZL4= 120
##$ABSF1= 10
##$ABSF2= 0
##$ABSG= 5
##$ABSL= 3
##$ALPHA= 0
##$AQORDER= 0
##$ASSFAC= 0
##$ASSFACI= 0
##$ASSFACX= 0
##$ASSWID= 0
##$AUNMP= <proc_1d>
##$AZFE= 0.1
##$AZFW= 0.1
##$BCFW= 1
##$BC_mod= 2
##$BYTORDP= 1
##$COROFFS= 0
##$CY= 11.3945322036743
##$DATMOD= 1
##$DC= 2
##$DFILT= <>
##$DTYPP= 0
##$F1P= 2.36226072786647
##$F2P= -0.459571619588291
##$FCOR= 0.5
##$FTSIZE= 0
##$FT_mod= 4
##$GAMMA= 1
##$GB= 0.15
##$INTBC= 1
##$INTSCL= 1
##$ISEN= 128
##$LB= 0.24
##$LEV0= 0
##$LPBIN= 0
##$MAXI= 10000
##$MC2= 0
##$MEAN= 0
##$ME_mod= 0
##$MI= 1.114404
##$NCOEF= 0
##$NC_proc= 0
##$NLEV= 6
##$NOISF1= 3.799351
##$NOISF2= 2.8
##$NSP= 1
##$NTH_PI= 0
##$NZP= 0
##$OFFSET= 15.70392
##$PC= 1
##$PHC0= -13154.19
##$PHC1= 12.40099
##$PH_mod= 1
##$PKNL= yes
##$PPARMOD= 0
##$PSCAL= 0
##$PSIGN= 0
##$REVERSE= no
##$SF= 200.130013532006
##$SI= 16384
##$SIGF1= 3
##$SIGF2= 2
##$SINO= 400
##$SIOLD= 16384
##$SREGLST= <1H.CDCl3>
##$SSB= 0
##$STSI= 0
##$STSR= 0
##$SW_p= 3612.71676300578
##$SYMM= 0
##$S_DEV= 0
##$TDeff= 0
##$TDoff= 0
##$TI= <>
##$TILT= no
##$TM1= 0
##$TM2= 0
##$TOPLEV= 0
##$USERP1= <user>
##$USERP2= <user>
##$USERP3= <user>
##$USERP4= <user>
##$USERP5= <user>
##$WDW= 1
##$XDIM= 8192
##$YMAX_p= 0
##$YMIN_p= 0
$$ End of Bruker specific parameters
$$ ---------------------------------
##NTUPLES= NMR FID
##VAR_NAME=  TIME,          FID/REAL,        FID/IMAG
##SYMBOL=    X,             R,               I
##VAR_TYPE=  INDEPENDENT,   DEPENDENT,       DEPENDENT
##VAR_FORM=  AFFN,          ASDF,            ASDF
##VAR_DIM=   8192,          8192,            8192
##UNITS=     SECONDS,       ARBITRARY UNITS, ARBITRARY UNITS
##FACTOR=    0.0002496,     1,               1
##FIRST=     0,             0,               0
##LAST=      2.0444736,     0,               0
##MIN=       0,             -93916,          0
##MAX=       2.0444736,     53196,           0
$$ Real data points
##PAGE= N=1
##DATA TABLE= (X++(R..R)), XYDATA
0@%%%%%%%%%%%%%%%qJ6j6J6j6K4l2L2m0M8n6O4p2Q5r3J04j20J37j61J84k05K29
37A20k56K88l21L59m00M43m91N43o00O62p32Q09q90R80j078J187j310J446j599
56h40J773j971K200k468K785l170L648m258N070o210P938j0898J7313n5744K3525
71b1307K3057r5666Q1890M725o2373M9008J7793m9780L4330J4245k6570J2446
83a8202J9329j8766P279J3109j0227N394P695j0372J2819l495o489J4818j0916
96A976j671J3368j8154Q465M893k0194J6627l292j9917K0975q813j6132J7665
109d204o996j2997R369J103j1337j212J2881j2095r260K2860j3567j2418K6954
122a0919j3446j0562K3600j0198o239J5200l855k799N872L818k452j33R837m970
$$ y = [0, 0, 0, 0, 0, 0, 0, 0, 0, 0, 0, 0, 0, 0, 0, 0, -8, 8, -8, 8, -8, 16, -16, 16, -24, 24, -32, 32, -40, 45, -48, 56, -64, 73, -88, 96, -109, 120, -136, 152, -169, 190, -210, 233, -258, 285, -315, 347, -385, 424, -466, 514, -564, 623, -687, 759, -840, 933, -1038, 1162, -1306, 1479, -1691, 1957, -2301, 2769, -3441, 4497, -6401, 10912, -44832, -21307, 1750, -93916, -12026, -7301, -69674, -20666, -2873, -52653, -18323, -4078, -30648, -18202, 1127, -17639, -10360, 2749, -7478, -2084, 5611, -4761, 8058, 4563, -1926, 12892, 1976, 305, 13673, -4481, 3984, 8877, -11317, 5310, 2018, -17899, 3076, -5737, -21869, -4204, -11200, -24197, -14828, -13725, -25062, -26274, -13393, -25488, -34748, -11888, -25455, -37873, -10919, -24365, -34927, -11327, -21525, -27764, -12564, -16419, -19218, -13346, -9528, -11980, -12113, -2276, -7246]
136g246j099J1537q034K150Q187q735O289J325n689P858n774O31N301j0307P428
151C822m37j0323J1477o543o692J1333r897j764P001q798J974J030m103K673l512
166a2759J477Q40m405M765j854j647M049l078K902l15j335O582o058L003O701
181a132r820P859L649r683J0745j262n793J0045n327n2N668o061M597k59l360
196a86N702n116J204L255o609M980j221m361N799n133M9L152n917M028j636l403
212e413N598n823R31M098p189M573P06n139N330k115r78K833k648L046j781j52
228d123M643o202M257L071p992Q181o41o648R663m350k903P786n853R68L456m274
244i61K930j021m36J817l502L618j632k906N667n376N37M429p209M344R04o168
$$ y = [-7246, -8345, 3192, -4842, -2692, 5495, -3240, 3049, 4374, -1315, 6543, 769, 1400, 6701, -3606, 3822, 3385, -6938, 4539, -2004, -8696, 2637, -7260, -9024, -2023, -10821, -8847, -7817, -11920, -9247, -12759, -11282, -10442, -14847, -10082, -11936, -13583, -9534, -12612, -9710, -10025, -11360, -4778, -10836, -7833, -1132, -10952, -3093, 556, -9127, 1618, 356, -5437, 4608, -719, -771, 4897, -1164, 3433, 3174, -186, 5516, 400, 1604, 4859, -1750, 3230, 2009, -2352, 3447, -1686, -1637, 1515, -4402, -374, -2010, -5413, 185, -5638, -4707, -609, -7798, -3225, -2519, -7658, -2328, -4443, -5421, -2588, -5236, -2190, -3971, -4123, 520, -5682, -1425, 1646, -6346, 1835, 1194, -5454, 4209, -141, -3044, 4742, -1111, -143, 3313, -961, 1969, 948, 512, 2329, -1173, 2445, 813, -2093, 3574, -1802, -1265, 3164, -4045, 299, 1203, -4965]
260d965O571l260k644N898n366J187K692m416L369j311p88K838m144L934l16m321
276e042P116m058k140P502o180O64N032n364K435J266j732J570j640K821j526
291G24k227O173n222o68O845p313J716M612o616L198R40k927K280k398K123q25
307D15l467O335m874k235Q055p716P8O817p804J816L965n059J418J176m16j388
323b884Q8L904n496J364O078q738L609N754r657N304L524p454M830J216l227J803
339A8M33J031k877J758L599p056M248L768r032O187K114p868N923J97m435L170
355A178l83n89j369J009K061n766L754K394q119O174R59p605O851r71m764N003
371a83j705j138J184l41J426k984K533J853n606N515M13n793O913j513l835N969
$$ y = [-4965, 1606, -1654, -4298, 1600, -3766, -2579, 113, -4303, -934, -2245, -3033, -195, -4339, -405, -721, -5042, 2074, -1984, -4124, 3378, -2802, -2138, 2894, -2470, -35, 1231, -501, 1069, -571, 2250, 724, -1503, 4670, -552, -1220, 5625, -1688, 28, 4640, -1976, 1222, 2162, -765, 1515, -883, 1240, 415, -3052, 3283, -1591, -3826, 4229, -3487, -3409, 3408, -4396, -2580, 1385, -3674, -2256, -1080, -1496, -2884, -2796, 1108, -4388, -3024, 3054, -5684, -2075, 3679, -5978, -674, 2850, -4604, 226, 1442, -1785, 18, 451, 1482, -1395, 363, 3962, -3094, 1154, 4922, -4110, 2077, 4191, -3677, 2246, 2443, -1992, 1178, 795, 206, -1163, -154, 1907, -3859, -105, 2289, -5830, 344, 1303, -6302, 549, -422, -5186, -183, -1888, -3026, -1842, -2183, -757, -3741, -1208, 645, -4961, 554, 967, -4826, 2087, 574, -3261, 2708]
387B708k537q70K793j672J343j207J143J398m085M393l72m735O313k867l131N874
403D489m324n56L290l721J439l58j182J633l162K210K9l983M733k578k567N118
419E10m209r6L385m039K099M85k061K589k093J216J098k767L748j475j546M586
435A430l589Q46L297m235K947P78k731L333j573o9J754k353K471j103j256L270
451C217l566J155K146m571L388m25l350M213l042o75L146m299K044O64l459L396
467a8j839j190K853l159J493O99k443K771j471m97K249k375J756J43j639L034
483C67k494R14K411l932L359L10l476M549j838j503L708k971Q76J292k464K641
499A749j806k24K449l777K206Q04l807L697j426k086L483l151N66J546k963K317
$$ y = [2708, 171, -699, 2094, 422, 1765, 558, 1701, 3099, -986, 3407, 3035, -1700, 4613, 1746, -1385, 4489, 165, -391, 2899, -822, 617, 259, -923, 710, -2452, -242, -213, -4196, 537, -2041, -4608, 510, -3699, -3795, -410, -4449, -2350, -1865, -3926, -1337, -3430, -2214, -1116, -3883, -135, -1610, -3156, 1430, -2159, -1313, 1984, -2251, 696, 1474, -1257, 2076, 503, 434, 2188, -165, 2306, 1203, -53, 3217, -349, 806, 2952, -1619, 1769, 1344, -2006, 2207, -835, -1510, 1636, -2663, -619, 45, -3414, -18, -1857, -3047, -194, -3353, -1860, -1161, -3604, -833, -2304, -2801, -552, -2927, -1171, -1028, -2667, 367, -2127, -1213, 1198, -2734, 625, 935, -2541, 2008, 170, -1333, 2375, -596, 280, 1572, -892, 1749, -57, -281, 2168, -1609, 597, 1401, -2406, 1291, -135, -2221, 1262, -1889, -1323, 223, -2740, -423]
515d23r52j395K579k610Q98J149k701K541r13j294K676k191Q15R24j907K508j734
532b030O8K772m022K901J393m765M835n91l680M951k012j490L205k187P32K20
548C00o83J648k374J606R40l487L443p39k661L926k383p83K756k728J012O11j435
565a031J400j355R94K01k296L404j942j726M500l691l42L854l942J151J567k330
581a584J652j020N19Q26k831L391r38k990M834k547j796M171k991R5J989k051
597a271J197o38J30J115k407K436j88k606L870k014j445L783k917Q0K398k421
613h98R11N54m87Nl76J725j930j61L342m232J294L364n539L100J867n101M064
630A502l21l126L863k176m85K253k638J496K01j711K103j454j13J284j620J186
$$ y = [-423, -1375, -2770, -191, -2801, -1903, -754, -3455, -914, -1827, -3121, -445, -2636, -1821, -897, -2804, -296, -2030, -1962, 810, -3212, -311, 1082, -3683, 1152, 561, -3119, 1832, -180, -1670, 1535, -652, 80, 300, -383, 1265, -1109, 497, 1437, -2050, 1393, 654, -2007, 1919, -464, -1247, 1509, -1219, -207, 404, -1031, 369, -986, 8, 209, -2087, 1317, -625, -2351, 2149, -1542, -1884, 1970, -1972, -821, 746, -1584, 68, -952, -433, 393, -2438, 953, 15, -2975, 1859, -688, -2484, 1687, -1304, -1209, 780, -1271, -74, -712, -582, 533, -1874, 562, 374, -2232, 1638, -376, -1821, 1962, -955, -875, 1523, -898, 13, 567, 80, 85, -291, 1434, -496, -657, 2685, -1547, -253, 3111, -2428, 672, 2539, -2562, 1502, 1181, -1945, 1918, -258, -743, 1510, -1128, 368, 569, -1142, 961, -493, -606, 678, -942, 244]
646B44l15n28J243j545J260q5j574K838k097l72L241l692J409K295m009K715M40
663A468k558K806j229l68J463j869J713n56j263K551k208K01J905k738J707J33
679A158j794K191j584J6J450k305J593j58j464K063j810N00J114k518K311n90
695A73j878L166k334k13K503k919J414Q55k344K391j062n72J779j874J156K66
711E07j566K239j544K1J872k600J835M05k510K928j195j181K612k184N34J252
727A425k048J655n38o42J548j692R03L27j445J749j107j12J330k116J761k35j886
744a123L102k237n80L291l683J091K193l659K169O88k511K101n89o59Q31o70Q10
761E65j020K42J223k396J748M31k544K767q92j596K797k017J17J487k141J729
$$ y = [244, -71, -599, 644, -901, 359, 274, -1300, 1538, -559, -931, 2310, -1382, 27, 2322, -1687, 1028, 1468, -1090, 1716, 487, 119, 1582, -287, 1426, 870, -393, 2158, -50, 151, 2056, -682, 1025, 1158, -636, 1555, -29, -13, 1437, -868, 725, 567, -897, 1166, -644, -144, 970, -1548, 763, 173, -1705, 1461, -873, -1086, 1417, -1502, -88, 767, -1577, 814, -248, -820, 959, -915, 241, 507, -1059, 1180, -364, -343, 1529, -1071, 764, 1169, -1341, 1587, 392, -789, 1823, -361, 173, 1425, -623, 1032, 494, -148, 1400, -292, 611, 938, -507, 1242, 135, 23, 1353, -763, 998, 763, -1123, 1979, -258, -838, 2453, -1230, -139, 2054, -1605, 564, 1252, -1259, 842, 253, -406, 425, -245, 565, -455, -213, 1010, -1386, 362, 793, -1751, 1016, 124, -1472, 1325, -692, -575, 912, -1229, 500]
777E00m33j181K290k033M30J775k701J672M90k071K071o65n22J026j056R84m77
794I9m78J630j991Q24J234k556J969Q4j942K146j089l82J194j379J200o90n92
811g19J953k392R19J646l402K451M20l017L128q71j589K351j422O5Q12r50J069
828D52r59L76R90k046J808K3j866K542j165q00J986j619M61O54j158J410j029
845F0OJ335k100J480L38k141K315r48j019K030j747M20O36j379J393j020j28J344
863H75k223J424N48k420K376o96j527K411j563o9J189j383R91l80l37J233j578
880a129J111M24j911K192q22j089K387j864L84J283j931J560k41j068J907j706
896e13N41J123k100J637Pj541K005j130k38J273j603J092j32q76J477j445L96
$$ y = [500, 67, -1114, 1176, -857, -427, 1348, -1353, 319, 809, -1262, 809, 144, -378, 648, -408, 576, 99, -379, 1251, -740, 84, 1318, -1238, 731, 815, -1127, 1019, -70, -452, 742, -637, 563, -127, -719, 1234, -1158, -239, 1407, -1995, 456, 876, -2141, 987, 116, -1473, 878, -544, -479, 333, -617, 452, -507, -131, 859, -1187, 621, 644, -1222, 1320, 155, -645, 1341, -278, 183, 837, -321, 1089, 60, 66, 1401, -699, 781, 1119, -1022, 1293, 345, -674, 1356, -391, 29, 665, -714, 679, -341, -469, 875, -1348, 76, 624, -1796, 580, -116, -1643, 768, -795, -864, 325, -1058, -67, -447, -784, 449, -1129, -18, 406, -1505, 687, -135, -1224, 1163, -701, -317, 966, -965, 595, 354, -714, 1193, -513, 28, 1151, -949, 688, 695, -846, 1159, 29, -209, 1064, -539, 553, 421, -455, 1022, -423, -27]
913b7R73j893J514k21j215J779j223j8J114j580J205k65r05J768j598L99J228
930A035k252J750Rj759K313j130p20J852j654O32N30j233J359r55j6J135j680
947g84J186K11j518J759r86l54J335j586R38J24j281J800j300j15J638k150J088
964EO68j925J782n65q73J586j295N44M28j196J427q58k74J442j737R17O60j758
982a022J702n72p60J582j408N97N28j367J553q14n40J738j920Q01J034j980J503
999F55j32j165J589j149K01O91j264J267n41o39J597j635N49R29j847J576l57
1016C25j039J660j356L40P98j527J485n70q73J983j880L24J591k361J427M91j799
1033i81J698n93m87R62r86P34k77n14J410j528M48J156k044J337K84j525J591
$$ y = [-27, 946, -947, 567, 346, -869, 910, -313, -331, 783, -797, 408, 143, -762, 1006, -592, -193, 1035, -1217, 533, 542, -1217, 1096, -34, -754, 1098, -556, 76, 606, -627, 732, -223, -239, 896, -784, 402, 613, -905, 854, -132, -486, 849, -737, 201, 325, -956, 844, -456, -571, 1067, -1083, 5, 673, -1252, 530, -35, -908, 678, -617, -73, 355, -841, 586, -272, -546, 896, -841, 76, 736, -1022, 680, 108, -652, 930, -478, 119, 647, -720, 833, 19, -521, 1217, -703, 98, 1132, -848, 655, 523, -642, 947, -202, -1, 690, -574, 693, 152, -487, 1110, -525, 24, 953, -894, 682, 325, -714, 946, -410, -70, 728, -799, 686, 116, -757, 1226, -654, -330, 1261, -1100, 327, 818, -981, 717, 124, -363, 599, -387, 347, 70, -444, 966, -562, -114, 1042, -1002, 335, 619, -906, 685]
1050F85p21m00J037j140R13k52q27J664j532J51J461k128J313M79j835J767o09
1067B6p99J467j231N31L04r92J332j041n8J389j870J084O08j771J532j92r92J189
1085E16o46J80J81m88J017j183M61J080k043J438M39j949J985o62r57J735j307
1102b03L41N62j251J406q01m83J572j738P02Q73j944J542j12j302J647r89k17
1119c95R49j095P17j70m43Q97j174O58N25j477J398l44q27J301r54K42M27r18
1137f83J223q88k07J562j970Q76J051k264J813Lj651K057j060m56J497j541P49
1154A11L51j152J311p77j84J074j307P35K41r86J097o59j60P53r57P43l30l91
1172d87J147j324O09P91j844J582r4j527J974r88n04J539j484P01L26j094J488
$$ y = [685, -36, -436, 601, -539, 374, 122, -705, 959, -573, -422, 1039, -1089, 224, 703, -1132, 635, 26, -773, 694, -537, -6, 298, -694, 638, -403, -461, 928, -942, 142, 750, -1021, 511, 319, -673, 516, -130, 50, 231, -257, 760, -423, 38, 1118, -925, 513, 952, -997, 988, 326, -631, 1104, -203, 138, 700, -551, 855, 54, -429, 1143, -595, 107, 980, -964, 578, 466, -836, 811, -178, -395, 554, -541, 176, 6, -437, 460, -714, -56, 469, -1008, 390, 46, -781, 520, -434, -192, 235, -683, 540, -348, -555, 1007, -963, -87, 964, -1300, 513, 516, -1135, 922, -138, -594, 903, -638, 111, 462, -690, 621, -156, -340, 734, -573, 162, 403, -583, 514, -145, -305, 448, -509, 234, -96, -487, 660, -664, -55, 736, -1108, 474, 380, -1147, 827, -161, -665, 874, -610, 91, 417, -677, 811]
1189H11j101j39J513j820Q45Q36j786J384r9r37J096o91J54K96o26Q22p36J20
1207e8P75j391J053P0j299J578q47m94J432j456O20M35j207J197o23l93J228j471
1225h51P38N61j608J587m96r48J597j200J29J030j369R59j17p40J252j072K64
1242b84P90j292J060j66p97J177p59J33N11r46R08l73l43J103j313O50N22j379
1260g98J344m13q47J580j289J97R77j559J171j31j042J612j140k4J118j422Q50
1277A84K42j191J335o59l67J014j003N03J19o57R72p36MP66j102P70O1q51J059
1296D63o91R8N55j047J014l76o93J500j357J49J315j908J048M91j616J547l87
1313A05p90J250r96K63M45r30R58n66j98R43j097N45L02j023J160n61l38J048
$$ y = [811, -290, -429, 1084, -736, 109, 945, -841, 543, 444, -493, 603, -88, 66, 362, -264, 558, -178, -58, 717, -674, 379, 449, -850, 728, -119, -613, 819, -637, -17, 418, -789, 408, -215, -608, 620, -851, -113, 448, -1160, 427, -69, -1017, 580, -620, -491, 539, -830, 129, 12, -728, 524, -548, -284, 506, -786, 274, 108, -689, 488, -271, -138, 373, -573, 335, -38, -381, 722, -591, 59, 581, -798, 546, 133, -714, 866, -423, -226, 751, -808, 363, 232, -810, 802, -338, -362, 756, -666, 184, 426, -765, 570, -89, -456, 558, -445, 58, 177, -480, 492, -244, -240, 526, -576, 194, 255, -596, 463, -228, -130, 425, -622, 392, 16, -677, 823, -534, -385, 930, -978, 70, 561, -1055, 492, 105, -685, 565, -431, -168, 277, -653, 305, -261, -459, 484, -613, -68, 234, -789, 371, -190, -528, 520]
1331E20j070N80K17r89J194o80k82J210j324O48N88j458J288l45o72J232j019
1348c62L10M95r95R21m35l60J103j174M66P02j440J109p3r03J202p95K6O47q60
1367d16P08k42l49Q23r78M91M06j171J212m09n95J219j084K64P40j232J003q3
1385C07q52J240r54P6Q74j200P50R9q21J102p48n5P88j113P29Pp03J006p01o9
1405b38Q20j093O64P2p90R72o54q4P51j086P70n5p92J175p95j15J011j207N64
1424a10L27r59R75m67j43Q11r21O24j0o95J062p26m4R74j173O13M53j115J054
1443E30m26k78Q07q82N24J59p82J078n87l40J093j206M06O59j216J020k65o21
1461c27R34p61K15K87o52P10m33k46Q61j073N19L94j111R36k16o34J061p70R7
$$ y = [520, -550, 30, 247, -742, 452, -228, -510, 700, -624, 24, 612, -846, 442, 97, -575, 657, -362, -52, 443, -552, 369, -66, -426, 677, -497, -31, 671, -769, 340, 267, -636, 566, -229, -203, 444, -416, 292, 50, -299, 524, -454, 37, 443, -728, 484, 75, -520, 699, -385, -121, 619, -613, 390, 307, -545, 695, -259, -183, 691, -509, 241, 340, -481, 621, -127, -182, 606, -507, 222, 229, -474, 532, -169, -238, 582, -511, 153, 225, -565, 407, -247, -331, 420, -666, 104, 49, -743, 432, -363, -478, 533, -674, -110, 217, -742, 233, -234, -377, 434, -487, 137, 127, -568, 494, -232, -276, 698, -475, 138, 591, -524, 530, 104, -174, 633, -249, 275, 434, -348, 730, 143, -197, 896, -310, 96, 755, -461, 559, 294, -327, 607, -154, 61, 348, -304, 406, -27, -273, 588, -485, 34, 428, -683, 253, 37, -597, 464, -306, -209]
1480b09M76q01O89k73k75Q46r45M57L90j047J157m42n60J217r65J18P62j087P98
1499C06p6p24J044p08Q4N85r05O90m9n76Q52p37Q5O71j019P78j51n89R02p20P5
1520a82O29r52O65k9o94J070p65q3Q87j095N91K42q41R11m40j70O65q52N36J21
1540B14n97Q66n82j19P53r39O21K12q83R95m44k68P79q64L73K63o39O89l95j33
1560i8O46q82O58Q2r17J111o00l70J032j048L62L91r35Q94m06k95Q50r50L65M29
1580C19r29R21l20n26R54q18J73N46q70O96j63m54O83m73K11K11n64P30m95j98
1600c66Q13q71M65L28q57Q46k42m95R38q45K51M87r26P78r2o34J000p53P8N58
1620D61r34P23l9o20R00o08m6O25q20M74J11n46P24o06J05M96q12O82j38n33Q56
$$ y = [-209, 267, -534, 155, -118, -393, 453, -492, -35, 355, -692, 465, 23, -537, 680, -285, -167, 595, -492, 306, 230, -494, 550, -158, -74, 511, -394, 296, 247, -329, 523, -214, -129, 542, -477, 301, 150, -439, 463, -257, -182, 447, -505, 160, 131, -563, 507, -258, -341, 546, -549, 42, 284, -557, 354, -86, -256, 409, -443, 93, 214, -383, 483, -99, -218, 535, -404, 217, 429, -454, 541, 97, -171, 608, -256, 117, 380, -259, 430, 35, -98, 548, -334, 324, 406, -511, 600, 0, -370, 662, -386, -24, 367, -568, 326, -80, -375, 475, -475, -110, 319, -610, 311, -9, -535, 419, -399, -226, 320, -550, 146, -17, -471, 212, -261, -50, 161, -403, 327, -168, -366, 447, -424, 41, 369, -488, 358, 116, -379, 559, -286, -35, 452, -474, 304, 212, -422, 578, -175, -97, 461, -473, 250, 211, -409, 491, -117, -163, 462, -358, 116, 227, -319, 405, -201, -96, 400, -412, 270, 132, -401, 455]
1641D55o54L1O48q53N63no04Q60n11q7N49p39N73k5n51Q31p06O3P51j067O40K24
1663C86r49R50l83l76P54o57J95K37n40O04m09m2N13p41M40K00p33Q53l67l11
1683c76O67o32K73J49m05N79m97N5N67r54O94J21q63J141n72m18J083r25J90O25
1703E02q97O57j14l84O14n20J81L26p22O96j79m94P91n49L1L97n52M14j18k14
1723a34M74o29M61J27p85Q71l57m79J000q98K19O34r60O82o1n41Q04n70l4N74
1743C98p20N08M5o10Q08n16l3N50p33N10L8n35O52m07o4M89o43M70o1m05O31n87
1765b15J84L36o96O32k28m58Q01o56L4O15q74O12M1o53Q36m56k03O92p56M39J45
1786A72n01O24m11p1N68p36L76K97o52O37k07k54N65n98L33J39m68O41m91p5P36
$$ y = [455, -199, -168, 480, -373, 190, 185, -419, 441, -70, -157, 392, -347, 226, 201, -350, 481, -225, -162, 589, -478, 162, 386, -563, 387, 4, -372, 382, -275, -80, 157, -383, 221, -188, -230, 283, -458, -18, 182, -551, 302, -65, -376, 291, -341, -68, 81, -324, 255, -242, -187, 380, -574, 120, 241, -622, 519, -53, -471, 612, -313, -123, 502, -395, 262, 148, -236, 378, -142, 39, 365, -357, 339, 160, -334, 457, -92, -61, 336, -216, 198, 80, -134, 340, -289, 172, 299, -486, 385, 28, -451, 549, -349, -130, 504, -456, 226, 165, -376, 428, -142, -176, 398, -322, 186, 231, -379, 429, -87, -120, 430, -303, 207, 245, -290, 362, -45, -109, 380, -263, 207, 146, -259, 372, -215, -31, 305, -391, 241, 13, -445, 356, -300, -266, 349, -525, 87, 128, -525, 311, -145, -348, 344, -412, 27, 172, -329, 295, -116, -187, 381, -355, 21, 318, -334, 303, 96, -158, 407, -191, 142, 281, -187, 454, -37, -112, 624]
1807F24q63M43K22o60O41k87j88N58n89K87J53n67O64l78j96O68q79M52L08r10
1827d97Q34k04m96P58n03j7L72n31M05j24k36N31n81L14J76o24O86k78l82Q17
1847D20o55R7M09o13M68p0k87N95n51J46L32o75N88j33l85P42m82q2N48p37M95
1868A70J05n51N99l80o3M13n52L73J8m62O38m40N7L89o00M69j45k92N87m85P2
1889h0M82q23N86P3o71R01n65j14O53o99L85J43o01O54l12j96N52n51L05J39m58
1910a97M90k19j53M50n09K79O8m32O26m76m1N74p35L73J56o44O27k08k11N14m94
1931a62K03J37n08N65l35j32N40o25K99K65p01O50k19l36N99m52Q5L06n15M48
1951A12j42k31N62n86L17K16p51P43k30l36O80n21N1M27o20M44r4k59N38n75K21
$$ y = [624, -239, 204, 426, -234, 407, 120, -68, 490, -99, 188, 341, -226, 438, 60, -136, 532, -347, 105, 413, -497, 337, 133, -363, 395, -108, -125, 247, -284, 121, -3, -239, 292, -289, 25, 201, -423, 263, -15, -397, 420, -235, -138, 271, -342, 126, 56, -231, 364, -187, -41, 291, -384, 204, 71, -314, 428, -54, -136, 412, -325, 170, 275, -276, 323, -57, -120, 293, -259, 114, 132, -330, 308, -132, -75, 314, -286, 183, 38, -254, 333, -152, -80, 402, -421, 165, 238, -433, 468, -97, -211, 442, -257, 128, 271, -330, 324, 12, -184, 368, -183, 122, 261, -197, 293, 74, -79, 371, -138, 141, 209, -223, 403, -73, -114, 460, -275, 98, 254, -390, 237, 29, -182, 332, -162, 41, 178, -330, 235, -100, -232, 308, -317, -18, 247, -454, 196, -23, -359, 240, -212, -127, 179, -336, 112, -30, -261, 301, -285, 32, 248, -503, 240, 10, -326, 354, -167, -116, 311, -309, 135, 41, -218, 320, -255, -34]
1972c4L86p27O28p7m95O97m44l9M76o09L84l6l09M87l96Q1L33n94M78l8m22N96
1994C26l68m5L98n38L29N5l19M24l80R7K52n42N85j54n04Q24o12jO43p98M44J79
2016B95o71O62l08j72M98m93J73K35m91M68k64m6L90m97K85P7m83N83l34n3M24
2037B78o03M00P1n14N82k73j90N55o23L32J92n71N52k08k72O22n78K10K61n57
2057c34N07j27k94M73m05J99J66n06N62k31k21N70n68K62J92n51O04j58l12N13
2077C41m15J39K17n06N17j57l36O19n82J56L50n96M42J0m49N67l57j2L36n05L69
2098A48o4k76N63n42J11M51p12M76K7n26O29l70q7M19n35L49j9l00N26m57M3M00
2120B54n86M46p8m30P13m68j9M86o52M42Rm17O18l79j29N49o72L47J87n61N82
$$ y = [-34, 352, -375, 253, 176, -319, 378, -66, -105, 371, -238, 146, 110, -199, 288, -108, -27, 306, -288, 190, 152, -270, 326, -42, -87, 311, -227, 102, 157, -162, 262, -118, -21, 231, -311, 274, 120, -384, 440, -172, -173, 470, -328, 116, 295, -376, 286, -22, -194, 304, -189, -16, 219, -272, 196, -68, -114, 276, -221, 64, 141, -342, 241, -93, -146, 278, -325, 75, 146, -368, 214, -59, -249, 306, -317, 15, 207, -364, 188, -20, -292, 330, -248, -38, 223, -334, 173, 46, -248, 225, -180, 19, 185, -321, 241, 10, -211, 359, -209, 53, 245, -306, 298, 140, -172, 341, -74, 65, 282, -224, 293, 136, -200, 419, -163, -7, 343, -253, 189, 199, -250, 317, -40, -52, 284, -221, 148, 84, -192, 371, -171, -60, 391, -321, 155, 182, -344, 285, -85, -172, 247, -288, 61, 42, -258, 268, -189, -146, 254, -332, 114, 36, -394, 319, -149, -168, 318, -334, 108, 117, -300, 318, -61, -190, 359, -313, 34, 221, -340, 242]
2141B42l09j53M91m70K11K22m51M82l17q0M45n10K04J81m09M72k01j66M13n02
2161b05K43K10n07N30k82j40M67n26K92J74m71N20k82k45N24n21K99J66n06N59
2181B99k30l03O52o17J50L96o32M01K1l29M30l14N0K01l67M02k49j49M21m50K45
2202B8K13n24M59q9l43N35m56J08K92n08M28j07l14O25n23J01M13o14M08N3m65
2223b80N38l03j23L76l65K12j3k75M70l65N4L18m93L69jm52N37k70n1L56m05K85
2245A19k8l07M88l97M7L90n76L97L6m65O19l58p1N42o46L41J03m75M89j89k00
2266a41N41n87K56J29l96M56k23j94M28l83K15O1l88M31k35j30M33n62L68P4m69
2287c16N51l14o3M69m99J29K24m92M77k00k27N64m99J36J82m43M19j13j70M15
$$ y = [242, -67, -220, 271, -199, 12, 234, -217, 265, -52, -132, 313, -197, 7, 188, -221, 251, 50, -116, 297, -205, 38, 248, -259, 271, -11, -151, 316, -210, 82, 256, -215, 305, 23, -222, 302, -219, 80, 246, -260, 299, 69, -234, 418, -199, -49, 347, -285, 116, 137, -192, 238, -76, -26, 175, -192, 210, -39, -188, 233, -217, 28, 241, -283, 176, 87, -256, 279, -177, -69, 223, -285, 143, 36, -278, 347, -176, -75, 338, -276, 132, 185, -280, 258, -45, -168, 208, -157, 55, 42, -233, 237, -128, -74, 244, -249, 120, 119, -333, 204, -66, -117, 239, -166, 119, 91, -216, 272, -125, -78, 312, -264, 133, 169, -296, 323, -35, -106, 436, -210, 131, 234, -241, 248, 59, -141, 400, -187, 69, 198, -198, 258, 35, -159, 269, -114, 101, 162, -226, 205, -30, -160, 273, -289, 79, 153, -316, 235, -79, -142, 327, -172, -43, 181, -311, 166, -34, -261, 303, -196, -60, 122, -321, 98, -15, -185, 230]
2307B30m65K18K11m68M36q4l11N52m87J01K75n15M67p2k93M91l84K0L01m43L37
2328A17n0l24N13m21J07K94m56L78q1k74M78m06Q6K80n05M51l7l77N74m75O7M23
2350C62o40L88R5m45N35l16o3L43m66K87P7l40L93l10K3L22m73L28ll15M27l14
2372a05RL20m65L27Nl65N25l71p1M64n10K93R6m85N57k47j43M26n23K81J47m27
2394b62M59j93j58L69m40K03J33l56M34k37j51M51m85J90J78l96M30j51k35M25
2414B08m36J59K30m71M44j59j89M53m19J79J95m71M90j85k17N08m54P4K97m61
2434b25L56m5k66M67l50P6J62l89L98j42j93M62l98P5K64n30M47n8k84M12l19
2455h0M2K46m06L49q9k67M65l96j4M01m99L08K1l37N02l83L1K33k88K59k0l24
$$ y = [230, -235, -17, 194, -274, 162, 78, -233, 319, -168, -67, 208, -307, 160, 88, -205, 286, -98, -78, 223, -220, 117, 67, -257, 256, -165, -58, 236, -220, 158, 77, -197, 281, -125, -39, 241, -264, 187, 150, -227, 347, -128, -61, 362, -278, 110, 205, -240, 295, -21, -84, 259, -207, 80, 157, -183, 210, -100, -77, 245, -228, 100, 97, -218, 209, -105, -96, 224, -241, 86, 91, -274, 251, -120, -191, 273, -237, 56, 152, -333, 224, -23, -166, 260, -263, 18, 165, -262, 197, 4, -154, 215, -225, -22, 111, -245, 189, -48, -199, 252, -233, -43, 135, -261, 169, 18, -217, 208, -228, -69, 161, -310, 134, -25, -214, 239, -180, -1, 194, -277, 213, 28, -189, 319, -135, -61, 236, -225, 131, 86, -180, 287, -63, 13, 175, -214, 184, 42, -151, 311, -87, -12, 252, -278, 169, 111, -173, 239, -80, -38, 208, -198, 151, 62, -205, 260, -136, -150, 251, -248, 60, 81, -256, 246, -137, -106, 127, -161, 98, 78, -246]
2477b46M71l58RL61n45L21R7m79N45k89r8M21m01K00L0k80M47k97JL54n47K96
2499A3J24l39M02k21j03L14l66J89R1l40M48j97j20M05m59J98J47m44M60j98j34
2520a30L94l81J73J73l49K28p1j30L68m11J48K79n02L59j71j26L72l88J45J82
2540A62m30M07p2k20L65l26Q6K32m87M07j11j91M02l32Q0K08m08L65j29k30M62
2561B40l86Q4J94l15K98k9k61M26l77J2K98n24M15K0k83L62k58m6K93l85L02r6
2583a6k13L45j82m1K61l56K51N0l32M16k65j00L37l42K35M4l20L85k22l4K68k89
2605a20K59n5l27L90j97m4L66m25K26J45l80L73j34j58K96k60J14J68l72L73k45
2626gk5K47l52K65o8k27L35j97o9L06l69K14J08m27M19j20k32M54m22J06J79l80
$$ y = [-246, 225, -133, -124, 237, -308, 13, 110, -369, 176, -113, -211, 210, -191, 9, 39, -241, 206, -91, -90, 264, -283, 13, 137, -202, 200, -21, -124, 190, -176, 13, 104, -236, 212, 15, -105, 300, -159, 39, 186, -258, 202, 4, -130, 264, -117, 56, 229, -120, 108, 37, -93, 275, -136, 12, 291, -211, 148, -23, -149, 223, -165, -20, 162, -268, 139, 67, -153, 212, -114, -28, 204, -283, 124, 13, -178, 224, -108, -28, 180, -228, 137, 8, -222, 240, -146, -62, 132, -183, 115, 86, -175, 251, -126, -114, 184, -340, 75, 95, -188, 174, -84, -130, 163, -222, 80, -16, -229, 116, -66, -107, 154, -202, 49, 99, -233, 183, -82, -182, 155, -187, 48, 92, -228, 157, -65, -99, 169, -120, 139, 84, -243, 147, -50, -94, 272, -153, 73, 218, -162, 211, 77, -81, 215, -45, 69, 237, -135, 238, -7, -32, 215, -137, 128, 60, -167, 168, -29, -98, 208, -161, 53, 161, -266, 153, 33, -199, 255, -167, -61, 118, -262]
2648b62L46n8k54L20k47J31J81l70L34j13j31L38l76J42J62l63L23n5j75L55l14
2669h6M9K46m00L07o8k22M13l53Q2J62k92K46o2j37L17l48R4K49m63L93j09k13
2691a95M88m05j2L09l79K88M6k81L13k05o0K82l45K52j5k08K80j94k6K20k46J68
2713G5Pj69K79k28l0L13m01K78nl15M11k03r6L04l51J79R7k86K90j45r2K52l44
2736a80K00R0l27L69k22j00M05l71J34J07l31L69j74j47L68l08J40L4k88L63k00
2757f9m3K45l21J72O5l05L77j49j34L14k58L4J77k86K72j07j07L40l61J74J34
2778A64l69L52r4k37L62k48N3K32l63L05p2k14K60k22R9J48l07K99j62j24L05
2799A67k29Q0J78l44K61k7j84K64k01mJ96l12L00j29k13L74k70mK52l07K03M0
$$ y = [-262, 84, 26, -228, 92, -155, -24, 157, -213, 121, 8, -123, 215, -161, -19, 143, -220, 103, 48, -127, 228, -86, -37, 209, -191, 116, 48, -174, 239, -114, -32, 130, -162, 84, 22, -115, 202, -146, -52, 197, -266, 127, 18, -195, 293, -112, -124, 185, -194, 94, 140, -141, 172, -33, -93, 189, -156, 96, 81, -127, 153, -41, -67, 153, -93, 75, 82, -87, 192, -36, -66, 247, -154, 124, 119, -196, 215, 12, -84, 220, -131, 48, 145, -141, 149, 4, -88, 164, -180, 20, 110, -217, 152, -70, -170, 235, -136, -2, 105, -226, 143, -31, -178, 190, -118, 22, 56, -232, 131, -69, -112, 133, -188, -16, 49, -256, 121, -28, -162, 152, -106, -72, 105, -181, 91, -16, -123, 217, -144, 30, 164, -205, 147, 53, -184, 178, -70, -17, 215, -148, 157, 85, -129, 131, -91, 8, 156, -151, 148, -14, -138, 167, -62, 18, 196, -148, 113, 86, -98, 166, -35, -39, 157, -155, 145, 16, -197, 177, -93, -97, 155, -152, 51, 91]
2821I1k65K57j78m0K99k95J23O3k47K90j76j2K51k87J53L0k59L93k59o8K56k68
2843a48J53M4k63L73k80j1L03l83K29Q0k63K91j61j25K92l05J86O9k73L42j74
2864b4q9K14k76K02Q9k45J94j02q5K94k41J02R3k27K27r2j54L51l27R6J38k73
2886a35L11j52j45L33k74O4J67k59J73Pk11L31k97N4J74l05K52k2j94L00k96M0
2908h4K42k81K00m7j75K87j92j4J98l14K32k9j44K09j54K5J64k77K56j8k16K62
2930A30k20J3K24l59K63Pk74L33j77j8K64l38J94Rj94K36j36o4K06k91K06P5k62
2953a73K99j10p1J44k22J82J1j95K66j31r9K18k83K20K6k25K72k16NL09l29K03
2975A01J05l41L44k21j06K76l02K07O6k62K75p9j33K51k34Q7L5k15J97K6j34K37
$$ y = [91, -174, 83, -95, -135, 164, -131, -8, 55, -192, 98, -78, -90, 161, -126, 27, 57, -202, 191, -68, -136, 120, -148, 5, 49, -214, 159, -121, -132, 171, -212, 17, 97, -166, 125, -36, -161, 131, -174, 12, 81, -192, 150, -24, -113, 101, -175, 27, 116, -129, 65, -37, -122, 172, -69, 33, 126, -101, 126, 34, -120, 231, -96, 0, 138, -135, 176, 24, -121, 212, -62, 2, 169, -90, 83, 90, -121, 210, -87, -33, 141, -164, 88, 66, -128, 172, -124, -84, 158, -123, 77, 30, -145, 142, -50, -64, 134, -180, 52, 23, -121, 88, -66, -41, 123, -154, 102, 84, -132, 130, -90, -77, 147, -212, 51, 58, -216, 117, -60, -78, 186, -152, 42, 51, -143, 93, -43, -107, 99, -192, 14, 89, -173, 126, 16, -55, 89, -133, 49, 60, -135, 131, 0, -99, 119, -164, 56, 82, -143, 129, -87, -82, 227, -102, 101, 206, -135, 209, -12, -118, 158, -144, 63, 129, -133, 142, 63, -70, 181, -53, 34, 69, -146, 51, 77, -57, 180]
2997A80k89J53J8k31L15j13j63K93k73R8J31k51J84n0j38K89k39N2J48k92K14
3018C6J1j47K10j34k8J61k54K18m1j94K82j90M5J52k93K51m1j52L07k61R0J29
3040A57l20J72L0j06K00j74n0K34k79J76Jj89L14k43O2J46l16K40k8k04K59r9
3062a7m9J90j65R6K0j92K96j78q9K68k05R1M1k40K73k27M0J91k48J82M9k15K18
3085A30j85j5K15l14K01J00k68K17m6j10J62k60J84O4k33K32p4r7K64k51O6P4
3107E6j97K26j32q2K18j51NJ76k93K90j08j34K75k66O8O0j83K42p1j38K67k15
3129h7M0J50k90K12%j22K54j90L1J23k19J73M6j44J78k08O0J47k16J40k8j76L17
3152A91j95jJ85k44J32j8j56K80k23L1J34k76J99lj80K55k28O6R4j50J48P1k57
$$ y = [180, -109, 44, 62, -169, 146, 33, -130, 163, -110, -12, 119, -132, 52, 2, -136, 153, -86, -34, 114, -178, 36, 47, -100, 110, -24, -52, 109, -145, 73, 32, -162, 120, -70, -25, 127, -166, 85, 44, -108, 199, -62, 28, 157, -163, 9, 39, -67, 133, -41, -91, 143, -136, 40, 41, -148, 166, -77, -15, 131, -185, 55, 27, -177, 82, -17, -66, 124, -41, 55, 75, -117, 179, 1, -88, 180, -25, 66, 107, -133, 140, -87, -47, 144, -104, 78, 127, -88, 130, -55, -70, 145, -169, 32, 132, -136, 81, 35, -75, 87, -173, 11, 75, -158, 74, 0, -97, 167, -84, -18, 56, -141, 85, -47, -129, 89, -62, -57, 119, -174, 116, 8, -126, 149, -117, -49, 11, -172, 70, -1, -139, 128, -87, -47, 103, -187, 25, 25, -97, 157, -33, -2, 121, -98, 75, 121, -23, 155, -53, 7, 154, -62, 78, 50, -126, 191, -4, -5, 180, -64, 68, 50, -106, 174, -49, -18, 116, -160, 39, 36, -144, 111, -117, -51, 43, -107, 41, 112, -145]
3175a45K55j69J2K09k69J43M7j71K18j90mJ43j43J08K6j39K11j81OJ57k20K40
3197A44k0k66K78j81p5K87k56J08O2k18K00p8j00K94k71N3O8k25K76r1j23K23
3219H9j80P9R1k29K10j07k7J73k15J11Q9k25K66j24r7K07k27J58J05k73K30l0
3241G4j53K08j73N0J26k54K61p0j32K22k21P7J13k24J34Rj70K43j53l3J36k12
3263a42J91l5j49K48j73J4J10j73J04mj27K57j79M8Q9j37R3Mj52K41j91k3K41
3286A55k96J98Lj54K03j27n0J91k21P2Q9k19K60r9q5J16j68J50O6j98K58k06K5
3309c7J22j88J21J2k02K86k17qK00j83J51N9k38K13j06n4J56j72J03Qj44J80k7
3332C5j11J79k18J60L7k09K60p9j30K54k24N4O7j49J42p5q1J73j32L9R7k65K52
$$ y = [-145, 110, -59, -47, 162, -107, 36, 83, -88, 130, -60, -64, 79, -64, 44, 70, -69, 142, -39, -33, 124, -96, 144, 124, -142, 136, -45, -120, 167, -89, 19, 81, -137, 63, -15, -115, 179, -92, -39, 29, -196, 80, -11, -134, 89, -91, -12, 79, -150, 60, -47, -74, 99, -116, -5, 84, -141, 125, 1, -96, 111, -116, 42, 147, -126, 104, 74, -79, 129, -44, 6, 132, -122, 139, 69, -63, 159, -62, 15, 128, -96, 38, 47, -123, 120, -33, -66, 70, -142, 49, 14, -135, 113, -60, -46, 64, -109, -5, -9, -136, 121, -58, -10, 79, -58, 35, 39, -113, 128, -63, -86, 155, -141, 57, 60, -94, 109, -18, -68, 123, -98, -26, 63, -156, 104, 5, -80, 36, -132, 18, 84, -114, 144, -62, -37, 85, -103, 18, 30, -172, 114, -103, -111, 89, -94, 57, 116, -122, 91, -15, -69, 87, -85, 18, 26, -118, 62, 35, -76, 103, -115, 45, 82, -127, 133, 54, -76, 178, -46, 8, 75, -74, 68, -7, -88, 85, -47, -8, 89, -176, 76]
3355G6o1r8J79j65K7J19j91J62r7r3K58k36M7J33k54K18o3q3K19k21J24N1k24
3378a73K24k0k17K77j73J4J63k47J50L3q8K21k24M5J35k14J34k6j15J54o4m5J60
3401A04k06J16P1k55K48j35oJ41j97Q3Q4j97L07j90o3J91k40J15O1j23K12j21
3423@r7K57k50R8J6p6J29r5m7J44k02J04R2j68K47j38o2K54l07Q5J33j86J27o3
3447en4J66k16J06J17k48J72j6j43J86j74J14M0j53J36l0j38J99k24J16J16j97
3469a30J40j6j21K46k00L3J36k70J76l3r3K41j77K0J74k42J14qm7J14j49Q3N9
3492E0j66K06p6j36K18j53N1Q9j77J49k3j32K20j64K1J35j90J26m1j06K67k47
3514g9J3J72j89J35j6r3J96j82J8J51k33R1Q6j38J91j43n6K09j75j0J22j80J77
$$ y = [76, 15, -83, 96, -69, -42, 77, -114, 48, -49, -142, 116, -120, -73, 60, -194, 24, -39, -122, 97, -124, 0, 51, -173, 51, 31, -186, 91, -82, -68, 95, -152, -2, 31, -57, 164, -60, -15, 120, -94, 40, 14, -101, 53, -11, -56, 104, -102, 14, 85, -170, 78, -57, -63, 78, -119, -36, 48, -149, 158, -32, -95, 96, -144, -29, 32, -91, 121, 0, -97, 160, -90, 8, 24, -52, 77, -18, -65, 79, -123, -19, 73, -95, 152, 14, -48, 206, -101, -16, 117, -69, 58, -5, -59, 107, -109, -3, 114, -134, 38, 22, -121, 65, -109, 5, 45, -108, 28, -2, -140, 59, -165, -49, 67, -130, 10, -6, -127, 119, -81, -48, 88, -182, -6, -39, -132, 109, -68, -48, 126, -116, -2, -10, -57, 57, -92, -9, 50, -116, 90, 14, -122, 96, -57, -6, 83, -94, 55, 32, -100, 120, -44, -23, 112, -78, 48, 7, -99, 168, -79, -66, 106, -83, 52, 36, -57, 139, -43, -25, 126, -107, -16, 70, -68, 123, -20, -76, 133, -42, -52, 70, -110, 67]
3537F7m0p8J82k62J67M2k23K44p6j14K39j90Q9L1k16K25o3r8J55k35J31J13k24
3560a34K13j07k1R6j40M4Q1j72J96k9j54J43j14R1N2j39J67j09o7J69j41P2R8
3583I5j84J54l4j15J98j90O6O4j85K24r2q1K34k11L5J41j55J20Mj64K56j91j1
3606b2N9j47J92m9j32K40j60J0J10k65J95k4j00K21j10n4J33k51J66m1l8J69j61
3629e9K3J00j77J90q1j20J92q5NJ46k75J91J6j56K05j22n6J84k22N5J18j78J73
3652F7j17m1J79j93R9J8j43J67o9j7Q9j17O7M2j41J93j38j03K94k29M7N5j36K27
3676A00j69k4K26k61J20Q9k13K01l7p0K17k50NJ16j11J66o0j12J92j56M1Q9j65
3699f6J25K5j40J61j63J27K7j71Q1J6j37L18k35N6Q6j71J58p1j27J66p7k5J68
$$ y = [67, 27, -51, 131, -131, 36, 78, -145, 99, 23, -91, 148, -42, 47, 78, -138, 87, 24, -74, 81, -154, -23, 90, -134, 79, -28, -49, 47, -93, -49, 32, -140, 56, 27, -127, 16, -98, -7, 45, -94, 73, -36, -103, 66, -75, -3, 95, -89, 65, 31, -84, 114, -76, -10, 54, -131, 93, 1, -80, 154, -57, -22, 119, -36, 84, 88, -76, 180, -11, -22, 37, -110, 82, 33, -99, 141, -19, -9, 101, -164, 31, 7, -93, 128, 18, -36, 97, -154, 12, -29, -67, 102, -59, -36, 64, -113, 77, -4, -124, 68, -17, -12, 134, -141, 50, 66, -90, 115, -7, -63, 121, -101, -46, 72, -106, 67, -50, -91, 88, -105, -6, 12, -131, 36, -33, -50, 39, -78, -11, 31, -110, 83, -55, -158, 136, -93, -46, 9, -127, 100, -69, -93, 133, -128, -8, 81, -132, 69, 32, -38, 179, -71, -66, 50, -61, 105, 45, -67, 125, -31, 10, 99, -66, 59, 84, -56, 105, -58, 69, 96, -75, 6, 22, -115, 203, -32, 24, 110, -61, 97, 26, -101, 65, -12, -37, 131]
3722A31k33J52l7j48K09j78K6J24j88J84k1j54K26j29rJ71k14J49q4r3J92q7L0
3745A9Q8j96J10Lp8J84j72PJ41k40J82l8j36K27j26k6J48j57P2L1j71K32j67l5
3769i8J88j58K6N5j01J54n3j21J87j66Q7O5j52J22o0j6J39j12L0J19j72P8j3n8
3793c0J56j54L6R6j80J87n7n1J10j69P1Q9k44K24q1q0J60j54L4L8j22J24jq5J04
3818B1j17M3Q7r0J26q3n8O7o3J14L2j97J28n6j01K45j54nJ95k68J42J3j45J62
3842C8p6m2J83j47N8jq9J61p0k5M8j12J42k1q6R0r4O2Q2j40R5nj70K00j00m6J38
3869G3k04J91l6p4J03p5oJ02k02J86o6o7J65j25j8J65j21n5P3j09J90j04j9J37
3893A04j48P6N8j82J89j24pJ20j58L7J31j97J84r5k5J38k12J55j8j15R9nj14J87
$$ y = [131, -102, 50, 13, -135, 74, -104, -78, 46, -142, 42, 21, -133, 93, -36, -45, 126, -88, 61, -23, -116, 76, -11, 19, 107, -89, 21, 24, -54, 130, -42, -35, 106, -134, 48, 10, -126, 101, -25, -51, 97, -60, 12, 43, -128, 104, -63, -98, 90, -68, -42, 13, -88, 66, 13, -108, 79, -87, 0, 65, -87, 35, -25, -41, 98, -14, 16, 135, -37, 41, 28, -30, 126, -28, 8, 104, -76, 111, 54, 3, 113, -56, 15, 104, -140, 84, 3, -77, 83, -71, -37, 1, -121, 3, 2, -83, 21, -96, -53, 34, -56, 70, -13, -71, -4, -67, 47, 79, -118, 10, -46, -147, 98, -56, -61, 134, -134, 8, 21, -124, 38, -38, -80, 103, -44, 14, 13, -76, 85, 15, -10, 38, -74, 68, 47, -39, 51, -43, 19, 101, -39, 56, 51, -119, 81, -19, -65, 73, -131, 60, 24, -50, 53, -22, -28, 74, -128, 58, -8, -75, 90, -35, -53, 112, -9, -64, 9, -100, 90, -14, -33, 104, -44, 32, 90, -92, 97, -27, -34, 86, -72, -35, 96, -101, 83, -12, -37, 101, -111, 44, 26, -89, 10, 5, -109, 78]
3917G8j44L5Q7j31J10k2r1J55j71J03K2j67J94m6p1J60j72R8L7j71J57q6l1J40
3941G3j09L4Q1j41R3pj43K68j88PJ29j95J78q1l7J77j57l1J63k02J10Rj15K15
3965A31k12L9J13p4J02j20l7J20j52N5J76k04K6L9o0J35n8l7J80k34J22kj19J59
3989H8j28k4Q8j31R0Q4j05J23j44L9J53k33N1J08j22Q3nj05K13j86M7N3j48J54
4013D3q3pJ72k20N2J13j62J72n0m9N9j43O2L7j00K15j15j07J49o9J5J35k26K06
4037I9o4j15J31q1K2K8j18J24j5l6J27j14K1N2j02O0Np2J34j31O0N4j25Q9jp1
4063c9J18r7J2J11j43J7Q6j12J54j82O8J24j53O2m3r2J70j25jJ46j50N1M9p3J32
4088I0j26J06pr8L7O4j31J29r2r5J99j29J26k9j54J99p9l7J02j70Q9M0j02R1l3
$$ y = [78, -66, -31, 56, -75, 35, 13, -78, 77, -94, 9, 31, -136, 58, 12, -59, 101, -71, 27, 64, -107, 50, -36, -67, 73, -36, -2, 79, -62, 31, 24, -119, 149, -39, -32, 97, -98, 80, -1, -38, 139, -18, -49, 114, -88, 22, 31, -84, 131, -81, -42, 71, -3, 99, -21, -58, 62, -90, -35, 141, -63, -37, 2, -58, 77, 19, -18, 162, -72, 50, 48, -71, 88, -40, -64, 24, -107, -17, 67, -38, 85, -59, -20, 133, -100, -49, 59, -63, 20, 15, -90, 123, -63, -16, 37, -111, 43, -40, -47, 125, -95, -43, 70, -92, 80, 30, -19, 40, -103, -41, -4, -104, 111, -4, -111, 38, -31, -16, 119, -107, 99, 35, -80, 51, -30, -8, 20, -98, 26, 11, -25, 102, -12, 9, 61, -41, 19, 24, -48, 86, -45, 15, 69, -56, 33, 32, -39, 79, -18, -6, 105, -38, -21, 65, -47, 107, -75, -7, 117, -36, 26, -17, -109, 61, -64, -65, 81, -69, -18, 31, -42, 90, -36, 70, 63, -35, 2, 66, -65, 64, -28, -123, 76, -53, 73, 44, -110, 89, 10, -27, 75, -95, -6, 34, -68, 23, -10]
4113a0l8J46j20L9L4j52J75j10o1K06j77O9K9p8R5n3n1J28j26O1P6j44P7jo0J15
4139F9r5RP4j60J54j1q1J16p0j3O4j12O7K1p2J68j72L0J43j60R4o6l0J61j17k9
4165a8R5r6K8L6j16R9p3L5R2j55Q3lq1J71j13mM9p7M3j3n3O6n7QQ5r7J01mj07
4194g6J50j08nJ01j38P9J1j13J54j37P5O7j65J03L5j29J83j10l2J22j21J25j4
4217E7r6J11o0k8P6j57J48Qj11O3n8N2N4j46Q1K6j24J70p9p1J69j60Q9J5p6P3
4243B6k4n3J09p7QJ3j20J46qp4J31j12P7M2j24R0K4q7J00j02m6R8j30J10o7J8
4269c2J03j34L6J01r9M4k1q5J35r8K6L3q9P1L9j25J56r7M4P2j76J32J3j34J01
4294A6l8pN1p6R4l6m5J38q9k5P8j11P0L9j36J29no7R9q6P4l7n2J56j46j3Q6r4
$$ y = [-10, -48, 98, -22, 17, 51, -101, 74, -36, -97, 109, -68, 1, 30, -48, 47, -6, -57, 71, -55, 6, 82, -62, 15, 14, -46, 69, -26, -17, 57, -103, 51, 40, -41, 75, 5, -8, 56, -56, 11, 32, -40, 128, -44, -14, 129, -31, 63, -3, -33, 128, 11, -18, 77, -19, 9, 45, -71, 28, -45, -10, 82, -73, 10, 7, -74, 97, -16, -20, 29, -48, -5, -18, -71, -5, -62, -54, 31, -66, 35, 31, -76, 74, -34, -39, 62, -76, 3, 14, -99, 55, -82, -7, 60, -105, -2, 33, -96, 87, -23, -55, 67, -54, 71, 57, -39, 72, 12, -16, 60, -97, 51, 59, -52, 11, -47, 5, 59, -87, -6, 20, -104, 66, -13, -84, 85, -75, 14, 29, -47, 26, 2, -51, 58, -19, -11, 2, -118, 28, 20, -54, 77, -35, 42, 84, -40, 50, 74, -13, 87, -15, -61, 37, -93, 17, -50, -32, 71, -63, -27, 74, -25, 19, -2, -87, 48, -50, -24, 9, -80, -9, 30, -95, 61, -36, 8, 80, -96, 36, 49, -85, 16, -22, -29, 22, -54, 40, 4, -41, 97, 8, -17, 61, -50, 20, 59, -77, 52, 47, -20, 79, -7, 67, 30, -22, 134, -12, -25, 61, -33]
4322c3N1L8j53J48m7p3Q5k3j3km0R9Qo5O6j02O8P6j90J50p1L0m8J2N4L1p0N5j1
4351C0m0J29j72M0M9j04J61n1p4J09j08J7O1j10J27n0r9J48j21P1K3q6N4j1m5
4376e2O6n3K8K8j12N6P2p1Q9j35kR4o2K3M1p1J67j52O8Mp1P0J5q8J40j12k3J75
4404A32j73P6mm6Q7j07M8O1q7P3l3j08R3J7o1J40j73L7N2q0Q7n4j3J04j43N9K1
4431Eq2J26o1l0J30j66R4K3j38J84q4m3Q7q5N3K1q6J10p5j5J92k02qJ40j41Q5
4457C4j3l4P1j38N2R8j36R7m0j22J44j16R5P2j32J38j02m2J60j71R3O4j56J69
4481H5j05o4J20j11J09J3j46J31m0p5J28r4O1N6n9K2mj35K00j33N4L8j80J67k
4506C6p2J32j00L0N3j33Q4l6r4J19m6L5J06j62M6J0q1P7L2m8O4p9J1M4q7J00k4
$$ y = [-33, 18, 56, -97, 51, 4, -69, 16, -7, -20, -22, -62, 37, 45, -20, 46, -56, 12, 88, -102, 48, -23, 7, -41, -29, 25, 56, -14, 41, 30, -10, 119, -53, -13, 36, -68, 93, 42, -32, 77, -31, -14, 47, -63, 64, 14, -85, 63, -58, 13, 36, -50, 4, -7, -52, 14, -39, -11, 17, -95, -39, 33, -38, 51, -84, -86, 8, -54, -31, 10, -61, 106, -46, 22, 26, -45, 25, 40, -48, 92, -20, -43, 132, -41, 35, 31, -15, 72, -35, 13, 74, -13, 60, 27, -81, 12, 29, -32, 108, -65, -28, 24, -56, 31, -23, -36, 68, -75, -16, 5, -77, 49, -12, -42, 88, -78, 16, 39, -99, 85, 1, -42, 45, -40, 13, 34, -52, 58, -17, -32, 160, -42, -50, 90, -51, 34, 21, -13, 58, -80, -28, 70, -66, 31, -9, -131, 13, -103, -8, 64, -68, 70, -32, -74, 86, -85, 8, 72, -84, 85, -20, -84, 36, -75, 34, 47, -99, 32, -8, -83, 45, -49, 12, 68, 9, 31, 27, -108, 92, -41, 13, 51, -129, 38, 36, -36, 96, -4, 26, 79, -54, 30, -6, -100, 19, -27, 8, 114, -48, -2, 8, -73, 4, 36, -12, 52, -27, -16, 28, -59, 41, 17]
4533A7q6J03j19R8L5j27O5kq9J25j23R0O7j06J03m1r4J22j73J30Q6j92J87m5l7
4558fR1j55Q0j8o4Q9P2j09J06j58O2O3j73Q1m2R2L6j11L6J19j62Q4q0j0J41r7
4584c3p4J74j62Q9K7r5J56j40O3O5j41P4m1o0J37p1K7K0j00J17J1n3P8o1l5Q6
4610E8p4P4J2r2J34j32p7Q1n7J14j7q6R3j06J3J49j42J25q5o0J38p6n4P8r1O7
4636a3O2j65J61j08L6P7r4L9N3j21J18p6P5L3r8mK8q7J48q1m8J43j50J14Lq7P0
4663B8o9J2Q3j23N5K6q0J25j9q7J21j01P9J4j77J55j6m7J11j57NP3r6J37k1o2
4689c1P2m9M2Nj32P1O4r1J54j50J7J15j25N0j2m2J18j63Q9J0r3J58n7o7J10j38
4715g5K8O6n0N7K0p6J29j53K2J10j18O5k2o0J01j06N6O2j65J64p3r9J41l2k2J04
$$ y = [17, -69, 34, -85, 13, 48, -79, -14, -16, -105, 20, -103, -13, 54, -52, 51, 10, -84, 38, -135, -5, 81, -111, 76, 31, -6, 85, -70, 10, -8, -72, 17, 89, -20, 86, -72, -10, 53, -120, -39, -81, 11, 47, -64, -28, 91, -71, 13, -67, -77, 64, -33, -107, 67, -95, -6, 21, -74, 82, -58, 5, 70, -71, 3, -38, -98, 39, -32, -5, 15, -85, 32, 43, -10, 68, 7, -28, 58, -16, 58, 70, -22, 112, -20, -97, -16, -73, 41, 24, -62, 31, -75, -62, 87, -55, 70, -15, -75, 63, -13, -67, 11, -80, -13, 49, -116, 45, -63, -27, 50, -44, -5, 48, -73, 45, -31, 44, 77, -21, -25, 3, -84, 64, -17, -65, 78, -72, 42, 45, -42, 28, -41, -29, 54, -69, -14, 12, -68, 57, 38, -49, 72, -29, 50, 64, -113, 42, 26, -21, 90, -67, -62, 11, -85, 52, 31, -31, 41, -8, 34, 39, -93, -22, 42, -49, 105, -45, -28, 87, -38, 12, 0, -42, 76, -87, 2, 12, -81, 77, 20, -47, 63, -75, -47, 19, -31, 26, 46, -30, 99, -54, -32, 78, -40, 25, 3, -57, 44, -62, -6, 56, -109, 55, -18, -117, 24, -8, -30, 74]
4741G4j87Q1P6j55Q8k9k8J40j64Q9L2j39J92q4RQ5j32N1O4j61J64m5o7J15j57
4766h8J43j9j43J48nj00J31j57J34kj11J44j07k5J27j19Q1pr0J17j20k8J78j30
4790d8l0J24r3J11rp7R2j30M9N5j12J50j16m6J82j51P5Oj81J63J4p1J21p3l4J04
4816G5j01O3l9p2J19q3J9M6p3O7j8r0J76q0k6J07j49J22q5j18J88o6k1M6p3J01
4842C5o8k4J29j11k7J37j51Q6K1p2J36j50K2R2j43J63l7q4J13q9pJ30j15O8j4
4867D0m5R2j43P6K8j02J11Qj24J21n7lL0j02L7J10r8N0q6j5J26j59M4N5m4P4k5
4894aq6J13j03N2N4j01J08k1m3Q4j10Q2M0j26J48q7k9J66k26N3M9j12J91j24m9
4919g8J54j24K3Q3j15P4m3j4J06j58Q3M3j59J27J8o5O3p0j4R9j19J64o5j13J93
$$ y = [74, -113, -32, 44, -111, -23, -52, -80, 60, -104, -15, 17, -122, 70, -14, -5, 80, -52, -1, 63, -98, 66, 21, -46, 69, -88, 55, 36, -107, 41, 36, -64, 67, -90, 44, 42, -69, 75, -32, -57, 70, -49, 32, 25, -65, 52, -68, -96, 82, -48, -78, 46, -47, 64, 55, -22, 70, -60, -11, 44, -68, 82, -34, -80, 102, -49, 26, 32, -149, 14, 28, -43, 78, 5, -29, 75, -26, 37, -2, -74, 45, -38, -19, 27, -46, 21, 3, -87, 89, 9, -17, 90, -59, 63, -22, -140, 48, -18, -39, 7, -66, 35, -33, -57, 72, -39, -66, 71, -80, 6, 27, -45, 91, -59, -37, 55, -88, 75, 38, -46, 67, -22, -29, 101, -14, 54, 40, -5, 87, -56, 20, 48, -54, 57, 65, -59, 62, 5, 2, 32, -70, -33, 77, -21, 29, -57, -72, 54, -105, -61, -6, -50, 24, -1, -87, 26, -77, -25, 29, -72, 36, 15, -28, 56, -54, 28, 68, -58, 90, 3, -26, 140, -86, -33, 16, -96, 95, -29, -78, 76, -48, -25, 58, -57, 17, -26, -40, 66, -92, -9, 34, -125, 2, 20, -45, 18, -52, -66, 33, -86, 78, 13, -100, 93]
4944I3j08J1R3j79R5j6k3J05p7k6J69j48M9N0j31J51j35K2J13j55N9P0j06J36
4968A12j44J0J34j58L5P5j18J20m5q5J04p0j3J26j51O0J9l5J04j22J6K1r9K11
4992A07j10j4N7p2L2L7j14J52q8p3J71j21k8J18j13J48p4m0M5p2P7N4j35P6Mo6
5018d2J08j30P0M8j44J07po3R4q8O4O7j25J10l1j08J10n4j8R0p8Q2l8r2J43j12
5044c7j0Q8j58J04%n9R8j03P8Q3j12O4Q0j63J37q2M9Mp0%M7p2J08j39L5R7j07
5071d0J12J1j85J96o0k6O6j50O9m8N3O2k4q6N8l1J3L5j21J54o2r8K26j33j6M7
5097B2q8R8n1m1J18j15N6N4j27J43q0o1J22n4n4Q0j06J06m3m0J16j04M5P2j12
5122d4Q7j00RJ26j37O6R3j67J13J5j04J12j19J09N7j06J9m5m0R3r8K9R0o7L7j2
$$ y = [93, -15, -4, 89, -90, 5, -11, -34, 71, -6, -32, 137, -11, 38, 88, -43, 108, -27, -5, 108, -47, 12, 82, -24, 112, -32, -22, 112, -46, -11, 64, -54, 66, 21, -64, 40, -30, -43, 83, -68, -8, 11, -24, 80, -42, -26, -5, -104, 107, -3, -17, 40, -32, 0, 37, -77, 75, -13, -86, 85, -36, -64, 54, -59, 89, 15, -25, 20, -52, 25, 79, -56, 20, 24, -42, 66, -64, 6, 54, -90, 17, 10, -53, 41, -47, 17, 84, -41, 69, 38, -70, 40, -14, -32, 58, -20, 62, 24, -68, 75, -37, -47, 41, -117, -13, -13, -72, 26, -77, 1, 84, -28, 36, 116, -47, 90, 8, 57, 61, -9, -9, 38, -34, 74, -65, -30, 67, -40, 72, 83, -102, 94, 34, 8, 74, -76, -7, -55, -2, 60, 36, -50, 8, -23, -10, 25, -96, 58, -4, -102, 124, -9, -25, 22, -66, 32, -19, -60, 58, -57, -1, 53, -74, 69, -11, -72, 50, -4, -58, 22, -84, 22, -21, -61, 55, -49, -4, 68, -44, 43, -57, -48, 78, -59, 7, 100, -67, 46, 61, -43, 69, -50, 59, 116, 10, 29, -16, -56, 37, -61, -32, 58, -9, 28, 16]
5148A6l1P0n5l3J14j34O8J9n7Q1j01OO8p4M7K8j22J23k9j2N3j05R0j0j19J94j31
5175c6RR0r1N4J2q3J23o2KR0j86O9N6r5J04p2L4M4j08R4m7q2J12o4n6J94p3Qp
5204C3j16J28q2j5J57j51L2P0j29J72j18LQ0q7J3rp8J34n8j7J31j22L8J09j30
5229a2P3m8m0Q8q5L3P5j46M9Pp9J00J9m8P6j10O8o0K5Q0j03J0P0j30Q1l0n6J63
5257G0p8K8J6j04J08k1n2J45j40K6N1l6O2q2l6Q0o3nN6j34R3M5q1L8k2O4Qj12
5285g6J08pq7Q8l9q8J28q8P9Oj43J28j0p4J02p4J05m0j16J37j56O5Q7j28J23K8
5311E8j40Q7%QM9j19J36J3j33J13m1m7J15j17k1L9q9J52o1m3J43j87J18k0r0J16
5337C9m6J4J2q1N5L6j15J23op1N3p1J9J22k08J65k5o1J17q8m2Q9j12J07m6pR6
$$ y = [16, -15, 55, 0, -33, 81, -53, 15, 34, -23, 58, -43, -37, 31, -43, 4, 32, -90, 33, 4, -8, 45, -60, 30, 20, -99, 95, -36, -27, 63, -28, 26, 38, -45, 78, 16, 18, 108, -78, -9, 47, -48, 56, -16, 18, 62, -46, 48, 1, -81, 31, -33, -89, 105, 32, 40, 33, -83, 45, -37, -52, 105, -46, -14, 56, -73, 99, -19, -16, 64, -23, -10, -19, -97, 37, -21, -38, 93, -29, 9, 118, -12, 61, 13, -27, 61, -24, 9, 84, -62, -13, -6, -85, 15, 34, -14, 62, -48, 20, -40, -15, 65, -38, -28, 42, -88, -7, -37, -93, 70, -8, 20, 36, -68, 40, 19, -33, 112, -28, -2, 49, 13, 75, -7, -43, 37, -26, -31, 25, -109, -16, 29, -52, -14, -36, 28, 36, -76, 32, 25, -62, 26, -13, -101, 27, -61, 18, 24, -119, 9, -1, -75, 27, -47, 58, 18, -98, 39, -117, -52, 35, -93, 30, 58, -82, 5, 5, 13, 62, -57, 79, 92, -41, 72, 31, -16, 99, -18, -39, 0, -89, 63, 2, -41, 102, -85, 33, 13, -77, 39, -7, 7, 19, -62, -7, 29, -86, 37, 31, -40, 13, -58, -39, 83, -125, 40, 15, -46, 71, -17, -59, 30, -82, 25, -21, -28, 68]
5364F8j15K8O8r0N3l4L4Q4j53K9P0m9K1Nj07J67n1o3R9j83J18K5o1J13j62O5M7
5391B6p6O9j9n8J11j23Q8j1p7N2L4q4J23Mo3Q7j41Q1K3j31J67n4m4J03j48Q4K
5418B5l8P5o0J0M9q1JO6j08J05o1m5J64j32M1M3j48J85j07K9L4r2M2k0p3Q3p3
5445h6J6J17j44M6M8j03P0J3j4L1m6rM4m1Q0l4k5J05p3j7J4JMk3J1L8k5L3K8j63
5475a04J05O6q2K5o8J9Q0p3M5J8j04J52j26mP9l3QOl9J34j31j3R1p5L3K2o1J26
5503I6j03n2Q2l6j3L3l7R4o9n7J54j66R7k7k1J9Pl7J39j25L3J5q2P7l0m6J11o2
5531fK0j9q1J42j28K6J01j33Q7J4r5J07j3p6J22j41O4L7j04J18k7j3J09j13K5
5556B3P7j58J51j24L2N3o8K4O6j68J34o5k1N2n2N8Q2j53M3J9k7N9m0OK3n8J10
$$ y = [68, -47, -19, 49, -41, 12, -22, 12, 96, -57, -28, 42, -7, 14, 19, -88, 79, 28, -35, 64, -119, -1, 24, -37, 76, -86, -21, 26, -50, 19, 0, -58, 53, -70, 18, 7, -70, -18, 16, -68, 55, 59, -4, 83, -58, 23, 46, -85, 82, 28, -16, 87, -61, 23, 25, -13, 62, 2, 12, 61, -20, -19, 47, -61, 44, -17, -62, 102, -30, 11, 54, -94, 91, -16, 13, 47, -45, -3, -23, -96, -13, -86, -70, 47, -97, -51, -3, -106, -36, -23, -37, -6, -52, -61, -17, -58, 22, -12, -37, 68, -5, -22, -8, -7, -3, -26, -15, 23, -2, 31, 59, -104, 1, 67, -15, 10, -58, -39, 41, -32, 13, 31, -73, 79, -47, -51, 28, -5, 3, 9, -30, 104, -27, -40, 51, -24, 9, 31, -30, 96, -7, -59, 23, -13, -26, 7, -30, 64, -5, -62, 92, -74, 23, -4, -25, -6, 1, -36, 103, -22, 11, 26, -56, 21, -9, -55, 56, -6, 14, -5, -86, 56, -72, -46, 55, -78, 9, 23, -72, 35, 22, -54, 68, -73, -9, 28, -76, 42, 15, 2, 111, -2, 23, 100, -58, 93, -31, 1, 54, -14, 10, 76, -92, 42, -23, -44, 8, -44, 14, 96, -57, -14, 5, -22, 37, -3, 3, 26, -32, 78]
5583G8p2J0L4p2MR0n8J8Ol9J31j54O1j4n2R4k3q0P7o2M8O8j76J50n9q4J73q6q6
5612g5J09o9M8J8p0M9J4m3L6o7Q5o1p0J12m9lN1l4Q0k0l7L3n4j5O9n7N7nj30J19
5642B1l2kN2o1j1K4l8P1k5M3Rq2M6L0p3P5l9RL5p2L2O2j23J57j09m3J15j58P6
5671a1R5j58J23l5r2J35p2lJ18j48N9L3k2Q9j38L4P6j72J49r5kQ4o2p2J62j37
5697f2J03j3n6J37j35J2RK4J3Oj20J21j06O5J5j42J89m5q8J52j34L5L5p5J09m6
5723Co9J30n3j3O5p7L7L0o1O1k8m5P2j09R5q2N2P0p7k4P5j24J10K7j54J56j04
5750c7l9J82j50M6po1R4m8M7J00j86L4J00p0N3j8j08J29j26N6P7j15O6L9q4P7
5776E1j07Q3L5j39J09l0l7R6q6K3K6q7J24j19M8J18j93O7L1j20J22K1r7J44j30
$$ y = [78, 6, 16, 50, -22, -18, 72, 14, 32, 38, -1, 130, -24, 37, 23, -29, 65, 42, -38, 39, -23, 25, 93, -83, 67, 8, -76, 97, 11, -75, 34, -35, 13, 31, -39, 10, 24, -19, 17, -50, 35, -26, -96, 16, -33, -36, 15, -19, 61, 41, 4, 37, -17, -32, 37, -20, 37, 32, -98, 21, -11, -13, 39, -22, -33, -9, -47, 24, -1, 42, 51, -31, 15, 45, -28, 47, 8, 17, 52, -20, 12, 74, -49, 108, -1, -44, 71, -87, -11, 84, -74, 49, 14, -78, 57, -15, -18, 100, -48, 11, 44, 22, 111, -27, 7, 83, -89, 60, -35, -37, 47, -15, -87, 75, -62, 41, 28, -28, 109, -26, -14, -5, 19, 32, 38, -82, 39, -67, -2, 13, -129, 60, 15, -73, 79, -55, -20, 15, -60, 49, 3, -66, 64, 11, -2, 63, -14, 23, 53, -8, 53, 25, -20, 52, -57, 38, -44, 8, 78, 1, -23, 52, -72, 38, 65, -89, 67, -37, -76, 106, -44, 2, -5, -66, 28, -20, 27, 127, -59, -25, 75, 5, 58, 40, -68, 61, -65, -9, 68, -47, 19, 58, -26, 51, -56, 27, 62, -77, 32, 2, -35, 61, -25, -2, 24, -63, 61, -58, -10, 108, -85, -18, 13, -107, 15, 36, -61, 83, -47]
5801d7K7O5j21J16j6p4M7n5L4L2j02O3J9j9Q8n1l2L0p5P8J4j16J96j59N8M5j12
5828f7J09l7j09J50m0n7J25o8P3j01l9J63j06m3R9m7N2n4p0J15q1l1J20j29J12
5853C9l0l2R4r6j4J32j62Q6pm9J23j33K6O8n4N2Rq9Q3m9j6P7q4O0Rq4P3n0J6N1
5883D9o3m0P8q2J22j01k9J20r5M1j2m8R4n5m8J17j32J13Rr7J05p0o6J60j09N3
5909A4L4r7Q7n1j13J28q7J10J6n2M5k4j2L4k8L4Oj16J01j0o3P9o9N5oj07R8K2
5937B8m4J01j22N7P1j33Q2j9j07J32q4L9R0j51O7L6j05Q5o4m3J12l5n4N5j09J51
5963C6j9n4J00j02M5j7j1Q3m3k3N8r3M5N9q8Q9r8LM6q8O0N4n6M5m3m2J17j82J68
5992D9o5p1J29p8m8J14q2L2M1o8Q6n4p1J34j45J27Jp3R6l7q3J91k06J27J1j22
$$ y = [-47, -20, 45, -76, 40, 24, -50, -3, -58, -24, 8, -94, -31, -12, -31, 57, 6, -26, 4, -71, 7, 21, -95, 101, -58, 0, 45, -67, 42, 5, -104, 46, 6, -51, 74, 6, 79, -22, -61, 102, -4, -47, 52, 5, 57, 3, -67, 48, -33, -64, 56, -73, 39, 9, -23, 71, -25, -39, 93, -69, 17, 10, -39, 84, -49, -23, 45, -9, 43, 52, -37, 46, -3, -19, 58, -26, 34, 43, -41, 32, -18, -2, 49, -14, -54, 24, -58, 64, -37, -66, 54, -41, 0, -12, -60, 34, -21, -69, 48, -84, 29, 38, -59, 46, -24, -90, 70, -39, 14, 48, -49, 38, -13, -126, 2, -85, 25, 41, -11, 34, 10, -2, 32, 4, 38, 44, -72, 29, 19, -44, 35, -34, 21, 15, -92, 6, 28, -16, 85, -37, 20, 91, -42, 40, 21, -86, 46, -38, 1, 91, -60, 7, 43, -62, 23, -41, -84, 28, -7, -61, -6, -115, 36, 17, -37, 63, -39, 6, -11, -22, 61, 18, -5, 53, -40, 5, 64, -24, 65, -33, -30, 16, -72, -12, 42, -14, 31, -12, -54, 63, -119, 49, -16, -87, 42, -36, -84, 30, -52, -20, 21, -47, 39, -15, -86, 48, -97, 30, 31, -42, 54, 17, -66, 125, -81, 46, 57, -65]
6018f5N2L8r5J10l4m0N2p8Q3j8pJ12j36J4L3p2J02n8n6J02l3n0J04j63J24j9Q
6045A0J1m4pQ4j08L4K4k3K0Np3J44j31J50o9n3Q5j17O0L5r4O0K2q1N1L4j8L9j02
6074e2O9mp0Q4q7Q1K2j02M4K1r3J75j22qN7n2N8n3j6Q2k0j5P9j59Q8qMK0j0m9
6104c6O7j22P4J8j05J40l2m0P8q9kJ05j14J04o3M6L2j11M3M9r8P6mr7J48j43M4
6131c2M8o2N0ol1N0q8R7M4j53K07j30l7P0j25O2J35j49O1Ko4J00p2pJ11j60R4
6158A5k1PM1l6m3P5r8O5J3p3O8p9J08pq8L6ln8J12j09J37l7q8L6m0K6J31r2p8
6187h0J56j46R4Oq0Q8n5k7J26j05L5k6l6O5o9O6O9j37N7M2o2J27j54k3J54j59
6213g4J00Lj09J51q9k8R8q0L5J1m3K0l1J9Q5j04N0Q0j97J59o3k9J17j11L8Po9
$$ y = [-65, -13, 25, -70, 40, 6, -34, 18, -60, 23, 5, -2, 110, -26, -12, 21, -51, 51, -7, -63, 39, 6, -44, 60, -103, 21, 2, 10, 21, -23, -30, 54, -54, -20, 4, -19, 1, 6, -67, 77, -54, 96, 27, -26, 59, -58, 2, 37, -57, 3, 25, -56, -5, 29, 11, 50, -52, 17, 13, -57, 27, -60, 21, 43, -59, -15, 6, -87, 88, -34, -42, 15, -37, 21, -32, -48, 34, 14, -1, 78, -81, 7, -1, 3, 23, 13, -36, 31, -91, -17, 1, -104, 36, 4, -36, 42, -47, -49, 56, -58, 46, -17, 29, 61, -50, -7, 42, -56, 20, 16, -81, 67, -76, -32, 16, -46, 4, -2, -33, 17, -71, 26, 70, -83, 124, -6, -43, 27, -98, -36, 99, -50, 11, 13, -51, 49, -23, -30, 81, -79, 15, -6, 1, 42, 6, -37, 38, -60, 5, 18, -55, 13, -66, 42, 35, -53, -17, -20, -78, 34, -75, 62, 25, -63, -27, -67, -41, 90, -2, -80, 76, -70, 24, 30, -50, 38, -17, -44, 82, -23, 12, -14, -50, 15, -54, 12, 81, -56, 1, 43, -19, 108, -46, -69, 85, -74, 26, 29, -80, 71, -18, -46, 52, -28, 7, 18, -25, -5, -36, -17, 68, -36, 14, 94, -103, 56, -7, -36, 81, -30, 8, 15, -54]
6240e4N6Ll6O1o0rK8k5J12q0k7O0q0O9Lo1O2m1%M3n7NR2j51J32m0l2P4j10L3O6
6271C6j31J19nm9O4r7L7J12j41N2qm4J08q7M5pl7O7l0o0J08j26O8P0j12J00o1
6298ip1R3m5k0R4m7lNl3J09j10KO8r4P4Kr6N8nN0l8m4R2o1k7P5k8%K7q7Q3n4k4
6331f4Q5l5l3M9l5J0K9m2M2l6k4J24j74J13oo8K9L9j1l6MO8k3j2K8o1N8J02j44
6360b4K9k1p6J41o6m7J38r7J9O6j62J07k9M2N8j00M0R2j76R1k3n6Q2r0J00J9q9
6387c2O5J2k6N1p9oL7j05J26j02N2J8j3M3K3n8j1K7q2J03m3j8Pl1O0No1Q9n3j4
6417a6P3r2N7k3l3Q4q9K8K2p6R7rn0R0o4L1J4rMK6q1Q6p7j2P5j08O6k8rQ4p6m
6449a9nm7O8j7o5J68r9k1O7o3N6j8j05J13Pq5N4j2L0L8o4M7l1o7J72j73P0k4j
$$ y = [-54, 2, 5, -31, 30, -30, -39, -11, -36, 76, -4, -31, 29, -51, 18, 21, -40, 22, -19, -19, 24, -33, -28, 64, -87, 45, 5, -27, 47, -63, -30, 36, -95, 24, 19, -30, 34, -63, -26, 86, -55, -3, -11, -55, 53, -34, 11, 4, -33, 34, 4, -56, 52, -74, -6, 64, -48, 52, -9, -80, 13, -32, -52, 42, -5, -8, -3, -36, 73, -37, -35, 33, -61, 13, 15, -81, -23, -28, 22, -16, -60, 32, -29, -56, 19, -9, -9, 18, -69, 14, -40, -64, 21, -14, -47, 2, -33, -23, 6, -36, 6, -30, -54, 70, -104, 9, 3, -65, -36, 3, -8, -44, -40, 28, 5, -7, 21, -40, 18, 120, -24, 5, -16, -92, 49, -17, -64, 74, -23, -4, 62, -100, 7, -22, 20, 78, -22, 18, 110, -66, 25, 2, -54, 28, -62, 38, 57, -32, 33, 45, 19, 70, -9, -15, 22, -83, 43, -59, -7, 11, -2, 41, 64, 6, -5, 22, -60, 43, 0, -18, -11, -42, 18, 23, -38, 51, -2, -16, 57, -35, 22, -1, -34, 50, -39, -11, 11, -65, 32, 23, -27, 63, -1, 30, 44, 35, 39, 65, -16, 70, -7, -19, 56, -52, 14, -14, -23, 61, -15, -19, -24, -71, -3, -20, -85, 83, -16, -37, 30, -33, 23, 5, -100, 13, 20, -65, -11, -23, 7, 45, -19, 28, -3, -70, 102, -71, -1, -25, -26]
6478b6P6r3O5jn3L4K3r0P8j3M7J4j14N4L9k1M1q8k5J22j15J08l4n0O5l0l9O2p6
6507d0O3lq9P7l3l3Q0n3J0R6j15J35q8k2j9j8K0J1JKkk2R1p6J0J17k09R7M4p4
6537d2J19r4k2K0m5N1L2o9M3m4O2M5r8M6M0q6Q2p5k6L5l7P1j1l5P5j9n0O1n0M4
6567B3j2m5L4k3K6M4p0M2Mj04J57j18J08j8o2M2Ol6O6o4OK7k7qQm0O3o5K2Q2j11
6598d3N4M7j16Q2j9p0J06o9Q8l9m4L1j1j5N8r7O7J7o2Q8r3K7Q6q5J8J9n0R7r0
6627a8r3J65o6j4M5k5K1m1o5J62j05K4k6k1R4J9j02R4o9K1R7j01pO8o4M2p3L8
6655@L8n9M2k1o7Q8k7RM2m9Q2j8p6K7k7K0O6j41P9Np2J63o7r6P1k1J7K6p8J22
6685G8p0n6J11j27R8m8J5N3j03N5O2j18P4O4j32O8k2p3J11j05ON8m1O7N6j06N5
$$ y = [-26, 50, -43, 22, 21, -32, 2, 25, -65, 13, 0, 47, 61, -53, 1, 40, 19, 60, -28, -53, 69, -46, 62, 28, -22, 43, 13, -26, 36, -40, 23, 20, -69, 8, -25, -58, 22, -31, -21, 75, -40, 95, 7, -15, -34, -52, -32, -21, -20, -18, -20, -42, 49, -27, -17, 100, -109, -12, 32, -42, 77, -17, -39, -19, -64, -13, 19, -50, -7, -51, 11, 56, -42, 4, 44, -42, 40, -35, -61, -26, -63, 8, -3, -38, 37, 18, -32, 29, -21, 23, 11, -34, 0, -23, 3, 47, -23, 19, 23, -81, 76, -42, 66, 48, -14, 28, 34, -2, 64, 0, 6, 33, 6, -2, 6, -34, 29, -36, -14, 68, -43, 11, 58, -58, 24, 5, -65, 41, -28, 60, 21, -23, 8, -3, -18, 40, -57, 10, 27, -35, 53, -40, -13, 73, -12, 6, 25, -25, 72, -18, -111, 54, -12, -26, 19, -6, 15, -26, -91, 71, -34, -10, -36, -57, 37, 56, -46, 48, -21, 0, 97, -4, -11, 57, -7, 35, -38, 0, 38, -21, 21, 0, -67, 21, -6, 3, 45, -4, 78, 60, -16, 11, -16, 4, 70, -71, 8, 13, -59, 104, 37, -59, 12, -9, 8, 34, -44, 78, 8, -48, 63, -64, 34, -14, 1, 54, -49, 6, 68, -50, 24, 88, -44, 24, 2, -71, 40, -65, -59, -1, -42, 25, 81, -25, 30]
6712C0r1O9N3j28R1kr0J18l5n8O3j27J33l8p8J33o5lJ21j52K4J1n2J41j06J8N3
6739C3m9J2Pl2J05p4l1Q6r4Q3k4k3lOJ9N2j10J4K5j9O7o0L2K1m2M0l1J8m0J5k5
6770b2Q4j17R0l5OM8l8k9Jj6M0l8l1Q7m8O1n8k1M7L4l9K9n9L2L5k4rk5M1M4k6
6801D4n6J1o3P2K1j2j4k6mM1l5M7n6k4J05o8L4P2j18P2l8m8K5loO7m9l9J04j04
6831d8J41j35O5Jq4M4M9j27J62n4l2N9q4M8K7n1J10q3k9N2j8M3k4n7O8l9n6J07
6859E5j10N4M5j08M7j9J4J30j75Q6N6j09M4m4n3J28j8l9L1n3N8km6L9k8m0J03
6886D6j08N1M8p3L1j8O4j3q9L4Q0j47J25j20M8O9q5N9K2m3J07j17mK8k6Q6l2r5
6914g2J01J4k3Oj14J12n4p3J08KqL0n9N6Jk5M0km2L8n7J2K4m1N8kk5P6r9Q0o4
$$ y = [30, -61, 8, 61, -67, 24, 22, -68, 50, 15, -43, 20, -107, 26, -12, -90, 43, -22, -25, 96, -56, -32, -21, -73, 68, -38, -20, 33, -16, -4, 3, -29, 76, 2, -29, 57, -37, 46, 22, -1, -4, 2, 21, 73, -37, -23, 2, -17, 50, -10, 22, 43, 1, 41, 10, 28, -12, 3, -22, 62, -55, 35, 0, 6, 54, 16, -13, -12, -28, 12, -26, -57, 30, -18, 43, -15, -36, 11, 45, 6, 35, -24, 8, 43, 19, 10, -15, 26, 70, 44, -12, -1, -64, 8, 29, 17, 3, -23, -27, 14, -21, 26, -30, -54, 51, -17, 17, 89, -29, 43, 5, -43, -18, -21, -27, 40, -9, -48, 56, -48, 93, -42, 23, 24, -60, -16, 33, -94, 68, 14, -18, 41, -43, 5, 32, -19, 91, 8, -21, 31, 13, 56, 32, -25, 43, 4, -52, 55, -55, -1, 44, -64, -17, -36, -22, 108, -67, 19, 75, -34, 10, -34, -87, 41, 23, -16, 15, -38, 20, 18, -28, 11, -17, -57, 46, -62, -11, 37, -36, -5, -23, 41, 28, -61, -27, 53, -94, 31, -89, -41, 28, -57, 2, 24, -19, 88, -29, -33, -5, -31, 55, 23, -72, 29, 43, 20, 26, -88, 24, -30, -103, 5, 7, -1, 29, -30, 26, 27, 2, 42, 40, -2, 36, -21, -9, 15, -26, 32, 30, 5, 81, -18, 62, -2]
6945bl4M4qm6Q8rl5O0q5N9r3N3j3qN6j8l1M4j4MK9k2J8n1k0ON0l0K5j10P9N9p4
6978b9j7M1RRj5K3L4k0j8%l0N9o4nR2p8Q4p3n1J00n3J6L0j41O0M8K9K2j40R6j
7009A7j07J29m1o4N7kL3L1j39J13Nr6J09l9qL7m9M3o3J0L1J0J0j1p8Q9l5n2Q9
7038B9rn8O3rk3j3OO1k8p8L2JJ4P4r8N4k9jL2m4NNo6J39q1k2R6o7n1Q3%J7n2j1
7072b9K6rNM0n1N1on9N2m5O6L3j01J6PNJ8kPK3l9k8P1l1jn4L3mk3J30o6n7N7r8
7106f3M4N9m3l0M5m6R2n7J12l0m8Rl5n3O1k0m8J27j08N8No0Q7o8K7P4p5j1kl7
7136c4N5m6lN9j05J34o0K3Km1K3pl6oN1n9J00qo1P9j14N4M3o3L5kl8O5k7p1Q7
7167B9n3R4q8oQ2r3M6M3o1O8q0nl0n7L4O3qL4k4j7R8l8L1m2q8J04p5L4R3j86P9
$$ y = [-2, -36, 8, 0, -46, 42, 33, -2, 58, -27, 32, -61, -8, -21, -29, 27, 9, -22, 22, 8, 12, 41, 19, 37, -14, -34, -28, 22, -8, 17, -93, -14, 45, -29, -46, -5, 4, 13, -2, 21, 55, 35, 17, 17, -13, 46, -18, -23, 69, -9, 75, 2, -49, 51, -2, 14, 44, -97, -37, 11, 40, 62, -78, 18, 17, -90, 39, -2, -66, -9, -11, 22, 53, -86, 27, 32, -64, 45, 6, -2, 35, -14, 29, -34, -24, 7, 17, 27, 16, -62, 27, -8, -60, 29, 20, -38, 25, 16, -7, -20, -14, 47, 19, -59, -27, -26, -12, 62, -36, 18, -11, -12, 20, -24, -19, -14, -80, 59, -22, -44, 52, -15, -66, 17, 17, 34, -18, -29, -3, -12, -7, 33, -18, 33, 27, -32, 20, -25, 41, 74, -27, -11, -4, 1, 19, 17, 24, 47, 8, -20, 51, 20, 19, -35, -2, -6, -29, 101, 35, -22, 35, -63, -19, 40, -3, -33, 12, -34, 58, 1, 113, 83, 35, 44, 9, -44, 17, -3, -51, 76, -32, 26, 31, -29, 58, -10, 17, 91, 16, 5, 3, -34, 21, -25, -28, 31, -74, 60, 0, 23, 25, -16, 7, 0, -36, -42, 9, -50, 50, 42, -19, 60, -54, 0, 43, -20, 15, 13, -25, 40, 13, -58, 29, -24, 70, -18, -24, 58, -35, 11, 54, -7, 61, -19, -24, -54, -111, -77, -14, -22, 12, -12, -29, 69, 31, 62, 20, -68, 36, -39, -5, 88, -98, -19]
7198a9M5l9J3J8rR1j42O7J6p8Q4l1l2L1p6M7%k1P8p5n5J23m0M1k3jL0o3J3K4j10
7229i3J07k0l8N0J0j38J11pQ1k5m3l3L9o9Q6j1m9M1n9J05n9L9Pm4k8J64j08J2
7257B8k7p9Q2J1k8M2p9P7k0q5J37j34J3O2J0L0o5j1K2k4KP1q7R2m6j8L6k2KL0
7287B2j13R3K2m5j4N6k6K8k7O0l9k6P6r4m1J12m4Mj2KL1Jl5M4m5J2Q4j26N4k2
7317hl8P9o7M0Lk1K3l9L6jm6J8L2L1l5No6Q3l2j4jk5M4J8K6l8o4M9k1KR5l0q4
7350d6J11j07M1P9j14N6q2K4R2k8o0L7J3M7l6mPn0jK5k3P6oj04P6p2K8Q9r1P6
7380E3m0k7M7j6p0P7n8L0N2l9J6m5J5Oj2K7J0oL9n8k1K3j5PN7j27R8m5k8P2l9
7411a7RN1n4Q5p0m0R9o2pK2q3J31o9mJl9K7K7n4P2o9M3P4j01R6l0o8L6J6o8Q6
$$ y = [-19, 26, -13, 0, 18, 9, 100, -42, 25, 41, -37, 47, 16, -16, 15, -61, -14, -14, -35, 43, -32, -87, 36, -4, 37, 14, 13, 43, -20, -7, 17, -93, 14, -6, -44, 6, 16, -122, -11, -18, 63, 38, -5, -38, 1, -68, 18, 7, -42, -1, -60, 45, -14, 25, 32, -12, -40, 124, 16, 28, 1, -78, 4, 15, -13, 29, -50, 27, 7, -78, 59, -75, -62, 0, 10, 40, -25, -36, -14, -38, -36, 35, -52, 40, -6, -24, 12, -10, -8, 22, -91, 2, 24, -21, -35, 21, -5, 23, -4, 56, 17, -9, 67, -27, -68, 44, 0, 4, -8, -6, 25, 26, -9, 35, -10, 2, 86, -40, 14, -8, -46, 33, -34, 6, 9, -12, 11, -28, 8, 7, -39, -21, 11, 42, 7, 12, -54, 29, -3, -17, -18, -43, 1, 19, 45, 7, -57, -8, -29, -27, 68, 38, -46, 65, -42, -1, 78, -36, 20, -62, -38, 54, 26, -34, 3, 16, 63, 27, 23, 30, -20, -21, 4, -19, 57, 51, -53, 23, -49, -21, 68, -23, 53, 13, -14, 33, 17, -53, 24, -34, -4, 48, 9, 25, -20, -5, 1, -11, 16, 26, 20, 59, 1, -20, 3, -12, -5, 52, -75, 23, -22, -50, 22, -17, -8, 43, -11, 74, 4, -36, 63, 1, -6, 16, -67, 64, -5, -9, -8, -47, -20, 7, -47, 25, -44, -1, 73, -28, 68, 38, -30, 6, 22, -46, 40]
7442D0q9L2O4q8L0J5l3Q6j36O3J01j07J9L4n6P2n2N1k1m4j1J5rQ4p5K0J0o5N2
7471Bj8J5J4n5RO6p1L7L4n6N6q5N3P4q7K2kNL2p4Q6j5m1N2o9R1n5Rn8L3pM0o9
7504c2j5J09n4Mj9%j6kPO6r1npP6KKj7Ml6J4O0j46P0J10j21Qj7O2k5NL5k1J7j2
7538A5l7N4P1p2L0k5o8R5qql6j08J35k3m7L2l7mO4p1O2K3q3N8l9N9j9n2L1J3m5
7569d0O3n7qR4q0J9K3q4P0%n0M7k1l6Q2n0O1L8p9J3K4r4R1Nl2L8n4L8rK5Np4L9
7602GPj6P5q4k2L2m5K1oK5M3n9oN3pl1K5l9N5m5K5j5K0Ml3K8N5n2l9M0n%J3m2
7636a8P9o2pN0qm1M0l0OJ2j8M3p0N7m1J5K7p8J17p8o3R4k8l5Q7m0m6J2J6KJ7L5
7668D6p7L5m3J37r2N%k6Q3n9p7J05j6J4J6l9M2r5J2P3l2k6K7n5P7j1p3N8j5QL3
$$ y = [40, -49, -17, 47, -41, -11, 4, -29, 57, -79, -16, 85, -22, -3, 31, -25, 47, -5, 46, 25, -19, -30, -15, -24, 60, -15, 5, 15, -50, 2, -16, -1, 13, -42, -33, 33, -38, -1, 33, -23, 33, -52, 1, 75, -12, 10, 8, 13, 45, -29, 57, 42, 1, 53, -16, 75, 20, 29, -29, 4, -3, 37, -32, -47, 62, 8, 12, -7, -7, -23, -25, -18, 48, -43, -48, -55, 21, 23, 25, 8, 12, -24, -10, 50, -96, -26, 84, -37, -29, -46, 16, -9, -4, 31, 10, 27, 15, -22, 32, 103, 31, 61, 36, -32, 63, 55, 47, 11, -97, 38, 15, -32, 0, -37, -41, 23, -48, 14, 37, -46, 12, -27, 32, 13, -39, -8, 5, -40, 23, -34, -42, 52, -28, -9, 14, -70, 0, 0, -50, -3, -24, -60, 22, -28, 33, 71, -8, 5, 29, -65, 26, 31, -1, 37, -17, 21, 12, 37, 42, -32, 7, 14, -2, 73, -11, -33, -1, -46, -25, -31, -6, 37, -22, -28, 25, 18, -13, 12, -27, 28, -17, 8, -7, 13, 17, -16, 12, 67, 15, -24, 16, 11, 11, 24, -18, 61, -1, -8, 42, 34, -7, 33, 3, 9, 21, 3, 46, -24, 33, -8, 7, 34, -44, 73, -5, -68, 26, -2, -37, 50, 10, -36, -24, -8, -6, 11, 46, -31, 4, -39, 98, 6, 11, 11, -15, 68, 9, -68, 37, 21, 35, 51, 12, 54, -41, -29, 44, 12, -14, 13, -42, 35, 24, -49, 9, -6, 2, 35]
7699C5j15J05Mo5P6o0J2M5j12J11pm1L7K0qRo0J6ml5N1O1o0J26j67J04m1n4LL2
7729A8k0J8j7PJ5j14J53p9oP5p8N6M3q1M8j3k7M1l2qM6n4N4Rr1M2Nj2l4L7k2%
7761b1RQ4j05K1L2n7J12r2L7j5n8M2R1o5L7m6o0J47j46nQ3p9Q7lr6J09q9M6K7
7790B7n3P3l5n9N3l3j0J2JM8o1j1Q0K0n6P4j26R0Pq4Q0m8N0l7rP0n6j4K0K0j7
7821A6K8o1Kk5KO9o3oQ5oJ6k4l7l7QQ7o2j1J2jk2M5ojQ0j25L0QqN3r2N6J3n9N3
7856A7rlO0j01L6%k2K0O2l5n3L0j8N1oo1N6k9kP3m5K8n2M1o4L0J7j5K5K1j08L8
7888a8K6l2Q5M0l9qj1k8%k3l9J04p8M7l9j7N1m3N6q4NJ05j16J23k9Lk1l6rM1l
7919A3MPm3M7l6l4P2K6m4k7j1N4m7l8O0j7J0N5k7k3%j3M2p6K3R3q3P8p3m3M1J0
$$ y = [35, -80, 25, 29, -36, 40, -20, -8, 37, -75, 36, 29, -12, 25, 45, 37, 46, -14, 2, -2, -37, 14, 75, 15, 141, -26, 78, 37, -17, -14, 18, -2, 16, -1, 6, 21, -93, 60, -19, -25, 50, -28, 28, 71, -10, 38, 25, -2, 39, 7, -1, 45, -9, 45, 54, -37, 5, 10, -2, -36, 1, -21, -21, -12, 72, -33, -12, 20, -37, 75, -17, 20, 5, -53, -11, 80, 15, 52, 6, -54, 93, -53, -58, 25, -54, 33, 30, -66, 43, -46, 0, 27, -26, 47, 12, -47, 6, -27, -37, -25, -24, 24, -37, -48, 32, 52, -4, 70, -56, 34, 41, -43, 37, -11, 39, 2, -7, 63, 7, -7, 13, 33, 16, 44, -17, -15, -40, -38, 31, -32, -38, 47, 41, 57, 33, -4, -41, -33, 54, -8, -19, -7, -8, -30, 15, 9, 8, 88, -37, -7, 1, -7, 46, -46, 10, 23, -36, 17, 8, 5, 65, -36, 0, 0, -22, -2, 60, 25, -28, 2, -16, 35, 29, -32, 24, -5, -7, 66, 21, 49, -3, 38, -26, 4, 21, 6, 31, 52, -56, -18, 8, -24, 61, 101, 62, 54, 43, 15, 15, -8, -47, 57, -21, 26, -13, -30, 21, -22, 34, -50, -45, 60, -56, 67, 38, 41, 20, -16, -25, 16, 13, 17, 24, -19, 28, -8, -42, 30, 56, 12, -15, -26, 28, -19, -57, 3, -14, -4, 51, 24, 1, 1, -12, 30, -46, -23, 70, -13, 65, -8, -51, -10, 0]
7951@j5L3j5Pj1l6N8o7J08k2o8K7mn4J20q9nP0n0K7m4K2PL6j0j0m5O1Kk8M0k9
7983A6n9N9l4N0m6j7Q3p2Kk5j0Q1p7K6N9n6L2M1n2Q6n2n7N5k2l9N8l1L7J8k7L8
8014F5m8RK8o7N6j3o9L5rm3Q0J0M0n7oK3o5K9L5r1kJ24q9O0k1m4L1pl7L6j8J3
8046a2N9o2J15j18P7k3q5L6L7l4M8m0J6J5p7L7K3o5J11k3q5M6%j1Lm6P4MNL7p8
8077a6O4o4J4J5k0J7M6n5K0j5n4R1o7N5Mk1K4J7q7J11j06K9L7k7Mk6k3N0lLJ4
8108C1l0O7n2p5P9p1M3K3o8Q0n4K1J3j2l7O0k4L5l4m1Q1o5K5mM1K9o6l2N1N2j10
8139d4O4r1R1J1n2M6j4l3M0m7N8M8r5mM5l3J2j4J0Q2j25Q1rqkp1R0l1n5M6mj2
8171b0K2j6ML1n8O4K1o2M1l8J0L4p9P4M7j29O7J6j3L0
$$ y = [0, -15, 18, 3, 10, -1, -37, 21, -46, 62, 40, -28, -1, -5, -59, 61, -28, -33, 37, -13, 14, -30, -8, -1, 35, 25, 15, -30, 31, 33, 5, 45, 16, -43, 16, -18, 32, -14, -31, 52, -20, -18, -43, -53, 28, -49, -23, 36, -20, 12, 53, 1, 87, 35, -22, 33, 11, -28, 30, -1, 36, 54, 27, 65, 17, 26, 54, -13, 43, 30, -39, -4, -13, -56, 24, 34, 74, 17, 11, 34, -31, -2, 33, -58, -60, 64, -25, 35, 14, -30, 1, -6, -43, -7, -25, -12, 47, -15, 100, -18, 59, 36, -49, -13, 24, -10, 38, -2, 14, 29, -48, -11, 12, -53, 58, 35, -50, -4, -4, -15, -12, -58, 16, 20, 25, 62, -16, 48, -16, -2, 13, -7, 10, 56, 1, 21, 6, -48, 43, -24, 31, 35, 14, 38, 55, -32, 79, -27, 2, 39, 12, 16, -10, -33, 17, 14, 17, 31, 1, 68, 16, -59, 20, -51, -8, 15, -53, 27, -27, -6, 7, -5, -42, 18, -6, 29, -5, -46, 35, -30, -5, -9, 32, 61, -5, -37, 14, 66, -44, 20, -71, 20, 31, -21, 25, 11, -22, 18, -29, 29, 77, -18, -22, 23, -10, 2, -12, -2, 80, -45, 36, 27, 19, 17, -54, 36, 5, -50, -4, -8, -20, 2, -14, -10, 21, -37, 27, 48, -14, 27, -11, -1, 33, -46, 28, 75, -54, 13, 29, 16, 46]
8191D6
$$ Imaginary data points
##PAGE= N=2
##DATA TABLE= (X++(I..I)), XYDATA
0@%%%%%%%%%%%%%%%%%%%%%%%%%%jNj0J3j5J6j6J6j6J6j7K1k5K7k9L2l7M0m2M6
46B4n1N6o3O9p5Q4r2J02j12J24j42J62j86K15k52L03l72M71o18Q52j266K116m394
69c045J8869L7372r6001L9950N2438q2286K8346M2149n7106J3337L2316l4277
81g938J270K3901j7803n509J7646j0390l963J1557j0243L638N425j2630J2009
94F970j767j0812J6351j0199l428J5811j8100P084J1419k2726J5058O370k1992
107i961J6259L703j6910R876N662j0179j678J1613m435j3687J8649j371k1335
120a3794K3044q76k2035K2017j400j6549J5411p21q872N974K227l137k617O672
134E344j647o822J0223l794n707J0768p185n98O992q329N222J12n343Q297p165
$$ y = [0, 0, 0, 0, 0, 0, 0, 0, 0, 0, 0, 0, 0, 0, 0, 0, 0, 0, 0, 0, 0, 0, 0, 0, 0, 0, 0, -1, 4, -6, 7, -8, 8, -8, 8, -8, 8, -9, 12, -13, 14, -15, 17, -20, 20, -22, 24, -27, 29, -34, 35, -40, 44, -48, 54, -58, 66, -76, 86, -100, 115, -137, 166, -206, 265, -353, 499, -767, 1349, -3045, 15824, 53196, -42805, -2855, 49583, -32703, -4357, 37792, -19314, -5977, 26339, -7938, -6668, 17233, -570, -6079, 11567, 1177, -2786, 8771, -1472, 2166, 7591, -5039, 6970, 5203, -5609, 10742, 543, -2885, 12926, -5174, 1910, 13329, -9397, 5661, 12031, -9961, 6298, 10001, -6909, 2967, 8629, -1550, -3228, 8385, 3950, -9737, 8912, 7541, -13794, 9250, 8374, -13661, 8356, 6956, -9593, 5818, 5097, -3775, 2199, 4426, 1289, -1328, 5344, 3697, -3125, 7098, 3304, -2403, 8365, 1180, 582, 7574, -755, 4467, 4579, -764, 7533, 368]
149C68Q57P157j1734P568K633j1822J1471k513q010J0763n573k405O045n010K156
164A951j69j512L494m373K507J628m429M324j478p23K555l688M702k268l082Q617
180H056p669K13Q833j1068M706N268j0571P795k84o362P556m750m59M028n974
195f82M270j302l556N711n617R60L578o745M806q49m097N674m523O27L126n531
211d150N060j448l400O866n263M06N400o398L749J727m027M237j681N66J434k807
227B71M833l342q94O539p707K981N057r576O526J280q075P860k637m147N853m324
243D98P7J654l124K368k784O44J567n035M494j567l970O364n165k91N388p105
259e987L881J938o117O331j837k692N691l917J214K411k945L721k081O29L494
$$ y = [368, 1225, 8382, -3352, 4216, 6849, -4973, 6498, 3985, -4025, 6738, 1165, -1240, 4805, -205, 1951, 1782, 270, 3764, -609, 1898, 3526, -903, 3421, 1943, 1220, 3775, 87, 4789, 2521, -561, 8056, 387, 600, 9433, -1635, 3071, 8339, -2232, 5563, 5279, -1083, 6473, 1723, 1264, 5292, -682, 3588, 2286, -1270, 4441, -1176, -216, 3362, -3383, 1423, 574, -3523, 2151, -2372, -1745, 1381, -4150, 910, -538, -3938, 2928, -2335, -1929, 3471, -2927, 822, 2549, -1478, 2759, 1078, 1644, 3078, 271, 5104, 1762, 868, 7407, -300, 2681, 7738, -1838, 4688, 5968, -2107, 5753, 3116, -1031, 4822, 498, 575, 2229, -895, 1473, -1311, -667, 900, -4135, 359, -1208, -5178, 1186, -3979, -4270, 1118, -5987, -2106, -168, -6285, 46, -1791, -4483, 1208, -2709, -1495, 916, -2029, 1692, -389, 240, 3734]
274C734n301M942Q01n795P527k485l894P171m212q82L874l294J038n27J68P58
290C623m103M451j608n102P212m425l506P149n941o65M169m792J661m09q16J684
306a418m153M092k69n827Q036l131m905R219n103k368P204m432l62L442j294j33
322a402k65L420k245k201P468n446j776R103p872J35P896q000J575M747n154J331
338A314J247n39j184p60M198n071n29O838q234J138O653q882K605M292o565K365
354a114J421k140O1k33K459l617J54N383p046J926N668q425L919L775p081M314
370e76J279l495K451m44Q06j102q7L631m787J840M145p006M175K530o589N102
386A873J88l950L787j290l46M78r34K249l344J351K787n870M030J270o104N540
$$ y = [3734, -1567, 3375, 4176, -1619, 5908, 3423, -471, 6700, 2488, 1606, 5480, 2186, 3224, 2697, 2865, 3623, -480, 3971, 2363, -2739, 4473, 48, -3458, 3691, -2250, -2915, 1254, -3538, -1877, -2286, -3102, -1418, -5571, -1479, -1748, -7575, 461, -2670, -7575, 1644, -3459, -5827, 1377, -3055, -3417, 25, -1269, -1402, -1667, 1753, -492, -2693, 4775, -671, -2447, 6656, -1216, -1081, 6815, -1185, 390, 5137, -17, 1314, 2561, 2022, 838, 78, 4276, -795, -1324, 5514, -2720, -1582, 5071, -3811, -1206, 3086, -3479, -1114, 307, -1833, -1772, -2005, 454, -3163, -3009, 2374, -4672, -2746, 2922, -5503, -1584, 2191, -4890, -576, 703, -2792, -341, -785, 21, -1081, -1168, 2463, -2324, -484, 3661, -3345, 830, 3360, -3229, 1873, 2061, -1889, 1898, 608, 262, 740, -194, 2055, -1289, 62, 2849, -3021, 1009, 2279, -3825, 1715]
402A715r82l997M921k619q00K228k457J945j529j42K484m224K763J122m808M852
418D72j187l313M992l023m98K993l060J885k06j128K613k879J769J198l639M105
434A094j215k396M736l335K0L321l718K056P20k271K669j835N43J252k735L066
450A972j425j670L984l799P73K805m622L170J7l409M156k615p86L294l888J867
466a76Q17l198L272j662r41K617k918J416P03k383K702j617k69J937k551K102
482a49l49j744L437l031N15L008m497K867J075l907L910j196j633L024k515J153
498c2N59k203L086k220l84L139l974J888J400l755L343q88j903L188k698O44J507
515F97k747K516r25j257K761k645J016J340k680K572p81j127K411k177J299L56
$$ y = [1715, 733, -3264, 1657, -962, -1762, 466, -1991, -46, -1575, -1717, 767, -3457, -694, 428, -4380, 472, -715, -4028, 964, -2059, -2557, 436, -2624, -739, -945, -2073, 540, -2339, -570, 628, -3011, 1094, -121, -2517, 2219, -1116, -1096, 2225, -1493, 563, 1283, -988, 1681, -154, 389, 1641, -1094, 1972, 547, -1123, 2861, -938, -165, 2640, -1982, 1188, 1205, -2204, 1952, -663, -1449, 1845, -2043, -176, 641, -2557, 715, -947, -1888, 729, -2189, -773, -70, -2453, 249, -1368, -1637, 300, -2251, -149, -498, -2242, 1195, -1836, -1321, 1687, -2810, 57, 1132, -2775, 1135, -61, -1694, 1330, -1185, -32, 527, -1676, 1410, -810, -1194, 1945, -2029, -141, 1259, -2496, 847, -41, -1944, 1244, -1454, -810, 697, -2050, 466, -459, -1716, 1045, -1600, -584, 756, -1924, 648, -133, -1260, 1151, -1026, 273, 629]
531F29j947L203k493k26L820m853K084K699n338L680O73l950L554r96j276J705
547I68j560J230j063n18K402l324J322J815m081L010K3l027L365j545r79K218
563B56j886Q97m5o08J528k183J871O52l442M186j064k930M816k409j340L613k527
580f15O14Q15j123J804k390J442J604m211L549K90m182M326j232k508L268j956
596e05j05P91j308J397j750M24J600l444K402N04l457L638j188k114L402j936
612a649n26J809j123M00k60J052k56j590L470k017j477M879l904j35M776n052
628a603J669L002m645L079M39k826L145j668l90J880k384J396o9j551J824j424
644a26k4Q32j601J104q49l27J059k115J648k61k335L307k101j328L836l488L87
$$ y = [629, -1318, 1885, -608, -834, 2986, -1867, 217, 2916, -2422, 1258, 1931, -2019, 1535, 539, -737, 968, -592, 638, -425, -943, 1459, -1865, -543, 1272, -2809, 201, 224, -2803, 562, -983, -1962, 256, -1630, -733, -778, -1386, 142, -2041, -170, 482, -2960, 1226, 162, -2768, 2048, -361, -1701, 1912, -615, -1, 814, -309, 1495, -895, 547, 2151, -2060, 1489, 1779, -2403, 1923, 691, -1817, 1451, -505, -610, 181, -1127, 270, -1480, -1056, 544, -2900, -498, 6, -3451, 187, -1001, -3115, 287, -1649, -2175, -366, -1489, -1089, -1349, -297, -553, -2143, 1327, -690, -2167, 2712, -1192, -1327, 3449, -1603, 66, 3068, -1577, 1502, 1941, -885, 2260, 592, 202, 2082, -302, 1094, 1025, -526, 1298, -126, -150, 682, -919, 185, -664, -991, 68, -2047, -399, -660, -2995, 312, -1789, -3117, 719, -2769, -2382]
661b382K708l510J836Q24k062K211j220L02J198j952K192m20j372K860j902J44
677e45J974k384J718J25j450K233j570M7J572k246J617l11j315K088k072N39J272
694A292k977K367l73k392L098k020p60K428k657J030O53k021J979j057m68J647
710b31j930J369J31j536K385j634J8K160k688J769R10k557K724p15j197K463j714
727b73N04J047j686J634o46m59J490j721R71L15j490J803j457J03J314k642K043
744H50j10k700L471k002j495L578l152l7K596l113J134Q65j741J205m51J00K6
761i76o32J533j491R2K010k670J514J206k822K601k90j624K556j595K16J406k065
778a031J995n14j345K652k031j3K119k506J144P06j670J388o40j53P07j328J439
$$ y = [-2382, 326, -3184, -1348, -524, -2586, -375, -1595, -1293, -95, -2047, 145, -275, -1647, 1213, -689, -545, 1429, -955, 763, 888, -562, 1671, 101, 148, 1720, -526, 1091, 780, -535, 1553, -519, 20, 1292, -1685, 682, 309, -2083, 1015, -1005, -1765, 663, -1994, -964, -311, -2332, -353, -1410, -1878, -231, -2161, -792, -661, -2197, 188, -1446, -1428, 732, -1956, -187, 723, -1834, 890, 175, -1022, 1441, -273, 231, 1278, -408, 1226, 580, 121, 1611, -110, 861, 1176, -314, 1489, 32, 135, 1449, -1193, 850, 740, -1960, 1511, -491, -1986, 1592, -1560, -1597, 999, -2114, -980, -115, -1856, -651, -1102, -1002, -976, -1608, -75, -1566, -1474, 536, -2134, -620, 586, -2236, 365, 75, -1549, 1007, -588, -372, 1034, -1031, 964, 450, -895, 1757, -274, -287, 1832, -674, 470, 1176, -494, 894, 254, 101, 808, -520, 919]
795I19r21p66K146k259M15J591k552J457L51j654J618j024J17O74j411J854j105
812e50q20K785k741M68K435l451J836J236k872K338j77j352J670r15L62Q4o52
829c16J470j470L86J473k506J645N05k212K070o61r53J585j389O12J80j222J729
846I26j439j37J768k470J331O65k258J972n58j069J766j427M69M72j294J738j324
863h69j70J968k409J190J143k562K114j59j450J943j067oR06j161J248p99j40
880b80J499j990J196P22k146K121n71j258K126j689L60J037j759J522m89j007
896f06J868j727K75J371k143J372J15j491J719j035j28R50j389J167l44q51J632
913G55j496L23J119j845J431n1j265J664j116J22R39j457J390m45r51J971j767
$$ y = [919, -2, -768, 1378, -881, -466, 1125, -1427, 30, 381, -1273, 345, -679, -562, 112, -1299, 555, -550, -1370, 1415, -1326, -858, 1577, -1874, -38, 1198, -1674, 664, 487, -865, 805, -110, 252, 336, -316, 1154, -316, 70, 1543, -963, 682, 1187, -1025, 1045, 384, -569, 1016, -373, 239, 419, -803, 926, -513, -650, 1118, -1352, -21, 644, -1614, 358, -200, -1269, 497, -930, -461, 11, -1283, 455, -869, -1039, 929, -1480, -290, 853, -1709, 405, 246, -1204, 739, -328, -334, 572, -589, 659, -140, -280, 1219, -771, 425, 1147, -999, 1122, 551, -707, 1419, -270, 90, 1127, -632, 890, 401, -606, 1262, -465, -190, 1181, -962, 410, 525, -966, 753, -282, -410, 540, -849, 318, -26, -877, 755, -741, -418, 701, -1144, 287, 236, -1029, 635, -481, -359, 580, -877, 513, 68, -883, 1088, -679]
930f79L37J598k409J480N08k035K054p67p63J488j395P29J92j105J436j156j8
947e05J342j842J046L42j504J645q91l39J210j573J067M9j328J922j193l76J743
964H15j914P86R30j760J552m77o73J401j273O71L76j236J680r52m45J694j735
981e60O86Q27j668J508n46o26J369j374P04M29j505J737r12q31J974j796L15J126
999H57j803J212k04q96J389j217L78N57j359J389p04p55J755j567L67J040j747
1016a308J356j97q70J515j328N52O82j570J665n45j134K168j572q3J773k015Q49
1033f2O66j387J194m55o8N23j098J242n56q10J797j594N3J498j958R56M43j351
1051i67J271p27o5P62j365J361m80j048K015j581r5J775k144R47P79j695J465
$$ y = [-679, -342, 1256, -1153, 327, 835, -1200, 854, 87, -676, 812, -583, 146, 338, -767, 669, -487, -505, 837, -1005, 41, 383, -1121, 524, -367, -706, 504, -1069, -2, 47, -1281, 641, -552, -928, 815, -1099, -313, 617, -1143, 409, -68, -741, 660, -613, 58, 434, -802, 878, -74, -519, 1175, -560, 126, 953, -715, 793, 247, -379, 990, -384, 320, 749, -756, 981, 69, -762, 1212, -584, -269, 857, -946, 266, 62, -834, 555, -662, -284, 273, -1086, 303, -401, -1156, 599, -968, -601, 439, -1308, 48, -149, -1019, 496, -832, -280, 402, -1168, 497, -48, -1182, 986, -586, -669, 1104, -911, -62, 604, -783, 411, -44, -112, 411, -687, 555, -1, -811, 986, -608, -555, 943, -1015, -59, 384, -967, 304, -423, -488, 274, -1091, 270, -210, -1258, 757, -824, -919, 856, -1288, -341, 438, -1257, 208]
1068B08m47n25J160j114Q34K4j042J690j126l33J792j903O62J005j644J114j6
1085C39o76Q16p14O37k76o62J570j501Q2J629k280R98Q47j944J538l74r12J474
1103E91j295M78M82j443J563p99p38J781j676M25J102j870J274R7j156J288o97
1120e93J8N50q02Q63m85l03J224j392N68Q04j506J272j71p76J189j024N74K50
1138B60j164J673j027n38K035k058M66J524k339J350M38j716J734p98m45J248
1154F43j371P86K21j108J296q44k15J085j226O80K48r29J045o78O8N21r14R35
1172B43m74m32J415j574N05J153k030J474K36j586J754p80m42J233j278P87J80
1189C84j236J649j029m18J626j626M45R33j567R59L6o89Q05p05L89l2n75J013
$$ y = [208, -239, -764, 396, -718, 116, 140, -902, 788, -338, -671, 1121, -782, -120, 885, -759, 355, 339, -337, 479, -235, 402, 126, -536, 1034, -467, -385, 1244, -1036, -38, 809, -1135, 403, 29, -883, 591, -704, -226, 256, -1187, 376, -423, -1161, 620, -1056, -631, 471, -1399, -125, -28, -1184, 104, -593, -575, -25, -827, 36, -449, -752, 472, -920, -352, 452, -1054, 218, 47, -729, 460, -564, 10, 260, -904, 769, -258, -796, 1239, -819, -353, 1171, -1168, 182, 620, -1096, 638, -160, -605, 643, -728, 58, 279, -829, 467, -377, -592, 493, -733, -53, 195, -734, 311, -367, -299, 222, -692, 243, -231, -663, 752, -822, -317, 836, -1194, 280, 516, -1070, 684, -96, -538, 695, -583, 204, 384, -852, 797, -232, -650, 976, -650, -205, 728, -839, 120, 156, -533, 272, -433, -44, -76, -651, 362]
1207C62r08N0J042j610R69L56j516J615o58n80J375j305N45M21j147J285o90l74
1225g68J393j506O85P60j683J500k26r84J491j006O6Q44j201R62j93o43J272j049
1243b86K04P40j184Q65j01o51R49p92K87L77j012J157o04l79J218j359M55P02
1261E86j470J343l42q95J483j225K29R25j565J168q6j038J562j056j19J177j430
1278g53P46M05j161J153m77l15Q82j009O86M7p50J105q50J4P20r49O83k7o52R73
1298D71r01L13N18j219J287l81j054J795j325j66J590j823P26P91j578J188j72
1315F0o93J113r01L62L17q63R94n71j92R78j137N40M07j024J075n04k85R80j069
1334d13O20K56j055J303p62l34J292j336N13O14j285J082k84o18J112r84L08M54
$$ y = [362, -546, -496, 546, -1064, -95, 261, -1255, 360, -298, -878, 497, -808, -263, 158, -989, 296, -394, -768, 625, -881, -196, 564, -1119, 381, 155, -829, 662, -344, -278, 566, -635, 327, 134, -509, 763, -286, -82, 658, -526, 339, 238, -413, 536, -256, 31, 408, -604, 553, -51, -430, 788, -571, -116, 586, -884, 459, 117, -778, 705, -520, -291, 634, -931, 237, 151, -887, 675, -381, -500, 677, -753, -7, 398, -763, 390, -87, -402, 480, -529, 157, 204, -546, 559, -291, -277, 443, -506, 177, 150, -502, 471, -430, -117, 401, -818, 469, 88, -966, 829, -496, -662, 928, -895, -169, 622, -956, 232, 60, -633, 480, -421, -59, 258, -605, 389, -182, -374, 604, -533, 7, 414, -610, 465, -39, -324, 656, -413, 207, 463, -592, 711, -51, -385, 907, -429, 84, 698, -587, 495, 211, -407, 705, -279, 29, 483]
1352D83j114J205n52n37J315j284L35Q04j371R89o8p00R75p43Q1N18p56P35l25
1371a0l24R27j080M58N28j136J108m04o55J303j042J73Q27j322R86j17q27J291
1389F84r23j5Q07j052O66M2p58J036p71QP33j074P48J7q16J126p64j05Q73j016
1409e54N51J22p54J029o68k5P80j153Q79qq92J299p99j90J081j110N32L17q35
1428c98R15m59j62P38j004P71K8q47J175p06k66J035j109M70L72r27Q53m24k80
1447b25Q35r77N97J54j000J149n96m83J169j087K55O01j061Q18k17m76P51o65
1465d58L71J77q17J032n53l37R96j010L56N99j112R47j69n56R12o79J14M66p44
1484d65Q24l54l54R64j013M40N11j187J017j66p22J141q48O3O55r44O34j4o29
$$ y = [483, -631, 574, 22, -515, 800, -484, -149, 655, -716, 273, 205, -495, 480, -263, -182, 336, -420, 315, -10, -334, 593, -487, -29, 499, -637, 471, 67, -588, 715, -327, -154, 673, -649, 337, 220, -607, 684, -239, -254, 553, -499, 167, 209, -549, 487, -284, -276, 457, -617, 131, 148, -668, 458, -306, -411, 462, -554, -3, 119, -635, 394, -274, -299, 481, -672, 207, 199, -693, 606, -193, -383, 698, -412, 120, 437, -398, 517, 58, -104, 634, -370, 401, 429, -418, 757, 51, -215, 820, -289, 181, 553, -374, 479, 55, -225, 610, -367, 230, 384, -616, 533, -63, -546, 623, -464, -209, 392, -669, 149, -68, -544, 207, -458, -87, 90, -727, 305, -248, -585, 411, -599, -243, 356, -756, 191, 22, -534, 378, -301, -187, 279, -465, 359, 5, -349, 615, -398, 42, 553, -634, 383, 217, -505, 636, -212, -149, 506, -438, 196, 182, -447]
1503d47R25o39m8O18r45O97l2o69J004p91R1O23r65O76q5n51R53p03P1O45j002
1524e74P96K3q69J124o80j30R03j031N23K82q22R18m96j56O90q28N76L9o27Q22
1544D83n80m7P70j018N61K62j005R98m84l57Q58p90L00K19o57P58n87k9P18j056
1564f83O54J56q49R86m64l67Q87r05M05L58q70Q79l45l40Q77q83M07M17r05Q58
1584B73k43m76Q94o88J06N37p88O44j38l46O54n96K71J42o47Q36m14l34Q67q55
1604c01L44L86r17Q09k45m97R31p82J63M89r10P20n7o05R15p08k2P25r55O76j6
1625A43o36Q16n47l0O75p67M85k0m26O92n85J67M31p48O01q5n58Q74o50n2O82
1646D62q39N89j8o34Q43n73%N27q08N77m9o18R79p78n1Q42j037N06L36r21Q08
$$ y = [-447, 478, -161, -209, 409, -536, 161, 129, -540, 464, -327, -236, 387, -578, 98, 13, -538, 415, -288, -217, 428, -574, 222, 245, -624, 500, -180, -310, 593, -438, 85, 367, -455, 463, -33, -189, 501, -327, 249, 288, -339, 483, -97, -144, 626, -392, 169, 431, -574, 424, -60, -417, 441, -349, -49, 170, -487, 271, -316, -345, 373, -683, -29, 127, -722, 264, -200, -567, 320, -585, -180, 178, -692, 187, -158, -498, 379, -504, -97, 320, -585, 273, 30, -446, 448, -240, -134, 403, -385, 259, 121, -225, 429, -167, 104, 246, -401, 435, 21, -313, 554, -301, 43, 429, -488, 321, 76, -421, 510, -272, -109, 380, -530, 190, 133, -472, 443, -265, -287, 438, -517, 159, 143, -493, 323, -224, -254, 421, -346, 139, 119, -307, 385, -200, -33, 398, -350, 251, 166, -392, 482, -168, -220, 462, -377, 212, 194, -440, 403, -170, -170, 357, -451, 126, 77, -541, 438, -340, -391, 451, -586, -80, 256, -665, 143]
1667A43k53l30O59o04K65J53m79P01n06j42P35p79M18K81p51Q18l07k02N49n56
1687a87L54K0n16P90o11R8O63j045O80J88r82J059l31n80J017p73Q1N00p60N71
1707B36j67k90O54o40J41L68p71O59r8m64O71m50k6L31m99M56k89m8N32p61M96
1728D1J96q14Q98l12m72R48p89J38O35r48O14M1n33O94m98m0O46q73N73Qn55Q05
1750D03n97J5N61p61M39Q4n55O25l40m6L57n78M65q9l72O13n34R6M55p53O71o3
1772I6o33R40o21n2P41q75N17N5o31Q27m07j72O74p00L80J28n91P69l74k57P33
1793E47o93K80K34n56N40k74j42M72n93L52J09o30P58m31k22P29q19L69K63p28
1813d35O41j98l18O27o74L47R3n34P32m88k17Q38q86L08N08r51P26p8n22P03l99
$$ y = [143, -110, -440, 219, -385, -120, 33, -446, 255, -251, -393, 342, -437, -19, 262, -489, 329, 22, -180, 369, -187, 167, 187, -329, 461, -150, -52, 611, -434, 246, 434, -548, 511, 180, -400, 617, -156, -75, 425, -335, 236, 69, -221, 433, -207, -66, 302, -469, 190, 92, -372, 299, -151, -177, 154, -345, 111, -178, -226, 306, -455, 41, 237, -577, 321, 9, -463, 485, -304, -166, 469, -479, 135, 176, -357, 337, -161, -201, 445, -428, 145, 153, -402, 403, -194, -179, 382, -379, 60, 144, -411, 214, -126, -172, 185, -393, 72, -17, -389, 224, -310, -214, 241, -512, 159, 96, -537, 403, -218, -270, 471, -404, 113, 168, -463, 364, -43, -215, 459, -241, 139, 267, -324, 445, 71, -186, 547, -146, 134, 368, -188, 352, 78, -64, 408, -185, 167, 276, -354, 404, -27, -249, 480, -339, 30, 293, -435, 206, 8, -310, 317, -357, -10, 83, -451, 281, -207, -424, 414, -472, -164, 344, -607, 119, 41, -481, 222, -177]
1834a77r0M17m86M86k53j16N66o59K98L77q05O51j03m39O69m75J0M36o24N82k17
1855D8l72O99o51K55M13q71O41o6n06P52m21o1M88o50M03K3m36N94m07l2M36o50
1877c71M96l2m25O03l91L4L46n49N07j11m75P83n37O5N27p84N24Q2o73P87m29
1898b3k03O28o16L16J31n74O45l27j70M96n58K95Q3m51N41l29r6M71n70L81Jm91
1920d20O72m84j10O64o87K56K69o23O35k63j87N03n23L19J26n00N86l19j88P00
1940D26p28K44L72o84O33k35k56N51m20J73J57m51N07k93j46O07o89K36M05p59
1960c50N87q9l70N90m77J07K93n37N21k33k51O06o62K70L27o69N45k0n07O10l70
1981g9q3M43n74M48Nl48N67m73J14K89n89M76o5l60N43l22j00M83n75M16n8l41
$$ y = [-177, -267, 150, -336, 150, -103, -219, 347, -312, -14, 363, -442, 209, 106, -333, 336, -139, -129, 307, -317, 265, 48, -324, 375, -276, -21, 392, -479, 162, 96, -410, 342, -79, -140, 348, -302, 101, 124, -312, 282, -125, -157, 279, -371, 125, 93, -332, 271, -120, -86, 260, -289, 218, 107, -368, 415, -122, -57, 470, -314, 210, 292, -381, 406, -23, -226, 402, -214, 102, 233, -341, 304, -23, -193, 303, -255, 40, 123, -328, 213, -116, -212, 259, -311, 70, 71, -420, 252, -232, -342, 322, -365, -109, 160, -463, 172, -91, -278, 225, -298, 21, 147, -353, 233, -86, -274, 426, -302, -58, 314, -370, 263, 28, -228, 323, -97, 76, 233, -218, 289, -4, -150, 457, -232, 4, 409, -350, 237, 148, -222, 368, -109, -2, 291, -246, 275, 42, -209, 397, -265, 5, 332, -337, 208, 188, -319, 291, -79, -162, 281, -293, 155, 160, -188, 379, -94, 20, 309, -280, 196, 131, -229, 314, -8, -108, 375, -200, 216, 158, -183]
2003a83N53n37J91K97p12O12m4n21P80n63j49O71p32L51K26n99O04k58k51N50
2023B86n51K27J91n11N46k95qL09n25L58M9l14N25l83mM60o04L64J80o26O70l43
2045Aj14N42o32L31K32n92N49k00k90O11n28J25K23m20M49j04l24M82m38K04J60
2066B67n32N56k63j87N67n67J39L43n59M39j77k31N04n16K26K48n51N55k19k61
2086b19N31n26J47M37n92L53K0m02N16l42N9K99n12M24j72l23O88n27J2M56o27
2107c00L98Q3m36M71k15r8L08m54L85m2l45N31m30P2L48o01M66J9m64O76m53o
2129h7M07n78M59Mn06O39l68j07N23o31L10K26n51M72j51j48L83m50K59J15m35
2150b15N13l12j06M54o01K99K55n75N28k61j18M62m92K19K07n46N39k45k21O14
$$ y = [-183, 370, -167, 24, 321, -391, 221, 177, -344, 436, -127, -276, 395, -337, 14, 240, -359, 245, -13, -264, 286, -265, -38, 153, -358, 188, -107, -115, 194, -331, 27, 76, -238, 287, -96, -100, 360, -244, 120, 300, -326, 344, 1, -113, 429, -203, 128, 360, -232, 317, 117, -173, 438, -90, 35, 258, -162, 287, 183, -141, 341, -97, 107, 267, -265, 291, 28, -159, 408, -159, -20, 323, -236, 203, 26, -205, 299, -217, 9, 257, -294, 261, 42, -219, 312, -214, -67, 370, -222, 131, 151, -251, 265, -77, -18, 281, -231, 193, 21, -302, 386, -141, -129, 327, -300, 98, 181, -255, 216, 1, -97, 211, -243, 142, 100, -245, 286, -144, -72, 276, -325, 141, 160, -304, 372, -81, -87, 320, -258, 201, 205, -301, 338, -30, -137, 386, -245, 65, 291, -260, 212, 61, -87, 296, -154, 105, 220, -215, 298, -14, -120, 334, -267, 32, 287, -288, 240, -21, -139, 323, -169, 50, 257, -289, 250, 5, -216, 398]
2170C98o07K16K13n33N89k71j67N02n64K53K81o21N71j95k91N60m75M7L19m75
2190b50L67n3k75L94l97J50J66l95N10j99k58M78m80J63L24n79M91j18l84N64
2210B19m60J51L23n55N51j70l69O27m84L2M67n77L51O4m01N25k96o5L50m45L27
2231A65J0l70N08l83P4L41n54L87j9l36M75k64o5L06m23L19l6l51N82n10N9M51
2253C66o78M73N5n16N53k50j80N04m69J78J45m65N09k29k10M47m18J83K01n00
2273c01M96j76k17M37m50K30R4m03M94k77q4M74n44K81P6m01M61j68k98N47m38
2294a67J50K61n83M81j63k23M84l80R8K57m64M30j81k26M94m80J76K88n76M73
2314A49j10k09M75m73J44K47m65L50j1k60M54l79P8K52m59L69j11k62N19m26Q5
$$ y = [398, -209, 7, 220, -313, 276, 5, -162, 340, -224, 29, 310, -311, 260, 65, -226, 334, -141, -94, 225, -250, 117, 64, -211, 183, -214, -64, 102, -293, 217, 18, -240, 238, -242, -79, 245, -334, 157, 39, -345, 219, -241, -90, 233, -322, 229, 59, -310, 317, -167, -135, 332, -245, 106, 170, -231, 294, -2, -67, 283, -162, 165, 175, -195, 313, -70, 4, 345, -209, 178, 159, -177, 298, 34, -31, 275, -148, 171, 135, -216, 366, -144, -85, 366, -312, 161, 216, -300, 253, 3, -177, 327, -142, 36, 181, -284, 225, -4, -214, 233, -185, -2, 199, -301, 195, 19, -198, 239, -211, 19, 113, -290, 204, -73, -157, 317, -227, 54, 130, -271, 190, 22, -276, 271, -167, -17, 244, -339, 142, -21, -244, 240, -140, -42, 215, -249, 181, 0, -226, 268, -212, -36, 252, -324, 149, 39, -170, 305, -168, -24, 223, -242, 108, 97, -163, 291, -88, -10, 242, -217, 152, 41, -221, 298, -128, -43]
2335d3K89m67L90p9k69L65l15J05K77m61L94j47k94O00m75mL93m81K55J52m89
2356c04N48l01q7L30m11L04J3l65M67l29m1L86m48K84J03l66M21l63L5L51m92
2377b65K85Q6m23O09m11p5M43n25K66J78m46M63k20j59M26m34K21J53m32M59j96
2398Cj77M70n00K26J83m27M37k34j51N29n22J75J78m61M42o6k75M04l98K11J76
2419B23m04L88j86j55M18m38J97J35m47M81q9l84N44l82Q1L22n63L77m7k30L93
2440B34l24K6K06l78L84r8k84M80l61K0K78m62L30o5j91M14l72O6K92m76L36q4
2462b9l08N77l55l4K96l36K51J9l27M11k55l0K87m44M10l0l79N01l34J3L61m47
2484a82K34P2l74M00j60J1K60l75K00P0l27L91k78k5L30m58L28L2l27L65j88j83
$$ y = [-43, 246, -221, 169, 90, -179, 186, -129, -24, 253, -208, 186, 39, -255, 345, -130, -134, 259, -222, 33, 185, -304, 244, -57, -144, 186, -225, 79, 92, -273, 194, -135, -176, 210, -238, 46, 149, -217, 204, -159, -124, 227, -265, 20, 106, -317, 292, -119, -194, 249, -276, -10, 168, -278, 185, -35, -194, 232, -202, 19, 172, -260, 199, 3, -174, 296, -204, 22, 205, -222, 215, -19, -170, 359, -163, 12, 190, -271, 171, 105, -170, 234, -164, 47, 223, -181, 207, 21, -134, 284, -154, 43, 178, -269, 212, 123, -261, 283, -99, -18, 304, -259, 118, 71, -159, 234, -90, -64, 142, -236, 148, 50, -234, 246, -115, -95, 183, -279, 51, -14, -205, 209, -163, -97, 195, -281, 55, -29, -337, 240, -115, -149, 147, -189, 62, 81, -246, 165, -90, -120, 167, -277, 133, 103, -276, 225, -109, -96, 265, -182, 52, 124, -250, 150, -10, 1, 261, -114, 86, 156, -171, 220, -58, -83, 247, -211, 117, 149, -178, 187, -1, -184]
2506a84M44m47K42J40m27M30k16j41M59n04K57J58m45M61j84j93M26l73R1K18
2526B12l67L43j36j72L49l27J35J85m18L54j28k44M41l90J76J69m10L62j85j27
2546a78L81l57J38J35l96L38q5j77L83l49Q8K54m65L20m8k10L67l46J04K83m27
2567b47L83j06j77L83l58Q9K30l90K53O4k60L51k93O4K83m15K94m2l06M06k91
2588h5O1K68m28K89k1k87L84k28k3K46l64K44N0l52M07k51J7L09m17K64K0l40
2610b37M27j89j81M26n18L17R4l82L39j45OJ93l07J73R1l23L82k23k5K59l91K55
2632D1R1l13L92l08j1L22m43K46K01m98L70j11k45M63m13J41J89l62L26j10k15
2653b47L95l26J01K01l98L24m5j84L38l27J75K21m25L37j26j23L24l09P2K42l80
$$ y = [-184, 260, -187, 55, 195, -232, 198, -18, -159, 300, -204, 53, 211, -234, 227, 43, -150, 276, -97, -6, 212, -155, 188, 52, -120, 229, -98, 37, 222, -196, 158, 30, -214, 227, -163, 13, 182, -228, 134, -51, -178, 203, -154, -16, 119, -277, 61, -24, -201, 182, -167, -79, 175, -290, 30, -18, -228, 139, -207, -103, 180, -247, 136, 30, -147, 236, -122, -33, 197, -193, 60, 124, -136, 215, -78, -14, 269, -146, 148, 106, -200, 206, -85, -24, 244, -184, 105, 84, -203, 181, -47, -70, 176, -188, 56, 106, -246, 161, -90, -73, 236, -181, 83, 103, -237, 190, 1, -180, 246, -272, 45, 139, -243, 96, -49, -43, 150, -157, 16, 107, -216, 166, -57, -82, 177, -214, 41, 132, -181, 211, -97, -108, 214, -229, 17, 218, -280, 90, -21, -266, 197, -216, -75, 114, -248, 78, -32, -247, 148, -178, -77, 124, -274, 50, 5, -179, 159, -168, 7, 228, -197, 140, 14, -109, 215, -94, -22, 220, -160]
2674a60K67n4j30K74k22N6J03l00L15l5k40M15l78P2K50m33L64l9l22M18l28L4
2696g3K89l99K73k5k54L72k09p4K94l78J85P7l11L72j63q8K60k85K04k7j99L01
2718A42k83P9K37l89K77L3k99L48k00o8K62l20J72Q6k88L32j34j24L06l09J69
2739B9J03l23L68k03j06L52m48K13J25k94L09k00j7K71l61J81J13k79L25j85r8
2760a25L06l22J36J94l70L53k04p7K83k93J03K18l61L41o1k29L87m43J60J51k80
2781a33L05j14k01L02k03k4K41l02J85rj92L53l32J15J05k69L09p2k32L51l05
2802a22O4K49l83K12L4k13L17j98l5J73l19K92p8k06M08k88qK75l65K18J3k18
2824a78K90j60m5K56l17J94J1k43K71j57J0K58m03K60P8k96K86j98%K22k65J21
$$ y = [-160, 107, 53, -77, 197, -25, 31, 134, -166, 149, 114, -126, 289, -89, -17, 233, -200, 164, 125, -197, 221, -107, -73, 216, -183, 90, 65, -189, 183, -26, -100, 194, -184, 1, 78, -233, 139, -24, -112, 148, -137, 67, 40, -159, 142, -141, -62, 175, -214, 63, 96, -203, 145, -55, -123, 139, -181, -9, 77, -211, 121, -13, -137, 169, -140, 29, 132, -191, 177, -26, -132, 220, -228, -15, 110, -184, 125, -75, -92, 179, -182, -1, 112, -167, 158, -27, -125, 181, -141, -5, 189, -181, 172, -32, -109, 174, -119, -16, 202, -159, 182, 121, -108, 279, -164, -4, 147, -133, 172, 58, -143, 159, -44, -68, 173, -129, 56, 47, -145, 208, -124, -9, 96, -173, 136, 64, -168, 183, -122, -58, 191, -192, 20, 54, -159, 158, -40, -75, 98, -221, 71, -7, -213, 195, -93, -101, 174, -191, 27, 40, -178, 112, -48, -93, 163, -154, 40, 51, -192, 79, -78, -68, 190, -213, 47, 125, -171, 115, -83, -83, 139, -126, -5]
2846eQ9k97L29j29j18L23l46J63J17l23L43j82o8L32l06R3J14k33K44j20j66L49
2868B03k94J48J34l15K87j08j49K15k18J59K8k46K84j39q4K82k99J17Q1k75L20
2889A31o6k07L16k66K8K25l16K52o6j65K89k62N0K22l50K17m1k31L89k67J11Q4
2911G7k57K10o5j31K93k61P5J78l02K94p4j93K87k31j4K07k39K23%k44L17k24
2933g4Q4J16k80K33L9k00K50k20k2K95l24J19Nr5K03j58l3J81k39J61Q8k79K91
2956A41j25k3J62l39K84o0j95K64k03j1K53k72J66N9k89L60j53j27K55j87R4J3
2978F7k16K54j36o4K97l24P0J94k70J87l4k05L16k37R3R7k43K24j01m4J54k19
3000a40J05O5k52K26oj57K85k36Q9J17l17K70p8p8K09j88M9J76l00K09jj75K38
$$ y = [-5, 84, -213, 116, -13, -131, 192, -154, 9, 126, -197, 146, -36, -104, 228, -78, 15, 129, -104, 140, 20, -146, 203, -91, 57, 191, -124, 163, 55, -94, 121, -97, 62, 90, -156, 128, -11, -95, 187, -112, 5, 86, -189, 131, 65, -142, 174, -92, -64, 161, -155, 97, 31, -134, 155, -107, -57, 165, -185, 32, -9, -240, 149, -118, -7, 77, -180, 30, -35, -166, 127, -134, -59, 119, -183, 111, 37, -156, 131, -100, -114, 93, -146, 77, 77, -167, 150, -74, 10, 126, -154, 79, 118, -82, 168, -52, -74, 221, -103, 16, 21, -74, 129, -29, -62, 119, -120, 41, 129, -150, 141, 16, -7, 155, -184, 100, 40, -155, 109, -94, -105, 148, -124, 42, 101, -188, 172, 19, -108, 147, -40, 54, 67, -149, 105, -31, -95, 202, -122, -52, 142, -128, 59, 25, -180, 136, -101, -8, 89, -154, 70, -31, -75, 79, -140, -35, 30, -222, 4, -2, -159, 126, -110, -21, 96, -221, 49, -29, -107, 102, -86, -37, 139, -161, 48, 47, -128, 110]
3023A10j83N6J70k80K22o9j28K54k11L8J90k68K49j12j08K86k73MK36k72J72k6
3045E7j73K70k42L5J62k22J96lj99K55k03J2K12l10K10k0j69K40j47n8K11k50
3067a36J69K8k25K74j64l2K09l04K05L4k03K63j96NK11k83K19j2k64L34j93p6
3089a37K73k96J34J24k77K73j50n0K24l04K13M3k43K64j88m2K39k46J67O4k42
3110a57K42p1j18K59l07J34J90k53J50Jj52K75k28Q3R3k50K41o2j22K70k62Q3
3132C9O7k18J73k3j05K49k18K2J75l27K18l7j34K05k03J05J72k96J83K6k26K59
3154A06j16k7J54k55K50p4k27L19j79m0J34j64J66k3j30K36j59l0J64k14J33P3
3176I7j75K95k72kJ72k17R6P0k06K60j72k8K46k68J17Lj29K19j65j1K26k45J19
$$ y = [110, -73, -17, 153, -127, 95, 26, -102, 152, -59, -21, 169, -99, 150, 38, -70, 216, -57, -53, 183, -89, 83, 57, -116, 154, -88, -53, 109, -113, 83, 80, -119, 136, -67, -55, 157, -153, 57, 37, -132, 108, -39, -97, 114, -136, 33, 61, -164, 110, -54, -86, 123, -181, 24, 58, -145, 118, -78, -73, 138, -145, 74, 62, -202, 132, -61, -137, 136, -160, -26, 98, -179, 94, -56, -106, 118, -186, 27, 70, -173, 91, -97, -139, 100, -146, 21, 85, -157, 85, 14, -104, 155, -152, -18, 172, -81, 69, 70, -82, 193, -35, 48, 141, -109, 132, 70, -52, 218, -44, 39, 106, -112, 61, 38, -67, 182, -36, -14, 161, -166, 52, 15, -119, 86, -117, -12, 160, -136, 47, 73, -153, 106, -10, -37, 117, -138, 112, 38, -189, 130, -49, -89, 45, -119, 47, 24, -106, 130, -29, -59, 105, -109, 24, 97, -78, 217, -55, -57, 115, -102, -6, 64, -142, 118, -54, -82, 164, -104, 13, 16, -113, 106, -59, -70, 156, -89, 30]
3199C0Jj89K76j56mJ58k16P3J27k18K67j42q3K25k54J53M7k11K15r9k1K32l00
3222h9J11R9j67J84j15o5J96k30J26N1j57K09j45l6J97k77J76N6j70J78j16j04
3244h8K27k25K8J36k42K43q0j77L34l13M5K77l23K32q3j04K11j78qJ72k40J77
3266B1pj53K18j62R3J07j70J09qj66K14j84N3J65l38L02l7j61K73j90l6K19k91
3289a29J48M5k15K98j94k7K29k72J93%j79K07r0k9J12j70J10L8j72K02j47l8J83
3312A03k26J57M6j58K07j81m6K39k10J23O3k06K42j29m5J72k36J16P1j82K12j55
3334b3o1K86k37L6J30k63K34j02q4K11j80J6P6k08J81m6j30L21k36K6J26k43K45
3357G5j27l9J72j27l1J37k65L14j38o2J84k23Q6J78k45J80l8j94L19k16N2J36
$$ y = [30, 31, -158, 118, -38, -42, 116, -100, -27, 100, -118, 149, 7, -76, 149, -105, 48, 95, -116, 99, 0, -21, 211, -89, 22, 121, -46, 138, 23, -42, 154, -76, 50, 101, -56, 153, 8, -28, 169, -108, 68, 124, -46, 132, 16, -88, 139, -86, -58, 78, -164, 79, -1, -178, 156, -157, -112, 165, -158, 74, -9, -113, 98, -80, -88, 84, -156, 21, 14, -139, 79, -83, 10, 117, -53, 56, 48, -118, 96, -88, -35, 130, -208, 94, 57, -104, 169, -21, -57, 162, -129, 19, 64, -151, 147, -47, -74, 155, -117, 76, 76, -103, 104, 14, -15, 97, -73, 37, 75, -97, 105, -42, -80, 103, -123, 34, 80, -78, 129, -52, -98, 141, -69, 54, 117, -89, 153, 24, -21, 151, -85, 31, 102, -80, 132, -23, -84, 202, -35, 1, 131, -132, 102, 0, -84, 127, -53, -37, 39, -169, 12, -34, -164, 157, -79, -53, 73, -170, 75, -52, -91, 81, -46, -77, 60, -205, 109, -29, -91, 93, -130, -44, 134, -111, 69, 31, -163, 156, -60, -8, 128]
3379A28k16J06J4j27K34j93J4J18k14K38n3j52K32k14J44Q1k37J97j08q5K73k38
3401e8JJ58k27J40M7k22K31n9n9J42k33J60P5k07K42j50j4J53k71J95j0j58K53
3424A29j46m6J89k30J16J6j09J42l5r6K22k75J17R8k25K47j26j27K46k00O2Q0
3446D9k17K70j19j27K37j91O0R4k09K12q7j06J95j61P8J07k33K18k2j30J40j58
3468a00M3J61k42K04o2j16K83k52O0J13k05J62m0n7K11k06Q8O0j94J63n7p2J72
3491A17j70N5P8k24K69p4j57K07j58m7J97j98J15P7j87K09j43MR4j64J11N4k05
3514a40K26p8r0J99j97Q2N0j62J74q0j3J52k28J44J4j83K04j38kJ83k37J87m6
3537B1j71K04j06n5J92k00J51N0k94L22j41o0J91j94J20%j28J45j29L3J41j95
$$ y = [128, -88, 18, 32, -95, 139, -54, -40, 78, -136, 102, 49, -103, 129, -85, 59, 140, -97, 100, -8, -93, 180, -58, -57, 101, -126, 14, 61, -161, 70, 11, -48, 94, -139, 21, 96, -111, 131, -19, -33, 120, -151, 44, 34, -124, 129, -17, -63, 126, -104, 12, 28, -81, 61, 26, -70, 152, -123, -6, 92, -133, 114, -12, -139, 107, -93, -31, 49, -168, 102, -17, -144, 93, -98, -38, 56, -153, 59, -28, -134, 61, -100, -22, 85, -148, 70, 48, -82, 58, -100, -57, 104, -138, 66, 4, -112, 171, -81, -21, 92, -113, 49, 9, -48, 163, -43, 45, 105, -89, 74, 17, -55, 117, -53, 2, 80, -144, 125, 51, -106, 101, -57, -104, 93, -105, 10, 87, -100, 109, -34, -30, 64, -100, 11, 65, -140, 86, 8, -82, 117, -80, 2, 52, -110, 64, -16, -29, 123, -105, 39, 53, -130, 74, -64, -66, 117, -120, 67, 21, -150, 54, -52, -107, 85, -115, 36, 86, -208, 114, -27, -87, 104, -90, 30, 30, -98, 47, -82, -49, 92, -103]
3559a03J67J1k05K37j68r0J98j37R8O7j76J77q0q1J41j27N9R4j43J47q2j2J64
3582A56j74L4Q5k10K25r7l5J58k20O8J31k19J79l9j17J83j57K1O4j73K30p2q6
3605f5J43j93Q6J65l37K54k4j53K33j94N7J16k00J45l2r9J57q1l2J06j67J35L0
3628E0k06K65j47OJ54j96O4M7j25J89j61NK19k75R2R3k06K05j40kJ83j95N9M3
3652B1j36J97j04m2J64k10J69Kj98J96p4o4J55j24L9R5j35J40l4r6J66k11Q0P2
3676F8j23J79p9j00J92k24J19O4j77J85o7j03K12j30kM2j39J78q9o9J11j01RR7
3700E3j49J58j04r9J89j42Q1O0k48K23m8m9J87j71%J85k76J75m6o0J82j71jJ71
3724A00k04J22p2o1K06j02J6R1j75J34q8n8J95j23j1J65k43J22J6r3J31j04K1
$$ y = [-103, 64, 75, -130, 107, -61, -151, 47, -90, 8, 75, -101, 76, -4, -85, 56, -71, -12, 82, -61, 86, 4, -8, 156, -18, 16, 101, -109, 116, 19, -16, 142, -78, -10, 121, -98, 81, 42, -75, 108, -49, -28, 36, -137, 93, 21, -65, 78, -115, -29, 136, -201, 53, 29, -124, 109, -85, -28, 88, -112, 33, 1, -98, 59, -22, -54, 52, -115, 20, 50, -156, 109, -38, -32, 122, -74, -10, 37, -88, 101, -60, -55, 164, -111, -19, 74, -132, 73, -67, -69, 114, -81, -22, 21, -115, 82, -22, -64, 100, -110, 59, 61, -137, 59, -15, -79, 76, -48, -9, 86, -49, 91, 57, -39, 127, -84, -4, 68, -55, 124, 45, -55, 137, -87, 32, 96, -81, 104, 37, -66, 146, 16, 14, 56, -83, 95, 6, -63, 48, -53, -44, 53, -96, 62, -42, -141, 48, -94, -13, 47, -201, 22, -26, -75, 112, -59, -59, 126, -150, 25, -21, -81, 101, -70, -71, 100, -104, 18, -54, -115, 91, -11, 5, 96, -79, 55, -33, -91, 104, -19, -30, 135, -108, 14, 30, -63, 68, -36, -15]
3747a5Q0j32Q1M4j47J60r5PM8q8J07K8j91K08j07QJ08k36K13l8j33J52o3l2J66
3772A33k07J23J0j27J08Jr2J17q7K8Q7k31K49j44K9J24j28QO7r0O6K1j41J67j86
3797i5P1J28j54R7n6j00K30k33JJ35j72J96l7j31J99j41k8J34j96J63p0j3J54
3820H2j68pQ2o6J33r5k3J78j74L3R3j58J44l3j22K04j22k2J14j37J32k9o6J80
3844A53j56K1R1k02J55j4j44J86q5o4J62j70R4N2j56J86j84QJ66j38L4Q8j10J09
3868H2r4n1N7o0N8R2j85J61n8k3J23k08J32J2j41J73p9m9J96k20R8Rj32K09j26
3893b4n3J84k00J14K7j29J50p7j11J91o6QJ4p0R1o1r5K13j43N0P3k20J41j7q9
3918i9K06j28O9k4j27J39l6NQ4k04P9J10j09J60o6o5J13j72P9O0j30J31Lj28J35
$$ y = [-15, 65, -67, 14, 58, -89, 71, -24, -17, 31, -57, 50, 78, -113, 95, -12, -4, 104, -132, 81, 43, -90, 62, -1, -33, 133, -74, 49, 59, -68, 40, 41, -51, 66, -21, 7, 94, -137, 112, -32, -3, 121, -7, 1, 68, -22, 44, 65, -76, 91, -95, -24, 104, -50, 47, -9, -109, 121, -112, -111, 24, -148, 48, 11, -120, 79, -62, -90, 44, -152, 11, -59, -72, 82, -86, -93, -11, -77, 56, -39, -62, 116, -58, -25, 68, -90, 54, 21, -101, 103, -19, -41, 73, -64, 68, 39, -27, 153, -3, 18, 109, -93, 62, 48, -96, 90, 5, -59, 103, -67, 27, 79, -77, 109, -75, -67, 99, -39, -5, 83, -27, 82, -12, -63, -6, -66, -8, 84, -101, 60, 2, -21, 102, -106, 26, 38, -103, 70, -9, -58, 138, -82, 16, 25, -107, 102, -24, -77, 107, -93, 21, 48, -81, 69, -8, -119, 72, 6, 14, 28, -42, 49, -12, -107, 106, -37, 13, 86, -134, 7, -10, -99, 107, -21, 48, 24, -103, 36, 0, 5, 89, -115, -36, 74, -35, 125, 59, -6, 107, -65, 14, 74, -56, 75, 78, -50, 85]
3943H5q4JJ03j80J08mj37J85r9k4J25j64J24K9j49J83j55O8Q0j76Q2j0r7J93k05
3968a18O5P7j68J84m1q4K00j30n3J38q2O6n8r4J58n2j13K26k64J63M4j54J63j41
3992f8lJ97k04L4P0j36K30j40nR1j19oJ40k28K29o6r3J50j53J65m8j87J99m9r8
4017i8J96j30L4O0j36P1j5l6J16n3%P6j69J54o0k1J07j09N9Kj15J37j3r6J40r9
4043Bm2J18j63J05m5k3J17n7k3J12j70J23Pj65J93j45J4J30j14O8l1j28J87j01
4067c1nJ61k07R5N8j42J31j20K5J74k06J04l2r5J51o6o3J28r3N5Kq7J12q3l1J66
4093A01j48M4O9q6Q5k3q4J09j40L9M9o3J75j10o5J15j11K3J01j61K10j39l9J18
4117F9j51O1N9r8J41p0r6K10j42J8L2j09J71q8l7J43j24PR0j95J95o1p4J85k16
$$ y = [85, 1, 2, 105, -75, 33, 29, -108, 77, -22, -46, 79, -85, 39, 68, -81, 102, -53, 15, 95, -81, 1, -9, -106, 87, -118, -53, 24, -144, 40, -1, -85, 115, -15, -68, 70, -12, 54, -4, -98, 60, 8, -105, 121, -143, 20, 64, -90, 73, -68, -71, 126, -78, -44, 26, -110, 120, -20, -25, 66, -53, -59, 81, -147, 82, 16, -77, 73, -80, 85, 37, -150, 49, 0, -98, 98, -32, 2, 62, -74, -3, -18, -54, 62, 9, 9, 85, -84, 70, 10, -11, 96, -13, 46, 48, -67, 70, 57, -39, 101, 2, -40, 78, -85, 20, -25, -48, 69, 12, -11, 101, -69, 54, 61, -104, 89, -56, -42, 88, -26, 42, 11, -117, 70, -31, -36, 125, -82, 13, 71, -71, 60, -60, -35, 139, -67, 37, 5, -90, 61, -5, -68, 60, -33, 22, 24, -63, 49, -34, -65, 101, -47, -3, 66, -20, 65, 42, -42, 67, -73, -34, 15, -48, 127, 17, -48, 67, -44, -21, 80, -81, 129, -10, -49, 69, -82, -21, 38, -60, 81, 11, -85, 125, -17, 1, 33, -76, 95, 7, -30, 113, -11, -4, 86, -109, 86, 25, -49, 136, -80]
4142h0R5N0j89J64K0j04J52j77Q1K9j28J34l6l8J16j82R0J47j85P1k4l3J23j22
4166b6J8M1j34J06k5j10J48p8N1Q5j66J03L0j05J29j02K9M4q7Q9l7m9J50j08P
4191CM4j18J68j8j07J16r1l2R9j50J19K7j43J64p1qO4r1N8O7j39J07p8p9J45j63
4217a07J40J7p1R2j12J1R4m1m2L2p6Q8p4O4M0o2j7O2o3J1N3j20J56j19K6O6r3
4244d5J03j1m7M5j38J14O1j57R4m0m8R4j05OJ47k07J48m6l7J61j91P1P4j05J93
4269A34j57l6P5m5M1L6j35O9N1j16J62l2k7M4j42J19n5q3J44p4L1J08j34J16o8
4294B6r0J87j55O0R0j52P2J8n0J03j15o2J73j16M2jo9J14k7m7O3j56J21j2p4R0
4320C3q7L3J15j57Q0J21j63Q1p0o0J88j72R2K5j10J56n7r6J45j93J21Qn4P2o9
$$ y = [-80, 15, 65, -124, 40, 60, -44, 108, -69, 12, 41, -87, 47, 11, -27, 89, -93, -3, 144, -41, 30, 6, -27, 96, -26, -8, 33, -101, 5, -20, -130, 18, -60, -9, 76, -90, 13, 43, -62, 67, -35, -6, 38, -49, 40, 3, -46, 104, -4, 3, 47, -71, 97, 79, -28, 88, -3, -35, 64, -86, 33, 60, -83, 81, 10, 2, 66, -25, 33, 100, -39, 68, -10, -89, 56, -107, 33, 50, -21, 71, -41, -30, 64, 23, -19, 13, -63, 25, -49, 15, 55, -7, -24, 38, -25, -14, 39, -81, 75, -44, -18, 48, -45, 58, 47, 0, 45, -93, 21, 82, -75, 19, -21, -69, 25, -80, -74, 73, -134, 14, -32, -69, 92, -99, -28, 46, -59, 134, -23, -59, 16, -29, 12, 48, -87, -18, 33, -83, 79, 47, 20, 64, -78, 41, -14, -97, 47, -27, 4, 112, -22, 94, 26, -64, 123, -32, 28, 118, -34, 38, 56, 6, 109, -6, -68, 105, -11, 31, 30, -39, 75, 48, 1, 64, -92, 29, 17, -57, 33, -54, -21, 94, -63, 17, 138, -25, 56, -14, -74, 114, -58, 34, 59, -51, 105, 48, -48, 97, -96, 25, 33, -21, 51, -18]
4345a8j6J61j54L2M7j48J68n1oL6j24L5J45j95J35j3r1J28r0L5J4j12J17k4q3
4370g2J34l6o5J21j29N9j3n0J35j29LJ21j70J24m0o9K00k13O6P8j01J24k9p0J86
4395A65j75KO3j22J36jj26J74j49L4J17j60R2l3m5P4l4l6J10r6K3Mr2J76j06j0
$$ y = [-18, -34, 127, -27, 5, 52, -96, 72, 21, 15, 51, -73, -38, 107, -88, 47, 34, -57, 71, -19, 16, 30, -82, 35, 11, -72, 62, 26, -39, 82, -47, 12, -1, -51, 84, -45, -42, 79, -91, 33, -7, -76, 124, -89, -23, 55, -46, 78, 49, -21, 165, -10, -8, 55, -67, 69, 68, -58, 116, -33, 1, 118, -42, 50, 17, -28, 46, 12, -24, 86, -10, 13, 17, -75, 101, -5, -15]
$$ [...]
8191c0
##END NTUPLES=NMR FID
##END=
