##TITLE=1H_6-2021
 CDCl3,8 sc, 
 8.02.2021
##JCAMPDX= 6.0         $$ Bruker NMR JCAMP-DX V2.0
##DATA TYPE= NMR FID
##DATA CLASS= NTUPLES
##ORIGIN= UXNMR, Bruker Analytische Messtechnik GmbH
##OWNER= root
$$ XWIN-NMR		Version 3.5
$$ Mon Feb  8 11:27:38 2021 Russian Standard Time (UT+4h)  she@DPX200
##.OBSERVE FREQUENCY= 200.1315066352
##.OBSERVE NUCLEUS= ^1H
##.DELAY= (6, 6)
##.ACQUISITION MODE= SIMULTANEOUS
##.ACQUISITION SCHEME= undefined
##.AVERAGES= 8
##.DIGITISER RES= 18
##SPECTROMETER/DATA SYSTEM= spect
##.PULSE SEQUENCE= zg30
##.SOLVENT NAME= CDCl3
##.SHIFT REFERENCE= (INTERNAL, CDCl3, 0, 15.7039)
##AUDIT TRAIL= $$ (NUMBER, WHEN, WHO, WHERE, WHAT)
$$ ##TITLE= Audit trail, XWIN-NMR		Version 3.5
$$ ##JCAMPDX= 5.01
$$ ##ORIGIN= Bruker BioSpin GmbH
$$ ##OWNER= she
$$ F:/spectra/data/she/nmr/H-F/1/audita.txt
$$ ##AUDIT TRAIL=  $$ (NUMBER, WHEN, WHO, WHERE, WHAT)
(   1,<2021-02-08 11:25:38.09 +0400>,<she>,<DPX200>,
      <created by zg, POWCHK disabled, PULCHK disabled
       configuration hash MD5:
       00 E9 B6 7A A2 85 ED C7 34 08 36 98 17 FE 4E 26
       data hash MD5: 16K
       EA 97 88 AC 4A E6 7F 51 B6 32 4F E6 01 90 7A E0>)
$$ ##END=
$$ 
$$ hash MD5
$$ C4 29 18 13 EB C3 98 2E 0D 8F 96 4F 58 57 78 40
##$RELAX= 
##$RELAX= 
##$RELAX= 
##$RELAX= 
##$RELAX= 
##$RELAX= 
$$ Bruker specific parameters
$$ --------------------------
##$DU= <F:/spectra>
##$EXPNO= 1
##$NAME= <H-F>
##$PROCNO= 1
##$TYPE= <nmr>
##$USER= <she>
##$AMP= (0..31)
100 100 100 100 100 100 100 100 100 100 100 100 100 100 100 100 100 100 
100 100 100 100 100 100 100 100 100 100 100 100 100 100 
##$AQSEQ= 0
##$AQ_mod= 1
##$AUNM= <au_zg>
##$AUTOPOS= <>
##$BF1= 200.13
##$BF2= 200.13
##$BF3= 200.13
##$BF4= 200.13
##$BF5= 200.13
##$BF6= 200.13
##$BF7= 200.13
##$BF8= 200.13
##$BYTORDA= 1
##$CFDGTYP= 0
##$CFRGTYP= 5
##$CHEMSTR= <none>
##$CNST= (0..31)
1 1 145 1 1 1 1 1 1 1 1 1 1 1 1 1 1 1 1 1 1 1 1 1 1 1 1 1 1 1 1 1 
##$CPDPRG= <>
##$CPDPRG1= <>
##$CPDPRG2= <>
##$CPDPRG3= <>
##$CPDPRG4= <mlev>
##$CPDPRG5= <mlev>
##$CPDPRG6= <mlev>
##$CPDPRG7= <mlev>
##$CPDPRG8= <mlev>
##$CPDPRGB= <>
##$CPDPRGT= <>
##$D= (0..31)
0 1.2 0 0 0 0 0 0 0 0.06 0 0.03 0 0 0 0 0.0002 0 0 0 0 0 0 0 0 0 0 0 0 
0 0 0 
##$DATE= 1612769137
##$DBL= (0..7)
120 120 120 120 120 120 120 120 
##$DBP= (0..7)
150 150 150 150 150 150 150 150 
##$DBP07= 0
##$DBPNAM0= <>
##$DBPNAM1= <>
##$DBPNAM2= <>
##$DBPNAM3= <>
##$DBPNAM4= <>
##$DBPNAM5= <>
##$DBPNAM6= <>
##$DBPNAM7= <>
##$DBPOAL= (0..7)
0.5 0.5 0.5 0.5 0.5 0.5 0.5 0.5 
##$DBPOFFS= (0..7)
0 0 0 0 0 0 0 0 
##$DE= 6
##$DECBNUC= <off>
##$DECIM= 32
##$DECNUC= <off>
##$DECSTAT= 4
##$DIGMOD= 1
##$DIGTYP= 9
##$DL= (0..7)
0 120 120 120 120 120 120 120 
##$DP= (0..7)
150 150 150 150 150 150 150 150 
##$DP07= 0
##$DPNAME0= <>
##$DPNAME1= <>
##$DPNAME2= <>
##$DPNAME3= <>
##$DPNAME4= <>
##$DPNAME5= <>
##$DPNAME6= <>
##$DPNAME7= <>
##$DPOAL= (0..7)
0.5 0.5 0.5 0.5 0.5 0.5 0.5 0.5 
##$DPOFFS= (0..7)
0 0 0 0 0 0 0 0 
##$DQDMODE= 0
##$DR= 18
##$DS= 0
##$DSLIST= <SSSSSSSSSSSSSSS>
$$ [...]
##$SUBNAM2= <"">
##$SUBNAM3= <"">
##$SUBNAM4= <"">
##$SUBNAM5= <"">
##$SUBNAM6= <"">
##$SUBNAM7= <"">
##$SUBNAM8= <"">
##$SUBNAM9= <"">
##$SW= 16.9725356469052
##$SWIBOX= (0..15)
0 0 2 0 0 0 0 0 0 0 0 0 0 0 0 0 
##$SW_h= 3396.73913043478
##$TD= 16384
##$TD0= 1
##$TE= 0
##$TE2= 300
##$TE3= 300
##$TEG= 300
##$TL= (0..7)
0 120 120 120 120 120 120 120 
##$TP= (0..7)
150 150 150 150 150 150 150 150 
##$TP07= 0
##$TPNAME0= <>
##$TPNAME1= <>
##$TPNAME2= <>
##$TPNAME3= <>
##$TPNAME4= <>
##$TPNAME5= <>
##$TPNAME6= <>
##$TPNAME7= <>
##$TPOAL= (0..7)
0.5 0.5 0.5 0.5 0.5 0.5 0.5 0.5 
##$TPOFFS= (0..7)
0 0 0 0 0 0 0 0 
##$TUNHIN= 0
##$TUNHOUT= 0
##$TUNXOUT= 0
##$USERA1= <user>
##$USERA2= <user>
##$USERA3= <user>
##$USERA4= <user>
##$USERA5= <user>
##$V9= 5
##$VALIST= <valist>
##$VCLIST= <CCCCCCCCCCCCCCC>
##$VD= 0
##$VDLIST= <DDDDDDDDDDDDDDD>
##$VPLIST= <PPPPPPPPPPPPPPP>
##$VTLIST= <TTTTTTTTTTTTTTT>
##$WBST= 1024
##$WBSW= 4
##$XGAIN= (0..3)
0 0 0 0 
##$XL= 0
##$YL= 0
##$YMAX_a= 146367
##$YMIN_a= -109665
##$ZGOPTNS= <>
##$ZL1= 120
##$ZL2= 120
##$ZL3= 120
##$ZL4= 120
##$ABSF1= 10
##$ABSF2= 0
##$ABSG= 5
##$ABSL= 3
##$ALPHA= 0
##$AQORDER= 0
##$ASSFAC= 0
##$ASSFACI= 0
##$ASSFACX= 0
##$ASSWID= 0
##$AUNMP= <proc_1d>
##$AZFE= 0.1
##$AZFW= 0.1
##$BCFW= 1
##$BC_mod= 2
##$BYTORDP= 1
##$COROFFS= 0
##$CY= 11.3945322036743
##$DATMOD= 1
##$DC= 2
##$DFILT= <>
##$DTYPP= 0
##$F1P= 15.9154993809931
##$F2P= -4.1035820241983
##$FCOR= 0.5
##$FTSIZE= 0
##$FT_mod= 4
##$GAMMA= 1
##$GB= 0.15
##$INTBC= 1
##$INTSCL= 1
##$ISEN= 128
##$LB= 0.24
##$LEV0= 0
##$LPBIN= 0
##$MAXI= 10000
##$MC2= 0
##$MEAN= 0
##$ME_mod= 0
##$MI= 1.114404
##$NCOEF= 0
##$NC_proc= 0
##$NLEV= 6
##$NOISF1= 3.799351
##$NOISF2= 2.8
##$NSP= 1
##$NTH_PI= 0
##$NZP= 0
##$OFFSET= 15.70392
##$PC= 1
##$PHC0= -10755.3
##$PHC1= 10.00094
##$PH_mod= 1
##$PKNL= yes
##$PPARMOD= 0
##$PSCAL= 0
##$PSIGN= 0
##$REVERSE= no
##$SF= 200.130013532006
##$SI= 16384
##$SIGF1= 3
##$SIGF2= 2
##$SINO= 400
##$SIOLD= 16384
##$SREGLST= <1H.CDCl3>
##$SSB= 0
##$STSI= 0
##$STSR= 0
##$SW_p= 3612.71676300578
##$SYMM= 0
##$S_DEV= 0
##$TDeff= 0
##$TDoff= 0
##$TI= <>
##$TILT= no
##$TM1= 0
##$TM2= 0
##$TOPLEV= 0
##$USERP1= <user>
##$USERP2= <user>
##$USERP3= <user>
##$USERP4= <user>
##$USERP5= <user>
##$WDW= 1
##$XDIM= 8192
##$YMAX_p= 0
##$YMIN_p= 0
$$ End of Bruker specific parameters
$$ ---------------------------------
##NTUPLES= NMR FID
##VAR_NAME=  TIME,          FID/REAL,        FID/IMAG
##SYMBOL=    X,             R,               I
##VAR_TYPE=  INDEPENDENT,   DEPENDENT,       DEPENDENT
##VAR_FORM=  AFFN,          ASDF,            ASDF
##VAR_DIM=   8192,          8192,            8192
##UNITS=     SECONDS,       ARBITRARY UNITS, ARBITRARY UNITS
##FACTOR=    0.0002944,     1,               1
##FIRST=     0,             0,               0
##LAST=      2.4114304,     0,               0
##MIN=       0,             -109665,         0
##MAX=       2.4114304,     146367,          0
$$ Real data points
##PAGE= N=1
##DATA TABLE= (X++(R..R)), XYDATA
0 0 0 0 0 0 0 0 0 0 0 0 0 0 -8 8 -8 8 -16 16 -16 24 -25 32 -40 48 -56 64 -72 80 -96 109 -124 141 -158 180
34 180 -201 226 -254 285 -317 351 -391 432 -478 528 -583 644 -709 782 -861 947 -1044 1150
52 1150 -1266 1398 -1546 1713 -1907 2127 -2388 2695 -3070 3533 -4123 4901 -5972 7543 -10055
67 -10055 14665 -25711 98915 79466 -109665 146367 -40914 27444 101345 -75129 56030
78 56030 75442 -73266 93545 2125 -28497 101147 -74489 53411 39729 -42295 58364
89 58364 -12167 452 31796 4703 -4669 43797 -30875 25453 28375 -29916 52098 -10882 4082
102 4082 21655 -1743 10286 30101 -24121 10403 33383 -45673 51811 -29289 246 26193
114 26193 -53141 32378 -10176 -16821 5667 -19767 -10088 17557 -36315 11189 2290 -36910 35665
127 35665 -43806 26375 -1621 -28889 29084 -29459 17196 -851 -10249 5339 575 -11732
139 -11732 13873 -6633 -2292 14293 -27142 27595 -19403 13770 4268 -18569 25429 -21666
151 -21666 20402 -3890 -2076 8646 -3346 -1693 9070 2146 -5653 15957 -23367 24149 -6178
164 -6178 -2308 13009 -15374 16442 -12136 11999 -5374 9183 -5300 -5372 14253 -12711 15164
177 15164 -11732 3272 -261 -161 -3668 6956 -3649 -9028 15778 -25924 26421 -15189 -4336
190 -4336 14580 -25667 20213 -10047 -2138 4408 -5533 -7860 11396 -12513 1622 9757 -27481
203 -27481 24469 -19595 6318 5695 -17242 12958 -11124 5165 -3155 5457 -8293 6806 -5116
216 -5116 395 11546 -12157 14145 -10359 10182 -1410 5621 3325 -2101 10964 -11265 19898
229 19898 -8737 10431 1887 -3687 11664 -3790 9993 -2393 8106 -7886 12636 -4887
241 -4887 4516 8409 -13338 16803 -13178 11775 -1646 55 2637 -3570 5821 -4897 11332
254 11332 -11151 10128 -6776 1879 5280 -5931 7747 -9310 7650 -9314 9450 -7203
266 -7203 826 2205 -12844 13338 -13966 7909 -5373 -3276 -501 -1948 -828 -3079 3982 -14678
280 -14678 12943 -14786 6284 1597 -12176 11292 -13828 7420 -3554 1391 -3605 2709 -5285
293 -5285 925 7171 -12487 15327 -14711 7908 901 -3844 8481 -6574 6219 -4228 8125
306 8125 -5731 10182 -5248 374 7646 -9318 14714 -9573 6461 -2766 1258 1092 -219 2834
320 2834 -7090 8592 -12838 10778 -6941 -780 3199 -10285 7349 -7970 4946 -6167 3123
333 3123 -6743 2166 346 -6070 8655 -13685 9496 -8611 2876 350 -4632 3604 -7939 5535
347 5535 -8248 6945 -8723 1858 -2461 -4930 5324 -9412 6592 -10325 4728 -6256 1411
360 1411 508 -5543 6115 -10507 9838 -6773 5172 -997 -803 3729 -1999 8695 -4387 10978
374 10978 -6004 8904 1555 2302 9479 -4734 11515 -4405 9564 -262 6284 1759 12 6723
388 6723 -4808 11725 -6519 7700 -2432 1611 3755 -2285 6256 -5531 7675 -7671 8127
401 8127 -3134 1751 3764 -7430 9616 -7073 7588 -3663 2632 -1085 446 2708 -3839 7408
415 7408 -8928 7603 -7499 3484 -173 -5390 3654 -9248 4969 -8872 3043 -6806 -1476
428 -1476 -2673 -6938 4435 -8345 5137 -8213 3163 -3113 1451 1786 -2963 7221 -7166 10079
442 10079 -5138 7087 1788 -2026 6640 -3722 8038 -3217 5824 -3569 5069 -1071 433 5694
456 5694 -5986 9378 -8093 7875 -1148 2412 2920 -2682 6681 -3639 9023 -4834 7612
469 7612 -1159 1426 4865 -2316 8216 -4985 6206 -4005 5947 -2175 1034 2637 -6234 8354
483 8354 -9167 7248 -3853 -380 502 -4216 3175 -3690 3920 -5875 5763 -5890 4509 -21
497 -21 -2495 7735 -8469 8595 -4700 5151 161 -650 2553 -2023 5551 -4839 6769 -5601
511 -5601 4885 -2269 -824 3970 -4571 5673 -6781 6109 -3986 4759 -796 -1303 6123 -5632
525 -5632 8955 -4233 6854 234 2131 3366 1400 5875 -1972 7794 -5044 9380 -2146 2555
539 2555 4466 -4614 7277 -6265 6585 -3247 2548 -1726 -1242 1920 -3385 4818 -6594 5843
553 5843 -5150 3118 -746 -888 4093 -5438 6601 -5998 6951 -2691 1105 2012 -2969 5343 -3992
568 -3992 4987 -4520 3596 -4252 1760 -420 -3643 4053 -9389 5839 -7354 1974 -2301 -3345
582 -3345 1627 -5714 3679 -5879 4430 -5515 2382 -1880 -741 4175 -4742 6406 -5392 5662
596 5662 -3016 3435 710 -1489 4969 -5484 7279 -4967 4311 -1917 -451 2262 -2997 4048
610 4048 -4272 4729 -5292 4560 -3056 928 2379 -5499 6418 -6894 5704 -3201 1085 18
624 18 -2199 2276 -3464 4321 -5439 4842 -5078 2565 -135 -2938 4202 -6252 5342 -5899 3696
639 3696 -2714 -121 424 -4123 4052 -5910 4977 -5459 2059 -2182 -719 1518 -3422 4285 -6440
654 -6440 5267 -4670 3206 -641 -1609 3438 -5055 5670 -4554 4941 -2550 1603 348 -696 4397
669 4397 -3855 6118 -4735 5711 -1625 2070 2613 -1866 5565 -4339 6509 -3204 4984 -908 341
684 341 3328 -2586 5718 -4126 5164 -3104 3445 -753 507 2996 -4060 5580 -5788 5667 -3013
699 -3013 1218 272 -2954 3314 -4562 4042 -4695 3370 -4056 701 -177 -3072 3917 -6704 4268
714 4268 -5213 2654 -2142 -893 912 -4166 3301 -5659 4795 -5325 1710 -1997 -2009 2681 -4880
729 -4880 3947 -5534 3436 -4045 1408 -919 -2054 2552 -5455 4982 -4967 4157 -2649 66 1576
744 1576 -2220 4103 -3913 5369 -3771 4337 -1422 1659 3234 -2334 5768 -4208 6342 -2442 3205
759 3205 94 312 3122 -2905 5642 -4137 5541 -3054 2199 651 -1067 3713 -4814 4620 -4813
774 -4813 3662 -2746 1095 545 -2948 3667 -4791 4852 -4623 2721 -2149 -244 1788 -3344 4024
789 4024 -5174 4238 -4359 2420 -988 -1156 1869 -4454 4075 -4850 3884 -3997 1289 -938 -2149
804 -2149 2822 -4796 4022 -5145 3158 -3251 845 514 -2623 3397 -4813 5095 -4524 3594 -1534
819 -1534 178 2111 -2577 4995 -3687 5222 -3312 3532 -329 556 3305 -2747 5345 -4361 5048
834 5048 -2329 2422 469 -1327 3089 -3579 4834 -4502 3884 -2871 902 335 -2273 3365 -4626
849 -4626 4019 -4490 2849 -2220 172 872 -3391 3540 -4743 4623 -3790 2329 -1131 -856 1908 -3247
865 -3247 4513 -4844 3906 -3722 1666 -833 -1747 2445 -4881 4039 -4938 3523 -2883 470 125 -2429
881 -2429 3178 -4412 4158 -4254 3105 -2194 988 1499 -2557 3998 -4191 4812 -3300 3361 -429
896 -429 117 2749 -2888 4641 -3315 4568 -2276 2557 185 -255 2937 -2880 4624 -4174 4381 -2635
912 -2635 1354 651 -2132 3331 -4288 4197 -3956 2704 -2245 145 639 -2390 3315 -4477 3952 -4290
928 -4290 2724 -1409 -232 1456 -3616 3673 -5063 3943 -3557 1047 -730 -2068 1948 -3953 3198
943 3198 -4536 2361 -3704 1091 -983 -2150 2121 -4794 3874 -4531 3064 -2045 -31 1406 -2885
958 -2885 3624 -3331 4374 -2868 2800 -855 963 1872 -1994 4309 -3723 5129 -2665 3074 345
973 345 -705 3358 -3132 5263 -2980 3953 -1459 2091 1042 -420 3189 -2330 4795 -3198 4251
988 4251 -1798 1610 1292 -2143 4367 -4055 4913 -3228 2316 -917 -809 1432 -2740 2849 -3891 3010
1004 3010 -4052 1942 -1601 -737 1622 -4205 3728 -5244 3223 -2881 447 32 -2529 2489 -3887
1019 -3887 3051 -3720 1968 -2709 546 -362 -2027 2337 -4512 3876 -4621 2940 -1687 -876 1755
1034 1755 -3388 3893 -3534 3419 -2539 1842 -434 141 1917 -1690 4180 -3407 4559 -2487 2939
1049 2939 746 -754 3889 -3446 4870 -2590 3634 -702 930 1618 -847 3215 -2287 4037 -2929
1064 -2929 3267 -1606 1386 1425 -2381 4298 -4127 4387 -2795 1735 -270 -1455 2284 -2905 2770
1079 2770 -3241 2637 -2887 1292 -1140 -974 1935 -3971 3482 -4991 2902 -2677 24 460 -3048
1094 -3048 2617 -3948 2870 -3499 1477 -1902 -279 349 -2032 2243 -3942 3579 -4006 2534 -1107
1109 -1107 -868 2202 -3722 4216 -3559 3117 -1881 915 265 -722 2157 -2154 3834 -3217 3754 -1934
1125 -1934 2117 875 -1168 3733 -3456 4722 -2871 2991 -205 184 2078 -1868 3390 -2609 3350
1140 3350 -2306 2762 -776 537 1260 -2694 3629 -4187 3788 -2993 1323 23 -2041 2509 -3449
1155 -3449 3062 -3384 1901 -2021 801 -594 -1453 1841 -3921 3292 -4331 2519 -2064 -605 1037
1170 1037 -3142 2914 -3722 2888 -2697 1238 -1150 -375 1336 -2523 2680 -3556 3271 -3030 2059
1185 2059 -572 -956 2265 -3463 3649 -3257 3007 -1603 646 734 -1350 2748 -2060 3455 -2576 3204
1201 3204 -1417 1301 1305 -1482 3631 -3168 4233 -2506 2458 -142 -313 2236 -2136 3279 -2448 3008
1217 3008 -2221 1714 -374 -380 1579 -2945 3128 -3884 2819 -2397 510 -151 -2195 2362 -3619 2705
1233 2705 -2982 1541 -1675 -191 -1 -1964 2123 -3765 2882 -3450 1734 -1537 -519 1071 -3064
1248 -3064 2832 -3606 2485 -2289 1216 -501 -1261 1274 -2637 2944 -3133 2697 -2552 1029 -275
1263 -275 -1268 2787 -3137 3563 -2783 3017 -1116 760 1782 -1442 3011 -1859 3146 -1740 2624
1278 2624 -227 1452 1920 -1581 3480 -2518 3664 -2023 2041 279 -190 1945 -2205 3050 -2514
1293 -2514 2528 -1872 1044 -501 -939 1919 -3048 2946 -3348 2392 -1843 376 627 -2043 2158
1308 2158 -3230 2545 -2738 1458 -1115 -535 491 -2128 2012 -3230 2435 -3126 1046 -1239 -1075
1323 -1075 986 -3303 2523 -3558 1810 -2058 155 -259 -1472 1582 -2550 2406 -2902 2486 -1734
1338 -1734 789 478 -1447 2828 -2716 3562 -2335 2322 -79 516 1587 -1460 3100 -1874 2978
1353 2978 -1526 2182 -196 145 1974 -1935 3267 -2551 3046 -1610 1450 593 -1101 2100 -2504
1368 -2504 2459 -2329 2218 -1402 795 120 -1050 2248 -2681 2745 -2848 1996 -1382 -219 637
1383 637 -2479 1936 -3440 2179 -2566 719 -1383 -1105 561 -2536 1784 -3435 2015 -2785 754
1398 754 -821 -1418 1488 -2993 2274 -3134 2184 -1495 171 317 -1426 1903 -2429 2481 -2089 1906
1414 1906 -1242 358 987 -1294 2431 -2707 3018 -1741 1755 -210 -205 1868 -1591 2790 -1980 2749
1430 2749 -1325 1554 106 -140 2088 -2016 3251 -2073 2515 -1098 981 737 -1081 2386 -2105
1445 -2105 2959 -1858 1930 -1139 -8 649 -1807 1735 -2439 2313 -2502 1434 -1025 -555 1100
1460 1100 -2414 2163 -3063 1775 -1900 485 -181 -1190 1273 -2227 1767 -2563 1675 -1984 380
1475 380 59 -1245 1342 -2818 2167 -2634 1680 -1070 -81 1065 -1728 1906 -2385 2566 -1958 1462
1491 1462 -657 197 1219 -1693 2491 -2443 2536 -1695 1456 219 -403 1896 -1676 2649 -1939
1506 -1939 2458 -1021 1137 543 -535 2177 -1909 2881 -2123 2035 -1033 528 821 -1525 2278
1521 2278 -2555 2298 -2040 1402 -651 -266 678 -1925 1788 -2635 2278 -2453 615 -846 -941 1126
1537 1126 -2637 1898 -2857 1599 -1697 158 -234 -1535 1104 -2683 1829 -2280 1469 -1823 -158
1552 -158 244 -1542 1922 -2553 1994 -2308 1381 -752 -107 1200 -1670 2021 -2035 2304 -1424 1296
1568 1296 -82 -451 1440 -1441 2658 -1961 2513 -1261 1085 553 -499 1942 -1749 2686 -1705
1583 -1705 2010 -677 827 761 -689 2066 -1678 2608 -1843 1591 -720 -10 1070 -1749 2203 -2519
1599 -2519 2129 -1665 789 -292 -1040 867 -2067 1828 -2390 1609 -1935 266 -284 -1188 1058 -2409
1615 -2409 1982 -2518 1541 -1404 28 -4 -1513 1343 -2215 1844 -2118 1272 -1163 -310 571 -1780
1631 -1780 1770 -2320 1920 -1866 1020 -391 -382 1238 -1680 2131 -1893 2082 -1158 923 234 -449
1647 -449 1810 -1560 2718 -1719 2206 -564 798 1084 -641 2238 -1556 2672 -1298 1728 -343
1662 -343 547 855 -1070 2190 -1869 2341 -1589 1116 -271 -358 999 -1789 2282 -2409 1810 -1530
1678 -1530 712 -166 -937 1240 -1879 1787 -2162 1403 -1617 233 -40 -1417 1439 -2317 1973 -2120
1694 -2120 1156 -887 -510 342 -1832 1511 -2427 1656 -2124 695 -776 -520 641 -1880 2056 -2394
1710 -2394 1716 -1745 1027 -145 -368 1763 -1854 2154 -1593 1800 -922 1000 640 -606 2261
1725 2261 -1497 2644 -1446 1929 -597 703 1063 -889 2152 -1782 2104 -1518 1084 -409 243
1740 243 1320 -1316 2040 -1995 2114 -1461 1241 180 -476 1619 -1656 2055 -2086 1869 -1233
1755 -1233 361 148 -926 1202 -2120 1585 -2004 1019 -1298 -180 256 -1892 1223 -2345 1371
1770 1371 -2094 727 -709 -600 581 -1742 1672 -2114 1520 -1752 932 -198 -532 1359 -1629
1785 -1629 2214 -1776 2065 -1042 614 546 -462 1869 -1703 2222 -1447 1605 -542 438 901 -742
1801 -742 2059 -1689 2197 -1577 1445 -448 69 1276 -1471 2131 -1371 2085 -944 1238 52
1816 52 -47 1418 -1527 2127 -1842 1775 -1407 544 84 -1002 1433 -2271 1568 -2034 1164 -1071
1832 -1071 89 249 -1627 1243 -2341 1566 -2162 950 -978 -320 298 -1811 1315 -1992 1692 -1650
1848 -1650 547 -424 -578 849 -1572 1839 -2033 1591 -1280 813 101 -832 1387 -1836 1928 -1552
1864 -1552 1562 -827 414 623 -708 1607 -1566 2105 -1368 1408 -248 381 1316 -984 2254 -1619
1880 -1619 2284 -1131 1334 -11 -45 1346 -1255 2065 -1617 1883 -1258 789 258 -388 1441 -1581
1896 -1581 1865 -1801 1510 -1128 216 226 -1218 1363 -2176 1504 -2363 1257 -1082 -301 596 -1485
1912 -1485 1191 -2070 1561 -1880 886 -499 -386 983 -1677 1853 -2060 1571 -1474 551 -145
1927 -145 -1084 1232 -1827 1704 -2100 1260 -1221 430 613 -1063 1604 -1783 1891 -1657 1402 -242
1943 -242 -6 938 -1019 1957 -1409 2355 -1341 1567 135 163 1410 -1030 2228 -1549 2274 -938
1959 -938 950 250 -516 1390 -1247 2245 -1829 1620 -1011 502 466 -641 1452 -2044 2030 -1731
1975 -1731 1193 -713 76 586 -1559 1557 -1749 1528 -1482 718 -629 -486 654 -1731 1510 -2277
1991 -2277 1488 -1700 325 -221 -807 1080 -1791 1553 -1973 1053 -1206 346 27 -1363 1426 -1870
2007 -1870 1656 -1752 1294 -644 64 657 -874 1852 -1436 1954 -1404 1219 -49 38 1036 -1172
2023 -1172 2216 -1580 1856 -971 1047 85 -331 1550 -1182 1934 -1530 1804 -609 631 508 -745
2039 -745 1452 -1696 1709 -1700 1540 -699 263 598 -1213 1448 -1862 1587 -1625 927 -753 -218
2055 -218 509 -1734 1301 -1899 1391 -1613 393 -402 -810 708 -1799 1450 -2021 1387 -1397 126
2071 126 -13 -1155 1057 -1893 1488 -1931 1114 -878 -39 389 -1070 1464 -1465 1704 -1519 1223
2087 1223 -316 115 1038 -1177 1799 -1792 1754 -1073 846 188 -120 1189 -1481 1954 -1356 1805
2103 1805 -990 878 457 -442 1523 -1340 2147 -1622 1669 -649 310 506 -615 1468 -1570 1930
2119 1930 -1464 1248 -463 -122 680 -1165 1650 -1672 1746 -1531 885 -409 -668 868 -1929 1411
2135 1411 -1835 1128 -1518 105 -123 -883 689 -1780 1269 -2004 1027 -1258 -27 149 -1141 1137
2151 1137 -1882 1600 -1698 1111 -618 -99 844 -1368 1626 -1634 1731 -1154 776 -239 -168 1290
2167 1290 -1019 1823 -1527 1963 -776 847 445 -419 1362 -1495 1733 -1408 1466 -737 561
2182 561 592 -668 1402 -1363 1801 -1345 1662 -179 219 868 -936 1658 -1695 1703 -1267 859
2198 859 -45 -245 851 -1419 1800 -1711 1293 -1245 335 -73 -857 883 -1932 1224 -1784 888
2214 888 -1194 -3 57 -1278 1024 -1855 1485 -1638 1162 -498 -191 485 -1013 1426 -1732 1540
2230 1540 -1222 747 -182 -287 1093 -1030 1550 -1406 1737 -1119 839 169 -385 1094 -1305 1807
2246 1807 -1485 1602 -693 609 612 -600 1586 -1169 2016 -1048 1348 -213 187 661 -798 1927
2262 1927 -1582 1679 -1088 1173 -214 -74 993 -1071 1508 -1609 1445 -1068 446 126 -638 863
2278 863 -1646 1276 -1793 1293 -877 284 69 -980 845 -1720 1462 -1519 1010 -844 -150 158
2294 158 -1222 944 -1434 1431 -1530 801 -587 -493 678 -1239 1324 -1852 1394 -1328 689 -9
2310 -9 -211 1076 -1295 1351 -1236 1603 -825 413 203 -281 1264 -1148 1897 -1227 1351 -315
2326 -315 184 787 -525 1433 -1224 1673 -1053 1308 -293 -23 906 -833 1523 -1222 1395 -936
2342 -936 767 11 -362 1112 -1271 1623 -1405 1313 -1040 186 119 -942 906 -1635 1218 -1303
2358 -1303 818 -1006 191 153 -1211 1138 -1751 1295 -1573 777 -666 -533 459 -1493 1166 -1610
2374 -1610 1306 -1218 329 -434 -339 1026 -1243 1496 -1291 1228 -826 567 303 -511 1202 -1144
2390 -1144 1258 -1036 1289 -328 133 736 -828 1429 -1151 1682 -929 1146 -159 70 882 -792
2406 -792 1394 -1464 1458 -1064 867 -2 -207 926 -1091 1320 -1210 1185 -673 386 -38 -616
2422 -616 817 -1501 1215 -1193 816 -653 159 365 -1001 1169 -1381 1242 -1219 767 -729 -155
2438 -155 255 -1205 1419 -1531 905 -1490 475 -441 -427 434 -1104 1035 -1506 967 -1209 388
2454 388 -112 -726 1164 -1293 1364 -948 1289 -506 523 238 -609 1251 -1021 1484 -867 1005
2470 1005 -163 344 857 -772 1469 -1103 1321 -909 999 41 23 883 -935 1421 -1084 1557
2486 1557 -891 581 205 -208 1034 -895 1412 -1246 1090 -466 174 384 -856 989 -1229 1198
2502 1198 -1019 860 -602 3 213 -1073 957 -1475 1335 -1306 350 -710 -549 510 -1212 1084
2518 1084 -1661 661 -977 74 -28 -411 595 -1196 1175 -1189 1093 -844 81 338 -650 1176
2534 1176 -1039 1365 -971 880 -382 223 754 -556 1227 -1087 1357 -815 1131 -43 139 987
2550 987 -1111 1265 -918 1375 -833 676 -18 -332 796 -923 1239 -1187 1113 -699 647 306
2566 306 -318 1137 -1028 1594 -1134 985 -513 -165 439 -852 1050 -1021 1211 -1037 578 -469
2582 -469 -258 421 -1087 911 -1471 964 -1025 79 -384 -671 480 -1228 937 -1177 691 -928
2598 -928 -24 -84 -731 683 -1007 1093 -1124 1160 -534 264 437 -643 1128 -955 1162 -805 958
2615 958 -127 -161 616 -834 893 -993 1319 -835 642 -74 -175 897 -953 1529 -1035 1130
2631 1130 -751 515 439 -256 952 -980 1349 -792 985 -360 -7 271 -611 969 -1382 1265
2647 1265 -1032 566 -233 -395 375 -1067 1029 -1375 1109 -1070 119 -302 -338 180 -1199 1002 -1370
2664 -1370 1155 -835 134 -264 -663 783 -1077 943 -1211 745 -739 97 139 -768 1078 -1224 273
2681 273 -887 1253 -536 -730 592 -422 1005 -1524 1403 -721 429 599 97 758 165 1675
2697 1675 -1169 1179 -953 722 226 -139 931 -1074 1577 -1006 1024 -539 386 831 -635 1169
2713 1169 -938 1309 -860 734 -429 -20 59 -889 1039 -1246 1007 -965 431 -343 -290 614 -1295
2730 -1295 1159 -1097 452 -808 46 -239 -668 650 -1142 896 -1248 730 -792 214 280 -876
2746 -876 658 -1403 1104 -999 616 -513 -129 337 -698 979 -1004 1041 -857 554 -113 -252
2762 -252 605 -870 1186 -1182 1012 -430 522 233 -374 989 -785 1133 -947 1189 -284 435
2778 435 325 -327 992 -1126 1287 -1015 694 -288 -19 571 -829 971 -926 1091 -689 497
2794 497 -206 -276 574 -925 901 -1069 956 -718 190 -68 -539 920 -1291 1210 -1309 675 -796
2811 -796 -136 21 -735 696 -1162 877 -1202 754 -729 29 168 -1108 1031 -1304 1260 -923
2827 -923 479 -200 -170 499 -1053 939 -1121 982 -811 494 -125 -318 686 -1007 1508 -837 1243
2844 1243 -548 369 556 -556 925 -856 1165 -964 841 -354 130 604 -618 1031 -1174 1262
2860 1262 -834 675 -354 -108 542 -761 960 -1097 1055 -674 338 -125 -283 775 -853 1154
2876 1154 -1406 700 -706 138 97 -554 798 -1230 1164 -1067 703 -656 -117 234 -870 722
2892 722 -1021 719 -972 626 -688 -422 406 -939 936 -1273 1165 -729 789 24 -192 630
2908 630 -883 1102 -917 1037 -310 658 137 -152 1044 -820 1261 -1182 1005 -512 197 483
2924 483 -740 1198 -1088 1337 -630 865 -203 95 504 -802 1211 -994 1432 -908 853 -51
2940 -51 -147 610 -774 1001 -886 1044 -397 393 44 -515 783 -1203 912 -995 922 -792 -72
2957 -72 134 -1025 737 -1690 742 -1433 490 -605 -268 315 -1051 656 -1080 734 -1125 581
2973 581 -446 -616 517 -908 1079 -1063 977 -771 166 145 -530 530 -941 1239 -1033 926
2989 926 -487 549 296 -506 1024 -943 1194 -822 828 -183 245 600 -447 1238 -803 1412
3005 1412 -451 708 111 -120 732 -550 1120 -904 1118 -730 473 68 -520 711 -1096 1043
3021 1043 -968 702 -682 41 243 -814 727 -1052 1051 -1167 634 -527 -105 332 -960 863
3037 863 -1163 850 -1032 242 -343 -364 531 -1093 626 -1077 616 -885 324 -118 -271 604 -790
3054 -790 1040 -1103 1111 -795 235 699 -482 1103 -683 1107 -725 827 -324 476 412 -614
3070 -614 708 -909 1552 -456 813 -375 34 849 -931 906 -1140 615 -1244 1012 223 -279
3086 -279 1128 -655 1272 -889 721 -113 542 57 -699 965 -1556 667 -1147 891 -970 -121
3102 -121 -431 -633 447 -1464 750 -1105 210 -941 -376 525 -709 707 -302 875 -923 51
3118 51 -188 -381 549 -844 967 -1151 624 -494 308 -135 -388 571 -881 967 -845 1072 -463
3135 -463 -10 337 -746 1049 -1009 1037 -413 856 -101 303 615 -399 746 -1001 1106 -595
3151 -595 609 316 -95 815 -967 1267 -1039 821 -757 -95 449 -400 1251 -1099 295 -818 1432
3168 1432 591 -66 -851 -1291 449 -1277 665 -895 282 -149 -186 670 -1002 514 -1216 872 -846
3185 -846 655 -511 -339 176 -828 659 -1083 848 -779 291 187 -686 566 -1022 836 -741
3201 -741 781 -564 234 -58 -447 736 -800 1228 -937 811 -36 -85 424 -886 1381 -901 793
3218 793 -641 488 111 -157 954 -559 945 -734 1106 -547 461 61 -375 677 -847 880
3234 880 -845 855 -495 212 173 -721 916 -735 856 -663 786 -188 60 259 -562 841 -1083
3251 -1083 960 -719 316 -243 -349 459 -958 624 -1309 485 -690 158 -194 -210 558 -1005 923
3268 923 -1138 601 -394 -170 -60 -790 707 -1012 717 -663 644 -430 39 268 -489 1128 -1126
3285 -1126 1144 -757 606 -126 91 563 -926 1161 -902 826 -607 527 401 -237 784 -484
3301 -484 952 -610 676 -466 586 210 -557 977 -774 1019 -701 602 -207 58 494 -570
3317 -570 752 -944 944 -609 243 -434 -16 268 -589 741 -1039 838 -673 170 -193 -322 294
3334 294 -1139 800 -868 552 -766 154 112 -758 656 -852 738 -1105 687 -431 -209 332 -407
3351 -407 896 -876 956 -756 514 -127 -140 388 -666 737 -771 802 -674 546 -14 -32 656
3368 656 -638 1386 -771 818 -389 426 418 -383 773 -385 1045 -200 986 -520 146 231 -795
3385 -795 798 -835 1060 -833 400 -67 -37 663 -571 998 -1078 444 -563 260 -236 -349 354
3402 354 -880 814 -903 673 -651 9 -86 -726 707 -1024 720 -731 326 -419 -176 169 -642
3419 -642 597 -1023 803 -981 429 -188 -172 225 -518 796 -791 778 -464 161 42 -209 525
3436 525 -538 775 -608 961 -530 351 -110 -269 789 -674 994 -544 678 -482 45 428
3452 428 -397 761 -819 896 -544 512 -385 100 349 -484 878 -503 854 -640 480 164 -96
3469 -96 406 -356 536 -803 427 -351 149 49 -395 480 -820 586 -812 534 -548 -138 31 -767
3487 -767 479 -980 640 -896 398 -453 38 313 -607 829 -901 843 -719 37 -266 -409 493
3504 493 -587 1058 -739 739 -433 415 34 -443 620 -649 772 -683 846 -488 166 189 -174
3521 -174 755 -819 782 -558 487 -162 14 349 -345 778 -755 843 -469 348 50 52 456 -480
3539 -480 776 -793 728 -313 250 42 -384 514 -773 556 -937 461 -424 -23 77 -691 728
3556 728 -741 864 -835 356 -671 -238 -100 -575 495 -803 553 -624 330 294 -356 240 -480
3573 -480 519 -419 663 -965 195 534 -203 409 -610 703 -928 857 -986 89 -339 -748 233
3590 233 -252 458 -846 575 -173 -89 690 -145 865 -981 723 -469 766 140 -420 65 -273 720
3608 720 -848 662 -872 203 -99 -305 222 -685 686 -482 553 -829 -151 35 -497 457 -758
3625 -758 621 -318 692 -300 -113 186 -325 468 -768 734 -872 411 -245 -143 525 -406 369 -1040
3643 -1040 601 -649 -140 -119 -548 63 -727 807 -975 623 -971 471 -429 -474 341 -772 1215
3660 1215 -380 295 544 235 50 -37 942 -644 557 -326 58 66 -454 419 -239 618 -701 313 -66
3679 -66 303 -4 -269 360 -611 932 -637 554 -426 109 305 -332 179 -598 546 -585 434 -83
3697 -83 -78 259 -455 402 -662 917 -694 529 -211 -330 158 -708 460 -900 435 -641 108 -45
3715 -45 -185 116 -657 408 -691 501 -508 140 -108 -209 500 -648 655 -728 572 -175 28 372
3733 372 -206 543 -654 594 -255 374 -263 -76 210 -391 738 -256 698 -183 509 151 -176 554 -244
3752 -244 851 -483 715 -181 176 -77 -241 641 -801 820 -696 454 -422 119 94 -478 490 -657
3770 -657 490 -528 261 -76 -37 224 -480 294 -859 612 -693 15 -303 -276 92 -781 492 -1023
3788 -1023 522 -519 -41 -176 -402 243 -739 468 -806 696 -249 135 104 -196 720 -503 596 -591
3806 -591 319 -350 169 440 -404 692 -693 575 -462 280 -192 -7 591 -269 871 -662 759 -552
3824 -552 152 24 -302 592 -462 667 -425 459 -279 281 66 -228 724 -533 641 -504 439 -279
3842 -279 47 346 -462 438 -796 495 -662 184 30 -197 383 -570 497 -627 296 -590 191 -1
3860 -1 -342 153 -875 608 -725 419 -439 -82 160 -499 521 -842 553 -630 342 -590 -293 89
3878 89 -405 227 -774 659 -641 222 15 -77 335 -551 817 -350 749 -253 273 -111 21 597
3896 597 -387 680 -480 647 -273 118 130 -163 596 -469 751 -615 515 -25 238 307 -64 425
3914 425 -554 778 -751 364 -213 -295 292 -773 369 -667 678 -743 -54 99 -349 466 -676
3931 -676 574 -742 489 -503 73 -81 -276 256 -711 792 -734 466 -389 -100 -41 -173 679 -686
3949 -686 605 -208 262 -163 -48 217 -474 440 -589 451 -328 362 -5 -230 572 -259 994 -666
3967 -666 741 -239 287 313 -381 171 -646 707 -457 487 -704 184 263 -540 667 -651 586 -103
3985 -103 462 -199 288 300 -21 795 -604 844 147 836 363 -253 324 -508 468 -547 452 -187 57
4004 57 -134 -122 381 -623 394 -748 244 -277 -7 189 -323 578 -623 724 -599 479 -267 57
4022 57 193 -456 452 -750 812 -325 494 -229 -172 416 -321 811 -463 751 -111 402 48 -166 486
4041 486 -660 674 -592 601 -28 412 357 -170 484 -561 761 -506 418 -245 -60 462 -309 549
4059 549 -412 550 -346 207 -194 -47 567 -417 556 -469 733 -738 12 56 -470 286 -570 436 -612
4078 -612 337 -265 142 -43 -432 194 -714 547 -692 517 -217 24 56 -325 557 -720 482 -577
4096 -577 407 -162 -149 358 -604 572 -497 398 -344 110 -22 -16 591 -325 744 -585 312 -173 332 317
4116 317 -168 469 -388 791 -526 507 142 33 365 -418 717 -517 633 -322 422 -165 -155 389
4134 389 -412 581 -715 357 -362 366 18 -329 460 -525 706 -672 447 -386 93 -71 -369 192
4152 192 -677 554 -675 594 -615 -136 13 -470 330 -629 453 -679 318 -23 -123 290 -407 484
4170 484 -757 379 -547 78 -55 -10 570 -528 618 -805 609 -252 99 -362 -137 552 -379 697
4188 697 -556 620 -332 3 -28 -156 605 -709 760 -446 346 -91 145 327 -372 709 -396 453
4206 453 -392 432 -81 -179 240 -542 629 -405 639 -417 201 256 -300 428 -715 407 -519 195 -312
4225 -312 139 122 -330 397 -782 713 -575 420 -328 -305 214 -476 561 -910 523 -675 75 -164
4243 -164 -246 239 -404 623 -658 615 -418 192 -34 -165 257 -310 631 -536 367 -282 228 229 -86
4262 -86 391 -299 738 -207 350 -123 96 -70 -224 604 -449 643 -386 336 -41 -119 156 -290 704
4281 704 -750 499 -329 -52 -241 -45 511 -260 675 -561 373 -408 168 -265 -463 308 -487 476 -448
4300 -448 301 -283 -11 132 -304 491 -542 696 -656 163 -190 -154 264 -552 435 -577 476 -264 61
4319 61 -141 -440 357 -519 416 -779 536 -285 130 5 -406 513 -513 784 -346 434 -276 -115 237
4338 237 -301 632 -377 722 -331 470 -122 -120 231 -140 730 -317 541 -420 302 37 -219 219 -406
4357 -406 586 -470 356 -254 132 236 -46 449 -600 554 -722 293 -329 -170 282 -401 157 -605
4375 -605 389 -514 101 -198 -83 116 -136 600 -632 346 -287 187 -135 -236 214 -646 413 -352 340
4394 340 -546 62 4 -354 433 -469 501 -655 322 -95 10 293 -173 437 -378 595 -609 268 71 -86
4414 -86 554 -262 485 -484 568 -393 160 64 -83 198 -423 538 -469 555 -128 102 276 -417 400 -493
4434 -493 541 -676 362 -162 -17 -7 -246 623 -464 289 -498 306 -203 4 34 -481 314 -639 660
4453 660 -396 301 80 -271 110 -577 457 -567 511 -464 -263 37 -312 462 -581 348 -274 406
4471 406 -588 22 318 -373 563 -144 440 -329 262 -363 63 350 -546 -150 -592 516 -149 345 -445 -44
4491 -44 107 -549 892 -775 348 -681 866 -323 194 166 -383 234 -495 182 -631 -496 749 212
4509 212 52 -66 823 -441 -217 -88 -284 193 -639 777 -494 273 -679 605 -629 -756 606 -369
4527 -369 563 -209 704 -669 188 417 -43 820 -33 -84 -826 34 -140 16 190 -152 185 -485 573 -787
4547 -787 329 -149 31 -19 -271 341 -462 322 -364 357 156 -226 155 -215 488 -372 555 -119 403 273
4567 273 -123 455 -707 322 -557 265 -241 284 447 -201 303 -545 627 -139 436 -112 -3 67 -149
4586 -149 494 -552 477 -343 185 -73 -259 72 -357 76 -587 259 -396 -175 -113 -316 295 -421 299 -544
4606 -544 114 -97 -85 195 -448 186 -410 303 -317 280 -275 7 -28 -497 357 -300 404 -702 66 63 -27
4627 -27 299 -346 428 -458 547 -343 521 128 -82 155 -137 675 -463 334 -292 90 222 -77 440 -408
4647 -408 578 -423 252 -138 33 27 -145 437 -425 518 -450 7 -179 -18 23 -106 539 -639 562 -309
4667 -309 65 -113 -260 334 -538 354 -658 54 -466 -58 146 -385 215 -454 528 -300 209 -151 -90 239
4687 239 -560 287 -548 370 -345 200 198 151 175 -209 330 -286 362 -170 171 55 -38 177 -329 301 -356 387
4709 387 -147 218 -118 -40 425 -291 478 -348 400 -86 288 487 -42 710 -611 326 -278 330 126 -87
4729 -87 116 -197 228 -475 556 -144 399 -33 -51 345 -180 351 -392 176 -62 -37 28 -165 197 -352 294
4750 294 -392 71 -167 -173 120 -488 42 -466 226 -288 1 67 -97 147 -184 584 -414 208 -326 204 6
4771 6 -323 226 -434 285 -422 317 -98 375 125 -203 411 -383 531 -411 561 -93 304 178 -258 563 -354
4792 -354 454 -63 546 -264 124 463 -258 567 -201 537 -258 -35 -69 -155 249 -363 358 -647 442 -276
4812 -276 127 73 -65 207 -367 407 -367 312 -409 2 113 -302 24 -344 212 -731 263 -349 -88 205
4832 205 -484 301 -519 303 -414 351 -204 -6 -27 -425 231 -501 607 -218 114 258 -440 69 -214 478
4852 478 -404 525 94 143 -243 -54 273 -275 332 -226 376 -82 72 292 -279 248 -386 392 -328 27
4872 27 186 -126 239 -205 589 -342 332 -242 232 341 -92 449 -242 499 -193 58 -128 -41 -20 -225 423
4893 423 -309 751 -211 74 -226 -326 130 -297 161 -286 332 -369 -39 44 -184 60 -330 365 -196 271
4913 271 -303 -92 -118 -270 30 -289 433 -534 232 -208 8 -75 -301 399 -220 374 -282 385 -142 280 168
4934 168 -51 329 -246 297 -261 335 -20 -104 158 -124 362 -345 281 -340 133 -69 314 403 47 562 -346
4955 -346 224 -261 51 198 -440 184 -557 551 -603 170 -168 -223 46 -172 273 -371 321 -335 34 -81
4975 -81 -74 145 -332 432 -631 291 -265 131 -60 -342 33 -389 271 -375 316 -139 54 -79 -338 97 -331
4996 -331 260 -439 249 -42 112 114 -258 463 -141 190 -127 280 -72 165 -6 -203 181 14 482 37 99
5017 99 13 -47 214 -234 239 -439 395 -99 133 155 -313 305 -405 147 -371 188 -188 -16 66 -371 290 -400
5039 -400 141 -311 123 -44 -21 120 -426 456 -323 294 -310 152 148 220 16 -509 355 -506 193 -268 116
5060 116 63 -119 279 -246 480 -445 205 -218 70 240 -335 412 -435 399 -316 170 -287 -247 56 -420 558
5081 558 -376 210 -264 115 -154 -154 334 -159 398 -318 318 -150 172 177 -83 328 -271 379 -132 288 -52
5102 -52 -153 -98 -221 168 -469 477 -209 -63 54 80 -45 -321 442 -440 392 -390 37 -106 -107 18 -327 258
5124 258 -197 359 -432 178 -14 -117 311 -424 207 -218 256 -145 -252 43 -261 281 -581 129 -243 134
5144 134 -171 -48 155 -80 485 -200 204 -325 365 -160 164 43 -378 589 -237 262 -172 110 42 -429
5164 -429 366 -265 316 -268 383 -24 -25 72 -215 366 -122 398 -159 27 -92 181 352 -157 86 -287 329
5185 329 -454 212 -41 63 332 -334 326 -435 249 -623 68 11 -171 87 -215 394 -471 170 -112 -65 -208
5206 -208 -186 472 -417 230 -311 204 -237 140 18 -306 192 -404 305 -191 291 -94 -153 290 -559 284 6
5227 6 341 -130 294 -119 -281 280 -283 601 -66 387 -72 134 93 44 405 -340 629 -39 336 -306 79
5248 79 206 -399 110 -385 648 -186 341 -67 207 95 -199 115 -489 468 -304 258 72 -30 164 -155
5268 -155 325 -411 194 -303 21 -19 29 191 -539 56 -670 114 -295 133 -55 -436 151 -556 75 -385 217
5289 217 -200 -152 254 -181 213 -461 186 -497 262 75 -6 29 -267 183 -280 233 -95 65 -101 -15 187
5310 187 -255 429 -195 301 9 112 131 -165 664 -395 542 -219 113 -140 23 83 -275 535 -172 326
5330 326 -53 236 40 -38 238 -161 434 -328 101 -351 -28 162 -171 280 -271 204 -295 401 -233 75
5350 75 -186 -237 231 -464 513 -376 285 -241 31 302 -439 445 -292 458 -211 97 -86 -6 220 -405 353
5371 353 -309 268 -292 94 126 52 114 -226 408 -148 608 -56 127 59 -239 400 -202 229 -294 384 -35
5392 -35 97 111 -50 536 -285 406 -216 253 -58 264 250 -269 215 -500 335 -330 24 125 -331 257 -430
5413 -430 224 -330 -186 -117 31 53 -242 146 -536 274 -281 213 -10 156 -236 -179 126 -407 206 -354 -123
5434 -123 -371 -266 -70 -337 74 -211 105 -336 -43 1 -180 299 -551 308 -332 298 -325 31 253 -93
5454 -93 179 -298 258 -324 117 145 245 302 -176 444 -109 316 -214 469 -99 21 312 -398 422 -211 424
5475 424 -323 195 32 -217 219 -204 468 -212 248 -284 -39 110 84 375 -274 308 -296 375 -114 174
5495 174 237 -340 72 -96 277 -329 149 -208 -227 -123 43 407 -468 154 -243 159 51 6 134 -340 150
5516 150 -394 271 -203 163 -236 -106 35 -217 309 -319 -34 -146 -14 170 -29 358 -106 335 -304 -209
5536 -209 -84 16 397 -201 370 -414 163 -260 191 179 -110 -69 -237 477 -303 322 -213 183 -26 122 311
5557 311 -223 318 -314 84 -23 219 -5 -106 254 -620 354 -339 141 -152 -58 -19 -311 25 -201 189 -407
5578 -407 273 6 -136 139 -132 198 -85 215 43 -4 -156 40 305 -172 295 -379 98 -241 -137 -88 -381
5599 -381 89 -338 280 -205 286 -112 44 311 -263 417 36 233 -24 404 30 -25 -45 -187 294 -208 375
5620 375 -70 -153 17 -143 17 -120 310 -249 214 -228 -114 -154 -205 422 -586 375 -407 293 -216 -172 167
5641 167 -109 244 -379 206 -339 244 -254 -42 67 -194 135 -242 137 15 22 -61 -62 267 -324 478 -379 222
5663 222 110 -227 83 -397 210 -317 127 -56 126 -94 -231 128 -67 238 -356 94 -359 72 93 -201
5683 -201 256 -177 319 -216 182 -235 228 -291 -108 468 -423 213 -190 -178 -486 453 -295 218 -45 -578
5703 -578 468 -675 278 -177 -22 330 -177 -174 -126 -68 205 -265 -437 282 237 -162 -159 -378 -41 -686 647
5724 647 -38 -500 130 146 -59 -756 144 45 80 498 285 269 -777 276 -25 34 -268 373 14 -83 -415
5745 -415 -546 268 115 -93 -102 -327 731 -309 -132 -87 171 496 205 493 177 -866 -309 646 -464 163
5765 163 -368 833 350 -314 258 132 115 -565 399 154 296 -149 -240 33 -97 234 -103 -47 26 -258 155
5786 155 -418 310 -494 391 -431 -162 -136 -27 186 -316 217 -477 123 -98 120 -481 120 -280 -282 175 -10
5807 -10 41 -378 -18 774 -433 175 -127 -133 17 357 480 35 239 481 415 168 147 -342 -151 -427 603
5828 603 122 -317 85 -237 -14 -277 219 142 -195 176 -207 504 -69 637 -71 186 52 -55 293 -169
5848 -169 262 -353 55 -155 25 381 -121 329 -482 345 -110 57 -178 62 134 -183 358 -359 279 -190
5868 -190 218 230 -119 156 -433 305 -41 195 -68 -48 243 -151 57 -424 133 -252 134 -190 109 -49 -100
5889 -100 134 -307 189 -149 -68 6 40 228 -309 210 61 247 -143 141 194 -134 324 -242 87 -224 426
5910 426 -333 83 -13 -297 264 -435 -55 -327 189 -246 -54 -189 14 242 -132 182 -5 332 -29 54 17
5931 17 -174 200 -268 -74 -86 152 118 -154 122 -244 -15 -355 82 82 -2 -24 -206 78 -88 234 -447 45
5953 45 -249 -364 259 -111 299 -137 82 -613 128 -14 -197 79 -427 183 -366 315 -290 101 -69 85
5973 85 50 -318 314 -119 126 -278 114 25 -223 358 -162 222 -412 342 -35 101 -3 -102 194 -402 281
5994 281 -341 262 -298 -144 175 -405 143 -198 405 3 31 -38 -57 373 -128 214 -330 275 -55 71 -130
6015 -130 28 160 -153 125 -351 -262 51 -58 -104 332 119 -78 -6 -240 6 -201 -217 45 -247 226 -414
6036 -414 209 -493 159 -10 26 175 -230 355 -239 114 77 -299 -46 60 95 -156 206 -151 122 -209 93
6057 93 19 -303 131 -166 398 -227 121 185 19 -121 -50 320 -145 151 -410 86 192 14 171 -117 254
6078 254 -81 329 -277 41 118 -146 275 -277 117 -334 110 134 -97 -157 -21 140 -245 236 -287 201 -11
6099 -11 213 11 -188 331 -370 97 -179 232 -212 66 188 -262 180 -210 238 -283 23 61 -77 173 -434
6120 -434 298 -123 91 -35 -21 73 -137 284 -143 293 -301 296 62 -87 230 -65 133 -288 303 -109 233
6141 233 -135 101 103 -354 339 -253 205 -3 1 107 -109 108 83 91 -256 335 -42 -91 -41 -148 212 -22 216
6164 216 -287 99 32 -164 -228 -162 198 -244 76 -339 192 167 53 -89 -88 284 37 32 -179 219 117 -110 35
6187 35 15 374 -345 305 -145 22 93 -195 65 -121 332 -73 135 39 74 -1 128 108 -292 526 297 171
6209 171 -51 -21 110 -42 224 -135 186 -106 72 157 207 227 -66 570 -291 253 -244 76 116 -17 -6 -133
6231 -133 97 -87 235 -169 -11 -207 -302 231 -356 299 -283 163 -8 -140 -52 -378 493 -282 181 -98 77
6252 77 -57 35 181 -198 187 -337 156 -224 29 6 -213 269 -215 383 -278 96 83 256 217 -154 365 -282
6274 -282 326 -346 -3 -148 49 309 -119 250 -185 326 -205 222 172 -100 284 -112 195 -358 115 -181
6294 -181 89 124 -65 151 -254 -44 64 202 94 86 70 -301 289 -175 493 -214 154 -239 -10 -110 -81 202
6316 202 -311 353 -515 72 -56 -308 -52 -320 204 -7 136 35 138 -166 5 191 -328 253 -432 116
6336 116 -95 266 91 -117 194 -608 408 -444 126 -20 -80 145 60 130 -308 236 -220 229 -71 -138 173
6357 173 -5 106 -98 309 -36 190 -210 45 133 -242 318 -236 105 16 171 110 24 266 -234 226 -202
6378 -202 312 63 -13 68 -150 416 -227 384 -363 119 28 -228 165 -113 72 -20 108 53 -4 -18 -81 303 -226
6401 -226 367 -263 68 -322 -8 55 -353 94 -129 226 -137 37 -96 -271 163 -296 144 -285 235 -84
6421 -84 -16 61 1 221 -447 333 -250 283 -98 -65 -37 90 351 -15 182 71 254 -252 336 -26 -86 430
6443 430 -268 215 -449 -157 -61 -107 -109 -39 108 -204 3 -197 123 -130 -26 36 -83 -89 -201 372 -230 62 -53
6466 -53 -242 284 -196 155 -124 191 -81 152 -83 -214 84 -341 257 -138 214 -86 97 126 -353 286 -457
6487 -457 365 137 221 -53 87 84 18 103 -195 214 -263 37 148 -100 42 -138 333 -63 60 247 22 -8
6509 -8 99 201 -147 193 -112 213 24 -193 29 -232 108 -162 278 -203 113 26 69 106 102 205 -244 226
6531 226 -129 64 -74 -107 43 -349 256 -18 245 -281 -21 56 -173 284 -75 255 -399 7 -232 -254 -46
6552 -46 -173 343 44 192 31 154 -307 -66 55 96 2 -283 55 -163 127 -66 -212 166 -240 70 -27
6573 -27 285 -78 -146 -122 -355 141 -281 360 -172 32 5 56 -251 -48 46 -224 326 -145 289 -132 -47 84
6595 84 -57 179 5 159 -160 87 -202 -3 157 -83 318 -279 58 -224 -68 -22 55 19 -263 254 -288
6616 -288 -129 -230 -83 -5 -65 230 -109 83 -368 -5 -90 -83 -115 -325 181 -134 150 -57 203 -131 -138 264 -181
6639 -181 64 -249 417 98 -55 24 267 175 -87 74 -52 180 -165 196 147 -13 75 -398 33 -341 126
6660 126 -156 -17 -65 -101 147 -254 69 -27 -52 37 -350 -24 24 -113 -98 280 -331 69 74 103 258 -175 68
6683 68 -353 229 44 -60 103 -231 107 -124 191 -68 272 -108 122 43 -23 138 -234 57 -267 -193 -92
6704 -92 77 128 -167 151 -21 331 -200 -241 -100 -183 209 0 192 -92 154 -37 302 -54 231 222 -155 239
6726 239 -62 193 -115 -98 35 -224 233 -152 266 -319 274 25 58 91 -110 116 -123 230 -9 164 -137
6747 -137 -100 145 -232 79 -31 -30 -311 163 72 -80 -1 -293 167 -170 197 111 -128 5 -31 45 -183 142 -199
6770 -199 69 -160 -44 220 -93 121 -394 193 -29 42 -170 -185 198 -118 86 -197 -9 -302 113 -124 -77
6791 -77 -63 -315 277 -155 47 -204 181 -2 -102 137 -134 256 -191 53 -104 112 -21 -214 -83 -48 149
6812 149 -64 71 281 -58 -42 -397 553 26 222 -226 31 71 -331 232 -99 158 -235 3 -167 172 0
6833 0 -80 155 -58 344 -252 -76 16 54 165 -346 335 -195 304 -70 78 46 -62 -10 -187 227 -207 285
6855 285 -47 22 -25 -23 22 -175 113 -4 228 -228 -68 4 -269 -136 -248 23 -117 261 -244 36 56 -82
6877 -82 383 -212 403 34 69 119 -123 9 -185 14 -62 165 -33 183 213 38 215 36 111 28 39 -245 130
6900 130 -4 -42 133 -64 296 -130 40 130 -104 -226 -23 -59 -556 109 -299 139 -240 -138 291 -183 190
6921 190 -154 228 -80 50 -10 106 229 -29 179 -63 203 -311 -203 40 65 39 -154 225 21 80 -77
6942 -77 77 208 -147 69 39 14 -58 -3 101 -28 276 -301 336 170 -476 94 173 75 86 464 107 155 -460
6965 -460 451 -537 634 6 342 -189 126 200 -484 -609 -556 72 -397 108 267 -595 -270 190 381 -236
6985 -236 -184 18 -54 200 -493 236 -120 18 139 -49 145 -169 341 -202 195 61 -22 89 -159 149 -153
7006 -153 124 -51 262 47 -120 177 52 163 -202 234 -66 -81 -63 81 84 2 38 -267 -73 -160 72 -160
7028 -160 1 182 23 81 -383 272 -115 179 -10 -116 47 -80 105 -5 289 63 -14 38 -37 -6 -113 274
7050 274 -283 187 44 180 165 -190 264 -5 2 -20 205 67 -197 32 -68 222 149 123 -138 22 -44 -10 206
7073 206 -191 280 -177 196 -33 23 9 63 155 -153 260 28 210 -92 -203 116 -218 162 -314 197 -168
7094 -168 -41 -10 73 156 -233 58 -301 -15 -137 311 171 -315 -23 -252 165 -182 171 -155 -143 242 -329
7115 -329 212 -142 282 -161 83 -102 100 17 -327 101 -88 81 -276 77 -195 95 69 -60 191 -19 -23
7136 -23 -147 107 -248 -67 -149 -308 311 38 145 -124 -73 -96 -302 352 -242 179 -159 123 -13 25 76 4
7158 4 -5 -202 8 -71 51 -83 -2 160 -124 115 -328 96 -69 -28 275 116 134 -113 428 -92 195 -92 111
7181 111 3 75 -83 -114 103 -356 182 54 206 21 -52 290 -145 95 -320 -1 15 25 26 -46 92 -78 365
7204 365 -184 -206 -144 -97 85 -63 213 -275 313 50 117 -70 50 181 210 488 -137 -99 -62 -39 160 -7 197
7227 197 -261 252 -120 -66 235 -14 12 -148 -22 -248 27 -107 -64 -2 93 131 -20 325 -272 189 68 201
7249 201 194 129 -36 -147 10 -52 326 -21 25 -76 124 32 -277 208 -174 50 -301 -206 -57 -180 70 -186
7271 -186 91 -241 110 111 -26 188 61 -42 -278 372 -51 82 53 -246 -66 -100 96 31 172 -20 -107 -5
7293 -5 -54 -52 -141 249 -141 -30 -195 111 -82 -210 348 -246 172 -53 59 -187 -126 231 -306 91 -222 -27
7315 -27 180 131 -171 -192 45 -104 195 89 149 -107 76 35 25 119 -15 110 -66 220 -84 53 -32 -287 -73
7338 -73 -64 65 85 -90 -134 -207 167 -73 278 -229 141 -28 107 29 -123 86 -12 291 36 38 -72 -67 -2 -223
7362 -223 7 0 52 -148 55 43 145 -20 -281 -42 -20 363 -419 -3 126 52 -22 -111 17 -236 307 -302 -61
7385 -61 106 -111 -101 -120 407 -84 128 -37 -57 33 -121 210 19 162 -212 51 -130 -78 42 -5 322 27
7407 27 107 -94 186 40 68 98 -94 180 -8 114 -206 -25 290 -58 365 -419 167 3 54 -53 -53 -96 -141
7430 -141 -50 -475 -64 -137 157 151 28 117 65 89 -306 315 115 146 -9 -198 -49 -177 173 10 213 34 252
7453 252 56 104 67 -163 94 -90 -204 34 116 -40 -45 227 -89 13 -255 42 -28 -32 -244 -25 -26 -168 -87 63
7477 63 -49 -219 -76 37 -163 328 -94 278 -30 56 -52 203 278 -187 187 -335 38 -192 167 37 89
7498 89 64 -437 -59 -252 -223 -271 -43 386 -202 141 -213 45 160 227 -229 -202 -127 -78 156 -247 217 4 280
7521 280 -60 -69 -166 -10 -158 -188 3 13 377 111 -16 90 243 45 -493 -271 355 152 -249 -426 -47 395
7543 395 -64 -270 59 19 -214 98 -333 -21 -28 184 52 173 63 287 236 -90 -18 198 442 19 57 -292
7565 -292 74 -13 75 -177 218 -92 61 -13 -39 -103 0 -99 334 -445 -286 -292 -260 185 -162 97 296 285 -272
7588 -272 199 -102 -182 147 -270 376 -217 149 -14 284 335 -225 95 68 280 -63 -126 -174 3 293 -306 -82
7610 -82 -399 374 -720 131 -240 -318 304 -219 271 2 -359 -77 68 197 73 110 -10 121 11 126 -234
7631 -234 161 125 -289 -114 -269 -24 -348 188 -97 -128 -21 -193 293 -79 -161 -11 -88 215 204 -127 -120 -46 -171
7654 -171 242 -213 18 -522 382 104 184 368 -685 -308 -143 -112 -381 -581 411 580 305 -326 596 -196
7674 -196 -391 180 559 371 -362 28 -293 38 -84 -11 -143 -330 56 -213 318 -194 276 57 -71 199
7694 199 -139 -12 62 -163 37 325 -133 -64 103 -278 324 216 -112 117 -94 108 -285 132 -140 121 -155
7715 -155 -34 117 -39 294 258 3 -126 312 -138 -108 118 44 266 -231 215 -114 75 137 20 -34 -91 -2
7737 -2 -233 236 -96 129 -38 158 11 50 4 -261 269 -230 126 0 -21 164 -171 -211 52 107 -197 5
7759 5 32 5 104 -153 124 -267 -187 -41 28 68 -44 86 -78 162 -130 4 -118 181 -29 -250 142 -37 -100
7782 -100 -335 99 -59 -120 -220 -151 139 -373 32 95 117 61 132 15 -109 193 -203 122 -136 70 101 73 -62
7805 -62 -132 115 -196 226 103 57 145 -177 152 -160 19 -150 72 -255 -157 119 -108 59 50 143 -229 228 -117
7828 -117 -299 -78 -78 117 19 169 -30 129 -169 -380 182 -35 172 140 -134 -157 -32 -77 -19 333 -66 161
7850 161 -25 -57 -346 -89 138 101 210 -17 58 -127 -5 22 99 22 -179 288 192 124 368 -65 23 -232 171
7873 171 55 154 -41 -71 8 -74 103 -140 94 73 134 -237 -120 50 94 -40 -355 -99 -164 145 -49 17 -54
7896 -54 -165 32 -52 -34 -225 -30 -142 178 2 -7 56 -178 222 -79 377 -3 -274 92 -39 114 -128 -22
7918 -22 -86 190 -22 142 219 16 150 -90 94 -201 -65 28 -103 231 -99 233 -206 9 -194 111 -94
7939 -94 -75 84 -92 -54 18 157 -83 -339 0 -233 124 112 72 -38 -53 -20 -104 24 -83 67 -162 -3 -65
7962 -65 -45 21 143 -27 -88 -69 -87 276 -95 -132 -147 -264 -106 -34 60 96 -162 -176 -6 -73 -204 142 -232 171
7986 171 25 -119 -25 190 19 -101 -21 -17 92 256 26 4 -22 127 -184 23 -16 -77 -96 251 122 -181 294
8009 294 141 327 -97 203 41 159 -226 84 144 -106 364 -243 188 -256 227 -137 -46 309 -420 149 -185
8030 -185 91 60 -82 -43 -149 142 -52 125 -57 28 -186 115 64 -20 189 -87 -111 -117 320 17 -135 -216 -214 184
8054 184 -308 73 64 -97 150 64 11 -319 -26 -139 430 499 -108 696 118 421 457 10 -43 541 170 -147
8076 -147 -294 22 446 24 360 -54 109 536 51 167 -108 -69 213 69 -25 10 122 -143 52 -132 -136 -191
8098 -191 112 -142 49 240 -205 135 -213 276 127 -14 -3 160 -98 -133 109 83 168 -184 37 -225 -204 102
8120 102 -480 169 -278 -3 -93 209 -97 -158 52 -27 -153 -66 -103 -239 134 -65 -26 227 -49 80 -28 -41
8142 -41 -43 -98 -44 -109 -213 -481 51 -126 -120 -95 38 216 -99 71 -87 -77 -35 40 150 -37 135 -113 -87 -183 74
8167 74 -45 -94 15 -5 260 -306 -40 -46 2 14 35 6 -28 -104 -216 86 -220 80 -84 -53 73 -148 244 -3
8191c
$$ Imaginary data points
##PAGE= N=2
##DATA TABLE= (X++(I..I)), XYDATA
0 0 0 0 0 0 0 0 0 0 0 0 0 0 -8 8 -8 8 -15 16 -20 24 -31 33 -40 48 -56 71 -80 94 -110 126 -143 165 -189 214
34 214 -240 271 -306 342 -386 430 -481 535 -594 658 -729 808 -892 985 -1086 1195 -1316
51 -1316 1449 -1597 1760 -1939 2145 -2371 2630 -2926 3269 -3671 4154 -4743 5479 -6433 7728
66 7728 -9606 12635 -18751 63081 -89835 78504 66917 -73182 130519 -53271 1275
77 1275 99732 -73643 7994 62795 -90390 81966 -41507 -39703 69807 -79857 27492
88 27492 9342 -35124 19530 -7057 -21221 25871 -4253 -21078 42819 -49475 24740 13435
100 13435 -25853 22696 -15537 -8016 11259 -10657 -22800 36827 -51039 2881 10082 -47625
112 -47625 44719 -53514 -768 11799 -38755 11739 -8776 -16512 10106 -19191 -14092 35022
124 35022 -38617 26250 -9772 -12985 42183 -38497 39156 -5503 -2059 23592 -10732 19013
136 19013 11266 -1572 6183 12967 -9763 29005 -14874 11826 6788 -15666 29608 -25730 25296
149 25296 -9130 -4517 13498 -15299 18123 -4288 -1946 -217 7590 -9621 17140 -9331 1655
162 1655 14590 -22965 25609 -11788 11051 -1364 -4043 8388 -3358 12758 -14148 17729
174 17729 -11960 4936 3811 -5369 10673 -9025 141 -3140 8522 -14823 16365 -17062 856
187 856 11089 -26465 29204 -22778 5294 4629 -15067 13619 -2621 -3859 4880 1055 -11072
200 -11072 24640 -18745 12882 5566 -16297 26517 -17709 16552 804 -2057 5626 1870 5429
213 5429 1022 9246 -9935 16760 -9232 9679 3788 -3155 8628 -8688 12264 -8011 13111
226 13111 -10137 5139 1862 -8143 15140 -13472 11366 -7863 1619 -57 1862 -816 -1583
239 -1583 4074 -12646 15945 -15149 9999 -3746 -7754 8632 -12228 9488 -9608 3845 -9530
252 -9530 2644 -5105 -2844 4534 -14162 8495 -13676 5858 -5671 -55 -3206 -5315 3613 -10745
266 -10745 12444 -15093 8494 -5813 -4606 8724 -9374 7413 -6499 2689 -5429 8396 -7644
279 -7644 5646 780 -10381 16309 -15791 13986 -4021 -2133 5820 -4410 5687 -428 4711
292 4711 -7131 11955 -10560 10396 1167 -6669 13313 -13816 11345 -4605 3633 -602 25
305 25 -781 -1190 6468 -10100 12634 -12990 5978 -1379 -4526 7422 -8364 4671 -7211 5799
319 5799 -7450 6290 -6112 -2416 5259 -11997 11955 -11489 4634 -4434 -2879 1113 -2986
332 -2986 2673 -6694 6831 -11108 9789 -6111 1560 3721 -8632 9605 -8365 8742 -4791
345 -4791 4108 -2219 745 3872 -4153 9783 -8843 9358 -5570 5334 1885 -353 6007 -5559
359 -5559 10395 -6231 11266 -3341 4556 3911 -3077 10568 -4824 9751 -4148 7094 -1364
372 -1364 5082 3625 -1732 9401 -8416 11357 -5474 6350 36 -2177 3760 -5211 6523 -7391
386 -7391 6385 -8719 2562 -2833 -4428 4425 -10007 4611 -9624 3289 -5771 1122 -3371
399 -3371 -4808 2837 -9675 8524 -10604 4638 -4891 -3854 1923 -6507 3918 -7835 2988
412 2988 -8812 4300 -5445 -1054 225 -8434 6601 -11036 6916 -5885 1138 -1862 -3380 4156
426 4156 -5326 7012 -7998 6421 -4366 2307 1780 -2000 5367 -5748 7091 -5479 8724
439 8724 -3586 2948 2514 -4152 10314 -6939 9095 -3490 3908 873 805 4098 -1024 5708 -6397
454 -6397 8753 -5548 6449 -1074 -2142 5885 -6710 7379 -6434 5637 -4453 872 -1240
467 -1240 -2636 5140 -8202 5837 -8047 3944 -3434 -60 332 -3482 3303 -7032 8113 -7348
481 -7348 6517 -3476 -880 6180 -6024 8115 -5345 4829 -2313 2684 -935 1333 1460 -4636
495 -4636 6024 -8663 8610 -6385 934 706 -5331 5777 -6458 5363 -4656 3682 -3344
508 -3344 2208 1921 -1029 6307 -5978 8686 -3560 6804 134 2033 4110 -2231 7533 -5026
522 -5026 9441 -5178 3592 361 -2242 5418 -5729 4368 -5168 3356 -4918 2482 -2664 -1736
536 -1736 2220 -8323 7361 -7837 4809 -3788 -1053 2344 -4149 4495 -4959 4865 -4990 4155
550 4155 -2092 1762 2382 -3993 5576 -5690 7176 -5153 3830 -1612 -1528 3142 -6627 6313 -6743
565 -6743 3166 -4421 -174 -610 -1991 950 -5368 4388 -7320 5923 -5055 1873 1575 -4771 5972
580 5972 -5484 7037 -3689 3836 -994 1274 3131 -1956 5794 -5043 7041 -4476 4388 -149
594 -149 -492 2721 -4243 5750 -5738 5699 -5179 1955 -169 -3237 4365 -6036 4943 -5379
608 -5379 2650 -2662 1638 -260 -1366 3439 -5562 7424 -6185 5576 -2094 -728 3246 -4808
622 -4808 5916 -4720 4066 -4066 2025 -1867 232 1429 -4807 4756 -7240 5556 -4422 2120
636 2120 -557 -2607 3735 -4726 6068 -4795 4734 -2899 1609 1798 -1752 4929 -4318 5802 -3884
651 -3884 5060 -1637 1716 2081 -3029 6169 -4881 6993 -3827 3393 177 -228 4013 -2658 5396
666 5396 -4123 5378 -3246 3392 347 -985 3610 -4597 5878 -4676 5039 -3237 1158 752 -2635
681 -2635 3935 -5221 5107 -5474 2384 -2905 -337 871 -3853 2486 -6311 4505 -5715 2537
695 2537 -3174 -2012 1793 -5696 4452 -6137 3220 -4459 397 -1060 -1481 1775 -5035 4071 -6170
710 -6170 4297 -3755 785 446 -3239 3441 -4810 5225 -4141 3415 -2750 961 1378 -2812 5001
725 5001 -5088 5399 -3823 3246 -191 287 2310 -3009 5042 -3860 5772 -3263 3292 581 -851
740 -851 4282 -3469 6302 -3867 4561 -1957 2903 1573 -1005 4109 -4357 6196 -4381 4742 -1605
755 -1605 256 2032 -3412 4616 -4142 4518 -4765 2342 -2163 -551 1273 -4762 4080 -5826 3686
770 3686 -4450 1592 -988 -2499 1653 -4483 4259 -5403 3455 -3619 819 189 -2384 3504 -4734
785 -4734 4268 -5017 3367 -2300 816 937 -3151 3806 -4655 4731 -4317 2793 -1633 -543 1935
800 1935 -2963 4599 -4725 4372 -3490 2568 -55 -738 2946 -3426 5058 -4169 4883 -2203 2127
815 2127 501 -1089 4148 -3558 5741 -3645 3729 -1426 1370 1763 -1887 4177 -4278 4822 -4063
830 -4063 3229 -1838 -545 1436 -4025 3918 -5135 3472 -4396 1371 -1822 -1626 1802 -4449 3776
845 3776 -5737 3376 -3555 1214 -399 -2281 2724 -4192 4464 -4118 3765 -2554 835 1254 -2499
860 -2499 4076 -4073 4350 -3927 2790 -1436 84 1364 -3370 3507 -5056 4574 -4094 2093 -886
875 -886 -1541 2417 -3840 4390 -4314 3732 -2679 1873 985 -960 3518 -3193 5153 -3417 4705 -1721
891 -1721 1545 1513 -1905 4213 -3748 5012 -3716 2694 -1246 -292 1527 -3183 2843 -4875 3402 -4343
907 -4343 1901 -1978 -1680 1198 -4907 3602 -5115 3067 -3617 483 -416 -1861 2588 -4114 3997 -4273
923 -4273 3051 -2523 1564 489 -2329 2944 -4241 4223 -4347 3020 -2034 -239 1364 -3415 4023
938 4023 -4519 3516 -3349 2007 -614 -419 1830 -2858 3997 -3820 4873 -2514 2905 711 -721
953 -721 4393 -2806 5620 -2838 3871 -816 1660 1716 -851 3541 -2864 4484 -3546 3809 -1499 920
969 920 1362 -2678 4302 -4117 4645 -3519 1881 -564 -965 2309 -2717 3459 -3888 2911 -3038 1798
985 1798 -1089 -1097 1569 -4064 4176 -5188 3193 -3358 -188 -261 -3327 3083 -4543 2663 -4249 1821
1001 1821 -2365 -24 33 -2796 2697 -4418 4044 -4121 2430 -1535 -829 2252 -3545 4329 -4174 3143
1017 3143 -2518 1160 285 -822 2134 -2575 3487 -3567 4397 -2240 2180 393 -1449 4188 -3364
1032 -3364 5133 -3180 3546 -368 427 2529 -1225 3549 -2478 3925 -2568 3218 -1064 978 1692
1047 1692 -2665 4191 -4309 4564 -2919 1651 -90 -1814 2879 -3263 3143 -3809 2501 -2338 910
1062 910 -449 -1366 1647 -4030 3722 -4780 3010 -2657 -331 720 -3661 3349 -4393 2733 -3432
1077 -3432 988 -1213 -763 524 -2777 2158 -4322 3457 -3630 2114 -1284 -1069 2025 -3880 4234
1092 4234 -3877 3061 -2024 677 645 -1177 2632 -2545 3137 -2930 3408 -1840 1787 671 -1424
1107 -1424 3841 -3603 4840 -2878 2858 -279 -335 2713 -2187 3725 -2716 3241 -1951 2395 -366
1122 -366 90 1764 -2519 4257 -3700 3929 -2510 1257 314 -2061 3018 -3457 3292 -3454 1724 -1760
1138 -1760 160 81 -1915 1958 -3894 3102 -4035 2261 -2374 -489 739 -3553 3301 -4364 2907
1153 2907 -2909 522 -587 -1195 1491 -2631 2421 -3354 3241 -2681 1631 -363 -1415 2646 -3619
1168 -3619 3761 -3353 2794 -1291 253 1070 -1707 3227 -2882 3414 -2296 2545 -871 855 1393
1183 1393 -1650 3614 -2953 4260 -2058 2558 116 -480 2879 -2283 3631 -2691 2903 -1548 1513
1198 1513 397 -455 2046 -2760 3592 -3522 3282 -2083 513 453 -2463 2958 -3802 3158 -3107 1584
1214 1584 -1422 -783 658 -2424 2004 -3741 2729 -3451 1759 -1682 -834 1156 -3382 3301 -3615
1229 -3615 2650 -2210 414 -151 -1225 1816 -2766 2747 -3085 2770 -2061 983 468 -1238 2632
1244 2632 -3302 3718 -2708 2629 -712 215 1807 -1716 3380 -2407 3250 -1761 2030 -266 431
1259 431 1804 -1644 3564 -2574 3647 -1675 1618 587 -793 2659 -2304 3368 -2933 2241 -976
1274 -976 404 615 -972 2034 -2491 3068 -2821 2212 -1301 153 638 -2460 2636 -3293 2535 -2737
1290 -2737 1063 -904 -788 1079 -2614 2422 -3694 2166 -2824 1125 -649 -1640 1497 -3455 2794
1305 2794 -3426 2062 -2136 263 11 -1685 1995 -2701 2579 -2646 1939 -1226 240 966 -1652
1320 -1652 2885 -2629 3406 -2416 2196 -329 -293 2051 -1998 3103 -2515 3089 -1327 1588 256
1335 256 -102 2141 -1580 3203 -2649 3341 -1338 1310 1057 -885 2815 -2187 3403 -1863 2580 -692
1351 -692 505 1027 -1096 2395 -2620 2568 -2469 1915 -1237 -606 876 -2666 2462 -3205 1889 -2462
1367 -2462 540 -787 -1195 1205 -2645 2032 -3275 2177 -2128 612 -287 -1239 1733 -3128 2699 -2969
1383 -2969 2030 -1533 -196 594 -1943 2215 -2721 2404 -2414 1575 -1199 265 1174 -1686 2703
1398 2703 -2699 3092 -1989 1597 32 -393 2260 -2005 3033 -1860 2511 -1134 1658 670 -420
1413 -420 2448 -1777 3140 -2304 2675 -1105 707 1074 -1231 2611 -2513 2894 -2013 1316 -666
1428 -666 -345 1194 -1665 2062 -2652 1991 -2369 1037 -915 -1012 1073 -2635 2347 -2947 2036 -2102
1444 -2102 103 -142 -1653 1270 -2574 2266 -2870 1462 -1715 84 176 -1670 1725 -3055 2474 -2820
1460 -2820 1637 -1272 -449 820 -1817 1987 -2447 2379 -1942 1283 -376 -221 1412 -1648 2429
1475 2429 -2266 2673 -1580 1267 557 -640 2219 -2123 2961 -1766 1923 -581 772 981 -788
1490 -788 2244 -1849 2482 -1800 2079 -505 434 1075 -1490 2472 -2336 2570 -1892 1113 -374 -524
1506 -524 1118 -1913 2362 -2420 1885 -1838 803 -428 -1009 1504 -2423 2418 -2571 1535 -1538
1521 -1538 132 342 -1671 1593 -2662 1843 -2289 1271 -1285 25 560 -1426 1925 -2536 2233
1536 2233 -2180 1159 -382 -584 1273 -1831 2391 -2306 2290 -1292 964 113 -216 1927 -1665 2723
1552 2723 -1981 2435 -818 1091 911 -779 2159 -1758 3088 -1589 2259 -403 687 1114 -972
1567 -972 2400 -1646 2370 -1461 1738 -380 68 1367 -1682 2429 -2355 2241 -1539 938 101 -994
1583 -994 1556 -2046 2132 -2418 1661 -1712 545 91 -1246 1538 -2501 2062 -2261 1362 -1051
1598 -1051 -144 498 -1908 1685 -2382 1740 -2183 872 -714 -202 996 -1871 1783 -2592 2012 -1911
1614 -1911 893 -377 -726 1421 -2131 2240 -1991 2022 -1222 865 525 -423 1826 -1747 2846 -1600
1630 -1600 2240 -526 1075 1263 -838 2454 -1755 2570 -1325 1449 5 179 1521 -1117 2512
1645 2512 -1924 2396 -1556 1136 -7 -330 1439 -1811 2413 -2154 1875 -1270 532 181 -1057
1660 -1057 1604 -2006 2186 -2146 1380 -1444 124 369 -1652 1519 -2494 1823 -2412 1028 -955
1675 -955 -315 367 -2122 1696 -2341 1590 -2097 582 -591 -880 909 -1860 1784 -2157 1609 -1501
1691 -1501 808 144 -902 1807 -1567 2333 -1654 1849 -683 592 867 -898 2220 -1624 2259
1706 2259 -1572 1740 -241 46 1225 -1359 2446 -1697 2348 -1393 1167 -76 -43 1558 -1489 2235
1722 2235 -1932 2042 -1461 925 212 -1089 1463 -2042 2142 -2005 1555 -1086 38 297 -1333
1737 -1333 1621 -2095 1693 -2251 792 -982 -494 241 -1784 1635 -2612 1538 -1996 732 -633
1752 -633 -920 825 -1832 1550 -1941 1637 -1598 493 -340 -814 1282 -1757 2150 -1744 1756 -1027
1768 -1027 455 688 -981 1605 -1631 2140 -1594 1156 -263 89 805 -1044 2116 -1900 2190 -1210
1784 -1210 1527 156 -33 1553 -1172 2476 -1701 2368 -1123 1156 450 -300 1652 -1570 2476 -1638
1800 -1638 1704 -993 495 521 -1316 1597 -2190 2036 -2286 1030 -806 -417 205 -1872 1364 -2294
1816 -2294 1766 -1852 725 -756 -417 609 -1954 1988 -2412 1707 -1640 398 -30 -919 1239 -2061
1832 -2061 1663 -2377 1449 -1067 190 97 -1096 1480 -1997 2220 -1874 1379 -568 61 871 -1016
1848 -1016 1935 -1638 2190 -1302 1544 -350 410 1292 -1117 2300 -1423 2331 -1064 1174 240 -346
1864 -346 1791 -1402 2334 -1764 1877 -753 557 422 -894 1412 -1899 2000 -1781 1405 -923
1879 -923 -17 391 -1243 1456 -2061 1852 -1733 699 -825 -718 709 -1781 1533 -2389 1468 -1364
1895 -1364 482 -272 -820 581 -1794 1698 -2508 1146 -1378 260 -133 -942 1075 -1810 1671 -1703
1911 -1703 1275 -968 203 524 -1111 1734 -1795 2071 -1495 1240 -363 -34 1284 -1264 2011
1926 2011 -1715 1875 -1210 1151 373 -199 1459 -1141 2401 -1531 1980 -756 823 471 -504 1744
1942 1744 -1701 2196 -1464 1956 -721 44 681 -1059 1743 -1909 1983 -1657 1114 -604 -307 775
1958 775 -1369 1772 -1838 1642 -1579 641 -686 -836 701 -1833 1443 -2077 1544 -1511 316
1973 316 -87 -1171 984 -1918 1699 -2080 1260 -1118 69 261 -1158 1315 -2126 1680 -1789 1163
1989 1163 -310 -203 713 -1379 1879 -1736 1916 -1392 1149 30 -267 1530 -1138 2072 -1479 2152
2005 2152 -646 934 468 -345 1616 -1346 2115 -1357 1722 -366 476 630 -508 1802 -1616 2105
2021 2105 -1297 1325 -452 193 900 -1204 1807 -1786 1703 -1313 1126 66 -720 906 -1642 1604
2037 1604 -1851 1633 -1364 429 39 -709 1065 -1879 1464 -2125 1241 -1318 159 107 -1398 1315
2053 1315 -2101 1739 -1873 800 -724 -257 609 -1490 1480 -1817 1679 -1525 1097 -265 -190 908
2069 908 -1055 1774 -1333 1935 -878 1062 356 -339 1829 -1071 2232 -1229 1906 -622 690 487
2085 487 -652 1640 -1460 2127 -1401 1547 -510 316 950 -1017 1743 -1481 1904 -1288 811 -176
2101 -176 -334 817 -1284 1593 -1852 1672 -1232 728 -128 -627 983 -1780 1518 -1914 1173 -1295
2117 -1295 314 53 -1115 1082 -1946 1274 -1933 1002 -1084 -361 306 -1310 1286 -2041 1456 -1508
2133 -1508 898 -302 -381 797 -1674 1708 -1549 1698 -999 972 144 -281 1461 -1428 2092 -1151
2149 -1151 1598 -731 752 551 -682 1598 -1455 1730 -1319 1287 -388 344 775 -820 1712 -1454
2165 -1454 1935 -997 1233 -34 335 1139 -1138 1802 -1212 1565 -1064 546 143 -338 1027 -1335
2181 -1335 1534 -1745 1410 -1295 200 -218 -1192 1017 -2002 1583 -2100 962 -908 -368 124 -1309
2197 -1309 961 -2084 1284 -1650 960 -645 -213 479 -1548 1190 -2002 1130 -1308 665 -136 -535
2213 -535 1092 -1501 1644 -1516 1296 -940 416 188 -579 1349 -1503 2005 -1342 1586 -595 403
2229 403 620 -608 1816 -1087 2156 -1031 1291 -254 178 1036 -1021 1859 -1448 1666 -807 1043
2245 1043 -75 -320 1375 -1328 1710 -1360 1437 -1074 510 -51 -722 982 -1376 1560 -1672 1097
2261 1097 -1057 -229 301 -888 1156 -1686 1476 -1734 907 -796 -459 570 -1388 1303 -1852 1324
2277 1324 -1408 580 -230 -583 626 -1487 1505 -1756 1231 -1189 443 70 -754 1184 -1236 1423
2293 1423 -1532 1469 -580 269 349 -714 1447 -1135 1668 -1157 1309 -246 394 819 -848 1740
2309 1740 -1154 1783 -695 1060 133 -97 1137 -964 1716 -1506 1236 -836 619 -67 -504 1034
2325 1034 -1483 1577 -1352 1269 -697 114 215 -1070 966 -1716 1193 -1535 949 -667 -357 355
2341 355 -1130 1098 -1633 1313 -1461 378 -364 -509 778 -1514 1096 -1508 1155 -1247 287 17
2357 17 -742 832 -1428 1217 -1725 932 -840 245 223 -839 1119 -1220 1386 -1036 1077 -710
2373 -710 420 571 -1010 1525 -1175 1624 -1034 1134 66 -152 797 -873 1449 -1237 1319 -819
2389 -819 602 149 -141 1030 -703 1550 -1186 1377 -651 375 306 -797 1299 -1468 1087 -1323
2405 -1323 938 -653 -43 327 -1263 1044 -1534 1234 -1110 585 -559 -405 242 -1430 1201 -1668
2421 -1668 945 -1066 285 -242 -754 598 -1559 1147 -1781 1122 -1103 187 3 -936 972 -1343
2437 -1343 1541 -1362 1067 -483 -215 470 -705 1189 -1304 1452 -813 1025 -337 73 728 -561
2453 -561 1628 -1128 1512 -551 830 400 -151 993 -1096 1442 -1072 999 -723 432 479 -520
2469 -520 1173 -1189 1418 -1349 914 -832 2 415 -730 1234 -1323 1247 -1154 527 -431 -322
2485 -322 823 -1148 1122 -1630 1129 -1258 257 -252 -821 885 -1502 1021 -1498 669 -912 99
2501 99 -144 -580 752 -1352 1262 -1415 843 -790 126 296 -1033 942 -1542 1252 -896 771
2517 771 -102 -75 649 -850 1328 -1011 1145 -863 744 22 -138 755 -906 1646 -1210 1498 -516
2534 -516 650 431 -353 1143 -721 1422 -708 954 -527 154 360 -504 1345 -1230 1413 -983
2550 -983 748 -445 53 318 -1043 1092 -1146 916 -1127 404 -272 -315 426 -1286 821 -1428 1101
2567 1101 -939 76 -51 -747 777 -1533 1307 -1626 725 -792 -104 150 -633 722 -1356 869
2583 869 -1045 777 -477 -188 627 -858 1188 -1441 1170 -1039 532 -184 -149 699 -935 1670 -1141
2600 -1141 1188 -957 618 182 -275 1205 -926 1359 -1114 1224 -598 261 620 -561 1128 -1036
2616 -1036 1581 -981 1120 -225 21 463 -636 1276 -1045 994 -1147 651 -345 -121 639 -1187
2632 -1187 1227 -1428 819 -808 296 -338 -553 541 -984 830 -1313 943 -848 -23 56 -1009
2648 -1009 727 -1503 963 -1136 627 -426 -77 369 -660 743 -1317 726 -1086 1183 -203
2663 -203 -75 577 -1008 1569 -1452 1158 -573 246 7 38 1219 -1003 1614 -677 1256 -785 250
2680 250 237 -341 1063 -1353 1709 -932 965 16 -703 733 -688 1108 -720 1354 -572 221 -414
2697 -414 -679 330 -688 892 -996 827 -811 306 -224 -840 932 -1148 1098 -1234 669 -813
2713 -813 150 73 -724 921 -1382 698 -1252 548 -755 -155 111 -826 972 -1420 1276 -1250 449
2730 449 -231 -482 461 -1129 1125 -1020 880 -768 502 -92 -274 689 -870 1372 -1087 1261 -684
2747 -684 175 322 -525 1056 -801 1252 -692 1237 -381 268 530 -477 1213 -990 1513 -932
2763 -932 940 -7 -116 882 -726 1317 -1280 1195 -448 425 -230 -177 658 -1055 1091 -1246 1003
2780 1003 -811 480 165 -795 278 -1341 764 -1223 550 -659 -209 387 -1097 738 -1020 878
2796 878 -1326 313 -602 -252 217 -1237 948 -1398 1109 -1108 176 -146 -241 571 -873 1244 -1134
2813 -1134 1012 -887 334 -16 -497 692 -921 1234 -964 1033 -482 -101 263 -688 1122 -931
2829 -931 1283 -684 814 -224 155 565 -588 1336 -1040 1436 -765 543 30 85 663 -822 1048
2846 1048 -1011 962 -739 180 53 -378 702 -921 682 -1106 721 -670 163 42 -665 656
2862 656 -1103 1168 -1251 621 -433 -239 108 -898 862 -1325 791 -1158 524 -207 -144 445 -888
2879 -888 905 -1259 1005 -845 299 -10 -417 909 -1179 886 -1240 778 -712 390 382 -616 933
2896 933 -904 1278 -1104 935 83 -19 663 -593 1316 -670 1321 -643 641 86 -166 938
2912 938 -755 1177 -783 1022 -577 440 9 -539 845 -742 1229 -1095 706 -547 -85 246
2928 246 -449 889 -952 1061 -839 710 -687 -107 131 -770 856 -1135 1195 -974 405 -337
2944 -337 -457 468 -1172 941 -1100 503 -1008 296 -362 -757 587 -1081 1095 -1289 876 -707
2960 -707 412 308 -642 1144 -1012 1081 -995 804 -354 299 616 -671 1015 -981 1364 -759
2976 -759 969 3 -171 844 -594 1371 -1078 1236 -543 569 122 -232 754 -752 1003 -912
2992 -912 1113 -743 494 230 -586 526 -1162 1245 -1411 472 -320 -66 383 -952 728 -1126
3008 -1126 917 -1088 569 -402 -227 287 -901 1047 -1290 854 -925 88 -69 -704 527 -1180
3024 -1180 906 -1118 646 -402 47 77 -664 740 -938 1014 -1107 1050 -627 229 209 -1049 809
3041 809 -1077 1026 -718 477 -34 -82 283 -735 1055 -828 1271 -609 783 155 -156 612 -660
3058 -660 1355 -832 855 -558 -97 92 -349 902 -703 782 -719 773 -666 118 192 -288 1058
3075 1058 -989 1187 -772 578 -530 116 -277 -840 1214 -901 637 -1398 268 -271 -41 236
3091 236 -1055 1106 -2114 982 -1070 -176 65 -986 204 -1312 876 -1365 523 -401 107 175 -283
3108 -283 775 -799 559 -1044 446 -301 -21 -158 -562 854 -1238 626 -651 671 -399 -11
3124 -11 656 -367 1208 -915 691 -478 323 385 -312 1032 -663 1290 -659 694 -361 359 449
3141 449 -467 927 -904 1039 -722 477 -176 192 299 -600 1064 -1225 692 -920 86 43 -247
3158 -247 557 -830 535 -872 442 -1098 571 -397 138 -301 -1150 802 -965 824 -715 -85 -196
3175 -196 -780 1199 -797 840 -727 432 -349 -328 467 -646 758 -1293 1043 -824 685 -321
3191 -321 -33 356 -856 1097 -816 1045 -601 447 381 -161 797 -771 1164 -718 944 -162 470
3208 470 250 -257 1049 -834 1207 -899 924 -427 217 235 -647 883 -932 770 -1040 679 -93
3225 -93 -331 613 -843 739 -914 982 -828 243 -301 -330 519 -1125 733 -1142 576 -907 6
3242 6 172 -453 415 -885 836 -825 447 -599 18 67 -595 810 -1118 713 -1066 540 -234 -90
3260 -90 464 -547 687 -732 997 -833 396 79 5 578 -726 964 -914 934 -423 414 192
3277 192 -296 768 -581 1012 -729 935 142 127 379 -592 738 -781 1074 -631 854 -151 177
3294 177 460 -690 845 -793 669 -753 267 -167 -56 469 -788 839 -836 910 -814 43
3310 43 -285 -635 265 -1040 929 -1113 462 -649 -22 128 -505 547 -1059 838 -654 394 -311
3327 -311 -53 224 -719 565 -1036 956 -527 302 -303 -100 684 -727 1001 -819 773 -646 537
3344 537 -12 -286 706 -834 1021 -982 681 -314 194 489 -38 633 -779 919 -682 728 -282
3361 -282 22 527 -590 871 -902 977 -615 548 -110 -115 559 -561 820 -735 776 -690 -348
3378 -348 -618 -676 247 -901 714 -735 568 -807 79 460 -796 735 -994 690 -726 397 -385
3395 -385 -250 186 -701 406 -988 421 -649 374 -116 -300 403 -514 536 -878 534 -647 364
3412 364 117 -512 593 -574 1016 -885 923 -431 354 172 -393 649 -983 1266 -755 702
3428 702 -63 257 683 -427 770 -619 894 -410 493 -225 43 476 -560 664 -710 781 -395
3445 -395 367 145 -227 611 -835 788 -722 782 -430 12 -80 -524 234 -1002 939 -800 200
3462 200 -439 -238 79 -730 466 -1013 570 -971 236 -389 -208 255 -533 503 -864 695 -556
3479 -556 284 -222 -233 393 -707 926 -627 539 -331 69 300 -514 569 -611 905 -708 685
3496 685 -234 102 295 -179 815 -612 964 -632 667 -132 2 606 -414 783 -572 954 -482
3513 -482 491 -21 -221 718 -564 593 -732 635 -687 225 151 -373 321 -870 727 -939 556
3530 556 -430 -325 116 -572 722 -888 653 -797 179 -8 -108 183 -695 562 -872 496 -783
3547 -783 124 -65 -403 277 -965 688 -807 465 -367 47 48 -359 833 -748 819 -711 617 -585
3565 -585 -32 341 -280 513 -563 1173 -633 181 -177 50 405 -428 875 -570 929 -461 173 -12
3583 -12 369 448 -552 1016 -412 648 -413 428 303 -217 332 -514 475 -384 365 -331 106 142 -331
3602 -331 1188 -1014 670 -731 63 -276 -295 -353 -630 798 -737 866 -599 -371 28 -189 217 -565
3620 -565 689 -953 774 -241 -531 -118 -591 535 -849 627 -1113 551 -429 87 149 -366 877
3637 877 -611 1393 -374 376 267 123 374 -215 1262 90 963 -122 1020 235 669 760 -851 456
3655 456 -353 806 -1053 624 512 527 494 -1221 800 -776 685 31 118 -20 -819 520 -777 489
3673 489 -301 278 292 -210 -109 -454 529 -838 708 -513 216 -219 -339 366 -792 675 -479 453
3691 453 -610 184 -307 -589 616 -449 417 -697 421 -328 59 37 -422 489 -794 553 -552 549
3709 549 -354 -156 453 -451 525 -733 576 -568 497 -175 79 447 -539 739 -605 595 -309 142
3727 142 145 1 545 -457 437 -567 731 -309 286 328 -175 361 -587 547 -565 477 -225 -41 248
3746 248 -224 471 -579 724 -746 264 -313 -336 168 -522 803 -570 340 -172 69 -136 -319 200
3764 200 -935 511 -838 481 -479 186 -119 -668 473 -818 584 -824 311 -283 -25 210 -286
3781 -286 357 -607 405 -568 507 -108 33 228 -455 515 -767 525 -366 136 188 -231 386 -518 754
3800 754 -516 624 -350 436 423 -288 684 -378 916 -484 652 -382 179 303 -145 387 -432 528
3818 528 -464 431 -64 -200 340 -349 720 -687 687 -433 294 -105 -401 485 -419 726 -648 591
3836 591 -409 63 -82 -334 359 -729 454 -623 461 -387 -119 -80 -145 282 -808 557 -668 329
3854 329 -411 87 59 -493 617 -733 717 -492 317 -177 -69 449 -416 691 -579 580 -471 121
3872 121 254 -225 647 -623 632 -644 637 -209 356 372 -187 488 -312 785 -803 540 92 38
3890 38 322 -613 645 -457 626 -480 390 -234 -206 476 -724 540 -742 378 -302 257 -93 -101 386
3909 386 -800 439 -748 626 -610 132 -127 -385 512 -756 316 -753 350 -294 29 445 -431
3926 -431 501 -702 568 -435 314 -285 -28 363 -535 645 -650 583 -195 257 230 -274 553 -435
3944 -435 786 -683 593 -242 6 180 -541 504 -462 610 -510 532 -146 353 232 -86 693 -560
3962 -560 752 -513 349 -428 -29 618 -542 453 -466 499 -440 68 37 -202 207 -424 643 -403 516
3981 516 -520 -260 179 -35 774 -561 327 -798 534 27 -696 319 -17 515 -901 748 -944
3998 -944 498 -230 -428 112 -403 363 -589 762 -532 430 2 -381 644 -447 532 -444 513 -330
4016 -330 78 -1 -297 611 -361 868 -495 509 -250 131 468 -246 458 -754 541 -320 463 -19 -79
4035 -79 335 -408 522 -589 523 -271 306 3 -91 577 -401 600 -646 368 -503 -2 26 -188 523
4054 523 -602 803 -593 427 -458 -316 266 -493 275 -705 436 -518 418 -295 -253 293 -418 396 -535
4073 -535 403 -395 124 -214 -314 283 -634 581 -800 309 -258 207 46 -110 295 -443 536 -399 339
4092 339 -203 375 227 -235 735 -504 697 -381 604 -171 -42 553 -248 636 -403 610 -269 172
4110 172 -190 -182 -251 -301 581 -373 581 -265 209 305 -253 355 -521 445 -592 184 -245 130 74 -502 375 -657
4132 -657 469 -539 577 -63 -263 488 -507 373 -697 474 -396 248 -84 -149 77 -670 373 -800
4150 -800 660 -403 157 84 -267 561 -393 640 -529 417 -200 -124 257 -326 473 -391 643 -508 511
4169 511 -108 9 201 -364 626 -394 491 -514 326 -123 -23 501 -289 483 -492 636 -215 153 -5
4188 -5 -278 461 -586 728 -318 499 -88 57 54 -98 528 -519 507 -618 223 -375 99 109 -248 341
4208 341 -713 627 -340 351 -127 -237 283 -686 708 -641 129 -600 199 -46 -441 246 -580 415 -626
4227 -626 444 -391 -8 169 -298 302 -609 329 -537 318 22 67 223 -200 559 -544 442 -553 459
4246 459 -168 99 114 -261 703 -414 715 -172 364 40 -93 240 -522 461 -547 625 -91 283 138
4265 138 -227 338 -412 714 -647 499 -607 5 181 -546 712 -650 429 -584 132 -142 -186 28
4283 28 -347 449 -666 330 -603 171 -179 -406 318 -609 274 -480 418 -206 -49 -63 -285 245 -461 600
4303 600 -244 363 -325 29 8 -347 449 -374 666 -175 74 -196 67 202 -332 464 -276 400 -397 73
4323 73 63 -199 401 -186 648 -547 480 -329 293 124 -163 602 -572 634 -521 309 -151 67 247
4342 247 -228 272 -541 375 -582 276 -319 -43 80 -506 436 -706 354 -484 136 -242 -67 262 -504
4361 -504 591 -579 451 -445 86 -199 -314 247 -621 494 -766 141 -308 -317 -35 -438 397 -221 284
4380 284 -569 340 -152 -1 64 -611 617 -403 570 -349 162 86 -185 397 -483 581 -372 477 -135 227
4400 227 38 -235 164 -222 408 -650 537 -139 267 299 -190 384 -530 577 -385 183 101 175 130 -261
4420 -261 613 -423 445 -444 335 -175 -151 46 -536 476 -503 332 -379 46 8 -54 235 -352 289 -587
4440 -587 464 -328 -91 26 -350 451 -313 550 -486 358 -124 -177 254 -467 395 -434 533 -354 256 -106
4460 -106 -275 277 -321 480 -341 542 -167 270 -45 -130 234 -295 651 -353 369 -204 336 5 95 343
4480 343 -443 717 -450 683 337 3 392 -444 821 -166 642 -774 235 -146 85 278 -307 265
4498 265 -36 89 -337 347 213 -348 886 -186 837 -438 28 -468 -524 538 -174 -385 -547 886
4516 886 206 216 184 298 74 -278 774 -40 395 -755 730 139 -776 -710 17 536 -524 246 -476 -182
4536 -182 -376 974 197 -166 483 -417 328 -124 392 -230 -181 280 -321 389 -235 151 86 227 221 -175 224
4557 224 -293 585 -226 327 85 -22 -14 -221 394 -753 255 -383 432 -22 -1 67 -404 620 -571 367
4577 367 -328 186 -9 -468 310 -504 344 -636 217 -409 -250 34 -414 131 -490 382 -416 148 -389 -63
4597 -63 -76 -523 508 -312 360 -186 -44 -123 -201 100 -349 395 -357 396 -105 81 112 -162 165 -308 307
4618 307 -242 234 -255 213 152 -200 442 -392 593 -348 211 -128 -83 364 -191 501 -617 348 -396 304
4638 304 -61 69 309 -344 368 -164 538 -211 187 -259 -152 384 -420 319 -285 186 -524 -27 238 -269
4658 -269 353 -686 298 -544 374 -59 -236 113 -432 111 -345 340 -319 167 -307 -68 129 -454 418 -515
4678 -515 153 -112 151 -45 -334 410 -381 376 -476 318 84 23 266 -362 534 -187 351 -299 378 -258
4698 -258 310 117 -82 521 -316 459 -232 217 114 91 433 -343 273 -436 321 -189 311 -113 -169 397 -524
4719 -524 573 -206 133 -259 -23 -89 -347 114 -566 404 -389 270 -354 -19 198 -413 240 -250 207 -454
4739 -454 100 -242 -52 276 -452 291 -366 56 -116 142 33 -239 241 -346 449 -307 291 -456 23 -23
4759 -23 -132 439 -417 434 -467 239 -45 -123 132 -177 317 -301 635 -248 188 63 -159 374 -323 494 -391
4780 -391 534 -109 -52 -41 -169 478 -177 481 -394 659 -259 279 -5 -253 433 -359 535 -394 295 -312
4800 -312 3 60 -290 359 -456 431 -614 30 -32 -59 262 -259 383 -485 131 -268 47 -146 -177 68 -226
4821 -226 318 -395 318 -297 102 166 47 144 -385 311 -320 396 -149 -9 138 -291 529 -347 392 -68 329
4842 329 -184 100 63 -266 341 -142 463 -156 211 96 -64 499 -374 814 -147 279 -387 238 105 -147
4862 -147 -5 -410 331 -313 158 -389 -63 -15 -208 584 -492 395 -184 140 -128 -145 74 -437 482 -522
4882 -522 277 -340 209 -182 -24 188 -295 239 -663 313 -8 7 201 -346 395 -233 138 -789 422 -131
4902 -131 -30 340 -296 451 -519 283 -354 104 -53 88 89 -246 532 -452 449 -76 91 -128 -102 286 -370
4923 -370 435 -326 197 7 28 -12 33 310 -449 580 -147 294 13 185 24 67 249 -249 152 -239 177
4944 177 -102 -78 222 -276 278 -284 395 -250 234 -39 -320 339 -522 249 -182 153 -280 -47 207 -214
4964 -214 152 -525 504 -404 350 -154 -64 149 -177 188 -378 410 -350 77 -178 -81 310 -230 593 -305
4984 -305 335 -266 -33 48 -23 234 -420 609 -561 130 -320 182 156 33 217 -106 671 -331 240 -50
5004 -50 143 295 -136 324 -573 580 -260 154 -233 88 446 -188 352 -412 311 -412 223 -163 41 270
5024 270 -261 474 -218 216 -227 201 -144 -3 406 -428 124 -455 228 -81 -284 64 -146 298 -210 361
5044 361 -476 254 -329 -84 -26 -287 161 -245 448 -422 245 -154 69 50 -177 177 -292 189 -80 140 99
5065 99 -117 382 -219 239 -207 391 -20 222 89 -200 123 -471 484 -406 141 -116 108 169 -286 179 -298
5086 -298 431 -459 92 -5 -209 308 -435 417 -538 174 -506 329 -377 -193 229 -288 375 -737 22 -394
5106 -394 238 8 -108 215 -302 405 -564 133 -341 142 96 -540 230 -191 514 -335 498 -273 55 -63
5126 -63 72 168 -428 432 -398 39 31 61 197 -217 269 -432 319 -86 74 69 -174 272 -270 640 -380 145
5148 145 -151 -16 218 -280 415 -196 407 -104 327 127 -101 137 -196 595 -240 202 -109 173 90 65 323
5169 323 -197 567 -599 255 -282 40 -19 -317 397 -316 171 -385 211 -360 -41 146 -472 456 -314 305
5189 305 -266 201 -34 128 69 -372 246 -46 25 -468 144 -122 7 301 -261 385 -314 462 -248 195 -67
5210 -67 -42 489 -427 426 -37 392 -347 -68 -96 -135 109 -586 321 -478 310 53 19 166 -206 288 -271 453
5232 453 -266 123 19 62 196 -86 460 -148 -89 -225 179 69 -129 231 -569 481 -310 384 -164 -44
5252 -44 73 -318 273 -444 588 -172 149 -297 -134 217 -341 335 -636 399 -288 138 -258 -254 254 -427
5272 -427 390 -454 280 -324 43 130 -266 346 -199 531 -90 371 -163 274 -116 -156 529 -372 584 -136 415
5293 415 154 19 330 -107 231 -211 251 -273 245 10 -174 266 76 397 -336 354 -112 45 289 -88
5313 -88 73 -573 399 -63 389 -18 166 95 -226 158 -257 168 -200 333 -318 -85 145 -86 222 -323 383
5334 383 -353 136 -107 -106 -46 -137 261 -698 310 -155 82 11 -43 216 -203 248 -411 459 -102 -28 -188 -202
5356 -202 218 -255 406 -436 224 1 92 65 -65 506 -182 450 -167 102 133 -129 64 -196 305 -463 225
5377 225 -387 281 -5 30 320 -335 461 -165 220 28 117 44 -95 123 -459 272 -383 -54 -174 53 205
5398 205 -220 209 -513 233 -298 86 19 -34 -7 -256 147 -307 166 -368 74 -98 -294 252 -295 144 -132
5419 -132 353 -97 30 118 -137 155 -289 441 -233 -21 -149 -59 118 -149 308 -126 259 -505 254 -248 -35
5440 -35 111 32 371 -224 424 -252 19 -27 -86 184 -103 467 -424 458 -230 67 13 -26 325 -247 406 -400
5462 -400 374 -237 130 133 -62 168 -431 336 -217 87 -111 -207 97 -463 145 -332 174 -365 203 -108 -181
5483 -181 376 -374 47 -228 287 -236 195 -45 -233 28 -201 473 -348 200 -151 -55 99 -280 434 -407
5503 -407 371 -439 257 59 -3 80 -273 296 -350 396 -379 184 -254 93 252 10 134 -292 132 -102 107
5524 107 7 -106 149 -182 289 -212 20 114 67 25 -61 159 -450 330 -357 202 301 -109 -200 -222 245 -274
5546 -274 -2 -217 152 -229 -35 -50 -145 233 -259 268 -276 28 6 -169 300 -153 449 -383 305 -101 117
5567 117 66 -26 384 -337 295 -516 71 63 -42 -29 -225 346 -190 286 -187 236 -125 -60 211 -56 495 -451
5589 -451 305 -260 31 -66 15 210 -173 352 -98 60 -261 127 154 -100 140 -381 324 -92 283 -9 8
5610 8 235 -11 160 -383 506 -278 127 135 -33 118 -397 346 -259 108 -358 34 -194 -157 82 -366 79 -177
5632 -177 148 -157 19 -30 -281 230 -310 242 -206 286 -222 118 134 -196 377 -283 175 -322 93 -192 108
5653 108 -43 -100 54 -300 382 -340 202 269 -63 183 -221 96 -238 180 -260 -24 -75 -198 74 -47 377
5674 377 -206 293 -338 -137 63 -154 48 -227 115 -128 163 -168 153 270 104 275 -464 451 -435 -164
5694 -164 -115 -83 -129 -248 -166 -518 52 -191 659 0 -185 189 -545 -455 -793 461 286 56 -89 402 401 -541
5716 -541 -48 -179 -228 -90 382 299 -381 557 429 85 -68 315 -329 9 414 -589 -325 232 1091 -88
5736 -88 -733 404 -571 244 -324 -325 -6 588 -353 214 67 149 704 -253 87 -216 38 -382 327 485 -43
5757 -43 -327 33 96 -90 21 154 818 43 -732 560 324 414 -274 268 160 -387 445 239 281 -327 31
5778 31 -233 49 -113 -176 245 -280 445 -158 469 56 -289 446 -115 567 -427 158 206 164 34 -479 -36
5799 -36 -460 -77 -362 51 -341 -97 -513 55 -122 -130 187 -226 546 -161 -59 335 -211 -26 -463 133 -499
5820 -499 131 -8 565 865 60 180 -896 553 -306 85 -175 -62 72 -52 316 -420 286 -24 -13 10
5840 10 -166 484 -408 342 -433 431 -355 127 264 -288 124 -65 250 -116 519 2 -8 272 -206 56 -440
5861 -440 210 -277 85 -5 -67 -78 -453 187 -401 302 -234 -82 -147 -104 403 -323 128 -428 156 63 47 88 -222
5884 -222 165 -218 109 -38 294 -168 -79 117 -98 398 24 164 5 511 20 36 18 -99 157 -222 354
5905 354 -184 50 51 39 -67 -23 521 -350 185 -7 97 155 -256 21 -263 110 -341 98 -147 -11 113 -195
5927 -195 302 -271 250 -260 -30 -159 -158 255 -187 246 -139 -69 -333 16 181 -11 247 15 270 -153 136
5948 136 -249 -62 -127 -222 216 -234 162 -194 223 10 219 -59 -153 36 -280 217 -246 481 189 124 133 -278
5970 -278 310 -415 203 -429 14 42 68 159 84 383 -105 210 28 60 9 -146 138 -169 481 -59 229 -55
5992 -55 62 0 -245 112 -200 110 -314 404 -10 -225 203 -4 -112 -401 133 -168 194 -158 -93 115 -200
6013 -200 245 -275 414 -14 -9 -181 48 804 -132 610 -349 353 -160 234 150 -196 201 -238 319 -201 241
6034 241 18 56 54 -250 429 -440 41 -133 203 -60 -112 110 -216 471 -259 124 -309 301 219 -117 199 -255
6056 -255 276 -155 367 -174 -39 70 78 197 -337 399 -277 38 -207 -149 -97 -300 228 -125 432 -382 112
6077 112 164 -166 -5 -503 186 -260 259 134 -125 -43 -25 -10 -180 277 -317 204 -222 -70 46 -147 210
6098 210 -60 440 -192 198 -39 55 89 -319 287 -205 46 -158 83 -10 92 213 -90 311 -293 254 -305
6119 -305 127 360 -185 263 76 236 -251 339 -164 -162 -8 22 247 -112 212 -275 107 -49 56 38 -154
6140 -154 312 -334 208 -291 150 -63 -203 176 -105 138 -228 325 -166 37 -265 -214 135 -341 198 -376
6160 -376 67 -80 -185 87 -111 179 -173 131 -301 212 -271 170 -82 -230 99 -271 384 -80 408 -66
6180 -66 -210 238 -220 48 -289 288 -43 169 -58 30 282 -158 372 -201 359 -250 -205 -76 203 200 -345 464
6202 464 -161 48 -129 158 184 94 211 -308 345 -204 -20 -96 -129 265 -61 260 -191 -50 -119 176 -109 98
6224 98 -184 -56 77 -169 129 -179 105 248 -33 -17 -286 286 -341 150 -104 -35 -51 -243 308 -220 233
6245 233 -463 155 -142 -143 -142 58 235 -111 85 -288 199 -117 -189 278 -121 304 -50 164 93 18 -74 -14 425
6268 425 -142 266 -343 190 -102 154 15 -258 407 -62 89 -271 13 119 11 10 -128 -73 -266 110 -198
6289 -198 -38 -116 -179 -57 -292 31 -383 300 -225 101 117 69 -92 -470 175 -290 241 -172 -107 63 -72 229
6311 229 -302 170 -354 220 35 -184 118 -103 73 -189 291 -231 371 -143 -49 199 -24 201 -259 163
6331 163 -48 -108 -50 -47 53 -89 144 -24 236 51 159 -131 2 449 -123 290 -313 135 -130 94 -19
6352 -19 -254 43 -224 144 -289 159 209 33 287 -124 247 -347 148 9 213 173 14 286 174 136 -143
6373 -143 282 -258 192 -108 -92 54 -62 141 -161 276 -308 127 43 -83 329 -442 258 -302 178 30 55
6394 55 314 -115 409 -328 257 -129 92 -81 161 202 -322 280 -226 -38 -60 2 -164 -34 124 -136 135
6415 135 -187 220 92 154 82 70 304 -379 70 -87 126 126 146 128 39 278 -386 97 -50 91 198 -24 173
6438 173 -129 263 176 74 -312 -12 -69 -199 31 -297 -78 -20 286 -333 -21 130 -272 278 -219 222 -209
6459 -209 127 -93 40 -137 -232 0 -308 329 -183 157 -84 -80 214 -96 174 -213 187 31 -50 -99 -161 117
6481 117 -203 351 -207 266 -39 -123 124 -400 284 -17 311 -240 239 -13 -77 378 -155 364 -207 542 -248
6502 -248 100 -113 -58 100 -241 147 -125 260 -29 -207 110 -323 66 -22 215 -348 156 -30 92 117 -127
6523 -127 47 -362 -38 -63 -34 -39 -13 -47 -229 93 -57 66 -195 192 13 -144 85 -236 74 -433 233 -137
6545 -137 199 -78 -77 149 -143 152 -387 249 -257 -164 -41 162 451 -349 147 -330 385 94 55 94 53 422
6567 422 -385 83 -116 298 -92 85 124 -115 -5 26 348 -326 235 -222 56 258 29 342 -199 126 -214
6588 -214 76 94 -202 38 -231 268 -167 131 -142 120 359 -141 256 -153 221 35 159 -281 30 244
6608 244 -263 77 -335 12 -122 3 -12 -193 213 75 171 -283 228 -254 116 215 -107 298 -250 317 -60
6629 -60 172 -18 84 -175 -113 156 -226 342 -71 385 -57 -186 240 24 0 -260 45 -137 3 176 -202
6650 -202 -36 -158 125 -201 178 -48 288 -25 16 274 -139 294 -296 -6 -352 -1 -75 -213 351 -66 270
6671 270 -130 104 -121 3 -62 -326 42 -326 234 -231 -22 -86 100 122 -304 197 -111 383 -122 187 -142
6692 -142 26 -24 -221 393 -118 87 -56 -4 -206 -159 158 -68 70 -28 128 81 -145 89 -401 17 -155 -72
6714 -72 18 67 137 -15 101 -356 137 -53 29 -62 -52 -131 -149 227 -119 106 -256 211 136 131 116 -174 113 50 183
6739 183 -190 200 -107 -234 -46 -158 -7 -314 200 -159 -51 -38 80 57 -115 145 -107 214 3 10 19 -202
6761 -202 208 -158 -14 -400 -44 -121 28 -109 -212 182 -286 218 -232 -23 156 26 31 -125 43 -300 57
6782 57 -30 -48 -11 112 192 37 23 -270 79 -151 -45 69 60 155 -216 306 -151 150 -317 -15 66 -13 160 -218
6806 -218 406 13 229 -86 20 178 -5 102 -28 131 -102 19 -224 -149 -93 -143 213 -143 -37 -246 -292
6827 -292 22 -115 137 -215 141 -120 24 1 126 48 -13 -23 -117 427 -137 441 33 -118 -172 -52 7 -250
6849 -250 153 -53 31 -259 95 92 -175 266 -145 128 -66 274 -64 -6 -17 -104 176 -265 237 -87 -29 -19 -261
6872 -261 4 -87 261 -251 115 3 177 323 -110 85 -224 192 142 168 -277 7 174 -231 137 -56 132
6893 132 -13 -260 106 -324 27 -156 230 -244 171 -70 -18 12 -152 146 -211 74 -115 88 100 188 88
6914 88 -120 24 -212 -32 -27 153 149 -22 332 -152 208 -176 -38 -72 259 120 137 -26 87 68 -231 169 -115
6937 -115 127 225 -42 -16 225 290 -257 245 106 -26 164 -54 266 -190 353 73 47 31 92 260 -390 61
6959 61 -199 521 379 -363 380 -269 -18 -482 390 -311 443 -343 -214 309 240 -139 551 257 -325 -390 -317
6980 -317 725 -88 32 386 152 52 88 61 75 7 244 -194 325 -149 266 -56 41 -136 -31 -38 -91 -61 -255
7003 -255 266 69 -152 9 -64 217 -325 74 -102 146 127 146 -113 -259 128 -50 53 -67 133 59 196
7024 196 5 142 74 -57 78 -144 18 -182 -66 231 -19 357 -188 62 -180 52 -196 -295 74 -313 188
7045 188 -266 -29 -138 179 184 -142 212 -364 210 -317 -46 -101 185 8 -169 376 -78 156 -90 169 27
7066 27 -84 16 -260 303 -188 23 -227 84 -84 -56 -190 -220 172 -298 154 -213 75 81 -104 175 -248 177
7088 177 -93 117 -177 -167 87 -25 138 -196 134 208 377 8 -23 231 -143 -222 -59 -69 -119 48 50 -24 270
7111 270 -13 108 -172 22 -7 -131 9 -30 22 -105 159 -310 115 65 -187 -131 -222 239 -38 323 -222 56
7133 56 37 107 159 -155 35 -215 141 -117 119 15 -338 -67 -177 106 -193 25 -331 -128 144 15 103 -265
7155 -265 122 -245 240 -132 77 -169 -186 -14 -173 197 -166 238 44 -32 255 -287 124 217 320 -217 -101
7176 -101 -68 25 48 -34 87 -100 1 253 226 140 -2 220 -36 36 -78 -64 -131 -82 87 29 154 -257 285 -17
7200 -17 321 105 -146 -55 -107 35 -109 53 -80 -69 20 -138 -56 -208 370 -2 112 -88 65 -55 -113 57
7222 57 -313 265 -192 195 -27 170 -1 89 341 -133 316 150 -114 84 -70 162 -152 28 -90 106 -109
7243 -109 466 101 -13 128 55 220 -101 319 68 75 18 28 -38 -142 108 -156 21 -79 22 89 14 64 -27
7266 -27 273 -283 343 -96 181 163 -258 347 -54 144 -25 136 -131 43 83 -193 248 -145 178 14 -110
7287 -110 0 -350 328 -118 24 -318 10 -241 229 48 -217 186 -359 24 27 12 -117 153 79 -67 50
7308 50 -162 152 -172 23 256 -6 -71 -153 233 -278 86 113 -107 -55 -64 191 -171 396 -167 19 -175 78
7330 78 -20 -2 278 -134 -132 -325 171 -26 -180 -28 -157 346 28 92 -138 130 -276 -116 162 -142 286 -261
7352 -261 217 -131 103 236 17 210 -283 15 -196 158 -39 23 17 -31 120 -371 141 -31 -1 -29 -304 -28
7374 -28 -25 89 -222 41 -37 138 -17 95 368 -57 27 -75 90 -179 238 171 -216 41 174 285 -83 57
7396 57 77 -56 -61 -72 207 -234 52 -46 -7 65 -17 -15 -91 223 -32 190 -51 99 -206 -91 -45 10 30 -178 219
7421 219 -46 -47 -149 -115 -40 -179 58 -150 -45 -5 -110 81 -272 178 -42 138 -222 221 206 -7 158 -285
7443 -285 190 -187 179 -140 -54 -254 56 162 -251 -5 -304 146 167 158 76 -59 102 -186 292 -117 143 -35
7465 -35 18 -134 254 31 18 260 -154 -21 18 196 275 -132 105 -153 264 -98 -161 -48 35 234 -49 163
7487 163 -277 203 -194 108 181 -190 31 -105 -49 -156 79 -235 5 20 -47 77 -52 315 -430 -72 -157 -169
7509 -169 -77 -83 228 -410 310 49 -12 94 116 -307 241 231 -110 -381 -5 -16 32 17 370 -340 133 -233 456
7532 456 -105 38 111 511 406 -72 -100 303 582 -53 24 -424 311 382 257 46 -256 86 -135 -18 69 165
7554 165 250 -114 -208 -394 181 163 -426 292 -182 -176 -368 -13 72 -103 99 24 80 5 110 -24 -7 82 -385 339
7578 339 -127 -304 -347 128 -767 -249 306 332 3 214 432 -255 -363 -424 15 117 0 468 -113 365 -88
7599 -88 -373 -508 -122 -211 257 193 -591 531 -408 458 359 -204 -15 30 744 -370 226 -349 368 7 -275
7620 -275 -26 127 294 -259 -205 33 144 -97 153 43 -126 201 -24 -26 -34 -142 139 -430 175 -127 83 29
7642 29 107 -161 -381 -250 -314 -178 58 291 -33 239 -2 447 -93 321 288 -624 113 -399 397 -187 22
7663 22 -571 -115 178 -503 565 -50 379 -270 -694 -36 -10 92 -607 -89 115 236 -386 -219 163 -466
7683 -466 377 2 -35 -249 255 -15 221 247 -166 248 -145 -196 -55 22 28 -252 208 -88 244 150 78 -233 20
7706 20 113 -7 169 -30 149 -36 -61 -82 -100 93 -88 119 -170 342 189 105 -112 -303 146 -227 323 -142
7728 -142 -129 69 55 -34 -83 64 138 -45 -2 -144 -21 39 -12 -159 104 -86 88 -88 25 171 -191 359 -246
7751 -246 -22 -40 -13 -126 -1 294 135 -36 -519 191 -92 420 -194 59 65 -346 49 -219 132 -57 31 -5
7773 -5 -83 218 -71 213 -102 43 -30 116 -88 -112 6 -77 40 -116 243 -70 -13 -22 -239 -17 -93 70 -95
7796 -95 232 -33 284 115 -12 109 195 159 -18 -180 -93 -117 135 -111 134 -204 150 -167 -111 159 -175 342
7818 342 80 92 -260 165 -70 94 -47 -117 275 -235 185 -157 77 252 -117 -80 11 232 -309 -55 -236
7839 -236 -154 -13 146 43 -77 273 -101 213 -159 55 128 35 -43 -49 154 108 43 -259 -3 -148 -100 163 35
7862 35 62 -244 -150 150 30 -315 -73 174 -101 60 31 157 184 -39 100 10 6 -389 113 -209 -115 43 -95
7885 -95 29 -112 326 -234 -118 27 79 -28 -154 -127 -131 61 -132 19 -253 60 171 -39 -98 171 164 -148 250
7908 250 -185 -50 129 171 153 69 53 65 -47 11 -94 483 -235 136 57 78 -254 54 242 3 62 -138 180
7931 180 -120 270 107 -134 -63 -109 -39 -244 -80 32 -201 199 53 -214 -216 230 43 15 -83 -330 207 -44
7953 -44 -169 -122 62 -84 -6 -268 -57 -116 -88 55 -221 41 -1 81 103 -80 -32 -282 22 50 307 112 143 -211
7977 -211 -80 140 -121 187 -54 51 -143 -66 229 -182 -15 -300 -11 -156 294 -193 61 3 -98 -24 -293
7998 -293 145 81 10 -99 -28 -49 -104 2 -149 136 -119 85 79 -61 152 -83 -90 18 270 -460 94 -28 62
8021 62 148 99 175 -251 -14 67 84 -151 131 104 -68 196 -108 -44 -71 -87 -6 -125 35 -210 125 63 -70 -143
8045 -143 -106 165 -63 254 50 186 -95 175 -135 77 113 -131 31 156 300 -336 132 -180 -412 -126 -240
8066 -240 278 -247 126 134 -78 -850 58 258 -383 -144 201 65 242 -813 211 361 -91 -77 101 101 -11
8087 -11 66 108 -14 96 -23 -240 139 -36 -166 94 -163 118 -10 158 -100 185 -241 -164 87 -227 123
8108 123 -64 99 -43 192 23 -196 -1 -92 61 -97 135 55 13 18 -120 113 -311 205 -228 2 91 -85
8130 -85 132 -35 227 -302 287 -103 -6 -14 19 309 98 62 68 -2 -129 -53 42 89 25 -123 51 312 261 -99 135
8155 135 77 -74 108 -177 -52 -306 96 -51 31 74 -42 75 149 147 -53 240 -81 -83 -42 31 -65 -438 232 -306
8179 -306 78 -141 -36 303 -99 282 -186 72 -41 58 -109 53
8191E3
##END NTUPLES=NMR FID
##END=
