##TITLE=1H_59-2021
 CDCl3, 8 sc, 
 29.07.2021
##JCAMPDX= 6.0         $$ Bruker NMR JCAMP-DX V2.0
##DATA TYPE= NMR FID
##DATA CLASS= NTUPLES
##ORIGIN= UXNMR, Bruker Analytische Messtechnik GmbH
##OWNER= root
$$ XWIN-NMR		Version 3.5
$$ Thu Jul 29 10:58:22 2021 Russian Standard Time (UT+4h)  she@DPX200
##.OBSERVE FREQUENCY= 200.131506
##.OBSERVE NUCLEUS= ^1H
##.DELAY= (6, 6)
##.ACQUISITION MODE= SIMULTANEOUS
##.ACQUISITION SCHEME= undefined
##.AVERAGES= 8
##.DIGITISER RES= 18
##SPECTROMETER/DATA SYSTEM= spect
##.PULSE SEQUENCE= zg30
##.SOLVENT NAME= CDCl3
##.SHIFT REFERENCE= (INTERNAL, CDCl3, 0, 15.7039)
##AUDIT TRAIL= $$ (NUMBER, WHEN, WHO, WHERE, WHAT)
$$ ##TITLE= Audit trail, XWIN-NMR		Version 3.5
$$ ##JCAMPDX= 5.01
$$ ##ORIGIN= Bruker BioSpin GmbH
$$ ##OWNER= she
$$ F:/spectra/data/she/nmr/H-F/1/audita.txt
$$ ##AUDIT TRAIL=  $$ (NUMBER, WHEN, WHO, WHERE, WHAT)
(   1,<2021-07-29 10:57:12.60 +0400>,<she>,<DPX200>,
      <created by zg, POWCHK disabled, PULCHK disabled
       configuration hash MD5:
       00 E9 B6 7A A2 85 ED C7 34 08 36 98 17 FE 4E 26
       data hash MD5: 16K
       EC 47 02 5B 74 A9 CD 8C 0E EA 22 A7 A6 8E 8A 24>)
$$ ##END=
$$ 
$$ hash MD5
$$ FB 66 A9 3E 63 3E 1F 90 11 C0 9F 3B 3A 22 07 D5
##$RELAX= 
##$RELAX= 
##$RELAX= 
##$RELAX= 
##$RELAX= 
##$RELAX= 
$$ Bruker specific parameters
$$ --------------------------
##$DU= <F:/spectra>
##$EXPNO= 1
##$NAME= <H-F>
##$PROCNO= 1
##$TYPE= <nmr>
##$USER= <she>
##$AMP= (0..31)
100 100 100 100 100 100 100 100 100 100 100 100 100 100 100 100 100 100 
100 100 100 100 100 100 100 100 100 100 100 100 100 100 
##$AQSEQ= 0
##$AQ_mod= 1
##$AUNM= <au_zg>
##$AUTOPOS= <>
##$BF1= 200.13
##$BF2= 200.13
##$BF3= 200.13
##$BF4= 200.13
##$BF5= 200.13
##$BF6= 200.13
##$BF7= 200.13
##$BF8= 200.13
##$BYTORDA= 1
##$CFDGTYP= 0
##$CFRGTYP= 5
##$CHEMSTR= <none>
##$CNST= (0..31)
1 1 145 1 1 1 1 1 1 1 1 1 1 1 1 1 1 1 1 1 1 1 1 1 1 1 1 1 1 1 1 1 
##$CPDPRG= <>
##$CPDPRG1= <>
##$CPDPRG2= <>
##$CPDPRG3= <>
##$CPDPRG4= <mlev>
##$CPDPRG5= <mlev>
##$CPDPRG6= <mlev>
##$CPDPRG7= <mlev>
##$CPDPRG8= <mlev>
##$CPDPRGB= <>
##$CPDPRGT= <>
##$D= (0..31)
0 1.2 0 0 0 0 0 0 0 0.06 0 0.03 0 0 0 0 0.0002 0 0 0 0 0 0 0 0 0 0 0 0 
0 0 0 
##$DATE= 1627541832
##$DBL= (0..7)
120 120 120 120 120 120 120 120 
##$DBP= (0..7)
150 150 150 150 150 150 150 150 
##$DBP07= 0
##$DBPNAM0= <>
##$DBPNAM1= <>
##$DBPNAM2= <>
##$DBPNAM3= <>
##$DBPNAM4= <>
##$DBPNAM5= <>
##$DBPNAM6= <>
##$DBPNAM7= <>
##$DBPOAL= (0..7)
0.5 0.5 0.5 0.5 0.5 0.5 0.5 0.5 
##$DBPOFFS= (0..7)
0 0 0 0 0 0 0 0 
##$DE= 6
##$DECBNUC= <off>
##$DECIM= 32
##$DECNUC= <off>
##$DECSTAT= 4
##$DIGMOD= 1
##$DIGTYP= 9
##$DL= (0..7)
0 120 120 120 120 120 120 120 
##$DP= (0..7)
150 150 150 150 150 150 150 150 
##$DP07= 0
##$DPNAME0= <>
##$DPNAME1= <>
##$DPNAME2= <>
##$DPNAME3= <>
##$DPNAME4= <>
##$DPNAME5= <>
##$DPNAME6= <>
##$DPNAME7= <>
##$DPOAL= (0..7)
0.5 0.5 0.5 0.5 0.5 0.5 0.5 0.5 
##$DPOFFS= (0..7)
0 0 0 0 0 0 0 0 
##$DQDMODE= 0
##$DR= 18
##$DS= 0
##$DSLIST= <SSSSSSSSSSSSSSS>
$$ [...]
##$SUBNAM2= <"">
##$SUBNAM3= <"">
##$SUBNAM4= <"">
##$SUBNAM5= <"">
##$SUBNAM6= <"">
##$SUBNAM7= <"">
##$SUBNAM8= <"">
##$SUBNAM9= <"">
##$SW= 20.0188882624521
##$SWIBOX= (0..15)
0 0 2 0 0 0 0 0 0 0 0 0 0 0 0 0 
##$SW_h= 4006.41025641026
##$TD= 16384
##$TD0= 1
##$TE= 0
##$TE2= 300
##$TE3= 300
##$TEG= 300
##$TL= (0..7)
0 120 120 120 120 120 120 120 
##$TP= (0..7)
150 150 150 150 150 150 150 150 
##$TP07= 0
##$TPNAME0= <>
##$TPNAME1= <>
##$TPNAME2= <>
##$TPNAME3= <>
##$TPNAME4= <>
##$TPNAME5= <>
##$TPNAME6= <>
##$TPNAME7= <>
##$TPOAL= (0..7)
0.5 0.5 0.5 0.5 0.5 0.5 0.5 0.5 
##$TPOFFS= (0..7)
0 0 0 0 0 0 0 0 
##$TUNHIN= 0
##$TUNHOUT= 0
##$TUNXOUT= 0
##$USERA1= <user>
##$USERA2= <user>
##$USERA3= <user>
##$USERA4= <user>
##$USERA5= <user>
##$V9= 5
##$VALIST= <valist>
##$VCLIST= <CCCCCCCCCCCCCCC>
##$VD= 0
##$VDLIST= <DDDDDDDDDDDDDDD>
##$VPLIST= <PPPPPPPPPPPPPPP>
##$VTLIST= <TTTTTTTTTTTTTTT>
##$WBST= 1024
##$WBSW= 4
##$XGAIN= (0..3)
0 0 0 0 
##$XL= 0
##$YL= 0
##$YMAX_a= 256804
##$YMIN_a= -293502
##$ZGOPTNS= <>
##$ZL1= 120
##$ZL2= 120
##$ZL3= 120
##$ZL4= 120
##$ABSF1= 10
##$ABSF2= 0
##$ABSG= 5
##$ABSL= 3
##$ALPHA= 0
##$AQORDER= 0
##$ASSFAC= 0
##$ASSFACI= 0
##$ASSFACX= 0
##$ASSWID= 0
##$AUNMP= <proc_1d>
##$AZFE= 0.1
##$AZFW= 0.1
##$BCFW= 1
##$BC_mod= 2
##$BYTORDP= 1
##$COROFFS= 0
##$CY= 11.3945322036743
##$DATMOD= 1
##$DC= 2
##$DFILT= <>
##$DTYPP= 0
##$F1P= 2.36226072786647
##$F2P= -0.459571619588291
##$FCOR= 0.5
##$FTSIZE= 0
##$FT_mod= 4
##$GAMMA= 1
##$GB= 0.15
##$INTBC= 1
##$INTSCL= 1
##$ISEN= 128
##$LB= 0.24
##$LEV0= 0
##$LPBIN= 0
##$MAXI= 10000
##$MC2= 0
##$MEAN= 0
##$ME_mod= 0
##$MI= 1.114404
##$NCOEF= 0
##$NC_proc= 0
##$NLEV= 6
##$NOISF1= 3.799351
##$NOISF2= 2.8
##$NSP= 1
##$NTH_PI= 0
##$NZP= 0
##$OFFSET= 15.70392
##$PC= 1
##$PHC0= -12995.71
##$PHC1= 11.60099
##$PH_mod= 1
##$PKNL= yes
##$PPARMOD= 0
##$PSCAL= 0
##$PSIGN= 0
##$REVERSE= no
##$SF= 200.130013532006
##$SI= 16384
##$SIGF1= 3
##$SIGF2= 2
##$SINO= 400
##$SIOLD= 16384
##$SREGLST= <1H.CDCl3>
##$SSB= 0
##$STSI= 0
##$STSR= 0
##$SW_p= 3612.71676300578
##$SYMM= 0
##$S_DEV= 0
##$TDeff= 0
##$TDoff= 0
##$TI= <>
##$TILT= no
##$TM1= 0
##$TM2= 0
##$TOPLEV= 0
##$USERP1= <user>
##$USERP2= <user>
##$USERP3= <user>
##$USERP4= <user>
##$USERP5= <user>
##$WDW= 1
##$XDIM= 8192
##$YMAX_p= 0
##$YMIN_p= 0
$$ End of Bruker specific parameters
$$ ---------------------------------
##NTUPLES= NMR FID
##VAR_NAME=  TIME,          FID/REAL,        FID/IMAG
##SYMBOL=    X,             R,               I
##VAR_TYPE=  INDEPENDENT,   DEPENDENT,       DEPENDENT
##VAR_FORM=  AFFN,          ASDF,            ASDF
##VAR_DIM=   8192,          8192,            8192
##UNITS=     SECONDS,       ARBITRARY UNITS, ARBITRARY UNITS
##FACTOR=    0.0002496,     1,               1
##FIRST=     0,             0,               0
##LAST=      2.0444736,     0,               0
##MIN=       0,             -293502,         0
##MAX=       2.0444736,     256804,          0
$$ Real data points
##PAGE= N=1
##DATA TABLE= (X++(R..R)), XYDATA
$$ plain form
0 0 0 0 0 0 0 0 0 0 0 0 -8 8 -8 8 -16 16 -23 24 -32 40 -46 56 -64 73 -88 104 -121 138 -161 184 -209 240
32 240 -273 310 -350 394 -444 499 -556 621 -692 769 -852 946 -1045 1155 -1276 1406 -1550
49 -1550 1708 -1879 2072 -2281 2517 -2781 3076 -3412 3796 -4241 4762 -5387 6145 -7090 8313
64 8313 -9953 12286 -15891 22235 -36757 143112 -56836 -101434 250472 -48894 -15023 256804
76 256804 63748 -151824 47393 85807 -12263 66105 85502 -93348 -67390 11999 31392
87 31392 55979 -53956 -86727 -4717 -113743 -12591 123871 -124356 -148840 23487 -106238
98 -106238 -72143 91224 -67761 -180760 -37968 -32128 -83689 35621 -16447 -178819 -46273
109 -46273 -8087 -88610 68853 -12581 -189029 9605 6770 -100022 95852 27671 -176083
$$ packed form
0@%%%%%%%%%%qJ6j6J6k4L2l9M7n6P2q6J02j20J37j61J92k25K59k99L45l93M49
32B40n13N83o60P44q38R43j055J177j313J461j621J798j991K200k431K682k956
49a550L258l587L951m353M798n298N857o488P208q037R003j0149J1532j3235J5403
64H313j8266K2239k8177L8126n8992J79869j99948m4598L51906k99366L3871K71827
76B56804j93056k15572J99217L8414r8070P8368J9397j78850K5958P9389J9393
87C1392K4587j09935l2771Q2010j09026J01152J36462k48227k4484J72327j29725
98a06238L4095J63367j58985j12999J42792N840n1561J19310n2068j62372J32546
109d6273L8186q0523J57463q1434j76448J98634k835j06792J95874o8181k03754
$$ plain form
120 -176083 -12001 73218 -54648 19460 92030 -93085 -94847 105766 35323 -29586 72090
131 72090 -23885 -67510 49268 47918 53688 11095 -61673 36667 23046 -23461 109941 34312
143 34312 -116797 20614 85346 -40251 18424 100280 -81928 -91889 121874 16676 -72824
154 -72824 89456 -25304 -119053 72100 42130 -45396 23321 -25721 -57737 16335 23359 2867
166 2867 -5456 -36567 -39689 17672 24881 -18527 15481 -15802 -74262 43546 46403 -47446 32241
179 32241 1172 -71935 44367 46351 -20323 20105 -3644 -28488 27406 39868 8745 8343
191 8343 7227 -22232 23298 62458 -13138 10218 40884 -49046 24107 84188 -29278 5872
203 5872 45229 -35930 11892 61748 3331 -9732 13055 4118 -4542 30977 26361 -21550 2454
$$ packed form
120a76083J64082Q5219j27866P4108P2570j85115j762K00613p0443o4909J01676
131G2090r5975m3625J16778j350N770m2593p2768R8340j3621m6507J33402p5629
143C4312j51109J37411O4732j25597N8675Q1856j82208r961K13763j05198q9500
154g2824J62280j14760r3749J91153k9970q7526O8717m9042l2016P4072P024k0492
166B867q323l1111l122N7361P209m3408L4008l1283n8460J17808K857r3849P9687
179C2241l1069p3107J16302J984o6674M0428k3749k4844N5894J2462l1123m02
191H343j116k9459M5530L9160p5596K3356L0666q9930P3153O0081j13466L5150
203E872L9357q1159M7822M9856n8417j3063K2787q937q660L5519m616m7911K4004
$$ plain form
216 2454 3294 -11253 35663 696 -22170 18274 -28052 -9272 43361 -22695 -19252 13390 -29556
229 -29556 -10411 21340 -6817 -25636 -10339 -2598 -23291 2377 14294 -39548 -13054 5945
241 5945 -33010 9662 5485 -38478 359 -10799 -22234 14825 -10409 -19823 -2830 -13210 -6030
254 -6030 289 969 -10965 -17638 8685 -8235 -8873 21186 -18833 -12608 18956 -15630 4964 16333
268 16333 -17604 5227 5033 -4767 14056 1515 905 3245 -695 12690 1232 7203 11136 -10261
282 -10261 13963 10316 -6540 21253 128 -5871 20154 -2986 5481 15067 -6418 8418 5247
295 5247 169 11832 -1884 5927 4317 -5575 13509 -1940 -2462 12670 -10606 3148 8554 -10879
309 -10879 8808 -1317 -8695 9267 -7907 -777 4857 -11395 4289 -3726 -7198 6315 -11207
$$ packed form
216B454Q40j4547M6916l4967k2866M0444m6326J8780N2633o6056L443L2642m2946
229b9556J9145L1751k8157j8819J5297P741k0693K5668J1917n3842K6494J8999
241E945l8955M2672m177m3963L8837j1158j1435L7059k5234r414J6993j0380P180
254f030O319O80j1934o673K6323j6920o38L0059m0019O225L1564l4586K0594J1369
268A6333l3937K2831j94r800J8823j2541o10K340l940J3385j1458N971L933k1397
282a0261K4224l647j6856K7793k1125n999K6025k3140Q467R586k1485J4836l171
295E247n078J1663j3716P811j610r892J9084j5449n22J5132k3276J3754N406j9433
309a0879J9687j0125p378J7962j7174P130N634j6252J5684q015l472J3513j7522
$$ plain form
322 -11207 -847 2063 -13911 5177 -4802 -10407 6587 -11552 -3469 2986 -13475 3688 -4321
335 -4321 -10111 6307 -10882 -2581 3347 -13123 4426 -2907 -9453 7566 -8944 -2168 4770 -10501
349 -10501 5360 -1568 -7042 8995 -7480 450 7277 -9073 7761 1695 -6224 11438 -3845
362 -3845 699 9837 -5862 8232 4236 -2779 11278 -1931 4267 9610 -5045 11437 3745 -3209
376 -3209 15001 -2688 2414 13102 -6051 7792 7041 -4698 10395 57 392 7392 -4233
389 -4233 6256 228 -3441 8905 -7878 1133 6967 -13214 6078 480 -13751 8776 -6278
402 -6278 -9926 6257 -10977 -5010 -1 -9587 -2381 -7821 -4789 -4234 -12247 2783 -9519 -12714
416 -12714 6639 -15540 -7107 7748 -19107 -1733 3601 -17710 3031 235 -11599 2188 -2874
$$ packed form
322a1207J0360K910j5974J9088r979n605J6994j8139Q083O455j6461J7163q009
335d321n790J6418j7189Q301N928j6470J7549p333o546J7019j6510O776O938j5271
349a0501J5861o928n474J6037j6475P930O827j6350J6834o066p919J7662j5283
362c845M544R138j5699J4094l996p015J4057j3209O198N343j4655J6482p692o954
376c209J8210j7689N102J0688j9153J3843p51j1739J5093j0338L35P000j1625
389d233J0489o028l669J2346j6783R011N834k0181J9292n598j4231K2527j5054
402f278l648J6183j7234N967N009r586P206n440L032N55q013J5030j2302l195
416a2714J9353k2179Q433J4855k6855J7374N334k1311K0741k796j1834J3787n062
$$ plain form
429 -2874 -4249 -816 1141 1866 -7777 6060 3926 -9488 15873 2184 -11114 19905 -1261 -4214
443 -4214 23495 -3375 -404 17852 -995 6746 15328 3415 4308 9232 10621 3381 12555 15004
457 15004 -7764 13934 17536 -10258 22300 14251 -17755 21520 11638 -11620 22411 7155 -12637
470 -12637 10904 9247 -2956 5233 9879 -8203 -7113 15515 -5212 -5467 15772 -19061 -8113
483 -8113 17248 -18049 937 11286 -29052 -1932 9712 -18847 1767 2856 -23444 -10304
495 -10304 6509 -8759 -12688 5613 -16623 -25304 15884 -7154 -21802 16162 -22620 -26813 24399
508 24399 -13410 -16880 18500 -24436 -22191 21125 -3781 -16651 9987 -5564 -27590 12445
520 12445 20055 -23562 2850 11768 -30387 10892 25240 -18500 6132 1606 -18610 19421 8449
$$ packed form
429b874j375L433J957P25r643J3837k134j3414K5361j3689j3298L1019k1166k953
443d214K7709k6870K971J8256j8847P741Q582j1913Q93M924J389p240R174K449
457A5004k2768K1698L602k7794L2558q049l2006L9275r882k3258L4031j5256j9792
470a2637K3541j657j2203Q189M646j8082J090K2628k0727k55K1239l4833J0948
483h113K5361l5297J8986J0349m0338K7120J1644k8559K0614J089k6300J3140
495a0304J6813j5268l929J8301k2236q681M1188k3038j4648L7964l8782m193N1212
508B4399l7809l470L5380m2936K245M3316k4906j2870K6638j5551k2026M0035
520A2445P610m3617K6412Q918m2155M1279J4348m3740K4632m526k0216L8031j0972
$$ plain form
533 8449 -5719 14033 -12354 -12518 25104 9062 -11243 12970 3052 -28745 18563 36048 -30248
546 -30248 -50 28008 -40962 5006 50059 -29083 -13278 23623 -26036 -3426 33670 -7676
558 -7676 -19704 3439 -7449 -7120 22159 551 -23271 3985 -10057 -9228 33331 -8746 -25418
571 -25418 16133 -18325 -7510 39324 -10248 -20646 12447 -11913 144 30969 70 -15894
583 -15894 7052 -1312 -1090 37184 7533 -26794 23194 4934 -17490 55643 15227 -43437 31777
596 31777 18256 -24006 46771 32065 -37605 4296 34154 -5462 12474 39423 -15717 -23074
608 -23074 29805 11305 4022 22778 -14251 -11247 8920 -1590 26317 5850 -37003 6382
620 6382 4112 -23255 26545 12565 -48973 -13677 19429 -21849 -7143 27210 -38717 -46623 26575
$$ packed form
533H449j4168J9752k6387j64L7622j6042k0305K4213r918l1797M7308J7485o6296
546c0248L0198K8058o8970M5968M5053p9142J5805L6901m9659K2610L7096m1346
558g676j2028K3143j0888L29K9279k1608k3822K7256j4042Q29M2559m2077j6672
571b5418M1551l4458J0815M6834m9572j0398L3093k4360J2057L0825l0899j5964
583a5894K2946q364K22L8274k9651l4327M9988j8260k2424P3133m0416n8664P5214
596C1777j3521m2262P0777j4706o9670M1901K9858l9616J7936K6949n5140p357
608b3074N2879j8500p283J8756l7029L004K0167j0510K7907k0467m2853M3385
620F382k270k7367M9800j3980o1538L5296L3106m1278J4706L4353o5927p906P3198
$$ plain form
633 26575 -9093 -27029 23796 -30304 -48126 16172 -6544 -15601 10643 -30453 -34065 7367
645 7367 -3009 -9184 7101 -20585 -37074 9509 12734 -17867 10630 -4762 -41869 13816 22254
658 22254 -13329 13167 -5416 -27383 16861 15053 3522 16001 -11616 -15894 20674 17339 2266
671 2266 18200 1822 -27685 20323 38227 -13951 12961 21756 -36994 11352 48039 -11744
683 -11744 1280 18200 -22020 1268 33219 7046 -6274 954 -6693 -2803 21766 9863 -8337
696 -8337 695 -15078 -2925 29267 -5337 -9511 10480 -26282 -4612 33262 -8340 -12820 6613
709 6613 -18231 -8125 23158 4989 -17268 -3767 -4166 -11805 17820 12046 -20798 -1156 -3723
722 -3723 -13770 24237 6831 -20031 5346 -8562 -9965 23975 5631 -15265 -1084 -2609 -5981
$$ packed form
633B6575l5668j7936N0825n4100j7822O4298k2716r057K6244m1096l612M1432
645G367j0376o175J6285k7686j6489M6583L225l0601K8497j5392l7107N5685Q438
658B2254l5583K6496j8583k1967M4244j808j1531J2479k7617m278L6568l335j5073
671B266J5934j6378k9507M8008J7904n2178K6912Q795n8750M8346L6687n9783
683a1744J3024J6920m0220K3288L1951k6173j3320P228p647L890K4569j1903j8200
696h337R032j5773J2153L2192l4604m174J9991l6762K1670L7874m1602m480J9433
709F613k4844J0106L1283j8169k2257J3501l99p639K9625n774l2844J9642k567
722c723j0047L8007j7406k6862K5377j3908j403L3940j8344k0896J4181j525l372
$$ plain form
735 -5981 12793 14277 -13824 -9834 7088 -7952 8379 19540 -17482 -7269 7222 -10783 12932
748 12932 13712 -16628 -3625 698 -5380 10704 8306 -8799 -9585 756 926 1847 11939 -6751
762 -6751 -15777 7134 -1991 15 16180 -12434 -11682 8238 -6207 4945 12403 -11401 -7661 2821
776 2821 165 3479 6396 -1565 -11990 704 8124 -2921 7505 1904 -15635 5389 5804 -3344
790 -3344 11530 -3865 -10622 6905 421 1941 7348 -3828 -5573 -224 5258 2608 -483 4198
804 4198 -7321 -4477 11103 -1654 43 4538 -10303 787 5406 -2530 5874 -3200 -6897 4227
818 4227 -866 1123 3290 -3661 -3393 -2398 4187 1990 -4850 4537 -4292 -7388 10047 -1016 -4791
833 -4791 5035 -5937 -1630 4087 -1415 2256 -2961 -3013 3068 -2599 2177 1980 -4294 649 -2154 1425
$$ packed form
735e981J8774J484k8101L990J6922j5040J6331J1161l7022J0213J4491j8005K3715
748A2932P80l0340J3003M323o078J6084k398j7105p86J0341J70R21J0092j8690
762f751r026K2911r125K006J6165k8614P52J9920j4445J1152P458k3804L740J0482
776B821k656L314K917p961j0425J2694P420j1045J0426n601j7539K1024M15r148
790c344J4874j5395o757J7527o484J520N407j1176j745N349N482k650l091M681
804D198j1519K844J5580j2757J697M495j4841J1090M619p936Q404r074l697J1124
818D227n093J989K167o951K68R95O585k197o840R387q829l096J7435j1063l775
833d791R826j0972M307N717n502L671n217n2O081n667M776j97o274M943k803L579
$$ plain form
849 1425 3342 -4964 3330 -270 -6762 7162 160 -4619 4402 -2999 -1166 2708 -1193 2728 -2804
864 -2804 -1462 4150 -3890 1897 2668 -4767 2232 -796 -863 3452 -4210 2430 1189 -5522 5397 -299
880 -299 -4105 4627 -2416 -712 2270 -2425 2763 -1644 -1369 4229 -3631 1434 2863 -3903 3310 -427
896 -427 -1189 3919 -3552 2026 2645 -4377 4426 224 -3345 4838 -1487 -306 2660 -2356 2448 -252
912 -252 -710 3670 -3461 1194 2273 -3915 3951 -725 -2765 4147 -3724 301 3493 -5175 2259 518
928 518 -4421 3204 -1887 -1556 788 -2892 1366 -2101 -1772 2559 -5543 869 1877 -6111 3381 -844
944 -844 -5629 4225 -3151 -2330 3791 -4455 144 1262 -2743 1310 -750 324 -42 -2048 3709 -2364
960 -2364 -646 5605 -5202 1667 5841 -5831 4450 4273 -4861 5174 1859 -1711 4396 993
$$ packed form
849A425J917q306Q294l600o492J3924p002m779R021p401J833L874l901L921n532
864b804J342N612q040N787P71p435O999l028o7M315p662O640j241o711J0919n696
880b99l806Q732p043J704K982m695N188m407K75N598p860N065J429o766P213l737
896d27p62N108p471N578O19p022Q803m202l569Q183o325J181K966n016M804k700
912b52m58M380p131M655J079o188P866m676k040O912p871M025L192q668P434j741
928E18m939P625n091L31K344l680M258l467L29M331q102O412J008p988R492m225
944h44m785R854p376Q21O121q246M599J118m005M053k060J074l66k006N757o073
960b364J718O251j0807O869M174j1672J0281j77r134J0035l315l570O107l403
$$ plain form
974 993 1077 1918 1759 2867 -825 4221 1893 -2762 7232 -297 -2231 8545 -3275 -717 8125 -5120
990 -5120 1717 6048 -4872 2025 3289 -2533 682 2025 53 -3120 1778 1907 -6850 3810 2088
1005 2088 -9592 5776 295 -9516 6721 -2007 -7894 5489 -3252 -5096 3002 -2700 -3788 -416
1019 -416 28 -3820 -1898 2701 -6507 -1927 4948 -8998 349 5110 -11209 2866 4236 -10928
1033 -10928 4734 2548 -9646 3708 2522 -6246 1262 2975 -4285 -2298 6885 -2800 -5243 8954
1047 8954 -4353 -6064 11941 -5069 -5107 10562 -6455 -2503 9544 -5071 -908 5584 -3907 -234
1061 -234 5008 -548 -2362 4128 413 -4888 7898 1728 -8715 9354 -322 -9699 13646 -481
1075 -481 -10086 11648 -1910 -7903 11347 709 -7557 5206 2862 -6153 3829 7416 -8206 -174
$$ packed form
974I93Q4Q41j59J108l692N046k328m655R994p529j934J0776j1820K558Q842j3245
990e120O837M331j0920O897J264n822L215J343j972l173M898J29q757J0660j722
1005B088j1680J5368n481r811J6237q728n887J3383q741j844Q098n702j088L372
1019d16M44l848J922M599r208M580O875j3946R347M761j6319J4075J370j5164
1033a0928J5662k186j2194J3354j186q768P508J713p260J987R183r685k443J4197
1047H954j3307j711J8005j7010l8J5669j7017L952J2047j4615M163O492r491L673
1061b34N242n556j814O490l715n301J2786o170j0443J8069r676r377K3345j4127
1075d81r605K1734j3558n993J9250j0638q266J2763k344r015R982L587j5622Q032
$$ plain form
1089 -174 8403 -8613 2829 10097 -11575 1865 7388 -9759 6416 6294 -10359 3624 3438 -5990
1103 -5990 5197 4303 -6377 -876 4850 -4009 187 9104 -7879 -4959 11198 -7678 -966 14095
1117 14095 -12382 -4471 13088 -9389 -342 12856 -9758 -6222 9747 -1486 -4435 8968 -771
1130 -771 -12394 7209 5885 -9050 8511 1658 -13706 8060 3693 -5909 9316 -3745 -8516
1143 -8516 7790 -1165 -1286 7728 -5451 -7615 6002 2584 -4895 5955 1307 -15040 5389 10045
1157 10045 -12237 6031 5680 -19223 5511 10690 -11280 4219 2981 -14073 2131 8054 -4397
1170 -4397 -996 2422 -8950 -3379 10787 -2836 -5387 6765 -10395 -5260 14805 -4967 -4489
1183 -4489 7064 -11688 -1972 11919 -3486 -1485 2240 -7572 -893 8655 1270 -2993 2443 -4156
$$ packed form
1089a74Q577j7016J1442P268k1672J3440N523j7147J6175j22j6653J3983j86r428
1103e990J1187q94j0680N501N726q859M196Q917j6983K920J6157j8876O712J5061
1117A4095k6477P911J7559k2477R047J3198k2614L536J5969j1233k949J3403r739
1130g71j1623J9603j324j4935J7561o853j5364K1766m367r602J5225j3061m771
1143h516J6306q955j21R014j3179k164J3617l418p479J0850m648j6347K0429M656
1157A0045k2282J8268l51k4903K4734N179k1970J5499j238j7054J6204N923j2451
1170d397L401L418j1372N571J4166j3623k551J2152j7160N135K0065j9772M78
1183d489J1553j8752R716J3891j5405K001L725r812O679R548p385m263N436o599
$$ plain form
1197 -4156 -4707 12990 2155 -8290 8444 -5103 -8045 18390 1062 -9209 9150 -4528 -6450
1210 -6450 14015 4307 -7090 1651 876 -4743 7045 9743 -7811 -2515 4091 -7051 7682 9623
1224 9623 -10879 688 1683 -8665 10275 6191 -9954 483 -663 -5312 6469 6060 -6462
1237 -6462 -5714 1819 -2964 922 8966 -6910 -8244 4584 -5673 2044 9968 -10661 -4953 3500
1251 3500 -7143 5055 7743 -9083 -4937 2127 -2406 1069 7392 -3359 -10785 3774 2264 -4228
1265 -4228 9603 -1605 -12743 5790 1411 -2240 9504 -3577 -8259 3492 665 2333 5384
1278 5384 -2067 -5547 -60 4536 1025 3471 2379 -8736 656 6937 -2112 5915 1492 -9742
1292 -9742 4069 3881 -1511 7432 -1697 -7283 3223 2845 1011 3737 873 -5823 -1660 7786 32
$$ packed form
1197d156n51J7697j0835j0445J6734j3547k942K6435j7328j0271J8359j3678j922
1210f450K0465r708j1397Q741p75n619J1788K698j7554N296O606j1142J4733J941
1224I623k0502J1567R95j0348J8940m084j6145J0437j146m649J1781m09j2522
1237f462P48P533m783L886Q044j5876j334J2828j0257P717P924k0629N708Q453
1251C500j0643J2198K688j6826M146P064m533L475O323j0751p426J4559j510o492
1265d228J3831j1208j1138J8533m379l651J1744j3081m682J1751k827J668L051
1278E384p451l480N487M596l511K446j092j1115R392O281r049Q027m423j1234
1292i742J3811j88n392Q943r129n586J0506l78j834K726k864o696M163R446p754
$$ plain form
1307 32 -789 5725 -7734 -3675 10171 -1663 -460 4368 -6771 -1247 5388 772 1726 -1659 -3332
1322 -3332 -480 1524 3745 -499 -1344 -2272 -3770 4827 1989 -3669 3178 -4707 -4958 7290 -891
1337 -891 -2407 2394 -5401 -2162 3292 212 -329 -2434 -2341 -1634 467 3316 -2748 -2132 -142 -5248
1353 -5248 3025 3332 -5835 1466 -1345 -5717 4566 1235 -3240 325 -1976 -1157 363 1425 947
1368 947 -4068 -462 796 -1726 3339 -435 -2755 1367 -2724 1799 3656 -3908 1440 591 -3566
1383 -3566 3704 2014 -1734 585 -560 656 340 1569 2175 -3308 865 2336 -2103 3119 1050
1398 1050 -2781 2162 -925 821 3482 -2235 1241 1267 -2160 3014 1292 -770 816 -415 1419
1413 1419 -225 287 3067 -2801 455 3076 -2781 1789 1866 -2546 2205 -339 -90 2160 -2047 1043
$$ packed form
1307C2q21O514j3459M059J3846j1834J203M828j1139N524O635m616R54l385j673
1322c332K852K004K221m244q45r28j498Q597k838n658O847p885k51J2248q181
1337h91j516M801p795L239N454l080n41k105R3P07K101K849o064O16J990n106
1353e248Q273L07r167P301k811m372J0283l331m475L565k301Q19J520J062m78
1368I47n015L606J258k522N065l774k320M122m091M523J857p564N348q49m157
1383c566P270j690l748K319j145J216l16J229O06n483M173J471m439N222k069
1398A050l831M943l087J746K661n717L476K6l427N174j722k062J586j231J834
1413A419j644N12K780n868L256K621n857M570P7m412M751k544K49K250m207L090
$$ plain form
1429 1043 1055 -1931 2486 188 -557 1050 -921 1267 -366 -987 2547 -2200 -314 2762 -3129 789
1445 789 1534 -2787 1615 -445 -1206 1419 -2003 322 385 -2303 911 -1038 -1015 660 -1862 566 -1176
1462 -1176 -2442 2022 -2554 -1398 2075 -3867 -733 1368 -3005 782 -496 -2138 485 -1738 112
1477 112 31 -1796 841 -1395 -452 1417 -1944 1460 -198 -2600 3180 -930 -1196 3690 -1965 -40
1493 -40 3220 -1154 1416 1352 -237 1274 254 2139 858 -117 3134 -724 986 3651 -1620 2319
1509 2319 2033 -2209 3920 977 -1342 3513 -837 -677 2913 -174 224 833 -137 -46 -697 2039 -870
1526 -870 -1897 2872 -2598 -1440 3258 -3652 -669 1602 -4155 527 881 -3461 343 -966 -2384
1541 -2384 -133 -821 -977 -2040 -193 -610 -3314 1801 -775 -4103 2677 -2198 -3135 3594 -2941 -1876
$$ packed form
1429A043J2k986M417k298p45J607j971K188j633o21L534m747J886L076n891L918
1445G89P45m321M402k060p61K625l422K325O3k688L214j949K3J675k522K428j742
1462a176j266M464m576J156L473n942L134K101m373L787j278j642K623k223J850
1477A12q1j827K637k236R43J869l361L404j658k402N780m110k66M886n655J925
1493d0L260m374K570o4j589J511j020J885j281r75L251l858J710K665n271L939
1509B319k86m242O129k943k319M855m350J60L590l087L98O09r70R1o51K736k909
1526h70j027M769n470J158M698o910K983K271n757M682L54m342L804j309j418
1541b384K251o88j56j063J847m17k704N115k576l328O780m875r37O729o535J065
$$ plain form
1557 -1876 2894 -3163 -506 2132 -1838 -322 972 -291 -848 1129 1359 -2711 1411 2461 -3640
1572 -3640 3010 2672 -4344 3628 1602 -3489 4164 962 -2143 3137 440 -598 1988 809 -436
1587 -436 354 2175 -981 -26 3650 -2428 -28 4288 -3545 1332 4381 -4774 1660 3223 -4491 1805
1603 1805 2380 -3145 479 1911 -1547 -1023 2572 -682 -2927 3441 -685 -3502 4529 -1358 -3725
1618 -3725 4939 -2200 -2491 4548 -2695 -1473 2960 -2389 -576 2121 -1242 -1325 1376 190 -2370 2090
1634 2090 1192 -4651 2759 1236 -5587 4359 700 -5866 4632 400 -4967 4030 263 -4066 2263
1649 2263 1057 -2770 590 2028 -3044 -856 3762 -3159 -823 4267 -4471 -503 4155 -4510 923
1664 923 3147 -4931 1774 2445 -3692 1738 1698 -2824 506 2453 -1457 -423 3497 -2379 -2418 5681
$$ packed form
1557a876M770o057K657K638l970J516J294j263n57J977K30m070M122J050o101
1572c640O650l38p016P972k026n091P653l202l105N280k697j038K586j179j245
1587d36P90J821l156R55L676o078K400M316p833M877L049r155O434J563p714O296
1603A805N75n525L624J432l458N24L595l254k245O368m126k817Q031n887k367
1618c725Q664p139k91P039p243J222M433n349J813K697l363q3K701j186k560M460
1634B090q98n843P410j523o823R946l659o566J0498m232n367Q997l767m329O329
1649B263j206l827L360J438n072K188M618o921K336N090q738L968M658q665N433
1664I23K224q078O705O71o137N430m0m522L330J947l910J034L920n876l9Q099
$$ plain form
1680 5681 -2082 -2782 6166 -3591 -3027 6970 -2770 -2227 5218 -2940 -2227 4026 -297 -2049 2421 447
1696 447 -3010 2497 2661 -3649 2202 1540 -4692 3456 1723 -4325 3553 -202 -4337 4635 -108 -3162
1712 -3162 2850 -933 -2923 2648 1330 -2818 434 1617 -3703 876 4306 -4897 12 3697 -5334
1727 -5334 1554 4637 -5523 835 2519 -4545 1882 3010 -3597 -166 1619 -1789 -478 3586 -1406
1742 -1406 -3000 3226 -1472 -1971 5363 -2462 -3514 4457 -2660 -897 4897 -2904 -1815 2476 -1881
1757 -1881 -283 2626 -1144 -2864 1169 689 -2114 2671 726 -4966 2457 1057 -3580 4419 -137
1772 -137 -5043 3264 -333 -2324 4169 -914 -3456 1723 646 -1243 1981 1093 -3631 -132 3452
1787 3452 -2504 947 3351 -5335 501 4379 -2990 1956 2581 -4467 753 2683 -1041 1456 1151
$$ packed form
1680E681p763p00Q948r757N64R997r740N43P445q158P13O253m323j752M470j974
1696D47l457N507J64o310N851o62o232Q148j733o048P878l755m135Q972m743l054
1712c162O012l783j990N571j318m148L252J183n320M579L430r203M909L685r031
1727e334O888L083j0160O358J684p064O427J128o607L431J785l408J311M064m992
1742a406j594O226m698m99P334p825j052P971p117J763N794p801J089M291m357
1757a881J598K909l770j720M033m80k803M785j945n692P423j400m637P999m556
1772a37m906Q307l597j991O493n083k542N179j077j889L224q88m724L499L584
1787C452n956L451K404q686N836L878p369M946O25p048N220J930l724K497l05
$$ plain form
1802 1151 -1729 -624 2436 1097 -661 1931 -1092 -1814 3987 -231 -445 3310 -3182 -711 4391
1817 4391 -1659 892 2388 -3651 13 2824 -575 -168 1133 -1239 -2182 2802 1847 -2899 1748 -108
1833 -108 -4132 3554 1693 -3368 1912 -1241 -3050 2989 607 -1249 276 -1375 -1063 394 1391 -506
1849 -506 -1701 235 -1733 299 2488 -2228 -412 543 -3366 2028 1805 -3065 1249 -586 -2783 2206
1865 2206 995 -1458 -431 -399 -1257 5 2287 -843 -2538 1408 -1502 -1187 3579 -1810 -2206 1807
1881 1807 -2159 41 2585 -1709 -803 -285 -871 552 575 24 -1347 -835 501 -817 1113 615 -2635
1898 -2635 894 -184 -1301 2843 -591 -2049 1642 -977 191 2388 -1018 -456 375 117 627 486
1914 486 1092 -1182 -460 2218 -465 794 1895 -2189 797 1857 -1295 2050 878 -1333 1562 211
$$ packed form
1802A151k880J105L060j339j758K592l023p22N801m218k14L755o492K471N102
1817D391o050K551J496o039L664K811l399M07J301k372r43M984r55m746M647j856
1833a08m024P686j861n061N280l153j809O039k382j856J525j651L12J457R97j897
1849e06j195J936j968K032K189m716J816R55l909N394k23m870M314j835k197M989
1865B206j211k453J027L2q58J262K282l130j695L946k910L15M766n389l96M013
1881A807l966K200K544m294R06N18n86J423K3n51j371N12J336j318J930m98l250
1898b635L529j078j117M144l434j458L691k619J168K197l406N62Q31k58N10j41
1914D86O06k274P22K678k683J259J101m084K986J060l152L345j172k211K895j351
$$ plain form
1930 211 384 1484 -11 203 -106 722 1184 -582 1041 -471 -1039 2234 -146 -191 1911 -1636 -232
1947 -232 1609 -1087 1183 447 -1398 541 -139 45 398 -810 166 -1031 110 756 -1284 586 34
1964 34 -1950 1539 -440 -1399 1452 -1625 -746 1088 -1219 176 6 -1110 91 -535 -41 -279 -991
1981 -991 544 -902 -526 864 -1576 392 447 -1883 1222 -4 -1502 1248 -777 -862 743 -887
1997 -887 61 137 -484 353 -579 206 275 -766 1261 -501 -670 1471 -1270 94 1167 -1533 916 550
2015 550 -1215 1326 14 -604 817 -515 344 100 -147 697 -728 574 415 -950 1705 -397 -952
2032 -952 1619 -946 82 1900 -1185 354 634 -962 1066 528 -293 387 -194 582 235 29 907
2049 907 -1154 342 643 -1008 1650 203 -1925 1440 -588 -420 1819 -761 -397 521 -540 384
$$ packed form
1930B11J73J100j495K14l09Q28M62j766J623j512n68L273k380m5K102l547J404
1947b32J841k696K270p36j845J939o80J84L53j208R76j197J141O46k040J870n52
1964C4j984L489j979r59K851l077Q79J834k307J395j70j116J201o26M94k38p12
1981i91J535j446L76J390k440J968N5k330L105j226j498K750k025q5J605j630
1997h87R48P6o21Q37r32P85O9j041K027j762j69K141k741J364J073k700K449l66
2015E50j765K541j312o18J421j332Q59k44k47Q44j425J302j59j365K655k102n55
2032i52K571k565J028J818l085J539K80j596K028n38q21O80n81P76l47k06Q78
2049I07k061J496L01j651K658j447k128L365k028J68K239k580L64R18j061R24
$$ plain form
2065 384 213 -205 -145 -636 861 -456 26 1150 -1790 -17 1001 -1941 818 774 -2142 967 -113
2082 -113 -962 1117 -671 -731 141 -146 73 -290 526 -377 -1141 1615 -356 -782 1800 -1374 -680 1797
2100 1797 -1427 323 1421 -1651 388 767 -714 440 165 -102 -458 671 880 -872 799 438
2116 438 -1577 1702 286 -1260 2011 -615 -1178 2233 -486 -436 1576 -957 21 876 -299 -123 380
2133 380 362 -906 179 1159 -1516 405 1144 -2231 1214 1239 -2163 1564 370 -1767 1661 109 -937
2150 -937 734 -283 -731 -241 577 -441 -844 859 -1079 -991 1858 -1557 -606 2079 -2199 -108 1546
2167 1546 -2237 242 915 -1527 288 430 -784 -109 320 -92 -1093 823 153 -1629 1084 -188
2183 -188 -1749 2069 -627 -1576 2264 -1128 -764 1909 -1308 -493 1335 -709 -450 697 353 -933
$$ packed form
2065C84j71m18O0m91J497j317M82J124k940J773J018k942K759m4k916L109j080
2082a13q49K079j788o0Q72k87K19l63Q16r03p64K756j971m26K582l174O94K477
2100A797l224J750J098l072K039L79j481J154k75k67l56J129K09j752J671l61
2116D38k015L279j416j546L271k626n63L411k719N0K012k533R78Q55j175J76N03
2133C80j8j268J085R80k675J921P39l375L445K5l402L727j194k137L428j552j046
2150i37J671j017m48M90Q18j018m03J703j938Q8K849l415R51K685m278K091J654
2167A546l783K479O73k442J815J42j214O75M29m12j001J916o70j782K713j272
2183a88j561L818k696r49L840l392L64K673l217Q15J828k044K59J147l44j286
$$ plain form
2199 -933 456 1005 -1549 888 1571 -1949 1304 1127 -2398 1881 871 -1951 1734 564 -1039 1165
2215 1165 533 -530 484 486 -178 -22 1118 -348 -411 1944 -1033 -119 2070 -1541 221 1861 -2042
2232 -2042 876 1484 -1797 791 734 -1163 343 742 -392 -647 1008 -166 -1273 1376 -374 -1840
2248 -1840 1921 -725 -1817 2137 -1100 -1427 1415 -1356 -643 1014 -1090 -555 315 -309 -690 -208 238
2265 238 -1351 124 728 -1802 968 824 -2267 1295 271 -1979 2024 30 -1748 1242 -170 -751
2281 -751 1123 288 -701 49 1165 -471 -178 1616 -1135 -338 2130 -1417 112 1942 -1562 620
2297 620 1371 -1246 1145 834 -1100 790 643 -273 387 785 -45 -689 1241 19 -1030 2117 -496
2314 -496 -1350 2409 -857 -985 2052 -1301 -638 1428 -631 -83 639 -681 -735 -2 623 -836 -10 694
$$ packed form
2199i33J389N49k554K437O83l520L253j77l525M279j010k822L685j170j603K204
2215A165o32j063J014Ko64J56J140j466o3K355k977R14K189l611J762J640l903
2232b042K918O08l281K588n7j897J506L99j134k55J655j174j107K649j750j466
2248a840L761k646j092L954l237l27K842k771P13J657k104N35Q70o24l81M82M46
2265B38j589J475O04k530K770j44l091L562j024k250M003j994j778K990j412n81
2281g51J874q35r89P50J116j636K93J794k751P97K468l547J529J830l504K182
2297F20P51k617K391l11j934J890j47r16O60L98q30o44J930j222j049L147k613
2314d96q54L759l266j28L037l353O63K066k059N48P22j320n4P33O25j459Q26P04
$$ plain form
2332 694 -1518 281 720 -1783 905 92 -1902 1354 -233 -1420 1199 -897 -1018 970 -321 -721
2348 -721 126 -156 -741 152 1129 -1091 -496 1403 -1692 107 1998 -1791 94 1198 -1735 747 1063
2365 1063 -1082 465 174 -505 362 679 249 -571 455 387 -770 1295 129 -1146 1335 -622 -370
2382 -370 1806 -1012 20 963 -1325 560 1010 -576 14 247 -226 -129 465 507 -1298 323 672 -1304
2400 -1304 1156 280 -2076 1155 -189 -938 1490 -215 -694 578 -417 32 227 -88 -313 -582 354
2417 354 -372 -248 675 -1069 -368 1156 -1167 462 706 -1689 524 405 -914 781 -85 -733 378
2434 378 -194 12 73 201 44 -993 828 175 -742 1181 -575 -917 1462 -522 3 1356 -1202 72
2452 72 764 -503 679 190 -384 -65 28 670 -157 180 757 -888 799 1081 -742 909 -138 -776
$$ packed form
2332F94k212J799M39k503K688q13j994L256j587j187K619k096j21J988j291m00
2348g21Q47k82n85Q93R77k220N95J899l095J799J891l789J885J104k933K482L16
2365A063k145J547k91o79Q67L17m30q20J026o8j157K065j166j275K481j957K52
2382c70K176k818J032R43k288J885M50j586N90K33m73R7N94M2j805J621L49j976
2400a304K460q76k356L231j344p49K428j705m79J272r95M49J95l15k25k69R36
2417C54p26J24R23j744P01J524k323J629K44k395K213j19j319J695q66o48J111
2434C78n72K06O1J28j57j037J821o53r17J923j756l42K379j984N25J353k558J274
2452G2O92j267J182m89n74L19R3O42q27L37N77j645J687K82j823J651j047o38
$$ plain form
2470 -776 1223 -253 -398 1008 -780 107 393 -437 356 -154 42 -143 -382 758 -315 -360 800 -1185
2488 -1185 235 940 -1037 632 1 -1129 1034 -236 -511 384 -564 -83 107 129 309 -425 151 86
2506 86 -915 818 -422 -831 796 -858 -196 835 -1114 263 387 -958 582 -222 -414 155 -314
2523 -314 132 -41 -184 367 -513 313 103 -828 669 -71 -1001 956 -256 -270 880 -862 5 426 -765
2542 -765 291 -35 6 297 -455 439 -176 -244 641 -543 -10 635 -854 548 237 -1033 861 -177
2560 -177 -708 901 -368 140 404 80 322 -217 123 234 -290 857 -33 -447 877 -491 -84 832
2578 832 -792 475 651 -609 507 -4 -547 641 -165 -30 301 -67 167 -329 108 379 -595 603
2596 603 -105 -638 912 -306 -342 888 -942 -18 598 -538 239 367 -619 323 -217 263 48 -480 376
$$ packed form
2470g76J999j476j45J406j788Q87K86q30P93n10J96j85k39J140j073m5J160j985
2488a185J420P05j977J669o31j130K163j270k75Q95r48M81J90K2J80p34N76o5
2506H6j001J733j240m09J627j654O62J031j949J377J24j345J540q04j92N69m69
2523c14M46j73j43N51q80Q26k10r31J497p40r30J957j212j4J150j742Q67M21j191
2542g65J056l26M1K91p52Q94o15o8Q85j184N33O45j489J402l11j270J894j038
2560a77n31J609j269N08K64l24K42n39L40J11n24J147q90m14J324j368M07R16
2578H32j624J267J76j260J116n11n43J188q06J35L31l68K34m96M37K71r74J198
2596F03p08n33J550j218l6J230j830R24O16j136P77J28r86R42n40M80k15n28Q56
$$ plain form
2615 376 -479 78 595 -810 379 215 -1145 1017 -123 -722 897 -685 -262 589 -539 224 46
2632 46 -347 141 -219 219 -130 -438 606 -520 -132 943 -925 42 590 -1106 483 80 -720 572
2650 572 -325 -179 407 -96 105 -61 31 82 -286 501 -217 -681 808 -448 -223 1053 -879 -170 738
2669 738 -819 415 763 -432 330 130 -69 72 -3 151 -489 -12 581 -573 567 383 -885 925
2687 925 -131 -560 1149 -470 -284 805 -627 295 429 -324 -186 2 109 170 -146 427 -520 -286 713
2706 713 -881 328 79 -1215 400 121 -972 664 -116 -762 330 -233 -161 134 -67 -178 -381 406
2724 406 -203 -525 471 -774 -518 930 -727 -215 709 -1080 311 415 -643 298 109 -466 55 211
2742 211 374 -20 167 207 -530 510 469 -808 994 110 -765 1016 -53 -133 821 -479 147 792 -413
$$ packed form
2615C76q55N57N17j405J189j64j360K162j140n99J619j582M23Q51j128P63j78
2632D6l93M88l60M38l49l08J044j126L88J075j868R67N48j696J589m03q00J292
2650E72q97J46N86n03K01j66R2N1l68P87p18m64J489j256K25J276j932P09R08
2669G38j557J234L48j195P62k00j99J41p5J54o40M77N93j154J140j84j268J810
2687I25j056m29J709j619J86J089j432R22J34p53J38J88J07O1l16N73r47K34R99
2706G13j594J209k49j294J615k79j093J636p80o46J092n63P2K95k01j11k03P87
2724D06o09l22R96j245K56J448j657N12R24j789J391J04j058R41j89n75N21J56
2742B11J63l94J87M0p37J040m1j277J802q84q75J781j069q0R54j300O26O45j205
$$ plain form
2761 -413 368 199 -14 -28 83 439 -357 212 483 -694 551 773 -1164 629 274 -1157 803 -24
2779 -24 -813 416 -376 -362 -50 -185 -178 -630 1 -125 -705 458 -456 -731 672 -951 -165 708 -1157 118
2799 118 353 -934 361 230 -742 30 87 -198 -170 22 100 -806 174 356 -785 910 50 -694 965
2818 965 -543 -300 1215 -509 96 941 -295 56 546 -71 120 197 505 -178 180 714 -553 301 665
2837 665 -749 747 477 -765 810 237 -573 1065 -138 -153 511 -139 96 236 186 66 -373 616 -176
2856 -176 -269 799 -521 -192 694 -845 -9 505 -1042 258 5 -464 235 -37 -491 -110 -56 -91 -439
2875 -439 235 122 -921 463 -48 -961 1103 -476 -631 1011 -510 -299 683 -349 -31 321 -254 11
2893 11 -45 21 -5 6 296 -240 412 914 -579 318 506 -650 858 50 -437 752 -62 -321 869 27
$$ packed form
2761d13P81j69k13j4J11L56p96N69K71j177J245K22j937J793l55j431J960q27
2779b4p89J229p92J4L12j35Pm52O31j26n80J163r14k75J403j623P86Q73j865J275
2799A18K35j287J295j31r72P72N7k85K8J92P8r06R80J82j141J695q60p44J659
2818I65j508K43J515j724O05Q45j236L51M90o17J91P7L08o83L58N34j267Q54L64
2837F65j414J496k70j242J575n73q10J638j203j5O64o50K35J40n0j20m39R89p92
2856a76r3J068j320L29Q86j539Q36N14j547J300k53m69O99k72m54L81N4l5l48
2875d39O74j13j043J384n11r13K064j579j55J642j521K11R82j032L18L52n75K65
2893A1n6O6k6J1K90n36O52N02j493Q97J88j156J508q08m87J189q14k59J190q42
$$ plain form
2913 27 -50 14 -23 59 18 599 -194 -280 802 -406 -185 1002 -972 -37 657 -740 354 393 -580 41 -141
2934 -141 -214 137 -218 -53 -212 99 162 -574 186 -158 -742 654 -404 -379 666 -654 -146 716 -586
2953 -586 -57 383 -523 -195 -145 -151 49 -243 97 -339 -132 479 -331 184 275 -817 489 179 -741 746
2973 746 -241 -425 512 -269 -246 49 -124 128 -144 426 -92 -370 486 -186 -282 857 -438 123 570 -592
2993 -592 380 262 -524 527 159 -300 651 -270 -162 185 121 93 -207 208 276 -637 608 -240 -551 571
3013 571 -315 -9 879 -603 168 661 -345 409 50 -151 181 194 -33 -185 97 281 -647 398 391 -568
3033 -568 309 199 -528 557 14 -267 508 -293 -11 195 -348 -2 -94 -226 98 -256 41 -148 -160 352
3053 352 -749 56 421 -678 229 374 -738 452 -124 -503 388 -54 -4 119 -159 251 -389 8 143
$$ packed form
2913B7p7O4l7Q2m1N81p93q6J082j208K21J187j974R35O94j397J094L9r73O21j82
2934a41p3L51l55J65j59L11O3p36P60l44n84J396j058K5J045j320N08Q62j302
2953e86N29M40r06L28N0oK00k92L40m36K07O11q10N15R1j092J306l10r20J487
2973G46r87j84R37p81K3K95j73K52k72N70n18k78Q56o72r6J139j295N61M47j162
2993e92R72j18p86J051l68m59R51r21J08L47o4k8l00M15O8r13J245q48l11J122
3013E71q86L06Q88j482P71M93j006P54l59k01L32J3k27j52K82J84r28J045pr59
3033e68Q77j10p27J085n43k81P75q01K82K06n43L46r2j32L24l54K97j89j2N12
3053C52j101Q05L65j099R07J45j112J190n76l79Q91m42N0J23k78M10o40L97J35
$$ plain form
3072 143 -382 291 124 -240 516 -257 -119 548 -559 288 477 -324 263 139 -180 338 -168 180 -191 -2
3092 -2 388 -211 99 260 -410 255 -18 -476 620 -250 -292 364 -324 -237 527 -420 4 -263 -237 100 -128
3113 -128 96 -101 -452 484 -413 -240 416 -461 378 248 -820 513 -135 -384 448 -298 -258 446 -446 -45
3133 -45 -22 -162 329 -437 396 68 -650 613 -170 -304 521 -254 37 308 -485 231 20 -182 249 -285
3153 -285 10 45 -135 112 -205 -9 36 -559 365 157 -697 478 55 -557 751 -252 -58 205 -511 226
3173 226 69 -558 403 -411 -166 185 -204 305 -289 -128 289 -301 167 144 -806 421 -38 -496 282 -234
3193 -234 -228 447 -135 100 -9 -24 319 -113 107 172 -187 375 -211 -286 477 -370 154 488 -373 323 -2 -298
3215 -298 768 -90 -100 405 -189 -69 -21 -100 415 -203 288 90 -426 257 -265 -485 450 -302 -143 492 -583
$$ packed form
3072A43n25O73j67l64P56p73J38O67j107Q47J89q01N87j24l19N18n06L48l71J89
3092bL90n99L10J61o70O65k73m58J096q70m2O56o88Q7P64r47M24k67K6L37k28
3113a28K24j97l51R36q97J73O56q77Q39j30j068J333o48k49Q32p46M0P04q92M01
3133d5K3j40M91p66Q33l28p18J263p83j34Q25p75K91K71p93P16k11k02M31n34
3153b85K95L5j80K47l17J96M5n95R24k08q54J175m23o12J308j003J94K63p16P37
3173B26j57o27R61q14K45L51l89N09n94J61M17n90M68k3r50J227m59m58P78n16
3193b34OO75n82K35j09j5L43m32K20O5l59N62n86p5P63q47N24L34q61O96l25k96
3215b98J066q58j0N05n94J20M8p9N15o18M91j98n16O83n22k20R35p52J59O35j075
$$ plain form
3236 -583 -52 132 -402 224 25 -177 176 -372 131 -109 -114 319 -624 -20 196 -384 201 -46 -652 369
3256 369 -317 -438 418 -532 39 172 -367 -51 -162 -41 188 -328 145 -86 -22 552 -408 330 432 -620
3276 -620 525 295 -625 248 193 -16 537 -104 -30 202 -122 433 242 194 212 -163 515 181 -122 656 -379
3297 -379 -78 464 -648 210 322 -568 109 57 -174 -35 -79 -12 24 165 432 -233 -261 357 -528 193 164 -408
3319 -408 368 -359 -259 483 -423 44 194 -465 -46 -46 -238 114 -320 132 -71 -393 395 -342 -108 45 -875
3340 -875 191 194 -312 198 -209 -541 122 239 -77 299 -92 119 -165 264 195 -110 311 128 -361 702
3360 702 213 -249 374 -407 32 476 -216 340 -207 -380 266 -192 123 170 -214 140 -90 388 218 -545
3380 -545 368 95 -473 585 -79 -420 489 -361 -211 199 -187 -65 -21 -182 207 -223 206 -56 -186 242
$$ packed form
3236e83N31J84n34O26j99k02L53n48N03k40nM33r43O04K16n80N85k47o06J021
3256C69o86j21Q56r50N71J33n39L16j11J21K29n16M73k31O4N74r60P38J02j052
3276f20J145k30r20Q73n5k09N53o41P4K32l24N55j91m8J8l75O78l34l03P78j035
3297c79L01N42j112Q58J12q90O77n2k31J39m4O7L6J41K67o65k8O18q85P21k9n72
3319d08P76p27J00P42r06M67J50o59M19%j92L52m34M52k03l22P88p37K34J53r20
3340h75J066Ln06N10m07l32O63J17l16L76l91K11k84M29o9l05M21j83m89J063
3360G02m89m62O23p81M39M44o92N56n47j73O46m58L15M7l84L54k30M78j70p63
3380e45R13k73n68J058o64l41R09q50J50M10l86J22M4j61L89m30M29k62j30M28
$$ plain form
3400 242 -351 -154 335 -566 79 215 -635 295 125 -394 312 -343 -304 251 -149 -29 -46 -213 187 -316 310
3421 310 167 -165 546 -364 34 475 -556 -45 232 -549 146 307 -436 213 -80 -250 226 -69 92 -101
3441 -101 -48 121 -378 322 232 -713 579 16 -292 531 -328 21 387 -369 322 502 -141 124 -81 -124 -20
3462 -20 -38 275 -147 24 469 -554 156 221 -420 362 -189 -406 527 -17 -191 343 -174 -80 169 -66 40
3483 40 -167 199 117 -306 397 -11 -458 457 -343 -255 465 -483 367 157 -369 290 -26 -210 506 -118 -285
3504 -285 100 -238 154 -423 -70 110 -475 165 10 -587 573 -126 -161 590 -403 75 100 -333 353 -76
3524 -76 -88 254 -248 311 -70 -325 571 -221 501 370 -475 308 -33 -581 478 -198 -342 410 -48 97
3544 97 144 -213 181 -64 251 228 -139 295 -190 -128 658 -235 -28 473 -468 397 363 -534 254 141 -146 356
$$ packed form
3400B42n93J97M89r01O45J36q50R30j70n19P06o55L9N55m00J20j7j67M00n03O26
3421C10j43l32P11r10L98M41j031N11K77p81O95J61p43O49k93j70M76k95J61j93
3441a01N3J69m99P00r0r45J292n63l08Q23q59L49L66p56O91J80o43K65k05m3J04
3462b0j8L13m22J71M45j023P10O5o41P82n51k17R33n44j74N34n17R4K49k35J06
3483D0k07L66q2m23P03m08m47R15q00Q8P20r48Q50k10n26O59l16j84P16o24j67
3504b85L85l38L92n77L53J80n85O40j55n97J160o99l5P51r93M78K5m33O86m29
3524g6j2L42n02N59l81k55Q96p92P22j31q45P83l41n48J059o76j44P52m58J45
3544I7M7l57L94k45L15k3l67M34m85O2P86q93K07N01r41Q65l4q97P88j13k87N02
$$ plain form
3566 356 -60 125 -41 -133 176 -81 -96 -57 -366 167 -138 -491 446 -386 -236 575 -477 -40 359 -241 -156
3587 -156 47 -518 -21 -84 46 -27 -417 225 -414 -115 425 -322 147 -28 -292 511 -50 -81 356 -494 65
3608 65 384 -538 140 91 -104 152 -381 178 -270 -360 585 -161 -193 471 -293 -11 238 -103 583 41 37 250
3630 250 -292 -125 419 -306 124 429 -19 206 157 391 214 -68 321 -91 -329 465 -375 -35 265 -189
3650 -189 226 -159 -294 284 -222 137 6 -415 173 -130 19 328 -293 137 138 -277 449 -237 -271 666 -222
3671 -222 -159 85 -187 78 0 54 440 -39 138 134 -161 306 35 -71 242 -387 109 385 -511 372 125 -345
3693 -345 511 7 -238 206 -169 200 -115 64 255 -348 -132 194 -614 237 -119 -378 391 -249 -195 117
3713 117 -425 110 -100 -423 173 -133 -302 -109 -203 -201 -251 -229 669 -404 4 239 -500 190 190 -252 371 -260
$$ packed form
3566C56m16J85j66r2L09k57j5L9l09N33l05l53R37q32J50Q11j052M37L99o00Q5
3587a56K03n65M97o3J30p3l90O42o39K99N40p47M69j75k64Q03n61l1M37q50N59
3608F5L19r22O78m9j95K56n33N59m48r0R45p46l2O64p64K82K49l41O86n42mK13
3630B50n42J67N44p25M30L05m48K25m9K34j77k82L89m12k38P94q40L40L00m54
3650a89M15l85j35N78n06L59j31m21N88l03J49L09o21M30Jm15P26o86l4R37q88
3671b22O3K44k72K65p8N4L86m79J77mk95M67k71j06L13o29M96K76q96Q83k47m70
3693c45Q56n04k45M44l75L69l15J79J91o03K16L26q08Q51l56k59P69o40N4L12
3713A17n42N35k10l23N96l06j69J93r4Kn0K2Q98j073M08K35p39O90%m42O23o31
$$ plain form
3735 -260 173 432 -170 352 220 -295 363 -2 -69 299 8 200 -77 -10 345 -253 -53 182 -401 337 191
3756 191 -201 -1 -81 -195 80 -159 99 -37 -155 55 -491 76 293 -282 296 -224 -425 396 -369 -237
3776 -237 274 -343 181 74 -427 11 -170 -248 81 -343 -192 -91 -130 112 -414 -6 11 -518 204 88 -158
3797 -158 631 -130 -45 322 -388 50 289 -37 153 66 -30 251 -100 161 -63 -294 348 -76 -48 252 -267
3818 -267 231 213 -306 441 -136 -360 238 -240 182 186 -223 407 -51 -226 348 -49 158 9 -290 365 -377
3839 -377 -191 348 -315 -307 153 -261 168 -19 -228 179 -307 -49 189 -84 99 -45 -272 182 6 177 107
3860 107 -517 433 -260 -191 348 -200 -215 413 -265 314 301 -130 191 -284 -127 30 -55 257 -439 -186 317
3881 317 -98 289 125 -448 382 153 -260 432 -244 -146 44 -218 162 -80 -235 41 -238 81 188 -176
$$ packed form
3735b60M33K59o02N22j32n15O58l65o7L68k91J92k77O7L55n98K00K35n83P38j46
3756A91l92K00q0j14K75k39K58j36j18K10n46N67K17n75N78n20k01Q21p65J32
3776b37N11o17N24j07n01M38j81p8L29m24J51J01l9K42n26M08J7n29P22j16k46
3797a58P89p61Q5L67p10M38K39l26J90q7r6K81l51K61k24k31O42m24K8L00n19
3818b67M98j8n19P47n77k24N98m78M22Mm09O30m58j75N74l97K07j49k99O55p42
3839c77J86N39o63QM60m14M29j87k09M07m86K58K38k73J83j44k27M54j76J71p0
3860A07o24R50o93O9N39n48j5O28o78N79j3m31L21m75J57J57q5L12o96K53N03
3881C17m15L87j64n73Q30k29m13O92o76R8J90k62L80k42j55K76k79L19J07l64
$$ plain form
3901 -176 380 -566 -252 226 -261 186 47 -429 141 7 -314 192 -218 -475 13 -166 106 -277 65 225
3921 225 -256 236 296 -500 232 51 -329 471 173 160 371 -350 188 259 -58 254 -67 -88 223 -213 201
3942 201 228 39 250 -378 137 286 -157 248 16 -116 229 -324 -126 263 -363 -30 37 -268 47 9 -142
3963 -142 27 -39 240 -84 -389 430 -286 -249 312 -261 22 30 -177 29 -100 -324 217 -334 -30 207 -136
3984 -136 154 -46 -43 61 -340 356 -225 -182 369 -234 -122 314 -267 381 172 -222 340 18 -7 378 -201
4005 -201 52 19 148 275 -304 -113 318 -271 131 85 -240 342 -249 -170 179 -16 236 331 -196 112 53 -167
4027 -167 395 -367 -37 149 -164 269 -387 8 237 -436 286 79 -628 235 -70 -277 111 -105 -1 157
4047 157 -415 182 4 15 72 -398 39 85 -324 348 -190 -81 232 -478 87 192 -211 314 104 -308 163
$$ packed form
3901a76N56r46L14M78m87M47j39m76N70j34l21N06m10k57M88j79K72l83L42J60
3921B25m81M92O0p96P32j81l80Q00k98j3K11p21N38P1l17L12l21k1L11m36M14
3942B01K7j89K11o28N15J49m43M05k32j32L45n53J98L89o26L33O7l05L15l8j51
3963a42J69o6K79l24l05Q19p16L7N61n73K83Qk07K06j29k24N41n51L04K37l43
3984a36K90k00LJ04m01O96n81M3N51o03J12M36n81O48k09l94N62l22k5L85n79
4005b01K53l3J29J27n79J91M31n89M02m6l25N82n91P9L49j95K52R5n27L08n9k20
4027a67N62p62L30J86l13M33o56L95K29o73P22k07p07Q63l05k07L88k16J04J58
4047A57n72N97j78J1N7m70M37M6m09O72n38J09L13p10N65J05m03N25k10m12M71
$$ plain form
4068 163 -58 90 35 -352 237 -87 -34 132 -120 304 22 -163 256 111 -129 494 -317 144 310 -285 257
4089 257 -31 -92 69 -18 52 -193 -205 165 2 -172 307 -118 -118 149 -415 122 -191 -181 204 -251 -85 -44 -292
4112 -292 41 -103 -278 169 -23 17 283 -355 167 -509 -197 70 -243 46 26 -351 -9 13 -99 286 -77
4133 -77 27 -127 -152 34 8 -326 329 79 -128 44 -185 375 1 -117 416 -221 -187 277 -115 258 54
4154 54 -298 244 62 73 224 -218 197 261 64 208 -98 43 268 -117 506 252 -248 283 114 -75 264
4175 264 -77 13 -24 -77 232 -54 33 157 -337 272 8 -91 268 -166 -73 200 -212 -75 -35 -281 234 -115
4197 -115 -67 262 -266 356 -83 -288 204 -255 -89 171 -275 173 189 -131 164 -127 -242 287 -288 16 95
4218 95 -186 304 -258 -110 55 -80 112 -72 -110 282 18 -148 173 -447 -65 69 -257 408 2 -32 268
$$ packed form
4068A63k21J48n5l87N89l24N3J66k52M24k82j85M19j45k40O23q11M61J66n95N42
4089B57k88o1J61q7P0k45j2L70j63j74M79m25%K67n64N37l13J0L85m55J66M1k48
4112b92L33j44j75M47j92M0K66o38N22o76L12K67l13K89k0l77L42K2j12L85l63
4133g7J04j54k5J86k6l34O55k50k07J72k29N60l74j18N33o37L4M64l92L73k04
4154E4l52N42j82J1J51m42M15O4j97J44l06J41K25l85O23k54n00N31j69j89L39
4175B64l41R0l7n3L09k86Q7J24m94O09k64r9L59m34R3K73m12J37M0k46N15l49
4197a15M8L29n28O22m39k05M92m59J66K60m46M48J6l20K95k91j15N29n75L04P9
4218I5k81M90n62J48J65j35J92j84l8L92k64j66L21o20L82J34l26O65m06l4L00
$$ plain form
4239 268 -114 120 -14 -120 164 -75 -89 271 -292 298 -125 -268 353 -269 -278 82 -195 -151 362 -393 278
4260 278 -150 -7 178 -456 135 106 -297 404 -217 -84 274 -225 196 88 -166 129 -20 -136 311 -233
4280 -233 -45 343 -64 305 -30 -128 276 -167 157 192 -152 340 -120 -169 168 -140 25 119 -339 141 101 -13
4302 -13 137 -185 -39 166 -469 307 -212 -122 123 -291 84 255 -257 230 65 -160 224 -156 -51 102 -365
4323 -365 226 -30 -362 284 -144 -27 -53 -54 171 -84 -229 23 -160 165 310 -88 124 95 -288 336 -145
4344 -145 -30 144 45 69 114 -150 153 29 231 170 -142 224 113 -85 452 -310 0 209 -102 393 -35
4365 -35 -121 390 -92 -14 532 -150 -87 253 -71 322 108 119 86 -163 317 73 -358 329 -263 -156 252 -208
4387 -208 -16 -156 -277 239 -192 -118 173 -501 -129 80 -25 5 -132 -103 -94 -362 210 216 -354 315 -318 -330 233
$$ packed form
4239B68l82K34j34j06K84k39j4L60n63N90m23j43O21o22rL60k77M4N13p55O71
4260B78m28J43J85o34N91k9m03P01o21J33L58m99M21j08k54K95j49j16M47n44
4280b33J88L88m07L69l35r8M04m43L24L5l44M92m60m9L37l08J65R4m58M80m0j14
4302a3J50l22J46K05o35P76n19R0K45m14L75J71n12M87j65k25L84l80J05J53m67
4323c65N91k56l32O46m28J17k6jK25k55j45K52j83L25J45l98K12k9l83O24m81
4344a45J15J74r9K4M5k64L03j24K02o1l12L66j11j98N37p62L10K09l11M95m28
4365c5q6N11m82P8N46o82O3L40l24L93k14J1l3k49M80k44m31O87n92J07M08m60
4387b08J92j40j21N16m31P4K91o74L72K09j05L0j37K9Rk68N72On70O69o33j2N63
$$ plain form
4410 233 -101 18 -182 -172 101 -32 56 221 -373 60 36 -58 380 -39 103 -238 -193 365 235 -390 175 -273
4432 -273 -88 513 69 -67 164 -239 166 -199 5 140 -224 -294 28 -153 248 -52 -169 204 -274 155
4452 155 153 -393 -88 -294 -363 378 -116 -22 86 -276 21 -58 163 111 -451 152 -42 -309 393 44 -18 278
4474 278 -474 398 429 -299 170 217 -347 330 -177 10 135 -187 102 -113 95 153 -317 208 223 -363 361
4495 361 -39 -209 -49 -167 132 216 -450 313 -232 -186 136 -70 -83 -73 -178 129 -27 -138 218 -426 -71
4516 -71 117 -457 45 155 -543 1 -141 -171 236 -78 91 -300 -167 494 -18 122 -106 -63 188 -124 -85
4537 -85 218 -86 -161 455 -258 287 174 -419 44 -75 126 136 -134 222 20 -105 348 -252 -10 238 93
4558 93 190 34 -7 431 -480 11 185 -329 204 280 -271 146 -110 61 93 -23 56 -168 -198 420 -213 -25
$$ packed form
4410B33l34J19k00J0K73j33Q8J65n94M33k4r4M38m19J42l41M5N58j30o25N65m48
4432b73J85O01m44j36K31m03M05l65K04J35l64p0L22j81M01l00j17L73m78M29
4452A55kn46L05k06o9P41m94R4J08l62K97p9K21n2n62O03j94k67P02l49o2K96
4474B78p52Q72L1p28M69M7n64O77n07J87J25l22K89k15K08N8m70N25J5n86P24
4495C61m00j70J60j18K99Q4o66P63n45M6L22k06j3J0j05L07j56j11L56o44L55
4516g1J88n74N02J10o98N44j42l0M07l14J69l91J33O61n12J40k28M3K51l12L9
4537h5L03l04p5O16p13N45j13n93M63j19K01J0k70L56k02j25M53o00K42K48j45
4558I3R7j56m1M38r11M91J74n14N33P6n51M17k56J71L2j16P9k24l0O18o33J88
$$ plain form
4580 -25 292 -302 58 -215 -131 188 -437 -141 327 -492 11 25 -442 90 -189 -12 -10 -384 212 25 -285 287
4602 287 -202 -190 35 -326 101 -40 -273 218 -107 -369 273 -170 221 129 -215 92 -161 73 204 -243 248
4623 248 -61 -244 326 70 57 286 177 330 147 -171 445 -8 -92 152 -276 203 37 -96 88 -188 89
4644 89 252 -236 189 146 -354 289 -69 -125 159 -284 16 72 -383 320 -102 -59 63 -232 -54 92 -35 132
4666 132 -69 -85 186 -250 148 -115 -245 73 -102 -22 135 -205 164 137 -130 376 -129 -13 256 35 404
4687 404 161 -224 41 117 -40 286 2 -32 -89 -156 130 -135 121 207 -253 265 135 -234 174 -20 -151 542
4709 542 -16 62 290 -272 91 -69 -259 299 -149 47 -140 -81 306 -57 -311 149 -366 56 86 -258 76
4730 76 -41 -119 304 -269 -143 51 -220 35 -85 -199 14 -250 -102 38 -119 -105 -146 -215 189 -156 30 249
$$ packed form
4580b5L17n94L60k73Q4L19o25K96M68q19N03J4m67N32k79J77Kl74N96j87l10N72
4602B87m89J2K25l61M27j41k33M91l25k62O42m43L91r2l44L07k53K34J31m47M91
4623B48l09j83N70k56j3K29j09J53j83l18O16m53q4K44m28M79j66j33J84k76K77
4644H9J63m88M25m3n00O43l58n6K84m43L00N6m55P03m22M3J22k95J78J46j27J67
4666A32k01j6K71m36L98k63j30L18j75Q0J57l40L69k7k67N06n05J16K69k21L69
4687D04k43l85K65P6j57L26k84l4n7o7K86k65K56Q6m60N18j30l69M08j94j31O93
4709E42n58P8K28n62L63j60j90N58m48J96j87N9L87l63k54M60n15M22L0l44L34
4730G6j17p8M23n73J26J94k71K55j20j14K13k64J48J40j57J4m1o9M04l45J86K19
$$ plain form
4752 249 -432 37 -62 -345 175 -185 154 113 -64 189 86 89 201 -246 143 363 -197 210 58 -245 174
4773 174 -86 -1 160 -163 105 24 43 227 -151 -93 99 -189 -44 114 -130 430 -159 199 251 -404 202 -38
4795 -38 -185 169 25 -80 362 -198 212 -71 -182 169 -91 -17 306 -139 259 -71 -71 344 -185 22 361
4816 361 -345 -83 133 -300 220 -136 -67 214 66 -19 96 95 387 -13 84 -47 -139 8 -130 -226 323 32
4838 32 -52 338 -335 66 -21 -240 165 -68 -1 -26 -146 180 236 -73 -64 -68 -71 92 -84 21 -29 -14 100 -218 -197
4863 -197 250 -267 -9 162 -148 74 -58 -152 120 34 302 53 -53 109 114 -250 48 -102 -66 46 -43 133
4885 133 -166 -57 309 -128 63 139 -159 107 -123 -21 212 -276 132 -57 -112 152 61 221 429 -232 -44
4906 -44 6 -251 226 -37 -107 254 -300 -166 228 -96 236 -70 -57 68 -209 -221 252 -441 -133 -208 32 255
$$ packed form
4752B49o81M69r9k83N20l60L39m1j77K53j03LJ12m47L89K20n60M07j52l03M19
4773A74k60Q5J61l23K68q1J9J84l78N8J92k88J45J58k44N60n89L58N2o55O06k40
4795c8j47L54j44j05M42n60M10k83j11L51k60P4L23m45L98l30%M15n29K07L39
4816C61p06K62K16m33N20l56O9K81j48q5J15jK92m00R7j31r2J47j38r6N49k91
4838C2q4L90o73M01q7k19M05k33O7k5j20L26N6l09RmlJ63j76J05n0J5J14l18K1
4863a97M47n17K58J71l10K22j32r4K72q6K68k49j06J62Nl64K98j50L6J12q9J76
4885A33k99J09L66m37J91P6k98K66k30J02K33m88M08j89n5K64r1J60K08o61J88
4906d4N0k57M77k63p0L61n54J34L94l24L32l06J3J25k77j2M73o93L08p5K40K23
$$ plain form
4928 255 -276 -26 20 -404 204 104 -477 46 -91 -21 314 -226 156 -104 -59 121 -358 -222 156 -285 74
4949 74 92 -241 504 -380 28 70 -75 77 248 -199 129 -149 -163 0 157 201 -166 -368 295 -137 317 306
4971 306 -206 274 98 -48 484 -179 -124 179 -141 126 162 -353 195 -129 -58 76 -63 96 -24 -92 136
4992 136 -167 -60 225 -377 -34 -200 -335 378 -82 -110 365 -75 158 150 -108 -197 73 100 79 -102 58 -51
5014 -51 -210 59 -315 -38 272 -408 -103 264 -41 75 -47 36 67 -314 91 296 -195 -66 21 -206 38
5035 38 -64 237 31 -91 157 -34 44 241 -312 -79 49 -135 260 -81 -152 -23 -282 128 115 -244 17
5056 17 -23 -6 263 50 8 53 -247 155 -15 -298 261 -317 -31 150 0 31 -53 6 118 -230 78 333 -278
5079 -278 27 -64 -22 189 133 58 203 -187 356 106 -155 138 -230 -71 87 -49 102 -137 -131 282 -239 231
$$ packed form
4928B55n31K50M6m24O08j00n81N23j37P0L35n40L82k60M5J80m79J36L78m41L59
4949G4J8l33P45q84M08M2j45J52J71m47L28k78j4J63J57M4l67k02O63m32M54j1
4971C06n12M80j76j46N32o63N5L03l20K67L6n15N48l24P1J34j39J59j20o8K28
4992A36l03J07K85o02L43j66j35P13m60k8M75m40K33qk58q9K70K7k1j81J60j09
5014e1j59K69l74K77L10o80L05L67l05J16j22Q3L1l81M05K05m91J29Q7k27K44
5035C8j02L01k06j22K48j91P8J97n53K33J28j84L95l41p1J29k59M10j3l59K61
5056A7m0J7K69k13m2M5l00M02j70k83N59n78K86J81j50L1q4N9J12l48L08K55o11
5079b78L05r1M2K11n6p5J45l90N43k50k61K93l68J59J58j36J51k39OM13n21M70
$$ plain form
5101 231 -35 -194 84 -230 -133 297 -228 52 209 -133 164 41 -132 254 -206 -158 199 -44 117 -132 -198
5122 -198 -71 -210 131 -86 -255 3 98 -75 163 -53 -14 -36 -437 20 3 -184 192 80 -82 42 -44 337
5144 337 -69 -445 319 45 28 100 -173 134 213 258 392 114 -41 -77 -290 202 84 -99 323 -211 45 83
5166 83 -113 227 -26 -136 193 -91 -47 115 64 115 -121 82 197 -165 -215 265 -104 92 100 -26 314 -62
5188 -62 -60 236 -81 -53 28 -95 -28 -206 -91 48 -244 -107 -262 -268 65 -168 12 15 -418 74 251 -270 422
5211 422 -97 -271 161 -327 119 101 -177 57 9 -103 111 -216 67 214 -189 245 6 105 202 -319 -66
5232 -66 13 -84 165 -42 -187 135 -232 -15 210 -203 206 -42 -36 206 -177 145 -29 -284 218 127 -114 240
5254 240 19 -111 66 -13 71 -8 36 136 -18 171 241 -62 184 -156 -86 312 -322 67 184 -203 132 32
$$ packed form
5101B31k66j59K78l14R7M30n25K80J57l42K97j23j73L86m60M8L57k43J61k49o6
5122a98J27j39L41k17j69K58R5j73K38k16L9k2m01M57j7j87L76j12j62J24q6L81
5144C37m06l76P64k74j7P2k73L07P9M5J34k78j55l6k13M92j18j83M22n34K56L8
5166H3j96L40k53j10L29k84M4J62n1N1k36K03J15l62n0M80l69J96Qj26L40l76
5188f2KK96l17K8Q1j23O7j78J15J39k92J37j55oL33k33J80Lm33M92J77n21O92
5211D22n19j74M32m88M46j8k78K34m8j12K14l27K83J47m03M34k39R9R7n21K53
5232f6P9r7K49k07j45L22l67K17K25m13M09k48OK42l83L22j74k55N02r1k41L54
5254B40k21j30J77p9Q4p9M4J00j54J89P0l03K46l40P0L98o34L89J17l87L35j00
$$ plain form
5276 32 -73 268 -55 -208 199 -303 -259 -61 -19 57 -261 98 -13 -250 180 89 -162 201 89 1 68 -224
5298 -224 89 63 105 148 -13 40 174 32 83 106 -137 106 -121 -8 51 -273 118 23 -145 310 -73 59 245
5321 245 -71 -21 111 -250 119 -62 172 -53 15 -172 -55 -106 -16 -203 30 321 -120 171 -39 -190 189
5342 189 -124 -138 296 -31 40 6 -325 5 -235 11 212 -68 154 114 -222 416 -16 46 185 -196 167 86
5364 86 -214 78 1 -47 208 -224 -97 53 -275 40 183 146 210 -129 307 -89 -113 153 -371 -42 -4 -327
5386 -327 55 104 -181 26 -10 -163 298 -101 129 146 -75 160 -84 -101 71 -285 -11 202 -334 -60 -155 -272
5408 -272 136 -138 8 333 -42 195 -6 137 241 -270 61 41 -48 10 -70 21 143 -230 144 -230 -217 127
5430 127 -26 -117 219 -136 260 167 -179 39 49 -14 148 -142 -17 75 -101 146 -127 -168 -18 -118 -81 162
$$ packed form
5276C2j05L41l23j53M07n02M4J98M2P6l18L59j11k37M30r1k51L63j12q8O7k92
5298b24L13k6M2M3j61N3J34j42N1K3k43K43k27J13N9l24L91r5j68M55l83J32J86
5321B45l16N0J32l61L69j81K34k25O8j87J17n1R0j87K33K91m41K91k10j51L79
5342A89l13j4M34l27P1l4l31L30k40K46K01k80K22m0l36O38m32O2J39l81L63q1
5364H6l00K92p7m8K55m32J27J50l28L15J43l7O4l39M36l96k4K66n24L29L8l23
5386c27L82M9k85K07l6j53M61l99K30J7k21K35k44j7J72l56K74K13n36K74r5j17
5408b72M08k74J46L25l75K37k01J43J04n11L31k0q9N8q0R1J22l73L74l74J3L44
5430A27j53r1L36l55L96r3l46K18J0o3J62k90J25R2j76K47k73m1J50j00L7K43
$$ plain form
5452 162 -235 178 -11 -166 170 -123 75 121 -128 23 0 -212 84 -190 44 88 -195 162 -188 -175 249
5473 249 -191 113 277 -372 153 -204 -65 119 8 -269 76 22 -17 58 -149 125 -182 223 -7 -183 162
5494 162 -135 -108 339 -232 80 142 -360 112 45 25 124 -80 29 146 34 151 137 -38 217 -66 -2 -53 -126
5517 -126 283 -55 -115 34 -181 47 380 -414 -96 151 19 169 -43 128 -55 70 -7 84 -55 -81 -65 -40
5539 -40 46 -279 113 87 -228 416 -114 -106 51 22 147 55 -53 145 15 -222 -82 -184 -109 -148 -178 -20 -112 201
5563 201 260 -261 174 -102 -201 167 34 139 63 -156 -34 -47 155 47 -222 173 88 72 79 102 -292 64 -242
5586 -242 9 191 -151 16 64 -95 -16 69 112 345 -122 -38 -30 -154 67 -183 -85 144 -80 101 37 -312 -53
5609 -53 239 105 335 -281 71 -42 -238 276 -242 -49 -121 -126 24 36 42 16 -269 -177 189 -200 -48 126 -124
$$ packed form
5452A62l97M13j89j55L36k93J98M6k49J51k3k12K96k74K34M4k83L57l50J3M24
5473B49m40L04J64o49N25l57J39J84j11k77L45n4l9P5k07K74l07M05k30j76L45
5494A62k97K7M47n71L12O2n02M72o7k0R9k04J09J17j12J17j4j75K55k83O4n1p3
5517a26M09l38o0J49k15K28L33p94L18K47j32J50k12J71j83J25p7R1j39k6J6K5
5539d0Q6l25L92k6l15O44n30QJ57k9J25r2j08J98j30k37J40j02P5l9l0J58r2L13
5563B01N9n21M35k76r9L68j33J05p6k19J22j3K02j08k69L95q5j6PK3l94L56l06
5586b42K51J82l42J67M8j59P9Q5M3K33m67Q4Qj24K21k50R8K29k24J81o4l49K59
5609e3K92j34K30o16L52j13j96N14n18J93p2nJ50J2Ok6k85R2L66l89J52J74k50
$$ plain form
5632 -124 233 -178 -126 252 -259 -102 -48 -199 27 -259 82 -141 -195 5 -49 -14 74 -355 -54 139 -326 0
5654 0 168 -295 -90 103 -292 42 -263 48 21 -57 -90 64 -72 126 -235 65 -370 -174 126 -231 -196 201
5676 201 41 -132 -96 -368 225 -5 -67 267 -75 -1 -161 -101 270 -35 -43 172 -423 213 210 108 99 74 -128 200
5700 200 -204 66 205 -18 1 -94 -16 248 82 32 43 -291 235 35 -135 214 -255 -282 38 249 36 -206
5722 -206 -205 39 -60 1 119 -53 199 -186 39 123 -259 90 240 -249 102 -48 -265 -134 -131 -155 157 -215 74
5745 74 -89 80 115 30 -94 -98 -109 131 150 -299 255 -193 -168 304 -61 97 -130 -104 37 -165 -114 99 -208
5768 -208 227 -150 -227 40 -97 117 271 -66 71 -4 3 143 -7 100 10 100 131 26 -34 207 -75 78 13
5791 13 -325 216 162 -275 76 -197 -116 118 -158 79 89 -10 171 -157 -193 -6 -117 94 -16 -130 152 -120
$$ packed form
5632a24L57m11N2L78n11J57N4j51K26k86L41k23n4K00n4L5Q8m29L01J93m65L26
5654@J68m63K05J93l95L34l05L11k7p8l3J54j36J98l61L00m35J96L00l57L5L97
5676B01j60j73L6k72N93k30o2L34l42P4j60O0L71l05qK15n95O36lj02rk5k02L28
5700B00m04K70J39k23J9r5P8K64j66n0J1l34N26k00j70L49m69k7L20K11k13k42
5722b06JK44r9O1J18j72K52l85K25Q4l82L49J50m89L51j50k17J31Lk4L12l72K89
5745G4j63J69L5q5j24mj1K40J9m49N54m48K5M72l65J58k27K6J41k02N1K13l07
5768b08M35l77p7K67j37K14J54l37J37p5PJ40j50J07r0R0L1j05o0K41k82J53o5
5791A3l38N41n4m37L51k73Q1K34k76K37J0r9J81l28l6J87j11K11j10j14K82k72
$$ plain form
5813 -120 136 274 -152 -11 71 -232 -37 -36 -40 103 30 -23 47 -89 -155 75 -75 121 -231 49 -4 -221 213
5836 213 -182 -124 -47 -305 57 80 -228 160 14 -322 42 -173 145 100 18 -157 7 -58 -38 -2 182 143 -48
5859 -48 444 -56 0 151 -100 180 -14 88 138 -176 -95 190 21 46 138 -185 315 133 70 -28 -66 164 53
5882 53 9 190 -189 -307 77 -159 -1 258 -157 199 -7 117 294 13 -135 93 -85 36 112 -211 134
5903 134 66 110 163 -246 205 -94 -178 162 -113 -24 -97 -315 74 19 -94 228 109 5 133 -115 468 -105
5925 -105 -164 125 -150 173 -30 -71 78 36 -105 361 -93 59 199 -96 72 59 63 316 -47 -62 -86 25 229
5948 229 11 -163 58 -313 212 70 -270 36 -50 -127 -117 -18 -268 167 -112 125 -3 -9 184 52 16 153
5970 153 23 -158 -108 20 -21 -24 134 -41 -197 151 34 -149 1 3 112 78 -20 16 139 -75 -152 40 69 -7
$$ packed form
5813a20K56J38m26J41Q2l03J95JmJ43p3n3P0j36o6K30j50J96l52K80n3k17M34
5836B13l95N8P7k58L62K3l08L88j46l36L64k15L18m5q2j75J64o5K0L6J84l9j91
5859d8M92n00N6J51k51K80j94J02N0l14Q1K85j69K5R2l23N00j82o3r8l8K30j11
5882E3m4J81l79j18L84k36J58K59m15L56k06J24J77k81j48K28j78J21P6l23L45
5903A34o8M4N3m09M51k99q4L40k75Q9p3k18L89n5j13L22j19j04J28k48N83n73
5925a05n9K89k75L23k03m1J49m2j41M66m54J52J40k95J68j3MK53l63j5k4J11K04
5948B29k18j74K21l71N25j42l40L06q6p7J0R9k50M35k79K37j28oJ93j32l6J37
5970A53j30j81N0J28m1lJ58j75j56L48j17j83J50KJ09l4r8L6J23k14p7J92K9p6
$$ plain form
5994 -7 -172 105 -46 -350 60 -18 -112 234 -166 112 253 -239 166 -51 -15 129 -106 -42 139 -223 236 -16
6016 -16 -99 130 -242 -83 12 67 -15 -84 -85 181 -269 98 -56 -200 112 37 44 -37 -55 48 68 -4 153 -54 57
6041 57 102 -176 -114 78 -82 -31 10 -69 344 -182 -13 54 -57 222 2 -103 -12 -238 -89 57 -35 320 -156
6064 -156 -18 241 -158 23 -44 -19 -26 -123 -109 169 -83 -25 117 -196 6 -70 164 82 -183 -119 -32 -459 154 -88
6088 -88 -4 53 -121 -9 182 -80 -168 -47 -129 -99 80 111 -80 -96 -104 -104 -48 151 27 23 -116 -164 151 30 14 -43
6114 -43 -149 28 172 34 50 100 -120 77 -185 190 -115 -93 238 -63 -6 400 -12 -50 278 -469 202 15
6136 15 -234 -34 -202 -110 290 -81 69 78 -53 177 40 1 -9 -125 -38 147 -81 161 27 -113 269 -256
6158 -256 -141 95 -43 132 -330 -134 9 -160 104 -101 -128 30 27 187 72 21 84 92 -154 172 -25 11 -2
$$ packed form
5994gj65K77j51l04M10p8r4L46m00K78J41m92M05k17L6J44k35O4J81l62M59k52
6016a6q3K29l72J59R5N5q2o9jK66m50L67j54j44L12p5Pq1j8J03K0p2J57k07J11
6041E7M5k78O2J92j60N1M1p9M13n26J69O7j11K79k20j05R1k26J49J46r2L55m76
6064a56J38K59l99J81o7K5pr7J4K78k52N8J42l13K02p6K34q2k65O4Q7m27O13k42
6088h8Q4N7j74J12J91k62q8J21q2L0J79L1j91j6q%N6J99j24mj39m8L15j21j6n7
6114d3j06J77J44j38J6N0k20J97k62L75l05K2L31l01N7M06m12l8L28p47O71j87
6136A5k49K00j68R2M00l71J50Rj31K30j37l9j0j16Q7J85k28K42j34j40L82n25
6158b56J15K36j38J75m62J96J43j69K64k05k7J58lJ60j15n1O3Qk46L26j97L6j3
$$ plain form
6181 -2 -140 27 -40 36 244 -62 107 312 -36 215 -213 -165 226 -166 -41 240 -223 269 150 -22 -67 -65 -28
6204 -28 103 128 127 135 10 -146 -301 33 141 -118 83 -25 -200 20 -139 -110 287 -386 82 195 138 274 -63
6227 -63 -9 246 67 227 103 -270 359 -164 -25 -34 -32 51 -110 77 114 83 12 -42 -64 32 -84 -255 199 -30
6251 -30 -22 181 -94 180 -45 -202 65 54 -103 151 30 -15 103 -142 -6 -34 -47 1 -124 101 -31 -255 113
6274 113 -263 -94 -47 -65 42 153 -76 195 -137 -117 80 -51 28 70 -211 51 50 25 -63 -190 285 9 -202
6297 -202 222 -49 -215 128 -10 51 219 -145 -63 251 -204 187 76 53 -9 -268 281 11 -5 205 -79 71
6319 71 101 -209 0 203 -143 85 -194 -281 85 17 -214 -73 52 201 -171 -57 18 92 42 -55 -103 194 -27
6342 -27 -37 12 -171 283 -63 -90 39 -71 -7 -115 23 198 -136 -17 147 -235 -100 -3 -262 48 116 17 155
$$ packed form
6181bj38J67o7P6K08l06J69K05l48K51m28M8L91l92J25K81m63M92j19j72m5KL7
6204b8J31K5jQj25j56j55L34J08k59K01j08j75K20j59K9L97o73M68J13n7J36l37
6227f3N4K55j79J60j24l73O29n23J39rKQ3j61J87L7l1p1n4k2R6j16j71M54k29
6251c0QK03k75K74k25j57K67j1j57K54j21m5J18k45J36k8j3M8j25K25j32k24L68
6274A13l76J69M7j8J07J11k29K71l32K0J97j31P9M2k81K62jk5q8j27M75k76k11
6297b02M24k71j66L43j38O1J68l64Q2L14m55L91j11k3o2k59N49k70j6K10k84J50
6319G1L0l10K09K03l46K28k79q7L66o8k31J41J25J49l72J14P5P4n0r7m8K97k21
6342b7j0M9j83M54l46k7J29j10O4j08J38J75l34J19J64l82J35R7k59L10O8r9J38
$$ plain form
6365 155 51 38 245 -268 131 -262 -176 -1 143 -33 -87 -44 228 157 -34 85 -134 -78 55 -362 151 117
6387 117 9 80 -64 -28 180 -178 -9 100 10 164 -112 -101 -18 -118 -134 -52 -200 85 10 117 112 -278 13
6410 13 124 -188 109 154 -22 68 56 -146 -101 -111 0 -20 -149 -18 -10 104 137 -117 234 -105 -140 53 -199 -10
6434 -10 103 -325 -7 -36 -249 2 29 208 24 -75 -56 -247 -226 183 -74 99 -219 -181 -89 5 31 -45 110 -14
6458 -14 140 -167 63 188 96 147 -207 44 26 -216 143 -69 -209 -78 -279 -119 44 -84 362 25 173
6479 173 250 164 75 95 -11 156 39 -101 131 -30 28 78 -56 8 -214 53 167 24 73 -149 -266 78 -156
6502 -156 -76 123 -227 -44 -11 -32 117 -151 -62 26 -80 165 -99 10 -66 -58 -67 218 -160 -96 54 -37 254 -122
6526 -122 -156 61 -113 -113 -88 -99 -25 -71 34 205 -213 -63 194 -159 167 -163 -153 308 23 33 225 -181 146
$$ packed form
6365A55j04j3K07n13L99l93Q6J75J44j76n4M3K72p1j91J19k19N6J33m17N13l4
6387A17j08P1j44L6K08l58J69J09r0J54k76J1Q3j00j6Q2j48K85p5J07nl90K91
6410A3J11l12K97M5j76R0j2k02M5j0J11k0j29J31QJ14L3k54L51l39l5J93k52J89
6434a0J13m28L18k9k13K51K7J79j84r9J9j91K1M09k57J73l18L8R2R4K6p6J55j24
6458a4J54l07K30J25r2N1l54K51j8k42L59k12j40J31k01J60J63j28M46l37J48
6479A73P7q6q9K0j06J67j17j40K32j61N8N0j34O4k22K67J14j43M9k22j17L44k34
6502a56Q0J99l50J83L3k1J49k68Q9Q8j06K45k64J09p6QrK85l78O4J50r1K91l76
6526a22l4K17j74%K5j1P4m6J05J71m18J50K57l53L26l30J0M61k85J0J92m06L27
$$ plain form
6549 146 82 39 156 -57 5 -72 -131 322 -20 -17 -67 55 64 0 137 -65 -28 -85 115 181 19 189 -236 -98 300
6574 300 -133 65 130 -103 6 -32 151 178 -69 47 -93 167 -9 -79 124 -98 -82 37 -6 12 216 -262
6596 -262 -55 -7 -139 -12 -126 -51 25 -41 106 -104 46 150 -59 -10 -145 -51 -163 -153 -24 9 -13 46 -26 -38
6620 -38 163 -219 -19 77 -159 32 48 45 252 -33 -52 156 52 143 174 41 132 17 -284 229 -73 14 284
6643 284 -221 1 14 55 118 -189 119 76 189 121 315 -148 311 83 56 188 -116 -113 -44 -98 213 37 -14 -107
6667 -107 -244 3 0 2 60 -222 73 317 -202 259 11 -327 113 -141 25 -84 32 -315 37 -128 135 -70
6689 -70 -92 219 -17 92 -177 -28 195 -95 -219 236 -174 88 6 -114 160 79 140 59 -109 131 -110 -117 53
6712 53 -193 -175 -140 -68 -140 57 12 -58 23 -19 169 -25 -189 230 -204 184 -35 -209 173 -4 -41 -94 -155 57
$$ packed form
6549A46o4m3J17k13O2p7n9M53l42Ln0J22Ro4J37k02L7n7K00O6j62J70m25J38L98
6574C00m33J98O5k33J09l8J83K7k47J16j40K60j76p0K03k22J6J19m3J8K04m78
6596b62K07M8j32J27j14P5P6o6J47k10J50J04k09M9j35R4j12J0J29L3k2N9p2j2
6620c8K01l82K00R6k36J91J6lK07k85j9K08j04R1L1j33R1j15l01N13l02Q7K70
6643B84n05K22J3M1O3l07L08m3J13o8J94m63M59k28k7J32l04LO9n4L11j76n1r3
6667a07j37K47lKN8k82K95K44n19M61k48l38M40k54J66j09J16l47L52j65K63k05
6689g0k2L11k36J09k69J49K23k90j24M55m10K62q2j20K74q1O1q1j68K40k41pJ70
6712E3k46J8L5P2p2J97m5p0Q1m2J88j94j64M19m34L88k19j74L82j77l7n3o1K12
$$ plain form
6736 57 -131 -146 279 26 -67 57 81 -4 29 -205 156 -222 316 -51 -135 -65 -14 -140 221 -236 -40 184 -139
6759 -139 126 -196 187 -51 -115 -131 54 -278 -41 -39 -87 333 -17 116 76 -64 176 -62 -212 223 -56 -44
6781 -44 151 -153 30 187 80 95 -32 -29 225 -148 154 -63 -17 133 -58 -204 -199 -128 -86 63 -269 135 -91
6804 -91 -52 225 -188 -181 204 -39 136 -33 -108 -22 -194 -89 -93 -141 92 -6 71 205 -153 174 141 -120 218 -54
6828 -54 -71 154 -120 94 -294 -211 58 -192 87 320 186 -192 64 49 20 32 99 111 9 -237 8 -338 190
6851 190 -148 -129 120 -98 260 -58 125 100 11 -45 375 -131 -11 27 -188 312 -68 54 249 -100 58 287
6873 287 -148 73 49 -58 -95 36 83 38 -87 235 -21 117 205 -145 -70 24 -20 352 214 170 308 -198 -77
6896 -77 -91 -148 60 -122 -48 135 -102 136 -86 -93 175 -141 7 24 -51 -173 165 -218 71 68 59 107 -88 -55 338
$$ packed form
6736E7j88j5M25k53r3J24K4q5L3k34L61l78N38l67q4P0N1j26L61m57J96K24l23
6759a39K65l22L83k38o4j6J85l32K37Km8M20l50J33m0j40K40k38j50M35k79J2
6781d4J95l04J83J57j07J5j27LK54l73L02k17M6J50j91j46NP1M2J49l32M04k26
6804i1L9K77m13PL85k43J75j69p5Q6j72J05mm8K33r8P7J34l58L27l3k61L38k72
6828e4j7K25k74K14l88Q3K69k50K79K33j34l78K56j5k9J2O7J2j02k46K45l46N28
6851A90l38J9K49k18L58l18J83k5q9n6M20n06J20L8k15N00l80J22J95l49J58K29
6873B87m35K21k4j07l7J31M7m5j25L22k56J38Q8l50P5R4m4L72j38m4J38n06J21
6896g7j4n7K08j82P4J83k37K38k22pK68l16J48J7p5j22L38l83K89lrM8j95L3L93
$$ plain form
6921 338 51 -3 4 1 5 -119 -37 90 -100 203 -113 -92 222 -19 -173 180 106 25 104 -170 13 -81 180 -36
6945 -36 5 76 -158 -40 167 -49 21 -169 -30 -24 -6 -316 -23 -169 -20 3 27 -143 -157 -67 162 -120 -119 129
6969 129 -246 176 -95 0 122 -194 -25 98 131 127 305 -6 -123 -233 -128 210 -126 147 -105 -24 225 -192
6991 -192 -25 89 -84 55 -115 -101 30 -48 -158 147 -273 -118 -78 -25 93 80 -138 104 -58 33 -19 -106 137
7014 137 -5 49 54 -80 -59 -164 -74 251 151 -51 77 -70 175 75 -101 312 -90 -9 -114 -58 1 135 -93
7037 -93 117 -299 80 99 -202 137 107 -33 44 -1 -148 -48 -119 182 -63 -15 12 -83 -98 -163 -139 -60 79 -239
7061 -239 -161 -21 6 -79 -261 50 83 -166 51 -169 -102 308 -143 118 199 -315 -29 -150 62 44 23 -92 -93
7084 -93 -42 126 33 44 227 21 336 50 -149 97 119 19 33 -395 103 163 -241 -48 -110 -110 -113 -27 103 96 -268
$$ packed form
6921C38k87n4PlMj24Q2J27j90L03l16K1L14k41j54L53p4q1P9k74J83r4K61k16
6945c6M1P1k34J18K07k16P0j90J39OJ8l10K93j46J49K3K4j70j4R0K29k82JK48
6969A29l75M22k71R5J22l16J69J23L3mJ78l11j17j10J05L38l36K73k52Q1K49m17
6991a92J67J14j73J39j70J4J31p8j10L05m20J55M0N3J18j3k18K42j62R1n2q7K43
7014A37j42N4Nj34K1j05R0L25j00k02J28j47K45j00j76M13m02Q1j05N6N9J34k28
7037i3K10m16L79J9l01L39l0j40P7m5j47J00p1L01k45M8K7r5j5o5K4P9J39l18
7061b39P8J40K7q5j82L11L3k49K17k20O7M10m51K61Q1n14K86j21K12j8k1j15j
7084i3N1J68r3J1J83k06L15k86j99K46K2j00J4m28M98O0m04J93o2%lQ6J30pl64
$$ plain form
7109 -268 132 17 65 5 -230 159 11 -221 91 9 119 362 -8 -92 43 -103 176 20 -190 251 -61
7130 -61 53 134 -73 16 127 -8 18 -195 -25 234 -249 -65 -79 -62 140 -94 176 19 -15 104 -56 99
7152 99 -51 -72 116 46 -239 -27 86 29 8 -84 -154 160 -57 124 151 -52 109 -110 138 -133 -30 105 26
7175 26 59 169 -64 -91 334 -95 111 123 -125 25 -19 -124 166 -66 34 -26 -111 140 -111 152 174 -60 84
7198 84 105 -174 124 -151 160 280 -133 79 130 -55 -54 -11 -20 283 -95 103 63 -213 193 -116 132 253 -226
7221 -226 -33 -124 42 220 81 -65 119 83 -101 63 -99 23 -109 -83 34 -48 209 -3 52 57 -90 17
7243 17 4 -62 -32 309 -177 113 -39 -31 -54 -174 94 317 -152 -31 -64 -79 116 -167 169 45 -51 134 -66
7266 -66 61 36 -306 44 40 -196 87 -121 -117 332 -137 41 -69 -57 -68 -117 -123 -2 12 -105 66 215 128 -25
$$ packed form
7109b68M00j15M8o0k35L89j48k32L12q2J10K43l70q4J35j46K79j56k10M41l12
7130f1J14Q1k07Q9J11j35K6k13J70K59m83J84j4J7K02k34K70j57l4J19j60J55
7152I9j50k1J88p0k85K12J13n7k1r2p0L14k17J81K7k03J61k19K48k71J03J35p9
7175B6L3J10k33k7M25m29K06J2k48J50m4j05K90k32J00o0q5K51k51K63K2k34J44
7198H4K1k79K98k75L11J20m13K12N1j85JM3rL03l78J98m0k76M06l09K48J21m79
7221b26J93r1J66J78j39j46J84l6j84J64j62J22j32K6J17q2K57k12N5Nj47J07
7243A7j3o6L0L41m86K90j52Qk3j20K68K23m69J21l3j5J95k83L36j24r6J85k00
7266f6J27k5l42L50mk36K83k08MM49m69J78j10J2j1m9oJ21J4j17J71J49q7j53
$$ plain form
7290 -25 -140 131 -35 138 48 103 132 187 56 316 181 175 171 -167 191 130 -32 88 -270 56 208 -20 132
7313 132 167 -66 70 132 198 80 59 68 -28 -60 121 23 -222 -204 -77 157 -222 153 -90 -252 46 104 39 16
7337 16 -214 -87 28 -47 -144 44 -185 339 82 -81 -26 -184 22 78 -85 -9 -104 -258 327 -138 -47 -1 -110
7360 -110 -47 -293 -180 140 -267 140 -18 -249 7 227 -272 181 -288 -32 53 -65 14 61 96 102 -123 -88 234
7383 234 -111 33 65 104 -45 -191 67 78 -202 52 297 -197 153 85 203 83 71 51 -59 51 286 -38
7405 -38 -144 0 -59 21 -67 -136 142 -85 -4 108 -89 235 -44 183 -14 -288 -22 24 -35 -56 134 185 44
7428 44 10 108 49 -93 -40 198 -295 56 58 -58 5 8 83 -202 -174 -79 -287 16 -66 -90 138 -25 -6 141 18
7453 18 12 145 -252 112 4 36 24 -102 -15 261 18 55 -11 -58 123 58 166 194 -27 -79 167 -234 392 -12
$$ packed form
7290b5j15K71j66J73r0N5K9N5j31K60j35oml38L58o1j62J20l58L26J52k28J52
7313A32L5k33J36O2O6j18k1Rr6l2J81r8k45J8J27K34l79L75k43j62K98N8o5k3
7337A6k30J27J15p5r7J88k29N24k57j63N5j58K06N6j63P6r5j54N85m65R1M6j09
7360a10O3k46J13L20m07M07j58k31K56K20m99M53m69K56Q5j18P9M7L5Ok25L5L22
7383B34l45J44L2L9j49j46K58J1k80K54K45m94L50o8J18j20j2k0j10J10K35l24
7405c8j06J44n9Q0q8o9K78k27Q1J12j97L24k79K27j97k74K66M6n9k1J90N1j41
7428D4l4R8n9j42N3K38m93L51Kj16O3LP5k85K8R5k08L03q2k4K28j63J9J47j23
7453A8oJ33l97L64j08L2j2j26Q7K76k43L7o6m7J81o5J08K8k21n2K46m01O26m04
$$ plain form
7477 -12 -1 131 -248 -63 7 -272 21 48 -78 -44 108 212 172 -56 -86 -209 198 333 11 18 12 -105 233 21
7501 21 -162 -37 -147 -134 25 -202 305 -24 -48 140 -83 46 66 -57 -139 -59 -72 180 -12 19 151 -95 -19
7524 -19 11 -137 154 -283 127 173 -304 -76 -116 -242 229 -60 -191 81 3 245 -196 -76 266 35 104 134
7546 134 -95 142 94 52 -30 -10 13 3 14 -66 -22 -100 172 -57 56 176 -64 126 -40 101 192 42 -21 83
7570 83 -132 107 -44 -125 44 2 -158 1 -123 11 113 -76 187 -215 -203 65 -16 -16 221 23 -282 -67
7592 -67 -55 84 -326 -90 45 -252 288 16 -125 -41 -51 112 -136 -8 237 -153 0 -4 -164 117 112 -7 -3
7615 -3 -194 100 194 -179 -10 -23 -136 59 -3 64 24 -7 -24 119 -150 10 -145 -13 24 -143 232 10 -62 235
7639 235 5 -1 262 -131 154 162 59 -99 -96 -208 -92 -47 26 117 -298 100 -265 -116 58 -89 113 44 -96
$$ packed form
7477a2J1J32l79J85P0k79K93K7j26L4J52J04m0k28l0j23M07J35l22Poj17L38k12
7501B1j83J25j10J3J59k27N07l29k4J88k23J29K0j23q2Q0j3K52j92L1J32k46P6
7524a9L0j48K91m37M10M6m77K28m0j26M71k89j31K72p8K42m41J20L42k31O9L0
7546A34k29K37m8m2q2K0K3j0J1q0M4p8K72k29J13J20k40J90j66J41R1j50o3J04
7570H3k15K39j51q1J69m2j60J59j24J34J02j89K63m02J2K68q1%K37j98l05K15
7592f7J2J39m10K36J35k97N40k72j41Q4j0J63k48J28K45l90J53mj60K81nj19M
7615cj91K94R4l73J69j3j13J95o2O7m0l1j7J43k69J60j55J32L7j67L75k22p2K97
7639B35k30oK63l93K85Qj03j58Lj12J16M5P3R1m15L98l65J49J74j47K02o9j40
$$ plain form
7662 -96 -11 -96 -160 127 -12 -108 105 -315 -106 59 44 183 -174 33 26 -144 175 15 -91 50 130 208 -19
7685 -19 -292 -20 -107 -52 53 -81 -205 -13 -165 171 32 -3 148 -72 -12 157 -181 175 21 -282 126 -161
7707 -161 -72 190 -389 56 8 -181 -71 66 125 -118 -81 271 166 52 161 -304 3 247 -191 59 107 -226
7729 -226 255 -128 140 -16 -139 84 -106 -107 46 17 -13 137 -222 307 91 -126 296 -299 -86 110 7
7750 7 107 -82 -84 -89 -24 -2 213 -129 154 -185 -71 122 -91 -36 113 -40 79 -126 -239 54 18 -99 45
7773 45 1 195 -18 -123 136 6 123 63 31 236 -51 -35 174 -104 140 14 9 171 158 -61 222 -185 -208
7796 -208 -142 -117 111 -44 38 83 -63 119 -112 -110 93 51 -132 64 -138 -106 45 -58 -68 4 -76 16 -145 -134
7820 -134 93 -5 11 14 -19 13 -36 -140 71 -184 50 167 -120 -37 5 -17 67 -131 167 230 90 -160 -164 135 72
$$ packed form
7662i6Q5q5o4K87j39r6K13m20K09J65j5J39l57K07pj70L19j60j06J41Q0P8k27
7685a9k73K72q7N5J05j34j24J92j52L36j39l5J51k20O0J69l38L56j54l03M08k87
7707a61Q9K62n79M45m8j89J10J37N9k43L7L52j05j14J09m65L07K44m38K50M8l33
7729b26M81l83K68j56j23K23j90jJ53k9l0J50l59N29k16k17M22n95K13J96j03
7750GJ00j89knO5K2K15l42K83l39J14J93k13N5J49j53J19k05j13K93l6j17J44
7773D5m4J94k13j05K59j30J17o0l2K05k87J6K09k78K44j26nJ62j3k19K83m07k3
7796b08O6K5K28j55Q2M5j46J82k31KK03m2j83J96k02L2J51j03j0P2q0R2j61J1
7820a34K27r8J6Ll3L2m9j04K11k55K34J17k87Q3M2k2Q4j98K98O3j40k50mK99o3
$$ plain form
7845 72 208 137 116 -82 131 -148 -43 217 -47 32 101 -308 31 10 -150 147 -37 23 99 36 128 -27 -86 41
7869 41 8 129 -19 -260 202 111 -134 149 -162 7 -62 -108 -221 -79 -57 211 -163 138 93 -46 183 -243
7891 -243 -56 100 104 -69 119 -84 247 54 -140 3 282 -26 -18 -186 190 -27 -12 151 -135 42 82 75 151
7914 151 -68 129 220 -73 157 55 -54 177 -197 -25 308 -3 -46 76 27 178 140 167 97 -115 140 244
7936 244 208 115 -133 -12 -4 -107 431 126 -24 85 40 9 249 41 298 207 -252 -41 -86 -191 391 -85 -78
7959 -78 161 -369 6 48 -183 -60 -149 22 21 4 -58 -77 32 -51 -164 81 -70 -144 -29 -188 187 190 -174 36
7983 36 -27 -180 117 63 -264 -54 -74 33 -21 -79 79 3 -114 86 -99 157 29 -183 332 -103 -112 167 -88
8006 -88 -30 243 5 -53 188 -183 111 251 -14 -66 51 82 -54 20 -108 72 86 190 -231 14 161 94 196
$$ packed form
7845G2J36p1k1j98K13k79J05K60k64P9O9m09L39k1j60K97j84O0P6o3R2j55n9J27
7869D1l3J21j48k41M62r1k45K83l11J69o9m6j13J42K2K68l74L01m5j39K29m26
7891b43J87J56Mj73J88k03L31j93j94J43K79l08Qj68L76k17J5J63k86J77M0pP6
7914A51k19J97R1k93K30j02j09K31l74J72L33l11m3J22m9J51l8K7p0k12K55J04
7936B44l6r3k48J21Qj03N38l05j50J09m5l1K40k08K57r1m59K11m5j05N82m76P
7959g8K39n30L75M2k31J23q9J71jj7o2j9J09q3j13K45j51p4J15j59L75Ll64K10
7983C6o3j53K97n4l27K10k0J07n4n8J58p6j17K00j85K56j28k12N15m35rK79k55
8006h8N8K73k38n8K41l71K94J40k65n2J17L1j36P4j28J80J4J04m21K45J47o7J02
$$ plain form
8029 196 -57 -55 330 -164 63 41 -196 264 -15 161 -179 -124 -116 100 -161 112 226 -53 83 -181 -153 -107 -137
8052 -137 186 -57 58 154 -97 11 -23 -173 77 -95 232 -46 -143 -70 30 -177 98 107 55 86 -143 181 -211
8075 -211 124 124 -30 128 91 17 -102 2 76 197 127 121 128 -261 107 27 -192 115 -183 -120 120 24 157 73 21
8100 21 217 24 35 237 23 -88 -37 37 69 -89 -126 217 -24 19 -76 -117 153 -20 -150 109 -45 76 38
8123 38 -84 47 -136 -27 226 -83 12 72 1 217 -104 -18 76 107 170 129 -101 76 -185 -87 60 -31 103 -48
8147 -48 62 102 18 115 -80 -154 14 87 -72 27 40 33 259 -207 -182 68 -248 30 110 -47 150 -136 -151 76
8171 76 -48 -55 28 -211 -250 -21 10 221 -329 73 9 29 116 -175 -89 189 -75 168 91 -15
$$ packed form
8029A96k53KL85m94K27k2k37M60k79J76l40N5QK16k61K73J14k79J36k64K8M6l0
8052a37L23k43J15R6k51J08l4j50K50j72L27k78r7P3J00k07K75Rn2L1k29L24l92
8075b11L35%j54J58l7p4j19J04P4J21p0oPl89L68q0k19L07k98O3K40r6J33q4n2
8100B1J96j93J1K02k14j11N1P4L2j58l7L43k41M3r5m1K70j73j30K59j54J21l8
8123C8j22J31j83J09K53l09R5O0p1K16l21Q6R4L1O3m1k30J77k61R8J47r1J34j51
8147d8J10M0q4R7j95p4J68P3j59R9J3pK26m66K5K50l16K78Q0j57J97k86j5K27
8171G6j24pQ3k39l9K29L1K11n50M02o4K0Q7k91Q6K78k64K43p7j06
8191a5
$$ Imaginary data points
##PAGE= N=2
##DATA TABLE= (X++(I..I)), XYDATA
$$ plain form
0 0 0 0 0 0 0 0 0 0 0 0 0 0 8 -8 8 -8 11 -16 16 -21 24 -32 32 -40 48 -56 64 -72 83 -96 109 -124 140 -158
34 -158 179 -200 225 -250 280 -313 346 -384 424 -470 518 -572 630 -694 766 -843 928 -1022
52 -1022 1129 -1248 1382 -1531 1704 -1906 2143 -2426 2770 -3202 3758 -4505 5556 -7145 9801
67 9801 -15010 28805 -136185 -293502 147769 -36320 -179527 113249 -21295 -285732 -66242
78 -66242 55690 -91654 -74896 -15564 -164752 -149578 -5417 -17117 -38277 -102606 -153875
89 -153875 -30325 -64350 -62183 84346 -107010 -199761 44257 -14039 -80353 85020 -26269
100 -26269 -168772 1096 69213 -27564 34194 38630 -117552 -12123 112076 -11189 58280
111 58280 67658 -128290 34428 139215 -35635 80307 98951 -124163 10551 165259 9417
$$ packed form
0@%%%%%%%%%%%%Qj6J6j6J9k7L2l7M5n6O4p2Q8j04J20j36J55j79K05k33K64k98
34a58L37l79M25m75N30n93O59p30Q08q94R88j090J202j324J460j609J771j950
52a022K151k377K630k913L235l610M049m569N196n972O960q263J0061j2701J6946
67I801k4811M3815j64990j57317M41271j84089j43207K92776j34544k64437K19490
78f6242J21932j47344J6758N9332j49188J5174J44161j1700k1160o4329n1269
89a53875J23550l4025K167J46529j91356r2751K44018n8296o6314J65373j11289
100b6269j42503J69868O8117r6777O1758M436j56182J05429J24199j23265O9469
111E8280R378j95948J62718J04787j74850J15942J8644k23114J34714J54708j55842
$$ plain form
122 9417 5029 104534 -34369 -74451 135325 98651 -50773 45005 19302 -62611 66364 76554
134 76554 11957 15 -59774 17489 61008 -28407 50579 34554 -124986 -8232 107461
145 107461 -31369 -37509 67783 -57746 -110182 104986 58499 -112851 35015 19477 -123166
156 -123166 55595 84265 -70782 -6902 4700 -48938 29215 44407 -5909 -12462 -20087 -14036
168 -14036 34309 45035 -11709 -2036 12266 -41353 40254 81569 -41758 2317 39235 -50425
180 -50425 38095 77652 -27959 -395 17114 -19457 30082 45993 -1425 -10150 4448 -8945
192 -8945 12131 53090 -14047 -30604 33314 -31524 -11812 76143 -32881 -47072 38800 -31640
204 -31640 -21298 49173 -14954 -44975 -4497 -3596 -16961 3633 6935 -40710 -26303 4330 -21776
$$ packed form
122I417m388R9505j38903m0082K09776l6674j49424R5778k5703q1913J28975J0190
134G6554o4597j1942n9789P7263M3519q9415P8986j6025j59540J16754J15693
145A07461j38830o140J05292j25529n2436K15168m6487j71350J47866j5538j42643
156a23166J78761K8670j55047O3880J1602n3638P8153J5192n0316o553p625O051
168a4036M8345J0726n6744R673J4302n3619Q1607M1315j23327M4075L6918q9660
180e0425Q8520L9557j05611K7564J7509l6571M9539J5911m7418q725J4598j3393
192h945K1076M0959o7137j6557O3918o4838J9712Q7955j09024j4191Q5872p0440
204c1640J0342P0471o4127l0021M0478R01j3365K0594L302m7645J4407L0633k6106
$$ plain form
217 -21776 6538 -2668 -48415 -1069 -13706 -29786 30952 -19510 -46927 11348 -18233 -21350
229 -21350 20431 -8750 -31816 -10692 4970 -11005 -4255 17211 -26979 -20617 24665 -14807
241 -14807 546 23129 -29963 -1339 17591 -13649 19096 8785 -17467 10138 6003 3756
253 3756 13346 7311 1264 -5342 16277 13784 -5260 24145 1853 -14258 30381 4132 -1806
266 -1806 27328 -8358 754 20022 -1624 13164 8661 -3044 8378 1949 10362 6282 -1252
279 -1252 10703 -7642 3155 15897 -11653 8147 5852 -16945 13427 674 -9652 11716
291 11716 -9842 -4922 5928 -8710 3221 -4044 -7560 2312 -11483 2420 -326 -14920 6037
304 6037 -8792 -10451 8524 -13791 -3363 2483 -15899 3695 -4135 -10686 5461 -11124 -3337
$$ packed form
217b1776K8314r206m5747M7346j2637j6080O0738n0462k7417N8275k9581l117
229b1350M1781k9181k3066K1124J5662j5975O750K1466m4190O362M5282l9472
241a4807J5353K2583n3092K8624J8930l1240L2745j0311k6252K7605m135k247
253C756R590o035o047o606K1619k493j9044K9405k2292j6111M4639k6249n938
266a806K9134l5686R112J9268k1646J4788m503j1705J1422o429Q413m080p534
279a252J1955j8345J0797J2742k7550J9800k295k2797L0372j2753j0326K1368
291A1716k1558M920J0850j4638J1931p265l516R872j3795J3903k746j4594K0957
304F037j4829j659J8975k2315J0428N846j8382J9594p830o551J6147j6585P787
$$ plain form
317 -3337 2324 -11503 4339 -4753 -8056 6969 -10707 409 4856 -12077 6826 -1761 -7366
330 -7366 9895 -7055 655 6748 -9253 8101 392 -5047 11366 -5512 2570 9098 -7498
343 -7498 9944 2857 -3804 12606 -3192 3655 9872 -5650 10612 3221 -2775 13597 -3318
356 -3318 3759 11137 -6159 10046 4563 -4263 12394 -2345 1667 9537 -5783 7425 2304 -3916
370 -3916 9799 -5468 1542 6610 -9802 7039 -142 -9453 9216 -7338 -4826 6651 -11492
383 -11492 122 -86 -10326 2568 -7400 -4770 -176 -11478 1449 -6609 -10385 5583 -13564
396 -13564 -5400 4732 -17151 1313 629 -15562 5009 -4890 -9761 4749 -6539 -2244 -378
409 -378 -4161 2596 -5744 3249 3329 -9484 11093 400 -7116 17470 -4383 -2760 18201 -5894
$$ packed form
317c337N661j3827J5842r092l303J5025j7676J1116M447j6933J8903q587n605
330g366J7261j6950P710O093j6001J7354p709n439J6413j6878Q082O528j6596
343g498J7442p087o661J6410j5798O847O217j5522J6262p391n996J6372j6915
356c318P077P378j7296J6205n483q826J6657j4739M012P870j5320J3208n121o220
370c916J3715j5267P010N068j6412J6841p181r311J8669j6554K512J1477j8143
383a1492J1614k08j0240J2894r968K630M594j1302J2927q058l776J5968j9147
396a3564Q164J0132k1883J8464o84j6191K0571r899m871J4510j1288M295J866
409c78l783O757q340Q993Q0j2813K0577j0693p516K4586k1853J623K0961k4095
$$ plain form
423 -5894 5146 15640 -4774 7883 10178 2064 8703 7894 8606 1986 7509 14857 -2970 12570
437 12570 14673 -10351 17105 12435 -9285 20785 5195 -9071 17978 2431 -1980 13309 -598
450 -598 -2685 4263 4460 -1103 -63 6977 -11852 -3662 13989 -16457 -799 11957 -27805 89
464 89 12944 -24939 1834 4434 -26425 -3099 4011 -14212 -8549 -1707 -13963 -17310 5399 -5443
478 -5443 -20532 4508 -14595 -22448 15047 -12766 -17406 11236 -24385 -13317 17016 -16251 -8847
491 -8847 7388 -19292 -10132 12117 -1919 -12773 4610 -3017 -19158 16514 11303 -22565 13743
504 13743 1300 -24441 29203 9829 -21773 22055 -1803 -19203 30374 13361 -15821 11488
516 11488 9947 -14513 14049 31875 -14351 -5934 25188 -14347 4343 37175 -13718 -5785 16506
$$ packed form
423e894J1040J0494k0414J2657K295q114O639q09P12o620N523P348j7827J5540
437A2570K103k5024K7456m670k1720L0070j5590j4266K7049j5547m411J5289j3907
450e98k087O948J97n563J040P040j8829Q190J7651l0446J5658J2756l9762K7894
464H9J2855l7883K6773K600l0859K3326P110j8223N663O842j2256l347K2709j0842
478e443j5089K5040j9103p853L7495k7813m640K8642l5621J1068L0333l3267P404
491h847J6235k6680R160K2249j4036j0854J7383p627j6141L5672n211l3868L6308
504A3743j2443k5741N3644j9374l1602M3828k3858j7400M9577j7013k9182K7309
516A1488j541k4460K8562J7826m6226Q417L1122l9535J8690L2832n0893P933K2291
$$ plain form
529 16506 -12050 15220 19586 -12572 7117 -1234 -13068 23942 13735 -17967 2416 8479 -20759
542 -20759 7902 36954 -25611 -22068 32667 -22586 -13662 51271 -20750 -35592 29345 -9511
554 -9511 -13885 33400 -4526 -28772 5829 6441 -4369 16828 5780 -25001 2861 10563 -6544
567 -6544 27160 4462 -32181 18005 8214 -10381 38068 1802 -29701 18571 8787 -1212 29810
580 29810 4240 -21152 8339 13538 773 24973 10190 -32730 10901 23202 -20212 30259
592 30259 21533 -55453 9914 35117 -31484 16158 28044 -49800 -17054 34668 -8834 -15796
604 -15796 17676 -22018 -41421 18186 11116 -23215 -968 -21176 -30419 5763 -5749 -1989 -3995
617 -3995 -47544 -11590 13545 -26942 2408 9078 -52072 -24203 27483 -11380 -21758 18207
$$ packed form
529A6506k8556K7270M366l2158J9689q351j1834L7010j0207l1702K0383O063k9238
542b0759K8661K9052o2565L543N4735n5253Q924O4933p2021j4842O4937l8856
554i511m374M7285l7926k4246L4601O12j0810K1197j1048l0781K7862P702j7107
567f544L3704k2698l6643N0186r791j8595M8449l6266l1503M8272r784r999L1022
580B9810k5570k5392K9491N199j2765K4200j4783m2920M3631J2301m3414N0471
592C0259q726p6986O5367K5203o6601M7642J1886p7844L2746N1722m3502o962
604a5796L3472l9694j9403N9607p070l4331K2247k0208r243L6182j1512L760k006
617c995m3549L5954K5135m0487K9350O670o1150K7869N1686l8863j0378L9965
$$ plain form
629 18207 -23895 -47471 30756 17017 -34441 15924 -5049 -42995 27122 22561 -17723 12439
641 12439 -7400 -22525 26188 21267 -3399 10765 -832 -17176 23324 36584 -6514 5912
653 5912 16362 -21154 19555 46239 -7310 4550 13524 -15941 23096 32559 -440 9210 -1743
666 -1743 -11452 25180 24790 -3978 4554 3725 -20500 12623 40365 -15739 -13818 21487 -27099 -5588
680 -5588 48580 -14508 -26392 15509 -16678 -9869 29164 -667 -24100 -6802 -4176 -5099 12896
693 12896 4286 -21505 -8923 -6241 -6931 22276 -3325 -26658 5969 -12051 -11615 32050 -4952
706 -4952 -28040 6630 -5914 -8436 22156 5160 -22553 -6561 6150 -4464 11456 14047 -22289
719 -22289 -8117 10890 -7940 16403 12811 -25805 192 7005 -8899 19797 8473 -21800
$$ packed form
629A8207m2102k3576P8227j3739n1458N0365k0973l7946P0117m561m0284L0162
641A2439j9839j5125M8713m921k4666J4164j1597j6344M0500J3260m3098J2426
653E912J0450l7516M0709K6684n3549J1860Q974k9465L9037R463l2999R650j0953
666a743r709L6632l90k8768Q532q29k4225L3123K7742n6104J921L5305m8586K1511
680e588N4168o3088j1884M1901l2187O809L9033k9831k3433J7298K626r23J7995
693A2896q610k5791J2582K682o90K9207k5601k3333L2627j8020M36M3665l7002
706d952k3088L4670j2544k522L0592j6996k7713J5992J2711j0614J5920K591l6336
719b2289J4172J9007j8830K4343l592l8616K5997O813j5904K8696j1324l0273
$$ plain form
731 -21800 -2822 6082 -1665 8967 10719 -13923 -14364 11523 1744 -176 15986 -15033 -16145 14779
745 14779 -3123 2881 14340 -17992 -9693 9403 -2124 6557 6775 -11535 -9821 4045 6534
758 6534 743 5585 -4149 -16131 8012 8518 -4705 10999 -6964 -16142 13164 2948 -1577 11723
772 11723 -9702 -10189 8710 4377 2004 3784 -2581 -9145 770 12700 -1342 -834 4139 -13126
786 -13126 2339 13009 -5566 4069 40 -13320 6935 6068 -2583 4707 -4526 -6991 2064 5044
800 5044 2180 -3979 -59 -3795 -6067 10464 1147 -7445 3826 -6931 -3004 9567 -3349 -10
814 -10 -526 -8625 4357 2894 -2290 2716 -4061 -3557 673 3050 3070 -5696 915 906 -7561 8048 3624
831 3624 -8845 4159 -1352 -4315 6635 -514 -606 -295 -3939 4165 222 -638 3664 -4189 -306
$$ packed form
731b1800J8978Q904p747J0632J752k4642m41K5887r779j920J6162l1019j112L0924
745A4779j7902O004J1459l2332Q299J9096j1527Q681K18j8310J714J3866K489
758F534n791M842r734j1982K4143N06j3223J5704j7963r178K9306j0216m525J3300
772A1723k1425m87J8899m333k373J780o365o564R915J1930j4042N08M973j7265
786a3126J5465J0670j8575R635m029j3360K0255q67q651P290r233k465R055K980
800E044k864o159L920l736k272J6531r317q592J1271j0757L927J2571j2916L339
814a0n16q099J2982j463n184N006o777N04M230K377K0q766O611rq467J5609m424
831C624j2469J3004n511k963J0950p149r2L11l644Q104l943q60M302p853L883
$$ plain form
846 -306 1626 -95 4397 -3645 -288 3857 -6101 4413 4241 -7334 3300 545 -3380 4278 -861
861 -861 503 -490 -3221 4705 -1520 -1387 4657 -4195 433 2475 -2382 3443 -1924 -976 4020 -4942
877 -4942 2745 3592 -5594 3620 911 -3098 3842 -1385 565 1460 -2743 3936 -1331 -1791 4473 -3439
893 -3439 727 2639 -3318 3138 -1120 -1469 4306 -4300 1067 3288 -5158 3008 824 -3581 2605
908 2605 -2043 -319 1235 -3137 2566 -2075 -2187 3541 -4096 530 1707 -5006 2743 -1228 -3444
923 -3444 4193 -4229 -1010 3092 -4963 1519 1038 -3675 1781 -1664 272 764 -2573 2995 -2187 -1487
939 -1487 4858 -4236 1186 3992 -5487 4046 1750 -3655 5362 -656 -1272 4533 -1344 1858 2304 77
955 77 2677 -749 3600 1698 -1929 6307 -1207 -1797 8018 -3485 259 7442 -4863 1943 4798
$$ packed form
846c06J932j721M492q042L357M145r958J0514j72j1575J0634k755l925P658n139
861h61J364r93k731P926o225J33O044q852M628K042m857N825n367R48M996q962
877d942P687Q47r186R214k709m009O940n227J950Q95m203O679n267m60O264p912
893c439M166J912n957O456m258l49N775q606N367K221q446Q166k184m405O186
908B605m648J724J554m372N703m641j12N728p637M626J177o713P749l971k216
923c444P637q422L219M102q055O482m81m713N456l445J936M92l337N568n182P00
939a487O345r094N422K806r479R533k296n405R017o018o16N805n877L202M46k227
955G7K600l426M349j902l627Q236p514n90R815j1503L744P183j2305O806K855
$$ plain form
970 4798 -4055 2704 1398 -1523 1140 -112 1059 -1653 123 1917 -4817 2366 1407 -6602 4816
985 4816 -1489 -7008 6092 -4234 -5279 5453 -5612 -3547 3011 -4655 -2690 345 -2089 -3871
999 -3871 -1583 1828 -6204 -1435 4132 -9418 424 4531 -10452 2697 3049 -10196 3969 1331
1013 1331 -7126 3319 -6 -3920 1374 1119 -1575 -1463 3479 -1878 -2995 6963 -3218 -2774 9210
1028 9210 -6303 -773 10416 -7396 1198 8710 -7511 2524 7569 -4784 928 5960 -1676
1041 -1676 -1786 6757 1410 -5786 7529 2100 -8351 10447 1688 -9173 10196 -270 -6815 10517
1055 10517 -1717 -5125 7058 -1764 -1974 5485 55 -3381 2463 2272 -4729 3788 4752 -9403 4232
1070 4232 5691 -11070 7912 5715 -13927 7535 4640 -11330 7770 4427 -10429 2640 4890
$$ packed form
970D798q853O759j306k921K663j252J171k712J776J794o734P183r59q009J1418
985D816o305n519J3100j0326j045J0732j1065K065O558p666J965L035k434j782
999c871K288L411q032M769N567j3550R842M107j4983J3149L52j3245J4165k638
1013A331q457J0445l325l914N294k55k694J12M942n357j117R958j0181M44J1984
1028I210j5513N530J1189j7812Q594P512j6221J0035N045j2353N712N032p636
1041a676j10Q543n347p196J3315n429j0451J8798q759j0861J9369j0466o545J7332
1055A0517j2234l408J2183q822k10P459n430l436N844j91p001Q517R64j4155J3635
1070D232J459j6761J8982k197j9642K1462k895j5970J9100l343j4856J3069K250
$$ plain form
1083 4890 -5945 753 6995 -6628 -5066 9613 -4782 -4146 11025 -8550 -5301 11230 -7623
1096 -7623 -901 9231 -10309 -1672 7294 -5727 1421 4892 -6679 -2932 5765 -1308 -2919 6774
1110 6774 -4217 -8871 10695 -1426 -7876 12618 -6749 -11235 14921 -3129 -7658 12516 -6169
1123 -6169 -10643 10419 2121 -7413 5313 1798 -11566 3509 10040 -9312 909 6360 -13319
1136 -13319 3581 9647 -9009 3320 782 -11221 7078 3341 -5949 4839 -3007 -8934 5785
1149 5785 5286 -6104 944 3301 -11741 1105 14247 -10333 -3200 10003 -15014 -218 17043
1162 17043 -10401 -3175 7602 -11024 317 12261 -3805 -4558 3428 -3936 -2902 11388 1434
1175 1434 -9136 5680 -1895 -6385 15527 656 -10510 8256 -3681 -4229 14892 -681 -6503
$$ packed form
1083D890j0835O698O242j3623J562J4679j4395O36J5171j9575L249J6531j8853
1096g623O722J0132j9540Q637Q966j3021P148L471j1571L747Q697p073j611R693
1110F774j0991m654J9566j2121o450K0494j9367m486K6156j8050m529K0174j8685
1123f169m474K1062q298r534J2726l515j3364J5075O531j9352J0221N451j9679
1136a3319J6900O066j8656J2329k538j2003J8299l737r290J0788p846n927J4719
1149E785m99j1390P048K357j5042J2846J3142k4580P133J3203k5017J4796J7261
1162A7043k7444P226J0777j8626J1341J1944j6066p53P986p364J034J4290r954
1175A434j0570J4816p575m490K1912j4871j1166J8766j1937n48J9121j5573n822
$$ plain form
1188 -6503 4430 -2998 -215 10267 2038 -5540 772 647 -3192 10298 5513 -11876 3549 2703
1202 2703 -9155 14152 5867 -15932 4829 2601 -8576 11097 5350 -11733 -1565 3432 -3426
1215 -3426 3050 7380 -8722 -8029 6164 -3322 859 9410 -11590 -6133 6809 -6733 4330 7665
1229 7665 -13020 -3600 4176 -4292 3707 4983 -7857 -7189 3373 1497 -1087 6430 -4595 -10808
1243 -10808 6509 1393 -1823 9408 -7463 -8841 8627 -1564 1405 8914 -7943 -6466 6379
1256 6379 1957 594 5681 -1788 -9531 4094 8602 -3610 4717 2566 -12275 5275 8840 -4222
1270 -4222 5855 -310 -9497 5330 5102 26 3689 -2358 -5302 1839 6131 1599 -474 945 -6222
1285 -6222 -1075 9486 -1516 -454 2831 -9518 1593 8155 -3671 2731 -437 -8781 3049
$$ packed form
1188f503J0933p428K783J0482q229p578O312j25l839J3490m785j7389J5425q46
1202B703j1858K3307q285k1799K0761k228j1177J9673n747j7083J0168M997o858
1215c426O476M330j6102O93J4193r486M181Q551k1000N457J2942j3542J1063L335
1229G665k0685R420P776q468P999J276j2840O68J0562j876k584P517j1025o213
1243a0808J7317n116l216J1231j6871j378J7468j0191K969P509j6857J477J2845
1256F379m422j363N087p469p743J3625M508j2212Q327k151j4841J7550L565j3062
1270d222J0077o165r187J4827k28n076L663o047k944P141M292m532k073J419p167
1285f222N147J0561j1002J062L285j2349J1111O562j1826O402l168q344J1830
$$ plain form
1298 3049 4974 -1163 338 -1078 -5341 -1783 7289 1049 -5632 2776 -4287 -6154 10138 538 -6793
1313 -6793 2999 -4842 -3455 6619 126 -2408 -1966 -3795 374 1817 1848 -1677 -3987 -1417 -2582
1328 -2582 3361 3031 -5954 103 -1112 -5723 6718 1731 -6357 1694 -2739 -2797 5059 601 -2037
1343 -2037 -1567 -1938 363 1202 2799 -1315 -3663 2115 -1817 1428 5598 -4971 -809 2922 -4128
1358 -4128 3926 4414 -4367 27 662 -137 2473 1406 981 -2255 -575 3848 -192 2152 1574 -3262
1374 -3262 2257 830 607 4717 -2953 -741 3348 -2740 2722 3682 -3078 342 978 374 1350 449
1390 449 1666 -2489 -753 4049 -1859 598 2268 -3704 1333 1249 -1258 2870 -1937 -1423 2569 -2190
1406 -2190 1022 2056 -2622 230 -54 316 455 -1226 2063 -1880 -2134 3508 -2125 -817 2481 -3170
$$ packed form
1298C049J925o137J501j416m263L558R072o240o681Q408p063j867J6292r600p331
1313f793R792p841J387J0074o493k534M42j829M169J443L1l525k310K570j165
1328b582N943l30q985O057j215m611J2441m987q088Q051m433n8P856m458k638
1343b037M70l71K301Q39J597m114k348N778l932L245M170j0569M162L731p050
1358d128Q054M88q781M394O35p99K610j067m25l236J680M423m040K344n78m836
1374c262N519j427k23M110p670K212M089o088N462R60o760L420O36o04R76r01
1390D49J217m155J736M802n908K457J670n972N037q4k507M128m807N14L992m759
1406b190L212J034m678K852k84L70J39j681L289l943k54N642n633J308L298n651
$$ plain form
1422 -3170 427 1022 -2008 1844 -1646 -1381 1755 -2386 290 933 -2226 469 -744 -253 356 -2140
1438 -2140 1516 -1165 -2521 2827 -2287 -1616 2255 -2978 -129 898 -2654 712 -1133 -1227 1006 -2355
1454 -2355 76 344 -1944 1026 -934 -160 372 -2473 1937 72 -2559 3007 -1550 -1412 3307 -1556
1470 -1556 290 2138 -1500 1668 794 124 2074 -797 1324 1049 -241 2804 -430 597 2291 -1769
1486 -1769 3042 2004 -2057 3735 156 -1409 4086 -179 -320 2131 -781 873 920 735 1076 -1388
1502 -1388 1440 -3 -1566 2845 -1779 -1166 2305 -3253 767 1492 -3927 1229 -392 -3435 1556
1517 1556 -1180 -2269 -127 -1647 -1065 -1417 -399 -615 -3492 1155 -1346 -3715 2788 -2272 -3369 2799
1533 2799 -3119 -1457 2764 -3308 -655 939 -1994 532 443 -450 -748 -258 1373 -1561 1369 2006
$$ packed form
1422c170L597N95l030L852l490K65L136m141K676O43l159K695j213M91O09k496
1438b140L656k681j356N348n114O71L871n233K849J027l552L366j845r4K233l361
1454b355K431K68k288K970j960P74N32k845M410j865k631N566m557J38M719m863
1470a556J846J848l638L168q74o70J950k871K121k75j290L045l234J027J694m060
1486a769M811j038m061N792l579j565N495m265j41K451k912J654M7j85L41k464
1502a388K828j443j563M411m624O13L471n558M020P25n419N156j621l043M991
1517A556k736j089K142j520N82l52J018k16k877M647k501k369O503n060j097O168
1533B799n918J662M221o072K653J594k933K526q9q93k98M90J631k934K930O37
$$ plain form
1549 2006 -3089 2660 1822 -3195 4438 768 -2931 4505 -44 -1065 4236 -304 -481 2543 789
1564 789 39 1251 2355 -1000 324 3825 -2176 726 4531 -3781 945 4122 -4017 1972 2927 -3517
1580 -3517 1796 1336 -2039 1355 840 -1229 -428 1033 -582 -1753 2426 -1423 -2540 3775 -2268 -2409
1596 -2409 4278 -3868 -1901 4347 -4021 -964 3464 -3421 -1017 2407 -1588 -1774 1573 -209 -3357
1611 -3357 1668 1297 -4582 2376 1393 -5386 3481 575 -4875 4015 -674 -3729 3296 -770 -2227
1626 -2227 2399 -659 -1628 1208 722 -1927 738 2281 -3689 822 3687 -4723 1463 3705 -6092
1641 -6092 2218 3763 -5582 2260 2752 -4585 1448 2544 -2795 243 2581 -1869 -1891 3903 -826 -2855
1657 -2855 4603 -1810 -2661 5398 -2340 -1632 4881 -3476 -521 4417 -2733 153 2943 -2510 -107
$$ packed form
1549B006n095N749q38n017P633l670l699P436m549j021N301m540j77L024j754
1564G89p50J212J104l355J324L501o001K902L805q312M726L177q139N989R55o444
1580c517N313m60l375L394n15k069Q01J461j615j171M179l849j117O315o043j41
1596b409O687q146J967O248q368L057M428o885K404L424l995j86L347j782l148
1611c357N025l71n879O958r83o779Q867k906n450Q890m689l055P025m066j457
1626b227M626l058r69K836m86k649K665J543n970M511K865q410O186K242r797
1641f092Q310J545r345P842M92p337O033J096n339L038K338m450k2N794m729k029
1657b855P458o413q51Q059p738P08O513q357K955M938p150K886K790n453K403
$$ plain form
1672 -107 2940 -830 -1439 2919 -398 -3116 4375 655 -4803 4965 35 -5363 6145 144 -5158
1687 -5158 4727 -719 -3819 4146 621 -3262 1242 883 -2672 881 2899 -3536 -496 3212 -4087
1702 -4087 963 3731 -5132 813 2184 -4787 2753 2208 -4818 1756 930 -3286 1992 1798 -2967 -787
1718 -787 2402 -2253 -750 4419 -3365 -2830 4838 -3033 -1212 5968 -4291 -2075 4747 -3375 -134
1733 -134 4156 -3140 -1564 2395 -891 -852 2808 -416 -3753 2550 1388 -3146 3967 21 -5224 4024
1749 4024 397 -3118 4495 -1428 -3466 3278 -156 -1130 2754 -752 -2873 935 1893 -1676 1133
1764 1133 1708 -4280 832 3745 -3438 2100 2080 -5492 2519 2828 -3028 2819 729 -3918 1977 2251
1780 2251 -996 861 1420 -2441 -665 4272 -985 -1426 3928 -3404 -1530 6018 -2023 -879 3736
$$ packed form
1672a07L047l770o09M358l317k718P491l720n458R768m930n398J1508o001n302
1687e158R885n446l100P965l525l883M504l59l555L553K018o435L040L708p299
1702d087N050K768q863N945J371o971P540n45p026O574q26m216N278j94m765K180
1718g87L189m655J503N169p784N35P668p871J821P180j0259K216O822q122L241
1733a34M290p296J576L959l286L9L660l224l337O303j162m534P113l946n245R248
1749D024l627l515P613n923k038O744l434r74L884l506k121L808R58l569K809
1764A133N75n988N112K913p183N538k0p572Q011L09n856N847k090m647N895K74
1780B251l247J857N59l861J776M937n257m41N354p332J874P548q041J144M615
$$ plain form
1795 3736 -3693 -437 4418 -1026 -142 1048 -1602 -766 2151 1418 -1577 340 -196 -2445 3034 1006
1811 1006 -3190 2018 -1522 -2683 4484 -921 -2249 2346 -2968 -1722 3566 -548 -1744 362 -1021
1826 -1021 -2071 1759 2302 -3281 -802 1597 -4063 1523 3167 -4629 59 935 -3250 2169 1705 -2686
1842 -2686 -392 -376 -781 929 1032 -790 -1627 229 -46 -313 2399 -1594 -2170 1750 -1984 497 2730
1859 2730 -3328 -327 1192 -2312 2310 1980 -2493 -776 223 -201 354 1760 -8 -2746 1189 842
1875 842 -1637 2790 -111 -3555 2457 -117 -828 2835 -1121 -1564 1137 -124 978 1136 -211 -682
1891 -682 -405 1692 458 222 1401 -1770 257 2350 -699 1918 940 -3000 2052 886 -218 2607
1907 2607 -296 -1185 1344 626 773 469 474 -375 -947 2084 351 -630 1910 -1351 -779 2675 -1296 406
$$ packed form
1795C736p429L256M855n444Q84J190k650Q36K917p33k995J917n36k249N479k028
1811A006m196N208l540j161P167n405j328M595n314J246N288m114j196K106j383
1826a021j050L830N43n583K479K399n660N586J644p796M688Q76m185N419m64m391
1842b686K294J6m05J710J03j822q37J856k75k67K712l993n76L920l734K481K233
1859B730o058L001J519l504M622l30m473J717R99m24N55J406j768k738L935l47
1875H42k479M427k901l444O012k574p11L663l956m43K701j261J102J58j347m71
1891f82K77K097j234k36J179l171K027K093l049K617r78l940N052j166j104K825
1907B607k903q89K529p18J47l04Nq49n72L031j733r81K540l261N72L454l971J702
$$ plain form
1925 406 1124 -2212 523 1081 -652 841 -441 -723 -63 -282 636 -974 -284 58 -1924 1274 177
1942 177 -1865 1182 -1242 -1536 1544 -1072 -848 489 -1989 -361 234 -695 225 -995 -518 -180 -777
1959 -777 620 -1011 -774 715 -1843 637 697 -1981 959 -487 -1501 1519 -750 -635 756 -1016
1975 -1016 275 362 -383 401 -584 360 8 -608 1367 -818 -653 1352 -1334 721 1274 -1688 1287
1992 1287 438 -1193 1214 -102 -628 883 -338 269 132 117 729 -579 863 484 -1029 1473 -281
2009 -281 -648 2068 -956 -50 1579 -1060 699 955 -800 749 36 30 690 -335 763 -351 -105
2026 -105 834 -771 903 662 -1182 1637 -63 -1031 1881 -546 -525 1390 -918 351 770 -954 -85
2043 -85 -320 22 250 -376 516 -735 -529 1160 -1153 241 1010 -2067 761 565 -1553 1219 -388
$$ packed form
1925D06P18l336K735N58j733J493j282k82O60k19R18j610O90L42j982L198j097
1942A77k042L047k424k94L080k616K24J337k478J628N95r29R20j220M77L38n97
1959g77J397j631K37J489k558K480O0k678K940j446j014L020k269J15J391j772
1975a016J291Q7p45P84r85R44l52o16J975k185J65K005k686K055N53k962K975
1992A287q49j631K407j316n26J511j221O07j37j5O12j308J442l79j513K502j754
2009b81l67K716l024R06J629k639J759K56j755J549p13oO60j025J098j114K46
2026a05R39j605J674k41j844K819j700r68K912k427K1J915k308J269M19j724Q69
2043h5k35L42K28o26Q92j251K06J689k313J394P69l077K828j96k118K772j607
$$ plain form
2060 -388 -1329 1053 -435 -319 308 -414 -231 -447 457 211 -554 989 -1049 -893 1582 -1165 -269 1301
2078 1301 -2087 534 1335 -1503 1169 219 -1111 666 319 157 114 76 374 -721 1066 705 -1105
2095 -1105 1480 -183 -1340 2342 -553 -786 1895 -1404 -80 1481 -837 79 378 -446 27 66 850
2112 850 -449 -41 898 -1330 843 1222 -1800 1088 560 -2099 1789 266 -1708 1235 -688 -822
2128 -822 937 -229 -592 -226 -59 -337 -376 1058 -911 -780 1474 -1587 -16 1705 -2041 35 1379
2145 1379 -2257 821 940 -1488 503 200 -921 285 353 -211 -797 613 -102 -1117 1725 -626 -1716
2162 -1716 1964 -909 -1002 2280 -1251 -703 1762 -1147 -137 1269 -706 -392 589 -110 -609 428 822
$$ packed form
2060c88r41K382j488J16O27p22J83k16R04k46p65J543k038J56K475k747Q96J570
2078A301l388K621Q01k838K672r50j330J777l47j62m3l8K98j095J787l61j810
2095a105K585j663j157L682k895k33K681l299J324J561k318R16K99q24M73L9P84
2112H50j299M08R39k228K173L79l022K888n28k659L888j523j974K943j923j34
2128h22J759j166l63L66J67k78l9J434j969J31K254l061J571J721l746K076J344
2145A379l636L078J19k428J991l03j121J206O8n64n86J410p15j015K842k351j090
2162a716L680k873r3L282l531N48K465k909J010J406j975L14R81o99m99J037L94
$$ [...]
8191I2
##END NTUPLES=NMR FID
##END=
