##TITLE=1H_58-2021
 CDCl3, 8 sc, 
 29.07.2021
##JCAMPDX= 6.0         $$ Bruker NMR JCAMP-DX V2.0
##DATA TYPE= NMR FID
##DATA CLASS= NTUPLES
##ORIGIN= UXNMR, Bruker Analytische Messtechnik GmbH
##OWNER= root
$$ XWIN-NMR		Version 3.5
$$ Thu Jul 29 11:11:57 2021 Russian Standard Time (UT+4h)  she@DPX200
##.OBSERVE FREQUENCY= 200.131506
##.OBSERVE NUCLEUS= ^1H
##.DELAY= (6, 6)
##.ACQUISITION MODE= SIMULTANEOUS
##.ACQUISITION SCHEME= undefined
##.AVERAGES= 8
##.DIGITISER RES= 18
##SPECTROMETER/DATA SYSTEM= spect
##.PULSE SEQUENCE= zg30
##.SOLVENT NAME= CDCl3
##.SHIFT REFERENCE= (INTERNAL, CDCl3, 0, 15.7039)
##AUDIT TRAIL= $$ (NUMBER, WHEN, WHO, WHERE, WHAT)
$$ ##TITLE= Audit trail, XWIN-NMR		Version 3.5
$$ ##JCAMPDX= 5.01
$$ ##ORIGIN= Bruker BioSpin GmbH
$$ ##OWNER= she
$$ F:/spectra/data/she/nmr/H-F/1/audita.txt
$$ ##AUDIT TRAIL=  $$ (NUMBER, WHEN, WHO, WHERE, WHAT)
(   1,<2021-07-29 11:10:37.46 +0400>,<she>,<DPX200>,
      <created by zg, POWCHK disabled, PULCHK disabled
       configuration hash MD5:
       00 E9 B6 7A A2 85 ED C7 34 08 36 98 17 FE 4E 26
       data hash MD5: 16K
       C2 EE 95 52 02 8D 6D 21 A5 C8 C7 2C 85 44 5B C1>)
$$ ##END=
$$ 
$$ hash MD5
$$ CB 06 59 34 28 25 B2 0D 13 27 C7 8B 05 40 28 D3
##$RELAX= 
##$RELAX= 
##$RELAX= 
##$RELAX= 
##$RELAX= 
##$RELAX= 
$$ Bruker specific parameters
$$ --------------------------
##$DU= <F:/spectra>
##$EXPNO= 1
##$NAME= <H-F>
##$PROCNO= 1
##$TYPE= <nmr>
##$USER= <she>
##$AMP= (0..31)
100 100 100 100 100 100 100 100 100 100 100 100 100 100 100 100 100 100 
100 100 100 100 100 100 100 100 100 100 100 100 100 100 
##$AQSEQ= 0
##$AQ_mod= 1
##$AUNM= <au_zg>
##$AUTOPOS= <>
##$BF1= 200.13
##$BF2= 200.13
##$BF3= 200.13
##$BF4= 200.13
##$BF5= 200.13
##$BF6= 200.13
##$BF7= 200.13
##$BF8= 200.13
##$BYTORDA= 1
##$CFDGTYP= 0
##$CFRGTYP= 5
##$CHEMSTR= <none>
##$CNST= (0..31)
1 1 145 1 1 1 1 1 1 1 1 1 1 1 1 1 1 1 1 1 1 1 1 1 1 1 1 1 1 1 1 1 
##$CPDPRG= <>
##$CPDPRG1= <>
##$CPDPRG2= <>
##$CPDPRG3= <>
##$CPDPRG4= <mlev>
##$CPDPRG5= <mlev>
##$CPDPRG6= <mlev>
##$CPDPRG7= <mlev>
##$CPDPRG8= <mlev>
##$CPDPRGB= <>
##$CPDPRGT= <>
##$D= (0..31)
0 1.2 0 0 0 0 0 0 0 0.06 0 0.03 0 0 0 0 0.0002 0 0 0 0 0 0 0 0 0 0 0 0 
0 0 0 
##$DATE= 1627542636
##$DBL= (0..7)
120 120 120 120 120 120 120 120 
##$DBP= (0..7)
150 150 150 150 150 150 150 150 
##$DBP07= 0
##$DBPNAM0= <>
##$DBPNAM1= <>
##$DBPNAM2= <>
##$DBPNAM3= <>
##$DBPNAM4= <>
##$DBPNAM5= <>
##$DBPNAM6= <>
##$DBPNAM7= <>
##$DBPOAL= (0..7)
0.5 0.5 0.5 0.5 0.5 0.5 0.5 0.5 
##$DBPOFFS= (0..7)
0 0 0 0 0 0 0 0 
##$DE= 6
##$DECBNUC= <off>
##$DECIM= 32
##$DECNUC= <off>
##$DECSTAT= 4
##$DIGMOD= 1
##$DIGTYP= 9
##$DL= (0..7)
0 120 120 120 120 120 120 120 
##$DP= (0..7)
150 150 150 150 150 150 150 150 
##$DP07= 0
##$DPNAME0= <>
##$DPNAME1= <>
##$DPNAME2= <>
##$DPNAME3= <>
##$DPNAME4= <>
##$DPNAME5= <>
##$DPNAME6= <>
##$DPNAME7= <>
##$DPOAL= (0..7)
0.5 0.5 0.5 0.5 0.5 0.5 0.5 0.5 
##$DPOFFS= (0..7)
0 0 0 0 0 0 0 0 
##$DQDMODE= 0
##$DR= 18
##$DS= 0
##$DSLIST= <SSSSSSSSSSSSSSS>
$$ [...]
##$SUBNAM2= <"">
##$SUBNAM3= <"">
##$SUBNAM4= <"">
##$SUBNAM5= <"">
##$SUBNAM6= <"">
##$SUBNAM7= <"">
##$SUBNAM8= <"">
##$SUBNAM9= <"">
##$SW= 20.0188882624521
##$SWIBOX= (0..15)
0 0 2 0 0 0 0 0 0 0 0 0 0 0 0 0 
##$SW_h= 4006.41025641026
##$TD= 16384
##$TD0= 1
##$TE= 0
##$TE2= 300
##$TE3= 300
##$TEG= 300
##$TL= (0..7)
0 120 120 120 120 120 120 120 
##$TP= (0..7)
150 150 150 150 150 150 150 150 
##$TP07= 0
##$TPNAME0= <>
##$TPNAME1= <>
##$TPNAME2= <>
##$TPNAME3= <>
##$TPNAME4= <>
##$TPNAME5= <>
##$TPNAME6= <>
##$TPNAME7= <>
##$TPOAL= (0..7)
0.5 0.5 0.5 0.5 0.5 0.5 0.5 0.5 
##$TPOFFS= (0..7)
0 0 0 0 0 0 0 0 
##$TUNHIN= 0
##$TUNHOUT= 0
##$TUNXOUT= 0
##$USERA1= <user>
##$USERA2= <user>
##$USERA3= <user>
##$USERA4= <user>
##$USERA5= <user>
##$V9= 5
##$VALIST= <valist>
##$VCLIST= <CCCCCCCCCCCCCCC>
##$VD= 0
##$VDLIST= <DDDDDDDDDDDDDDD>
##$VPLIST= <PPPPPPPPPPPPPPP>
##$VTLIST= <TTTTTTTTTTTTTTT>
##$WBST= 1024
##$WBSW= 4
##$XGAIN= (0..3)
0 0 0 0 
##$XL= 0
##$YL= 0
##$YMAX_a= 495854
##$YMIN_a= -576116
##$ZGOPTNS= <>
##$ZL1= 120
##$ZL2= 120
##$ZL3= 120
##$ZL4= 120
##$ABSF1= 10
##$ABSF2= 0
##$ABSG= 5
##$ABSL= 3
##$ALPHA= 0
##$AQORDER= 0
##$ASSFAC= 0
##$ASSFACI= 0
##$ASSFACX= 0
##$ASSWID= 0
##$AUNMP= <proc_1d>
##$AZFE= 0.1
##$AZFW= 0.1
##$BCFW= 1
##$BC_mod= 2
##$BYTORDP= 1
##$COROFFS= 0
##$CY= 11.3945322036743
##$DATMOD= 1
##$DC= 2
##$DFILT= <>
##$DTYPP= 0
##$F1P= 2.36226072786647
##$F2P= -0.459571619588291
##$FCOR= 0.5
##$FTSIZE= 0
##$FT_mod= 4
##$GAMMA= 1
##$GB= 0.15
##$INTBC= 1
##$INTSCL= 1
##$ISEN= 128
##$LB= 0.24
##$LEV0= 0
##$LPBIN= 0
##$MAXI= 10000
##$MC2= 0
##$MEAN= 0
##$ME_mod= 0
##$MI= 1.114404
##$NCOEF= 0
##$NC_proc= 0
##$NLEV= 6
##$NOISF1= 3.799351
##$NOISF2= 2.8
##$NSP= 1
##$NTH_PI= 0
##$NZP= 0
##$OFFSET= 15.70392
##$PC= 1
##$PHC0= -12995.62
##$PHC1= 11.60099
##$PH_mod= 1
##$PKNL= yes
##$PPARMOD= 0
##$PSCAL= 0
##$PSIGN= 0
##$REVERSE= no
##$SF= 200.130013532006
##$SI= 16384
##$SIGF1= 3
##$SIGF2= 2
##$SINO= 400
##$SIOLD= 16384
##$SREGLST= <1H.CDCl3>
##$SSB= 0
##$STSI= 0
##$STSR= 0
##$SW_p= 3612.71676300578
##$SYMM= 0
##$S_DEV= 0
##$TDeff= 0
##$TDoff= 0
##$TI= <>
##$TILT= no
##$TM1= 0
##$TM2= 0
##$TOPLEV= 0
##$USERP1= <user>
##$USERP2= <user>
##$USERP3= <user>
##$USERP4= <user>
##$USERP5= <user>
##$WDW= 1
##$XDIM= 8192
##$YMAX_p= 0
##$YMIN_p= 0
$$ End of Bruker specific parameters
$$ ---------------------------------
##NTUPLES= NMR FID
##VAR_NAME=  TIME,          FID/REAL,        FID/IMAG
##SYMBOL=    X,             R,               I
##VAR_TYPE=  INDEPENDENT,   DEPENDENT,       DEPENDENT
##VAR_FORM=  AFFN,          ASDF,            ASDF
##VAR_DIM=   8192,          8192,            8192
##UNITS=     SECONDS,       ARBITRARY UNITS, ARBITRARY UNITS
##FACTOR=    0.0002496,     1,               1
##FIRST=     0,             0,               0
##LAST=      2.0444736,     0,               0
##MIN=       0,             -576116,         0
##MAX=       2.0444736,     495854,          0
$$ Real data points
##PAGE= N=1
##DATA TABLE= (X++(R..R)), XYDATA
0 0 0 0 0 0 0 0 0 0 -8 8 -8 8 -16 18 -24 32 -40 48 -57 72 -81 102 -121 140 -166 193 -225 263 -299 344 -394
31 -394 452 -513 580 -657 739 -831 932 -1042 1163 -1293 1438 -1596 1771 -1958 2163 -2387
47 -2387 2633 -2902 3197 -3521 3877 -4276 4715 -5208 5761 -6391 7109 -7944 8922 -10093
61 -10093 11516 -13294 15587 -18671 23062 -29842 41801 -69148 265897 -119568 -237448
72 -237448 449911 -120926 -83336 495854 94433 -357747 95349 122731 -93679 112989
82 112989 110047 -221851 -139461 3345 69982 89016 -131326 -151717 -14736 -198010 17507
93 17507 249336 -215104 -261641 91387 -148164 -130825 215983 -86031 -332780 -1844 -12112
104 -12112 -145063 106003 -26985 -312546 -32711 1039 -138041 142645 -31319 -325744
114 -325744 46708 38369 -181672 169796 84379 -310453 2994 190200 -106182 40539
124 40539 208016 -149189 -116142 234246 68252 -30311 135536 -18567 -71922 91272 80220
135 80220 86608 5069 -100229 61828 29410 -71887 145460 53700 -215801 23907 150545
146 150545 -124284 -6938 173889 -164485 -146270 216023 -18460 -142320 153285 -42749
156 -42749 -187258 122273 60971 -93052 45863 -8235 -90574 31929 36353 -24198 7577
167 7577 -33421 -61824 44015 16413 -60114 40130 -22529 -112217 76453 47338 -87399
178 -87399 59355 17079 -97289 67476 69190 -35874 47398 39453 -28848 52615 74232 -3001
190 -3001 35858 53807 -30138 47272 93396 -37608 27758 72471 -71233 28687 102045 -52609
202 -52609 4793 66767 -52575 -8162 67586 -15287 -31369 29306 -7923 -35893 32751 6838
214 6838 -45514 13866 -9394 -29316 38667 -13642 -28580 25275 -38422 -17082 41008 -32035
226 -32035 -24597 15592 -37480 -30747 14144 -15646 -46710 -7441 -6936 -49502 1447 6497 -59510
239 -59510 -6566 3382 -43622 15680 4650 -37923 6557 -8318 -18656 18118 -1165 -10738
251 -10738 3132 295 -3541 2620 13975 -10474 -6293 25336 -7528 4632 30639 -20602 -29
264 -29 24263 -13303 15616 18662 -13242 7427 3728 -1696 9185 2803 6759 919 8666 17146
278 17146 -998 15503 9919 -7055 24722 9656 1378 25072 -5454 -1053 16111 -7179 8517
291 8517 8294 -6069 7432 -1849 1182 3389 -7832 6243 -4522 -4097 11981 -11359 -2122 2550
305 2550 -18604 2942 -2425 -12830 5442 -12202 -9143 423 -15298 -73 -4507 -10525 5122
318 5122 -9852 -3178 2009 -13935 2981 -3772 -9676 7568 -10788 -5490 1688 -15808 965
331 965 -3068 -9851 7427 -7785 -1902 5137 -10741 6314 1413 -5365 11983 -4124 -195 7046
345 7046 -9640 5321 1403 -4649 11614 -2659 3343 10575 -5918 10841 6802 132 18349
358 18349 3424 6780 14447 -3233 9664 6472 -1668 14009 529 3779 9432 -6154 6935
371 6935 1248 -4531 11689 -3173 1866 9475 -9334 4766 1006 -9111 8375 -3590 -2725 5995
385 5995 -9746 -198 -2992 -9416 3777 -7396 -1957 3354 -11650 2715 -4428 -12149 5338 -11050
399 -11050 -6708 4053 -16864 -5452 -6601 -20325 -3837 -11397 -12517 -3336 -14048 -5329 -7460
412 -7460 -9702 2393 -9720 -195 5929 -8844 9466 2553 -8488 12805 -1370 901 17450
425 17450 -1478 5967 11224 -1017 11921 10341 7680 11067 5054 12829 6202 6762 16126 -3322
439 -3322 8381 16703 -3288 16830 11408 -7480 15687 6072 3577 23304 5265 5431 14405 3804
453 3804 10441 13784 8763 2801 4022 12845 -4144 1734 12029 -22649 -6040 10467 -23117 -359
467 -359 4200 -31567 -9507 -4608 -20381 -3149 -6589 -18314 -13731 -8726 -10535 -12804 -3702 -16360
481 -16360 -19852 6519 -12281 -11935 13733 -24456 -16666 16917 -16654 -2601 16392 -22747 -11304
494 -11304 6708 -12220 -4635 4098 -13899 -16632 4433 -4174 -14102 13449 -10495 -26606 26004
507 26004 1276 -17171 37374 -4041 -28261 36663 12481 -12142 32445 12939 -18746 15064
519 15064 26619 -3590 5725 19928 -12637 -1475 23280 -3317 5613 3506 -22123 14708 6254
532 6254 -16029 28519 -8230 -39659 26726 8060 -27738 26007 11112 -41939 8231 37374
544 37374 -21679 -153 38220 -30687 -11578 55082 -10539 -11828 33652 -29027 -13213 39036
556 39036 -9625 -5888 13919 -30273 -12402 25920 -5097 -10590 13235 -18878 -19774 36378 7430
569 7430 -21047 22877 -11368 -19650 48642 10184 -12203 26760 -19970 -8428 51213 1704
581 1704 -5900 29456 -23026 -16470 54375 7489 -34782 28541 -4097 -50031 51725 32703
593 32703 -67661 10943 16007 -62032 30176 45286 -55402 -15504 15573 -30141 8629 34058
605 34058 -22418 -26867 3498 -6533 10135 21213 -27920 -21047 -935 -28060 21351 24610 -59961
618 -59961 -16897 9082 -49836 17702 36806 -63893 -29907 20763 -33763 -3170 42006 -39193
630 -39193 -49978 28222 -4626 -15538 45752 -21500 -51977 34814 6930 -6468 50286 -17462
642 -17462 -40047 35417 10517 1325 43668 -9247 -37753 26468 24735 -5062 28541 2048
654 2048 -43648 20602 35207 -8165 27315 1953 -41888 27167 29713 -1800 37160 -4327
666 -4327 -35946 33099 27188 -4824 30621 2382 -42747 21243 43505 -19194 8192 18701
678 18701 -53477 1286 55654 -21797 -7240 18411 -47816 -9006 41182 -11526 -12662 498
690 498 -31975 -8177 26327 -4003 -14356 -1323 -26890 -7709 37973 -5317 -17962 14556
702 14556 -31055 -12833 49952 -7393 -22388 16878 -25751 -15452 38413 165 -24356 3400
714 3400 -10713 -14621 26264 11281 -26033 67 -2507 -16507 31540 13982 -28252 8977 -3116
727 -3116 -17506 35044 11743 -25086 7177 -515 -13039 22208 15565 -19369 -5354 8491 -9288
740 -9288 10971 22186 -21517 -11267 10652 -14753 10324 19328 -25262 -7740 4418 -15940
752 -15940 10765 13160 -17261 -7498 3397 -4849 4940 14233 -8414 -14299 9144 -501 73 19637
766 19637 -11225 -16193 11438 -6509 2064 20013 -12805 -10592 8038 -4604 3889 12675 -4757
779 -4757 -10165 3686 6277 -110 9033 1095 -16168 4971 7648 -3362 14539 -1998 -16035
792 -16035 8856 1727 -943 14741 -2841 -9506 5162 5076 2088 3752 2388 -8540 -4216 11202
806 11202 -312 -2449 3701 -12618 -3752 7536 -2739 5001 -1858 -11467 4438 893 -1707 6941
820 6941 -4407 -7510 977 3200 -49 -3706 900 -6356 -8164 10362 817 -7243 4584 -6477
834 -6477 -4713 7663 -218 1196 -1102 -5486 3347 -543 -389 3185 -5120 -2178 830 1455 2704
849 2704 -4804 310 71 -6043 8173 3541 -6046 4504 -1251 -2513 5418 209 1751 -241 -1817
864 -1817 5363 -1630 -3 3581 -4098 1738 3670 941 4687 -2011 1580 3505 -3276 6550 3727
879 3727 -3710 5402 -247 -1771 3435 -2996 700 645 -1917 4851 -1884 -1415 3055 -3485 2640 2246
895 2246 -1112 3795 -2607 203 2928 -5448 1987 416 -5265 3866 -1138 -3021 1360 -4936 -601
910 -601 88 -2842 2259 -3467 -2804 455 -5037 -22 -1820 -5256 1248 -4659 -1864 2115 -7318 -486
926 -486 159 -5413 3798 202 -2181 2805 -1845 1085 2508 460 4240 -1048 1521 3543 -2897 4493
942 4493 862 -3407 6227 -1151 328 6626 -3222 1593 4399 -1961 5248 3657 147 3415 121
957 121 2041 1058 1440 4464 -2306 3097 4573 -4515 5562 2249 -5159 6703 1137 -2890 5946
972 5946 -2543 -2833 1351 -3662 -1498 -1409 -1948 -2512 -5263 -1344 -5707 -5317 893 -7251 -2110 2132 -8873
989 -8873 1051 673 -9490 3203 149 -6609 4251 -648 -4985 1046 -416 -3256 -1461 2943 -2570
1004 -2570 -4258 5765 -3276 -4844 8228 -5080 -3349 8878 -5280 -827 6513 -6151 324
1017 324 3750 -3021 2281 2793 -306 569 3681 2495 -264 6916 2678 -2527 10818 945 -4428
1032 -4428 11990 -2739 -5324 12715 -3524 -4653 9022 -4351 -5399 6257 -412 -4656 3288
1045 3288 2957 -6575 2159 6543 -7917 2753 7042 -8368 5770 6539 -8177 6198 2081 -6280
1059 -6280 8524 1859 -3584 6861 -398 -4106 5309 3236 -4742 2513 5502 -8685 1629 9109
1073 9109 -13084 -1175 9426 -14502 1201 11446 -13897 -1087 7829 -10805 -14 8886
1085 8886 -4609 -2520 5845 -2553 -4512 7048 -1630 -8042 6210 -3955 -6540 9165 -8046
1098 -8046 -7486 7201 -11108 -3200 10176 -10986 -4419 6265 -11014 -3713 8851 -5887 -8227
1111 -8227 7310 -3155 -10324 12145 323 -15238 11793 2406 -13551 16638 4192 -15156
1123 -15156 11036 3182 -9811 12142 5755 -9815 2515 5014 -5666 3020 7180 -8683 -1759
1136 -1759 6654 -6822 4502 7459 -12408 3922 6293 -8976 12766 6481 -14553 7262 6008
1149 6008 -9063 10615 8891 -13164 -37 11292 -7125 85 15093 -11618 -8141 17132 -5682
1162 -5682 -3512 15319 -12575 -8788 13614 -4772 -615 9554 -10287 -6750 7842 -936 -1638
1175 -1638 7080 -4828 -9070 10293 3906 -6012 9912 -4256 -12211 13769 2898 -6395 10306
1188 10306 -8168 -11475 11591 -350 -4537 6291 -7793 -10753 7904 3510 -7853 3333 -1847
1201 -1847 -15099 8933 10722 -13470 3591 1370 -18088 9620 11068 -11766 2681 -411 -12602
1214 -12602 6325 9405 -5256 -1431 317 -7277 3507 12363 -5302 -4860 4456 -9717 3288
1227 3288 16105 -9354 -4158 5384 -11487 4900 15072 -6176 -2594 3281 -5130 4257 12894
1240 12894 -462 -6037 3643 -700 561 14371 -891 -10344 6149 -3344 -1182 16823 -4182
1253 -4182 -9905 6059 -4465 135 13140 -2352 -9074 1295 282 -1783 7247 2050 -12435
1266 -12435 -1208 3961 -5417 7474 2287 -14796 437 2085 -4788 9206 420 -10818 295
1279 295 -315 -1453 5001 646 -7449 -4205 2133 -1339 1243 3444 -9626 -5103 4878 -3674 4171
1294 4171 5111 -11205 -1218 3338 -3924 6586 3151 -7885 -1491 1987 -614 1969 3574 -4493
1308 -4493 -6253 5120 1952 -1157 7136 -4418 -7033 6833 839 1473 6996 -5206 -3587 3227
1322 3227 526 3909 2789 -2753 -2512 569 3581 1555 2238 -265 -5801 3505 4680 -907 5729
1337 5729 -1460 -6319 5473 1912 539 5428 -3297 -3160 2377 1453 2743 1285 -731 -2016 205
1352 205 4924 -121 334 1796 -5733 1838 5646 -3177 1936 -36 -7174 1829 1478 -1520 517 -2358
1368 -2358 -1855 -678 348 1897 -2806 -1107 -49 -1960 3016 -95 -2909 635 -3874 323 3970
1383 3970 -3498 171 214 -4499 1691 1227 -2008 -338 -1420 435 -133 126 1439 -4002 -972 1979
1399 1979 -1813 2330 -307 -3490 1299 -1512 489 3128 -3407 439 1697 -1399 3244 1421 -1190
1414 -1190 11 -171 3085 873 -261 1436 -4206 -527 3256 -1549 840 -797 -3549 1466 -203
1429 -203 677 1615 -4146 -218 1801 -764 2554 -520 -2646 -785 -416 3078 587 -1300 1267 -3295
1445 -3295 532 4747 -1052 971 54 -2448 3077 1022 468 1170 -3597 166 2224 -296 1872 -1092
1461 -1092 -2240 -321 -233 3315 241 -1410 1843 -2412 788 4615 -1882 715 1116 -1769 3309 1404
1477 1404 -544 488 -2691 170 1971 -174 1011 -1478 -1371 -172 -935 2567 -1002 -2994 2154
1492 2154 -2788 -1172 3271 -4097 -1774 648 -3015 1047 793 -1544 -543 -1728 549 883 111 1620
1508 1620 -1181 275 1032 -1726 2367 -478 -3250 3319 -1542 -1502 3881 -3075 -1969 2658 -1951 176
1524 176 1858 -652 -672 267 1463 -674 662 2936 -2350 1507 3431 -2875 2770 2029 -3264 4063
1540 4063 1640 -1930 3765 -19 -1381 2646 533 -237 1219 1089 -1091 -690 2365 -2548 -1420 3235
1556 3235 -4151 -633 3893 -5297 310 3031 -5046 1770 3156 -3491 1277 1735 -2525 -466 2009
1571 2009 -1270 -2365 2548 -971 -4082 3599 -2094 -4753 4299 -2599 -3529 4632 -3546 -2812 3438
1586 3438 -3859 -1585 2868 -2370 -1552 2159 -1087 -2866 2465 474 -4292 4094 1705 -5188 5586
1601 5586 1760 -6406 6039 1340 -5048 6484 1353 -4415 4118 1107 -3849 2576 2076 -3483 609
1616 609 3247 -4360 232 4536 -5272 897 5221 -5672 2336 4819 -6655 2502 3391 -5915 2950
1631 2950 3495 -5237 956 3456 -4230 -565 5331 -3535 -2578 6792 -3989 -3756 8191 -4609 -4451
1646 -4451 8075 -4826 -3656 7383 -4902 -4083 5443 -2905 -3100 5000 -951 -3919 4225 780
1660 780 -4514 5367 1377 -5768 6297 1344 -5988 7006 12 -6854 7231 -112 -5193 6777
1674 6777 -507 -6026 4721 1313 -5454 3753 3336 -6941 2682 5126 -7923 1688 5572 -9465
1688 -9465 1927 6533 -8464 2026 4941 -8391 1228 5104 -5159 791 4249 -4787 -1334 4997
1702 4997 -3191 -2259 5387 -4447 -3229 7466 -4492 -3185 6508 -6689 -2301 8171 -5031 -1852
1716 -1852 6661 -5421 -2221 6745 -1900 -2754 5668 -1506 -4417 6948 851 -6185 6331 -18
1730 -18 -6869 8784 1326 -6833 6900 -1059 -5940 7691 903 -5358 4414 290 -5451 4458 3202
1745 3202 -5955 1213 3035 -6427 2809 5329 -8092 1147 4123 -7079 4272 5161 -7205 1829
1759 1829 2774 -5574 2845 4409 -5015 -948 3238 -3843 -393 5711 -4735 -3013 5770 -3811 -1083
1774 -1083 7462 -5540 -2967 5956 -4272 -51 6625 -4973 -2869 4064 -2619 -1266 4843 -2359
1788 -2359 -4680 4554 376 -4229 5802 -727 -7483 5965 1122 -5040 5782 -1159 -6800 3851
1802 3851 524 -3177 2596 -714 -4360 595 1707 -2230 322 821 -4292 928 3134 -3659 1753
1817 1753 1228 -6035 2891 2468 -4213 3576 621 -5201 2979 2803 -2668 1673 2534 -3077 361 5592
1833 5592 -1390 -1113 5363 -2787 -1243 6935 -1543 -1295 4701 -2933 -670 4841 -738 71 2234 -906
1849 -906 82 2497 1528 -477 1531 214 -1215 3071 1000 -2288 2336 -1235 -2313 4405 -1052 -2265
1865 -2265 2755 -2930 -2424 3207 -867 -1582 885 -1448 -2759 1070 1475 -3452 -847 854 -4378 768
1881 768 2546 -4495 -581 129 -3940 1605 1660 -2211 -262 -908 -1353 632 957 49 -1720 -441 -846
1898 -846 -497 2093 -1137 -2001 422 -2373 596 3162 -2496 -501 482 -2702 1895 2417 -945 -378
1914 -378 -422 -634 516 1802 812 -2592 -226 510 -689 2818 432 -2772 759 -625 295 3592 -751
1931 -751 -1243 -312 -1163 1765 2066 -259 -1005 -1477 342 1032 1203 1371 -2512 -851 1611 215 2998
1948 2998 1268 -2662 617 520 1054 3519 -278 -1026 -197 -75 2377 1588 -57 -741 -1449 1360 1497
1965 1497 615 1424 -2192 -824 2188 73 1731 546 -2982 -249 186 346 1903 -941 -1345 -725
1981 -725 -152 1731 18 -454 -482 -1598 1292 970 -657 505 -2360 -1428 1231 -842 346 -112 -2746
1998 -2746 -152 -18 -429 738 -1305 -619 -362 -198 1184 -836 -804 -35 -1308 1109 608 -1205 697
2015 697 -1032 -817 1546 -835 182 874 -1146 924 181 -337 799 -490 367 297 -344 1155 -771
2032 -771 -315 867 -1224 505 284 -1493 1054 -153 -524 1203 -1073 214 1191 -526 797 97
2048 97 -676 414 -473 735 91 -826 777 -743 -243 1389 -1049 223 561 -1131 1316 152 -713
2065 -713 989 -1168 -102 1032 -334 102 -435 -954 180 -248 797 153 -874 690 -727 155 1167
2082 1167 -1320 -62 438 -1268 1683 488 -1296 571 -1211 -387 921 -251 -97 -536 -444 379 -216
2099 -216 805 -438 -1144 1107 -554 -71 1620 -1329 -373 614 -1228 1092 503 -1214 676 -441
2115 -441 -227 967 21 388 -415 384 644 -542 1235 -346 -1509 1622 -178 -354 2178 -1606 -763
2132 -763 1258 -1051 583 1032 -692 194 435 135 330 357 576 -952 558 954 -1133 1058 200 -2118
2150 -2118 1657 181 -1444 1943 -897 -1320 1362 -336 -395 932 -303 -490 90 701 -786 -216 783
2167 783 -1874 56 1561 -1970 367 1060 -3047 1075 960 -1961 1178 283 -1744 760 430 -973
2183 -973 106 589 -745 -793 1226 -1176 -1342 1863 -1639 -1043 2739 -1953 -412 2089 -2336 -133
2199 -133 1873 -1583 -98 1109 -1056 -358 1093 -221 -1265 1304 377 -1896 1917 447 -2214 2473
2215 2473 97 -1769 3077 -326 -1173 2576 -558 -1159 1738 129 -638 1356 727 -1161 779 1255
2231 1255 -1623 1033 1868 -2356 1688 1892 -2689 2057 1340 -2790 1901 885 -2069 1114 624 -1923
2247 -1923 209 1200 -1407 -350 1765 -1560 -999 2444 -1796 -1292 2218 -2500 -577 2395 -2566 -398
2263 -398 1563 -2697 -333 1565 -1573 -647 1184 -938 -1414 1547 -270 -2121 1930 -263 -2284 2815
2279 2815 -795 -2491 3041 -1068 -2069 3115 -627 -1687 1831 -413 -1372 1514 906 -1356 1110
2294 1110 1183 -1677 1140 1850 -2577 997 1631 -2667 2089 1469 -2879 1746 723 -2120 1993 935
2310 935 -1924 757 1238 -1293 24 1934 -1889 -921 2626 -1624 -749 2954 -2505 -1074 2854 -2135
2326 -2135 -102 2259 -2169 -452 1436 -1113 16 1110 -713 -1208 1055 18 -1348 1595 -364
2341 -364 -1913 2216 -310 -1670 2374 -1271 -1844 2505 -785 -1182 2020 -1089 -1305 1412 259 -1215
2357 -1215 1048 736 -2073 767 1702 -2472 616 1526 -2936 1241 1680 -2423 1105 746 -2044 975
2373 975 727 -835 327 273 -819 -84 618 -985 -889 934 -1214 -201 2105 -1865 -115 1756 -2124
2390 -2124 717 2150 -1943 183 1319 -1403 -72 1204 -659 -907 1147 -37 -1302 1529 93
2405 93 -1911 1756 207 -1751 2019 -433 -1477 1605 -710 -900 1213 -624 -697 695 -150 -249 -58
2422 -58 221 -875 228 1023 -1414 562 940 -1927 1099 728 -1830 1030 181 -1630 922 -23 -1204
2439 -1204 545 -121 -521 -12 648 -348 -260 1446 -630 -722 1443 -1109 -274 1724 -1378 -121 1238
2456 1238 -1319 560 1010 -815 130 290 -57 -137 302 462 -652 353 637 -948 1197 50 -1323
2473 -1323 1031 -302 -782 1670 -785 -573 674 -538 253 1026 -266 -263 -124 379 -126 499 708 -1098
2491 -1098 19 888 -846 814 259 -1820 397 202 -503 1329 -384 -1325 302 96 517 525 -85 -559
2509 -559 -716 761 252 -341 651 -1140 -444 1497 -429 434 441 -1664 281 844 42 788 -251 -821
2527 -821 -101 54 630 34 -300 -440 -885 657 480 -948 853 -789 -868 1541 26 139 565 -1186
2545 -1186 -128 665 -76 271 -477 -454 -82 -258 771 -353 -212 -207 -941 547 479 -865 423 -518 -996
2564 -996 1026 -58 -214 521 -762 -404 367 261 481 -369 -20 -93 -322 1105 -68 -165 618 -814 428
2583 428 737 -621 652 -185 -833 932 124 -79 723 -360 -146 138 155 315 -177 307 119 -779 1064
2602 1064 190 -418 950 -560 -57 827 -673 557 333 -724 402 40 213 531 -320 98 -391 -47
2620 -47 626 -687 195 163 -953 613 -25 -764 730 -769 -410 521 -564 274 -1 -592 98 -210 -156
2639 -156 385 -418 99 -502 -153 617 -665 -161 136 -1235 98 222 -608 359 -437 -246 382 -412 417
2658 417 365 -569 373 -85 381 580 43 229 -178 74 815 -349 225 607 -785 814 668 -159 472
2677 472 -101 92 705 -338 424 272 -412 339 -138 78 354 -522 386 -111 -424 665 -220 212 417
2696 417 -729 602 471 -574 466 -307 -446 470 -373 243 -113 -583 -23 -331 196 -134 -755 456
2714 456 -199 -386 837 -863 -496 359 -643 -80 71 -740 125 -230 -341 327 -177 184 101 52 370 -11
2734 -11 305 309 -630 778 -64 -478 713 -337 -429 694 -343 149 583 -41 360 109 17 444 49 258
2754 258 88 -119 551 20 536 488 -766 660 406 -604 879 -6 -349 473 -190 -67 658 -122 124
2773 124 -1 214 -16 -227 208 -331 -685 650 -672 -149 399 -908 272 312 -705 610 30 -611
2791 -611 555 -41 -245 328 -416 -68 -304 31 168 -873 367 -439 -588 716 -448 -297 735 -1099
2809 -1099 40 705 -694 76 542 -253 6 187 -86 20 198 213 -476 240 578 -697 746 376 -779
2828 -779 1177 80 -338 1296 -194 -333 698 -269 -73 307 31 14 105 574 -185 14 693 -405 185
2847 185 996 -956 430 853 -872 585 421 -572 652 78 -433 236 -135 -237 -97 241 -173 -261 547
2866 547 -572 -531 670 -696 -279 878 -902 -304 715 -1108 -187 514 -381 -17 531 -213 -414 225
2884 225 339 -373 399 527 -796 326 356 -634 763 98 -754 855 -579 -140 737 -508 -371 479
2902 479 -321 4 296 109 -325 -58 494 -739 270 309 -939 416 572 -1045 670 144 -1022 642
2920 642 340 -626 251 112 -457 -2 164 -120 -489 411 -315 -641 839 -388 -508 680 -678 -99 782
2939 782 -720 209 170 -974 246 239 -239 177 229 12 -355 411 82 -737 450 159 -623 1032 61 -648
2959 -648 832 -131 -560 794 -291 -239 402 -220 -16 131 127 -215 -147 383 -518 131 702 -801 81 428
2979 428 -777 391 358 -513 515 -110 -179 321 -54 -75 107 -76 -99 -296 187 90 -262 414 -434 -264 841
3000 841 -697 -74 624 -866 -141 484 -429 55 -43 -243 42 -206 128 -228 -211 -126 -552 280 193 -348 715
3021 715 -147 -496 1040 -222 -553 430 -317 -137 399 53 129 -286 -102 -29 -55 463 9 -193 81 -486
3041 -486 159 363 -548 478 98 -800 857 194 -622 354 27 154 463 297 246 -230 351 84 -64 494
3061 494 -107 -319 227 -233 -3 414 -705 474 257 -629 688 148 -573 28 -113 -107 -26 215 186 -336
3081 -336 162 76 -467 533 145 -435 365 -130 -49 235 -383 -28 213 -667 332 180 -381 -269 -262 -245 -430
3102 -430 23 518 -436 66 241 -505 160 273 -443 423 -48 -287 591 -83 141 213 -161 74 190 -31
3122 -31 106 -111 133 -135 -141 778 -475 23 538 -501 199 537 -247 522 216 -196 391 -239 79 160 -89
3143 -89 195 36 605 228 -189 189 -4 -102 602 -315 -256 447 -539 -116 342 -559 -177 83 -463 5 -247
3164 -247 -147 -156 -662 -38 -175 -362 288 -705 -145 -28 -402 463 -4 -121 537 -408 -54 330 -206 19 -190
3185 -190 -323 214 -104 0 -58 -291 363 -181 0 424 -519 122 276 -374 450 -29 -243 664 191 -46
3205 -46 459 49 247 78 43 236 138 390 121 -385 633 -220 8 440 -256 319 191 -518 248 307 -522
3226 -522 424 -123 -156 73 -413 21 -97 120 15 -450 95 102 -483 374 -327 -480 488 -320 -373 63 -548
3247 -548 -173 12 -128 155 -172 -142 27 -165 290 -215 -392 176 -211 399 -38 -341 419 -162 -525 625
3267 625 -119 -38 546 -279 80 491 57 121 -108 277 217 -6 511 -2 -181 496 -309 224 444 -55 205
3288 205 15 -371 526 -137 -339 482 -185 43 116 -125 78 -152 296 193 -322 527 -129 -294 419 -389
3308 -389 -113 476 -561 152 142 -359 286 -38 -301 -79 -57 291 -84 -387 128 -426 170 219 -460 345 136
3329 136 -313 460 -196 -110 528 -442 158 98 -280 354 -120 -249 169 199 387 -194 163 309 -522 283 447
3350 447 -584 137 140 -638 299 70 -307 169 -104 106 -50 -191 208 -167 -97 66 -250 212 -56 -209 204
3371 204 -487 125 271 -756 129 135 -576 -85 -163 -241 164 -21 -83 106 -149 179 -306 17 -98 -375 514
3392 514 24 -196 626 -211 -350 610 -189 1 367 -24 142 114 73 54 -190 147 -111 119 531 -265 -121
3413 -121 358 -215 134 252 -228 541 -10 -247 389 -167 -79 454 -345 91 61 106 7 -260 72 -335 -170
3434 -170 181 -582 -177 398 -639 11 233 -560 136 83 -678 63 3 -292 64 -61 -43 -363 134 81 -273
3455 -273 225 -61 -473 411 -324 -275 299 -573 74 345 -316 95 112 -47 188 360 12 93 -19 238 74
3476 74 261 274 -498 590 283 -486 433 170 -386 212 -34 -134 270 -275 -55 11 -235 -69 -440 310 -207
3497 -207 -294 320 -247 17 533 -290 176 354 -472 425 165 -241 454 -216 33 115 -88 347 -114 -47 163
3518 163 19 155 12 -139 416 -389 -258 299 -484 -98 378 -349 21 350 -69 157 -76 248 11 -48
3538 -48 184 -65 66 190 -401 304 29 -422 564 -213 -401 405 -395 -185 270 -417 -135 157 -291 13
3558 13 -83 147 124 -198 441 -62 30 490 -51 262 511 -204 185 -64 -268 353 -57 40 327 -174 55 157
3580 157 170 241 -264 115 -88 -478 199 -424 -52 247 -306 111 318 -146 338 165 -182 195 -39 155 381
3601 381 -96 182 38 -255 145 -281 202 96 -538 251 -114 -191 432 -279 -381 395 -137 156 -29 -264
3621 -264 91 -493 -58 125 -197 57 -128 -31 138 -233 137 159 -351 436 97 -82 524 -155 -28 156 -100
3642 -100 -8 -25 -19 177 -442 -15 108 -152 275 0 -41 236 -224 159 268 -361 305 23 -392 183 -163 -61
3664 -61 225 -112 99 -160 -120 337 -370 -85 125 -258 105 81 -418 165 -382 -235 213 -334 113 -44 -250
3685 -250 221 -24 -155 222 -91 -64 -167 303 366 -202 -120 95 -417 27 14 -455 84 -242 65 66 -321 159
3707 159 31 -468 204 -2 -121 5 -259 219 9 -172 235 -404 -140 116 -155 48 152 -199 77 -197
3727 -197 -90 91 -12 -41 139 -236 208 -147 -75 233 -428 170 81 -104 211 -36 59 151 -185 282 156 -199
3749 -199 281 80 70 402 -153 273 173 -45 174 -20 21 315 -102 209 351 -319 399 -140 171 189 -533
3770 -533 55 168 -230 -47 -198 -72 28 -229 37 66 -401 79 -20 104 442 -77 41 -133 -103 458 4
3791 4 -156 216 -599 -203 96 -129 -1 -95 -79 -30 -335 289 19 -555 268 -336 20 352 -257 -5 -53 -228
3813 -228 310 -53 -255 377 -392 88 79 -307 109 -198 63 343 -28 150 -88 -286 338 -202 -188 399 -291
3834 -291 -69 164 -166 286 95 -197 191 -145 367 40 -329 178 64 208 107 -127 271 -59 -488 217
3854 217 3 -166 269 -310 3 30 -92 118 -46 -180 -60 -39 68 -32 -162 13 -171 85 155 -377 99
3875 99 99 -636 276 25 -128 96 -94 -91 143 151 190 11 -179 111 -118 -16 137 -260 -47 -230 -156 356 -436
3898 -436 374 109 -379 219 2 -43 58 -316 -304 179 -194 186 -229 -80 55 -148 301 176 -390 23 -187
3919 -187 51 567 -181 -6 275 -220 244 232 -70 187 -173 136 306 -54 295 -133 -93 164 -363 287 245
3940 245 -181 166 -43 -221 475 -156 -87 379 -240 -8 -18 -14 -176 -164 114 -80 -89 331 -207 -17 277 -426
3962 -426 223 45 -238 50 -44 -102 80 -158 -167 214 -285 7 -102 -120 24 -334 7 -135 -184 396 -108 -317
3984 -317 320 -586 151 481 -233 163 66 -195 458 79 102 392 -7 70 -34 38 148 -273 56 29 -327 328
4006 328 -236 -383 463 -178 -96 456 -56 -33 230 -26 141 65 180 70 -179 192 -102 12 106 -87 108
4027 108 -8 -337 209 -224 -588 131 -18 -121 49 16 -119 70 -68 -7 -364 -39 23 -137 134 -6 10
4048 10 543 -30 7 283 -240 181 97 -174 313 68 -120 186 -17 -84 -259 -21 -19 -352 -150 104 -298 197
4070 197 70 -156 293 -191 -85 300 -296 232 407 -87 138 19 107 48 -145 -163 6 38 276 -368 83
4091 83 109 -539 214 -77 -296 41 -155 -346 234 -144 -42 119 -133 229 21 -34 72 50 320 91 -183
4112 -183 314 -53 239 324 -300 163 284 -153 189 -67 2 147 -203 -36 6 -76 277 -167 47 -7 -58 306
4134 306 -83 -79 372 -128 -47 432 -201 34 293 57 331 61 -103 138 -150 295 -106 -39 20 -311 -180 -12
4156 -12 -238 117 37 -336 143 -134 -179 181 -283 -37 -228 -129 280 -19 -55 52 -391 235 -6 -263 69 -201
4178 -201 -311 -47 -228 49 93 -290 0 46 64 88 -328 -8 102 -403 348 -221 202 328 -341 112 351
4199 351 -236 268 7 -266 180 -98 128 212 50 254 -108 -225 253 -101 56 -319 -85 163 -325 38
4219 38 165 -331 179 61 -215 211 15 -240 311 -93 -9 174 -45 295 -142 -15 121 -248 205 -105 -340
4240 -340 375 -128 -140 -74 -426 -24 17 -380 -187 -168 -379 70 -56 -81 25 -378 68 -22 99 55 -390 53
4262 53 163 -245 301 -82 -71 296 7 103 52 -117 196 -130 221 261 -75 70 -3 -122 522 -32 148 263
4284 263 -259 213 233 -108 242 33 -98 385 89 229 -9 -220 68 -21 153 228 -281 30 -23 -391 359
4305 359 -46 -133 -59 -174 61 73 -1 -43 -110 -117 122 -217 12 169 -382 -24 -93 19 123 -128 212 -78 -28
4328 -28 180 -41 -233 323 -442 14 92 -92 144 -208 -188 138 52 -187 -29 -391 -30 -202 43 331 -223
4349 -223 -58 -51 -99 153 160 -26 -60 -240 -1 301 82 351 67 -304 34 -55 105 81 -178 -134 -95 105 264
4372 264 -242 101 68 -398 313 183 -5 -82 -240 58 -41 86 225 -229 -321 7 -86 -27 231 -248 64 -132
4394 -132 157 416 139 48 73 -417 289 220 160 233 -377 -13 313 39 262 -99 -110 221 32 406 340 -9
4416 -9 58 -126 207 371 60 95 -84 -437 200 50 -6 50 -311 -79 142 189 134 2 -520 -80 -275 140 143
4439 143 -195 -6 -171 14 242 -217 -233 215 -351 326 208 -197 -22 -271 -148 256 100 153 -202 -188 169
4460 169 -66 202 188 -263 153 -128 26 169 -164 138 328 -268 436 320 -306 -34 15 -116 -185 -27 136
4481 136 -51 -195 171 -340 222 190 -118 -78 65 -192 325 -64 -18 263 -151 344 11 -191 284 -43 -315
4502 -315 218 -81 74 -132 -316 153 -164 119 280 -391 -17 43 -252 91 -128 -82 157 -358 -94 340 -76
4523 -76 -174 -67 136 1 -284 156 -318 -240 316 -260 -194 214 -381 -92 33 -80 294 -253 -37 18 -300 160
4545 160 112 -97 -91 -158 -14 32 -55 479 -130 -96 525 -415 -120 376 -227 -213 222 -144 144 -134 103 168 -160
4568 -160 216 97 -50 6 -215 17 191 -129 230 -270 -281 408 -22 235 451 -40 109 267 -158 164 -29
4589 -29 69 165 -202 317 87 -139 274 -169 -90 172 -98 324 269 -555 143 169 -142 166 -21 -115 30 -5 177
4612 177 -220 -237 285 -486 303 -13 -245 43 -138 -371 141 -172 210 -142 -199 264 -172 -113 515 52 -98
4633 -98 -103 -307 258 -49 83 121 -210 151 -14 -185 131 -167 -76 63 -19 25 165 -62 114 -200 201 127 -340
4656 -340 124 9 -198 186 -430 -122 296 -170 -101 -251 -325 -44 -189 -386 131 -233 299 63 -225 154 -31
4677 -31 -49 224 -149 144 50 -24 14 -1 -141 85 -114 -209 -20 -112 381 -400 -180 -30 -311 52 -4 -144 150
4700 150 64 -36 216 -280 156 150 -415 41 -44 -81 305 -132 299 29 -278 474 -304 -284 321 -292 -107 162
4722 162 -374 265 -28 -92 80 -147 74 12 77 221 -63 88 338 -151 140 192 -122 305 -124 -48 274 -178
4744 -178 -71 248 -290 142 39 -153 185 8 -15 102 -144 97 0 -62 320 -272 107 233 -411 176 -47
4765 -47 -66 132 -128 -130 51 -344 106 -185 -423 -166 -158 129 -236 95 157 -246 -117 85 -260 214 15 -449
4787 -449 14 -80 -393 222 -308 -184 122 -323 70 -146 -28 92 -307 99 -138 -16 374 19 102 402 -297
4808 -297 27 123 -426 256 -39 -157 315 -13 195 67 -134 2 61 -83 127 34 65 58 -204 272 -49 -261
4830 -261 273 -268 -9 482 -362 71 -46 -151 391 18 -34 -13 -199 173 12 -121 206 -132 -150 112 -282
4851 -282 207 -337 -312 414 -225 -140 381 -323 137 2 -163 381 14 -22 -55 -238 366 23 -2 262 -356 -102
4873 -102 -35 -457 212 -90 -298 324 -253 -5 424 -50 14 -130 -199 251 -189 28 243 -328 6 -138 -120
4894 -120 304 -430 343 35 -319 217 374 -268 209 -222 -237 325 27 153 75 -116 233 -89 317 174 -299
4915 -299 324 126 -196 365 -187 151 216 -159 230 106 -335 87 -272 100 337 46 107 -72 -181 202 -90
4936 -90 117 143 -423 -25 -19 -88 52 -201 -173 199 -158 32 -183 -116 80 -164 -127 361 -47 26 -353 -49 282
4959 282 -268 96 188 -307 193 257 111 279 2 -114 57 -106 94 283 -445 27 -302 -162 201 -61 122
4980 122 -172 26 141 -365 181 -120 -384 92 -39 -261 79 -330 -253 145 -347 77 51 -207 -5 -251 209
5001 209 201 138 -127 -207 0 199 -84 57 101 -207 204 294 -229 325 46 -175 7 -122 274 48 -138 95
5023 95 -66 234 200 -65 336 -98 -110 385 -31 20 199 -335 -21 247 14 380 -285 -134 168 -80 266
5044 266 -90 -399 83 -29 -17 367 -105 -131 -73 -272 461 -255 -186 252 -687 76 202 -256 62 -284 -174
5065 -174 -194 -25 330 -155 -489 -2 -49 -127 395 -352 31 -54 -156 323 192 54 112 -183 320 455 -225 186
5087 186 -145 -187 199 122 -148 215 -51 435 -50 22 222 -135 118 -37 -138 351 -111 -1 297 -168 101
5108 101 143 -41 -11 -114 -16 86 -107 180 -82 -342 338 -178 -80 346 -368 130 -82 -172 176 -263 -122 141
5130 141 -368 -54 243 -195 -19 -207 -114 46 22 318 -144 -482 225 -184 -28 194 -155 -21 192 -169 40
5151 40 -368 -85 254 -259 78 135 -304 375 -24 -145 25 -16 194 123 -137 226 -39 63 74 -236 110 -86
5173 -86 -197 330 -76 -150 44 -444 147 132 -120 203 -26 -69 315 67 10 113 -199 107 -49 -81 170 -106
5195 -106 62 87 88 259 61 -57 560 -290 -67 8 -183 282 99 -82 145 -264 -63 -2 -408 114 -166 -140
5217 -140 54 -382 -34 56 -88 83 189 -4 255 -140 23 124 -47 195 139 -133 294 -182 43 -162 -216
5238 -216 17 -70 37 74 -228 212 -37 -237 175 -47 -352 388 -68 -45 256 21 51 -49 -3 -8 -171 200
5260 200 -163 -311 122 -191 -9 139 -124 -97 137 -292 19 46 -430 221 -53 117 30 96 84 -25 -139 -69
5282 -69 -36 179 181 -18 444 26 -78 420 -107 -120 272 -143 179 61 -7 161 164 -21 4 188 362 109 130
5305 130 47 -189 -10 117 -78 316 -124 -14 464 -165 27 79 -22 26 113 -117 142 -3 26 -95 -159 122
5327 122 -186 -96 -30 -288 -118 11 -242 102 129 -200 176 -247 -176 182 -116 37 -91 -75 114 -340 -75 257
5349 257 -123 289 -33 -20 341 -82 25 276 -197 185 -19 -133 148 24 -88 311 33 -92 -108 119 35
5370 35 -236 75 30 -102 183 346 22 143 -335 -62 197 -297 -49 324 -192 253 107 -77 36 26 -68
5391 -68 -92 38 260 -182 -8 196 -196 131 -163 -85 156 -90 -243 224 -329 267 -15 -142 196 -134 61
5412 61 106 -150 185 114 -12 425 -131 30 294 -221 -67 -118 -117 233 156 -24 71 -343 82 -35 -127 63 -66
5435 -66 -84 97 -98 210 -90 -172 137 -322 212 367 -169 25 -109 -77 90 -38 -182 211 -298 42 162
5456 162 -365 22 -114 36 73 -410 93 -93 -224 304 -408 49 348 -279 232 55 -251 113 -154 -142 397
5477 397 -58 -146 -180 162 252 -14 27 -113 -37 46 -105 176 175 -201 -28 279 -198 211 223 -319 173 148 -425
5500 -425 180 -270 61 -6 -252 176 -136 125 61 -308 194 -35 -133 449 -93 -200 88 -218 147 240 -205
5521 -205 48 -100 -53 56 -194 -67 -163 75 193 -157 -108 43 -135 265 99 -122 69 -356 -198 210 143
5542 143 208 321 -261 248 130 294 241 4 180 85 -93 61 -106 -25 236 -188 -163 278 -115 159 -36 -39
5564 -39 238 -38 -160 162 -143 190 116 -161 -38 -293 107 25 -25 279 -71 -3 77 -312 245 85 -264 50
5586 50 -139 -33 65 48 214 3 -180 251 99 135 117 -98 167 -183 -248 249 1 17 21 -218 315 183 85
5609 85 131 79 -136 281 -103 -31 58 -197 42 -137 116 150 64 17 38 -332 119 26 -66 94 -30 167 55 -143
5633 -143 18 -64 -191 239 -168 25 -96 -49 366 33 102 59 -377 73 77 -212 278 13 -79 113 -210 42
5655 42 211 -52 -41 -46 -33 279 -248 126 81 42 83 -30 102 407 -85 -61 45 59 98 44 26 49 -123 175 9
5680 9 -155 -58 -470 -95 -78 83 -28 72 -354 230 -22 -245 247 -346 107 285 -198 298 -137 -42 346 -240
5702 -240 -75 2 -401 131 -13 12 377 -208 209 173 -201 217 -71 204 134 -23 -99 139 217 131 -173 -78 191
5725 191 -286 259 220 29 81 32 -224 315 46 17 13 -65 -40 -93 101 183 -320 34 -129 -342 131 -32 -335
5748 -335 36 -199 -120 219 -358 79 -131 120 233 -195 -113 -45 -76 4 -26 -19 192 -224 24 29 -261 254 -41
5771 -41 -340 217 148 -76 354 -225 71 380 -51 165 -94 154 73 -141 268 -9 -35 263 -204 14 352
5792 352 -111 44 127 -126 166 -92 -298 16 -189 81 -69 217 37 -75 7 -14 120 105 -192 -5 140
5813 140 -442 -137 184 -151 -19 80 -136 10 -8 126 30 -108 26 -48 -27 175 -151 110 -6 -113 213 -74
5835 -74 -63 273 -45 -60 91 -199 -135 -42 -107 173 149 -265 -39 41 52 251 -46 75 -178 88 82 -291 150 116
5859 116 -257 156 -49 -68 202 -63 -6 119 -103 53 -210 113 -12 -180 320 16 18 335 -215 -150 372 -532
5881 -532 -54 191 -150 353 3 142 227 -39 20 166 27 131 108 174 16 -75 65 -96 8 376 -60 68
5903 68 173 -145 4 300 -126 235 -83 -33 241 -54 143 215 -110 273 -26 198 239 -288 314 -38 -157
5924 -157 167 -106 -100 198 -90 107 171 7 307 153 -50 153 -279 31 209 -23 165 -13 -143 27 -421
5945 -421 -22 46 -186 240 -156 -188 71 -32 -89 -68 33 -81 26 -133 123 -178 162 189 -39 61 70 -115
5967 -115 -71 -209 -8 -20 -434 252 -31 -60 169 -243 90 4 29 213 -30 -41 233 -205 -34 118 -205 261
5989 261 -52 -192 85 -4 142 97 -138 25 -132 -91 205 -358 193 -7 8 273 146 -102 237 -59 26 -60
6011 -60 -156 270 -91 -216 113 -261 341 26 -242 263 -136 -81 148 -152 -16 106 -53 197 -112 2 -183
6032 -183 -73 -30 -77 -283 249 -163 -75 385 -273 103 -80 -302 118 -6 -199 195 -40 71 123 15 215
6053 215 -8 -63 220 -188 231 -102 101 88 -117 -258 99 -82 116 -138 -341 174 -142 -95 374 -22 -104
6074 -104 56 40 154 -231 -176 112 -233 74 108 -153 67 21 55 122 -152 84 78 -313 200 216 -43 265 -117
6097 -117 153 84 133 149 -128 2 68 109 -121 223 -107 328 94 -169 502 -230 125 106 -56 126 167 88 142
6120 142 -82 53 -218 -116 294 -141 -83 242 -169 -19 271 -209 37 -118 -309 112 -103 -274 58 -252
6140 -252 -16 -56 -80 -79 55 -78 -24 -121 396 -229 -226 52 -174 74 192 -94 32 68 -122 147 -32 -53 133
6163 133 -128 175 -241 62 92 -343 167 -26 -6 155 -190 -206 116 165 24 204 -69 120 84 27 213 95
6185 95 76 80 71 212 -80 -99 259 -248 -136 62 -89 18 -14 -221 115 -185 -143 -6 21 49 119 55 -8 -91 -67
6210 -67 88 -336 215 87 22 193 -296 -9 153 -39 384 -78 -166 141 20 209 19 -386 120 -26 -36
6231 -36 16 -205 -123 202 -42 276 104 -293 151 -223 -172 339 -131 -99 -7 -319 217 13 72 13 -211 117 -97
6254 -97 -267 261 -62 -139 -52 108 74 19 -224 181 -52 9 138 -154 93 80 -275 130 -299 -297 18 -275 204
6277 204 206 -138 306 -126 -195 98 118 -29 159 -28 70 -341 -49 211 -160 160 -99 -172 -49 -50 -5 268 -440
6300 -440 140 6 -269 91 338 60 -7 214 158 -225 -171 138 -46 -37 258 -161 257 243 -50 119 72 -115
6322 -115 -95 -255 5 45 -89 -148 15 -189 30 -83 149 -317 -76 204 -65 38 119 -228 61 230 -193
6343 -193 287 -6 -75 70 -88 -27 145 -70 -53 86 150 151 -118 169 175 -41 133 -64 -92 104 -274 120 123 -212
6367 -212 368 185 27 55 -2 -19 19 36 89 -291 45 156 -250 210 0 -226 106 -184 -71 111 -299 -69
6389 -69 87 -141 3 -45 -86 16 -122 26 148 -90 8 -173 -35 247 -309 172 77 -225 22 93 -91 -28
6411 -28 -132 78 -19 -26 -13 -84 -110 22 -212 193 -51 -96 224 -284 -167 100 -345 151 162 -122 48 -66 13
6434 13 185 -356 159 91 -246 293 -58 122 220 105 102 -74 -183 169 -91 -148 275 -294 -29 -19 -293 16
6456 16 187 -56 331 -185 -66 -47 97 10 -92 116 -8 -72 -28 238 -35 135 -36 52 370 94 -255 95
6478 95 -125 165 -30 -286 118 -64 -109 -138 -183 170 -174 64 98 40 60 75 -178 212 192 -193 122 -242 25
6501 25 27 86 -6 39 -134 97 26 50 -20 226 140 78 27 60 -191 -35 77 -258 268 30 23 141 43 84 4 -151
6527 -151 -41 1 -158 239 -77 -74 -97 -73 69 -218 -62 124 -146 -42 -26 -158 63 174 -42 269 88 74
6549 74 174 -140 -1 -2 73 -68 -175 17 85 -70 205 -264 -231 134 -113 29 295 -101 -2 95 -309 38 -48
6572 -48 -248 7 -123 -121 -19 -8 103 -229 57 56 -44 112 -112 -75 182 3 -3 -24 -33 49 -49 -76 -162 -179 -4 271
6598 271 -342 65 10 -73 49 -144 -22 217 -158 312 -64 -152 85 -51 -78 124 8 -44 159 -39 43 -219
6620 -219 135 68 -62 261 43 68 215 -240 95 187 -55 91 -87 -100 35 231 101 108 -1 -77 76 149 -54
6643 -54 -120 -88 65 -144 -101 -187 18 241 -11 170 -79 -73 70 -2 -86 229 -9 -94 -165 -255 34 19 295 -68
6667 -68 21 3 136 -46 93 25 -198 134 -82 -21 245 -269 38 -119 -354 156 39 117 13 -82 29 -90
6689 -90 -262 133 15 -215 8 73 133 105 -75 223 -122 147 -12 -162 267 -161 -42 -53 -129 -177 -22 -146
6711 -146 105 47 44 -161 -254 67 49 118 83 -160 -174 204 -162 104 59 -195 96 -156 114 181 -100 -57 116 -265
6735 -265 191 202 106 351 -56 150 90 -70 81 -59 -157 456 -77 106 177 -89 155 -12 -125 197 91 -60
6757 -60 66 53 69 -51 76 -19 -39 -145 -82 -21 333 22 -32 180 16 -127 -61 -15 -96 78 60 178 -224 -167
6781 -167 8 111 65 41 -165 -110 -224 58 98 -152 39 -140 -20 -66 39 83 128 -14 -46 49 -94 237 -164
6804 -164 -176 -50 68 138 -4 -251 141 -68 53 285 59 -109 61 -21 312 -156 27 117 -140 281 -34
6825 -34 -33 28 -123 -186 101 185 -65 -30 -74 -44 88 183 174 -164 134 -140 -86 -7 -5 -128 -19 -48 -35 248 -63 220
6851 220 -281 -49 -72 -140 128 -49 -120 26 -58 21 -237 -3 205 -56 -159 96 -104 -255 229 -254 -190 34
6873 34 2 51 -196 -19 86 -127 107 -104 -198 33 -135 -9 205 -129 87 -95 103 121 -20 -197 105 -193
6895 -193 -1 7 -282 -17 -137 71 189 -43 314 122 -153 71 -98 325 401 69 204 -33 -131 247 204 -102
6917 -102 139 54 -127 181 14 -51 -229 182 -14 -44 88 86 -29 82 21 -69 193 41 129 35 -178 114 217
6940 217 -136 38 -11 36 -32 -29 70 -90 -16 -39 -75 34 -24 27 168 -59 4 274 104 -155 150 -118 -2 -44
6964 -44 17 85 11 81 4 155 176 -125 -38 206 -118 -14 116 -298 98 46 -245 -36 -53 -34 130 -71 -25 120
6988 120 -73 18 -219 190 -15 -44 -30 -126 44 121 -26 55 -309 -122 174 195 -175 -28 -83 7 -41 -156 -110 15
7012 15 -84 346 -10 -22 -37 -94 -56 -120 -171 -107 -68 -81 71 -77 -52 -80 -154 150 -148 117 218 152 81 -148 27
7037 27 11 68 118 74 -170 171 -41 3 135 -281 5 92 -189 -18 -172 -146 263 -74 7 -172 -260 6 9 312
7061 312 161 -75 67 23 -45 86 203 19 231 87 -170 -55 -244 96 38 -51 170 -25 171 -37 -127 70
7083 70 -195 -209 226 -138 -233 129 -260 107 -250 55 143 -33 15 169 -169 12 -56 -22 73 80 101 -69 -115 36
7107 36 -53 -94 25 -209 27 36 -64 221 -63 -149 177 -37 198 -154 56 121 104 -19 163 57 -1 136 -206
7130 -206 120 -111 22 107 151 -63 277 -247 46 8 -69 73 -93 -20 162 -128 147 -62 -68 114 15 -132 80
7153 80 -218 32 -91 -173 27 -238 63 82 -201 -51 69 67 201 71 -68 -273 52 106 -74 39 238 -266
7175 -266 29 265 -52 41 114 -224 122 -107 -43 277 -117 88 43 54 159 90 109 227 -82 133 -164 176
7197 176 222 118 92 273 298 27 108 -131 -38 44 -15 -75 130 57 31 -58 151 -39 21 -258 -61 329 101 -222
7221 -222 204 60 46 210 -77 -29 70 -10 105 -159 28 25 62 254 -43 -35 21 -63 -203 55 -299 -130 58 155
7245 155 281 60 146 -140 -65 37 -4 -122 102 -21 -32 -48 59 115 -59 -104 61 44 5 0 -216 155 24 -107
7269 -107 169 -185 15 100 201 -7 -253 -184 -174 -102 -33 -118 38 -77 -210 -58 49 -32 26 69 -90 -36 -36 168
7293 168 146 72 -92 29 -122 52 266 -3 -57 -13 208 103 -2 99 169 -152 21 -186 315 66 -148 -86
7315 -86 13 -138 2 -161 -177 197 -221 -36 3 -73 -12 -135 -199 113 -166 210 238 -59 122 -94 -46 29 120 -91
7339 -91 42 254 106 -54 78 15 49 209 85 -28 105 -118 -199 271 -260 -274 -29 147 81 -121 34 45
7361 45 -128 32 -28 70 72 -72 -98 -150 -149 -18 99 -122 93 6 -108 37 -197 108 -106 -142 72 70 -94 57
7385 57 -11 72 -66 50 90 -5 133 342 -216 -94 81 -110 71 -3 162 34 -107 11 15 -108 -200 -12 -74
7408 -74 138 -180 217 -104 87 56 85 28 100 -48 33 -125 -222 196 12 105 -39 184 112 126 71 1 -81 145
7432 145 113 43 -154 50 15 158 23 -131 -40 -178 119 122 -111 -87 -153 -110 -139 -160 90 33 140 -35 56 -37 87
7457 87 -152 -163 199 30 157 198 -27 112 6 -85 212 -17 48 -136 -225 41 -111 97 -151 -247 121 139 4
7480 4 127 -5 -117 -30 -18 -147 -5 -88 -108 -4 33 229 -24 67 -113 45 -50 -279 213 41 -194 -87 131
7503 131 26 95 109 281 190 -267 58 190 -138 -70 -19 180 111 -246 77 11 -5 -23 191 170 -78 -27 55 -27
7527 -27 40 -78 -59 -21 95 47 -132 -139 55 -39 62 103 176 -36 223 -154 71 100 111 58 10 -246 222 51 60
7552 60 262 -84 21 -58 -66 224 143 -81 -81 61 -112 1 71 75 141 -76 57 20 -91 6 -83 29 151 -338 183
7577 183 -85 65 -42 88 153 26 -110 -18 -247 -121 -38 -35 -320 -108 -10 0 56 -11 -33 -342 -34 -93 -16 48
7601 48 -269 51 162 -83 78 111 -160 8 -28 81 -33 -255 257 49 71 302 -44 -158 -35 -194 26
7622 26 -63 3 -70 12 1 59 -47 -6 -56 -141 366 -143 -189 -77 59 155 -214 36 -101 -190 -224 41 -119 -101 74
7647 74 155 269 38 70 -100 -54 29 -83 -121 -31 -51 20 145 -84 -132 -143 9 86 9 39 4 -108 3 31 -32 -77
7673 -77 3 59 34 -153 177 -79 -3 -67 -24 -50 -108 -23 79 130 169 65 134 11 202 77 168 -100 198 39 32
7698 32 324 109 -62 98 -31 -106 50 146 -69 119 5 121 -129 49 34 101 133 24 1 -3 14 11 349 14
7722 14 -4 169 -168 192 -48 -172 11 -2 -17 35 -93 -84 181 -93 218 -90 -64 -216 28 103 -30 51 -105
7745 -105 -146 102 166 -107 145 19 -77 92 -133 34 70 -122 -53 3 49 -99 -76 -125 63 -134 29 11 6 70
7769 70 114 -91 -84 2 -9 111 -112 66 -212 -69 -123 -115 144 122 11 12 -26 86 29 26 195 85 78 223 177 -111
7795 -111 8 -164 132 8 176 -19 83 -228 -120 -57 208 23 -42 104 35 -114 -133 -25 -14 -18 2 38 -64
7818 -64 -89 154 -30 229 142 -228 121 -138 -19 -109 82 -40 -256 4 -33 -164 -173 78 26 -161 -149 123 153
7841 153 58 4 -82 -108 -108 17 55 190 -44 -60 -253 24 106 -107 24 -56 -3 -12 21 -13 -22 -14 -115 75 -100 49
7867 49 86 -134 -29 117 54 176 80 -79 193 -112 122 126 -107 81 37 -76 -254 -211 -74 192 96 74 -62
7890 -62 -53 -60 -256 191 128 -112 152 -39 35 67 28 -176 -52 -33 -68 184 81 10 151 41 22 24 109 -30 112
7915 112 161 61 95 102 72 119 -30 -111 81 -84 3 -75 -88 4 118 -99 -46 -108 -87 169 -4 -63 -56 -35 -104 -204
7941 -204 86 98 -125 10 74 144 68 -41 57 37 146 -70 25 -30 -3 -153 15 6 12 26 -65 -95 -109 -57 153 -79
7967 -79 89 -96 -44 103 -278 24 -236 -48 207 64 -84 -27 141 -7 32 142 -86 131 161 -89 -3 -33
7989 -33 -64 11 73 -29 75 42 69 -103 -175 -233 115 123 115 -200 198 111 -29 123 -243 -36 -240 -57 175 -4
8013 -4 -13 141 -66 -75 103 110 -191 169 269 25 14 92 88 -57 117 -99 -52 -8 -33 -136 146 43 27 -2 -59 -12
8039 -12 -171 -11 24 -53 33 9 -69 11 40 250 5 -20 150 -80 -39 166 -145 -53 101 -32 37 45 -45 -171 -35
8064 -35 39 -38 -91 70 57 -22 -20 -153 -16 -77 -5 -71 202 109 -55 131 -159 30 -31 87 99 -101 0 -3 185
8089 185 51 -102 89 -173 89 124 45 43 216 -11 -45 33 -146 309 -21 40 -192 -116 -32 -124 224 49 24 26
8113 26 -153 22 -56 67 128 18 36 -73 40 55 6 -31 -27 -124 116 -3 41 -67 -24 -80 -64 -223 -102 34 -11
8138 -11 -169 90 -192 76 45 21 -55 8 -160 -25 7 -80 19 -161 47 -47 10 -23 1 56 283 -28 -230 -122
8162 -122 104 151 -3 -77 -18 -246 46 50 22 -179 -196 -61 -107 -4 -39 54 -104 87 -31 -64 10 -33 -9 97 -48
8187 -48 139 -115 58 95
8191I5
$$ Imaginary data points
##PAGE= N=2
##DATA TABLE= (X++(I..I)), XYDATA
0 0 0 0 0 0 0 0 0 0 0 0 8 -8 8 -8 16 -16 24 -24 32 -40 48 -56 64 -74 88 -101 117 -136 155 -177 205 -231
32 -231 262 -295 331 -373 418 -467 520 -578 643 -715 790 -873 963 -1063 1171 -1293 1425
49 1425 -1567 1725 -1902 2099 -2319 2565 -2846 3168 -3542 3986 -4511 5153 -5955 6993 -8382
64 -8382 10342 -13312 18287 -28065 54075 -257219 -576116 275574 -44651 -344991 251371
75 251371 -1187 -567617 -85915 144191 -196873 -97484 6974 -299340 -219766 38189
85 38189 19813 -26563 -176728 -225936 3973 -69921 -37573 204840 -164613 -328838 133603
96 133603 31024 -143165 180228 -3154 -322932 32310 163495 -83499 64086 67258
106 67258 -233447 8229 202027 -37442 109152 103416 -228300 86384 260134 -71767
116 -71767 131464 202707 -211735 13277 327364 -4506 -27376 211834 -67057 -138977 245364
127 245364 128446 -119262 63104 12364 -106554 83529 83158 -7366 -33081 -119250 11880
138 11880 68549 -87693 43217 53134 -214642 -35519 184262 -86756 -94780 150844 -88217
149 -88217 -177526 208414 75034 -195129 98196 52614 -188647 101181 134704 -121566 -550
160 -550 39649 -81096 29026 69878 -31065 -10719 538 -32979 50218 58913 -45430 23747
172 23747 41352 -67803 73258 114136 -72170 28366 79335 -70294 52891 112759 -40840
183 -40840 9939 56518 -29658 23076 68593 -20438 -14700 37038 -32372 -7216 67459 -53203
195 -53203 -51484 50265 -71789 -44221 79839 -68642 -75114 45714 -57086 -58539 48944
206 48944 -23588 -66784 9429 -1800 -47540 9248 11361 -58392 -9605 7686 -42021 14034
218 14034 -5031 -57317 9304 -19495 -39322 35735 -20246 -46619 18881 -17485 -30726 22733
230 22733 1766 -35301 -228 19765 -23649 2154 33397 -32662 -4986 42202 -16543 15879
242 15879 37669 -23167 14732 29087 -2995 31364 22548 -2763 16816 16039 8577 10855 17058
255 17058 2550 -6583 25599 5502 -9780 26563 -10835 -14018 32667 -3488 2354 26529 -11955
268 -11955 1975 15223 -1623 9747 4728 974 1717 -1014 9726 -7041 -4079 6719 -15011
281 -15011 8017 10432 -15497 9352 -6001 -18531 11326 -8664 -8480 4822 -16837 -6537 -6019
294 -6019 -13555 -3381 -14799 -6167 -3988 -14248 4806 -9548 -13788 5770 -14125 -2231 8314
307 8314 -12994 3673 -2068 -12019 6386 -7512 -2644 5320 -9888 4767 -1086 -7182 8365
320 8365 -6674 2342 9944 -5571 11771 3860 -4446 12999 -3022 3038 11990 -5115 9227
333 9227 2644 -4929 10760 -3943 3651 12339 -3747 12589 6969 -1857 14953 254 5427 13840
347 13840 -2059 11644 4891 -3482 10884 -5301 1075 9676 -6461 9368 3405 -6765 9192
360 9192 -5818 -2081 7450 -8029 4539 -269 -9723 2909 -11544 -7110 195 -13876 1327
373 1327 -4672 -12732 3282 -12938 -7907 2940 -13055 2500 1100 -9895 4595 -7819 -6824
386 -6824 2050 -10357 1186 -2402 -9442 2534 -12002 -6438 27 -14854 2852 -1349 -10146 9293
400 9293 -6601 -5157 8440 -7836 4643 7604 -3187 9425 1600 2278 9467 1038 12508 7685
414 7685 5628 19817 4727 12387 18930 -541 18109 15538 2000 21218 5528 -580 13904
427 13904 -1125 4844 9418 -1266 3883 -440 2230 3224 -3214 8107 -3586 -3863 14282 -6301
441 -6301 39 9091 -16100 1715 5856 -11517 6917 -4640 -17093 -1055 -10072 -9919 -2970 -11285
455 -11285 -14500 -13621 -5163 -14377 -19612 -2251 -25124 -23671 7472 -22660 -19232 3597 -31621 -18420
469 -18420 5258 -16275 -4849 1817 -12952 -4616 3861 2902 -188 5724 2859 -6553 16398 8702
483 8702 -9523 17250 -4927 -17011 26658 1728 -9342 22476 -9708 -11798 21432 3278
495 3278 413 15201 1146 -3731 16187 15036 -2824 16347 11799 -15395 28367 26584 -16796
508 -16796 28658 16487 -29407 32160 30501 -19729 19224 17907 -23181 5990 26363 -7904
520 -7904 -11089 11413 -12153 -15299 17845 -6102 -15756 1601 -21394 2085 16222 -20681 10806
533 10806 6180 -38012 21657 29562 -27248 13456 22815 -34739 261 44041 -14786 -21534 31668
546 31668 -16840 -29585 47399 -892 -39851 24713 -12073 -27785 39495 -740 -27103 12519
558 12519 -17054 -15923 30338 2451 -20458 9192 -3563 -17034 32136 18732 -29907 11858
570 11858 10646 -21104 38738 20666 -34423 11999 -4274 -21993 39851 2321 -37352 9892
582 9892 -16778 -33159 34112 5047 -57609 713 9722 -50512 21708 39589 -73456 -19287
594 -19287 41706 -45954 4529 55048 -54607 -37055 33919 -14577 -6154 30760 -23398 -37711
606 -37711 10240 7158 -72 13403 -24566 -28561 14503 -5728 7942 28865 -48598 -27778 38042
619 38042 -19915 3870 49057 -45313 -34287 50976 3366 -4799 49941 -10839 -40373 48166
631 48166 38188 -12672 39746 8368 -44831 43364 43757 -15340 34668 1209 -45039 38256 34899
644 34899 -12909 24887 -1870 -40190 25043 39103 -12493 5722 7416 -37244 13079 48290
656 48290 -14719 -3146 7795 -40038 15338 42095 -18004 4020 -2230 -43647 19879 33723
668 33723 -23258 -1042 -478 -44556 5093 41951 -28203 -28734 12243 -42753 -19103 53479 -21620
681 -21620 -43858 15572 -31019 -20028 46922 -6473 -31878 4920 -14044 -5247 32157 1319
693 1319 -23704 64 -6918 -4801 35991 2412 -33209 10463 -6247 -15840 47207 4305 -40468
706 -40468 15190 -1831 -17046 38023 8608 -33836 2713 7392 -8638 21425 15135 -28831
718 -28831 -6064 15147 -7792 20800 20349 -32813 -962 17091 -13620 24423 18630 -33090 -908
731 -908 13465 -11474 13227 13768 -24760 -14073 12760 -3904 -1240 15913 -19954 -21082 18184
744 18184 -2370 -607 20735 -20807 -15052 17826 -4984 4841 16725 -16431 -10862 10989 1573
757 1573 1908 10876 -5861 -14519 11238 10765 -3449 13456 -4008 -19921 14942 7004 -4776 16847
771 16847 -8746 -17448 11900 2173 -1550 10042 -5251 -11565 4828 10122 -603 2119 2077 -13082
785 -13082 3505 15463 -4368 4672 1702 -18776 5809 9354 -7294 7132 -2969 -15531 3516
798 3516 5855 -2517 -1656 -1402 -6807 -4392 10731 2138 -9009 1585 -7068 -5747 10791 -2074
812 -2074 -3405 -305 -12153 2505 6229 -4663 3673 -1886 -7778 4213 5993 991 -2984 453
826 453 -45 -5200 9592 5438 -10877 2195 52 -5956 9110 2191 -3287 1221 -3874 4022 4379
841 4379 -1157 3977 -1839 -1805 4994 2055 1949 -3016 -1705 3781 -3556 4721 6367 -8006 1616 3032
857 3032 -3595 5931 2407 -736 2225 -1462 4636 1440 -2636 4181 -2240 -870 4881 -1760 283
872 283 -2306 -3494 3113 -3474 1110 4281 -6457 1555 1882 -4752 2834 -1615 -2320 1618 -3572 1245
888 1245 -1328 -5992 1310 -3265 -1902 2801 -3617 633 -1283 -3123 3566 -4112 -1304 3314 -5630
903 -5630 1307 1085 -6274 314 -3155 -3018 1769 -3321 197 -1217 -4154 2433 -1594 -59 3057 -2961
919 -2961 3231 1682 -1275 5962 -1832 10 6215 -2272 3960 4802 -2889 3274 1305 731 4890 872
935 872 3426 1309 -13 4973 -1084 1697 3851 -3883 3964 1636 -4114 4444 -2771 -3574 4763 -2951
951 -2951 795 3553 -3240 310 106 -523 922 -978 2020 -2507 -2585 2836 -6692 -2185 1906 -9416
967 -9416 -161 839 -8784 545 -2681 -8020 47 -3156 -3083 -338 -2713 -1657 -3811 -882 -1123 -3979
983 -3979 3312 -1912 -2751 5951 -3875 -449 6746 -5516 2938 7287 -4232 5121 5011 -3604 3118
998 3118 3688 -295 1503 4443 1350 -3597 5090 1900 -5969 7692 1497 -5432 10447 576 -3497
1013 -3497 9898 -974 -552 8661 14 2134 5215 -168 420 2646 1700 -1646 2502 2738 -5685
1028 -5685 4368 3055 -9120 6205 1324 -10774 8612 261 -10694 6417 -1673 -8965 5003
1041 5003 1037 -6652 1089 3265 -5693 -1300 7536 -5395 -2017 9656 -5770 -9 9682 -8309
1055 -8309 349 6243 -8203 3860 3649 -8661 1705 -205 -7988 1141 1590 -7227 -2497 3977
1069 3977 -7186 -4332 9005 -8835 -6981 12655 -8689 -5643 14364 -10137 -7666 11214 -7281
1082 -7281 -4706 10023 -3966 -6508 4713 -435 -6027 4527 1952 -9007 4118 2005 -8616
1095 -8616 6825 -1607 -11464 7803 -3110 -7106 11895 -5057 -8367 10409 -3278 -3883 12528
1108 12528 628 -7021 9175 5431 -7141 10294 8569 -13420 7939 12068 -13281 9496 11034
1121 11034 -17908 5181 10776 -11180 6373 8772 -11688 -418 8658 -3452 -162 7910 -5604
1134 -5604 -4932 9720 -2311 -1553 9063 -9713 -2350 11803 -7420 3912 9738 -15176 1429
1147 1429 12498 -8701 3616 9969 -12834 -5039 12527 -4356 -7362 10883 -7537 -15007 14720
1160 14720 410 -13540 11173 -6328 -14291 15435 1700 -7987 8538 -6238 -8805 10420
1172 10420 2803 -5173 3856 -2182 -9620 7179 7309 -9736 2201 1038 -13483 9895 8467 -13013
1186 -13013 3802 -2032 -13531 11107 4854 -9953 3240 -3316 -10229 7771 6879 -9093 -1164
1199 -1164 3097 -10393 5520 15511 -11947 -3699 9459 -11270 5952 17988 -11442 -3519 6984
1212 6984 -8291 5081 12241 -6550 -5387 3202 -2658 2236 11511 -3632 -9378 6726 -1075 129
1226 129 16638 -5707 -10948 9646 -3578 573 16044 -6597 -9311 5677 -1449 1578 10093
1239 10093 -2452 -10052 2376 3755 -1400 8084 -864 -14955 3655 3566 -5730 10361 -3216 -17391
1253 -17391 4511 1150 -4980 8830 -3319 -13598 321 3589 -2285 2756 1533 -11481 -2831
1266 -2831 8835 -3001 1087 3875 -14121 -1990 9265 -4136 4054 2118 -12609 -338 5376
1279 5376 -1008 3624 852 -6279 -2004 5750 2542 -311 3145 -5475 -4777 9053 926 -463 5515
1294 5515 -9112 -3227 9104 -1062 3322 5317 -7260 -788 6406 1942 1863 3045 -2330 -4912
1308 -4912 5645 5786 -3300 3389 -1121 -8237 7406 5044 -2664 4832 -3594 -5198 5943 2568
1322 2568 1412 1936 -3860 -2279 2007 3362 833 -1395 -547 -4798 1550 6067 -2890 477 -42 -7267
1338 -7267 4436 5076 -2869 2617 -2478 -4967 3544 1785 -172 -652 -3157 -2434 -685 2695 -904
1353 -904 -4114 313 -4046 -1420 6229 -3788 -2799 1399 -5982 971 4424 -2889 -1108 -1699 -2621 409
1369 409 16 979 -2275 -2258 1739 -391 1757 1397 -3635 1024 -271 -370 4946 -2359 -1889 2203 -3519
1386 -3519 1047 3091 -2696 -480 -43 212 1270 -478 1245 -1764 -1038 4324 -162 854 2111 -2976
1402 -2976 1763 1556 -145 3713 -2065 -1757 3271 -1478 940 1486 -3174 -196 618 1901 967 -2229
1418 -2229 497 -1918 -1299 4559 -1066 -1746 200 -3515 1177 1531 -1356 1299 -2726 -1004 4073 -158
1434 -158 1430 1021 -2553 1075 1971 2775 1349 -2561 497 -1159 -798 4733 -1468 -2291 886 -2411
1450 -2411 1734 2026 -1591 720 -2266 -613 3601 -152 116 -487 -2681 682 895 1967 667 -3361
1466 -3361 961 -622 -1013 4642 -1657 -2566 1939 -1677 1316 1988 -2764 -521 -2093 -974 2444 -1281
1482 -1281 -1266 -1864 -3099 24 -876 712 -204 -3986 1642 32 -1990 3875 -1623 -2621 3479 -426
1498 -426 906 2399 -1860 -290 -226 343 1891 -206 855 -639 -728 2222 -1049 1016 1536 -3118 2823
1515 2823 1562 -2679 3543 -1003 -3116 3364 -171 -802 2450 -539 -752 657 1910 499 -147 3030
1531 3030 -659 -410 4138 -2306 -211 3468 -3610 942 2586 -4319 936 160 -3995 1093 21
1546 21 -2297 -325 -285 -1267 -1651 1395 -1105 -2830 2987 -1602 -2905 4055 -3312 -3074 4229 -3803 -1135
1563 -1135 4209 -3770 -1274 2815 -2479 -823 2150 -321 -2453 2077 870 -4147 2172 1050 -5357
1578 -5357 3224 1068 -4973 4444 -112 -4615 4594 -428 -2250 4798 -90 -1502 3389 984 -1498
1593 -1498 2630 2833 -2939 2134 4399 -4443 2312 4530 -6428 2727 4456 -6504 3244 3891 -6096
1608 -6096 2184 2811 -4123 1133 2971 -3154 -1027 3438 -2792 -2484 4630 -3313 -2649 6063 -4048
1623 -4048 -1717 6329 -5033 -1036 6304 -4895 -57 5608 -4606 -1357 4363 -3378 -2675 4314
1637 4314 -1857 -5066 5106 -549 -6688 6522 -663 -7301 7842 241 -6541 7512 -725 -5760
1651 -5760 6349 654 -4186 4973 1041 -4639 3011 2824 -4712 2459 3950 -6058 2893 4852 -7247
1666 -7247 3398 3646 -8357 4305 3662 -7508 3936 1938 -8024 2410 3422 -6178 880 4170
1680 4170 -6291 -883 6570 -5768 -2119 7901 -6652 -2066 9726 -6325 -2906 7483 -6954
1693 -6954 -2210 7695 -4189 -2575 5135 -3526 -3293 5420 -912 -4176 4858 -584 -4719 7039 -432
1708 -432 -5982 6814 -1517 -5113 8995 -1326 -5407 6989 -1953 -4328 7425 354 -4803 4751
1722 4751 1087 -5258 5235 3791 -7155 2933 3624 -7575 4822 4322 -9365 3163 3039 -7773
1736 -7773 4800 3325 -7696 1825 2604 -5641 2141 4576 -5624 -1136 5107 -4566 -536 6758
1750 6758 -6553 -2865 6769 -5354 -264 6921 -7000 -1855 5536 -4342 468 5535 -4348 -2780
1764 -2780 4542 -1295 -2181 5062 -2357 -5325 5587 -411 -4521 6468 -2792 -6278 6961 -741
1778 -741 -3211 6642 -2877 -5227 5438 29 -2929 4064 -754 -5570 3541 2859 -5544 2738 2079
1793 2079 -7799 3595 4960 -6377 2630 2081 -7280 3201 4007 -3891 1539 1250 -3875 1073 3419
1808 3419 -1696 -773 2241 -2215 221 5036 -2039 -522 3678 -3825 2100 6228 -3575 1443 3641
1823 3641 -4546 2342 5174 -2719 -63 3083 -2035 -860 5160 -482 -3788 4054 -442 -3368 5932
1838 5932 159 -4881 3995 -906 -3040 4508 -618 -2842 1047 -1511 -1712 1169 54 -2038 -745
1853 -745 16 -2254 872 862 -4027 -42 -33 -3629 2558 -45 -5068 1133 -1796 -3646 2778 -443 -3479
1870 -3479 291 -777 -2501 820 1748 -2676 -1550 2521 -2026 -58 4150 -3195 -1780 2887 -2290
1885 -2290 1210 3486 -2386 -818 486 -495 1320 1538 233 -1079 104 1314 433 2022 27 -2373
1901 -2373 1321 209 -107 3638 -1834 -2104 2237 -1310 1262 3323 -1492 -1097 376 402 1194 1508 682
1918 682 -1941 -271 2186 -47 1461 1005 -3540 335 1728 -165 2795 -576 -2657 759 220 1588
1934 1588 2425 -821 -1125 -567 1159 1838 543 713 -2157 -1241 2924 567 928 907 -3311 -8 2033
1951 2033 344 2139 -714 -2597 274 472 1332 879 -1536 -1403 -1464 595 1339 -1280 -476 -2128 -1907
1968 -1907 2572 133 -592 104 -2971 -518 1629 -85 656 -1166 -2213 -57 -132 878 -106 -1861
1984 -1861 -541 -1012 830 1439 -1677 -410 -868 -1325 2432 299 -886 536 -2047 -223 1656 -465
2000 -465 386 -393 -706 840 -44 1100 203 -1016 1109 -29 466 1890 -941 478 365 -876 1941
2017 1941 69 -423 1045 -949 108 804 -822 459 -60 -109 844 -493 725 162 -682 1300 -428
2034 -428 -147 1203 -913 583 758 -1362 839 -398 -597 1392 -420 -152 298 -836 361 245 199
2051 199 615 -1282 195 70 -844 1206 -685 -972 844 -1162 584 682 -1546 625 -380 -783 1626
2068 1626 -310 -303 181 -855 329 331 355 434 -1147 137 70 -493 1302 -893 -996 1109 -657 529 944
2087 944 -1604 155 17 -775 1296 53 -581 11 -555 375 -79 185 91 -1238 1055 642 -925 1496
2105 1496 -668 -922 1637 -397 699 1425 -1253 93 263 -484 651 -75 -455 -207 -362 556 -438
2122 -438 171 406 -1697 1141 838 -1401 1315 -664 -1573 1726 -410 -502 1158 -1285 -526 487 -146
2139 -146 -130 -105 37 -617 -133 1275 -1068 -73 1007 -2013 635 1328 -2175 934 261 -2368 1169 34
2157 34 -1372 627 -355 -932 139 359 -221 -591 897 -637 -561 1939 -1734 -1023 1931 -2364 -159
2174 -159 2111 -1974 301 1190 -1902 287 1071 -647 209 805 -325 -416 1258 -134 -1592 1789 58
2191 58 -1822 2698 -372 -1784 2462 -1086 -990 2836 -579 -591 1972 -138 -700 1256 558 -1084 970
2208 970 1338 -1775 1143 1468 -2519 1371 1509 -2521 1985 1326 -2338 1996 507 -1834 1807 497
2224 497 -1065 886 582 -1296 26 1290 -1559 -486 1969 -2189 -544 2288 -2783 -180 2094
2239 2094 -3150 492 1851 -2700 -62 1204 -2007 -352 1222 -1334 -1325 1148 -952 -2116 1759 -523
2255 -523 -2340 2421 -831 -1910 2934 -1191 -1848 2453 -1121 -1188 2449 -604 -893 1439 -406 -1381
2271 -1381 1455 1008 -1890 1346 1415 -2401 2074 1341 -3039 2192 1303 -2461 2536 1000 -2608 1809
2287 1809 617 -1683 1252 1115 -1397 108 1490 -1285 -30 2436 -1870 -396 2747 -2030 140
2302 140 2467 -2905 104 2197 -2331 975 1542 -2313 -339 1265 -1271 -356 1738 -963 -1603 2025
2318 2025 -587 -2188 2376 -1147 -2550 3058 -941 -1741 2462 -1202 -1599 1782 -427 -927 1107 -205
2334 -205 -1119 915 681 -1360 643 537 -2028 1330 1210 -2223 1555 37 -2743 2184 746 -2036
2350 -2036 1684 -26 -1838 1464 1025 -1342 653 1248 -1490 119 2299 -1887 -737 2344 -2095
2365 -2095 -324 2559 -2430 -405 1654 -1610 414 1332 -1228 4 457 -483 -8 691 -266 -832 864
2382 864 -231 -1173 1842 -640 -1318 2245 -1032 -883 2599 -1418 -967 1855 -1167 -595 1700 -595
2398 -595 -1164 881 321 -1277 765 452 -2331 933 1274 -2165 1157 812 -2301 1185 574 -1676 1129
2415 1129 251 -999 634 296 -687 -113 391 -510 -326 1251 -1048 -465 1311 -1629 -8 1710 -1638
2432 -1638 335 1373 -1655 528 904 -1245 281 605 -409 -219 429 -112 -587 792 259 -863 1297
2449 1297 39 -1039 1913 -619 -989 1777 -630 -242 1254 -838 -381 432 -364 25 124 168 -621 3
2467 3 1107 -687 250 624 -1579 693 748 -1212 1129 -286 -1419 1050 -134 -284 736 -444 -622
2484 -622 17 13 301 -177 561 -831 -534 1493 -427 -352 436 -1870 174 1241 -764 702 -113 -1593
2502 -1593 524 431 128 662 -253 -244 -318 727 684 -498 352 -466 -717 1923 124 -850 825 -1510 -286
2521 -286 1507 -370 436 -169 -1063 434 610 419 -41 -606 74 -232 699 1021 -1092 -62 -64 -871 1466
2540 1466 607 -1008 763 -710 -358 1023 -77 2 -201 -491 254 99 587 -13 -855 286 -300 145
2558 145 894 -935 -130 270 -1061 1228 841 -932 762 -359 -82 979 86 225 -122 -257 231 -236
2576 -236 700 195 -756 682 -198 -173 1026 -705 -282 636 -894 674 708 -563 512 -190 -379 270
2594 270 -81 195 -612 -156 507 -430 330 276 -849 471 -197 -344 971 -580 -449 202 -1226 -52
2612 -52 31 -599 177 -481 -402 -213 -400 258 -439 -288 306 -763 233 651 -855 539 -143 -893 704 -146
2632 -146 -192 372 -826 -125 503 -43 454 -159 7 -66 -112 812 -186 -240 572 -687 43 941 -525 469
2652 469 30 -465 776 210 116 765 -573 422 663 188 692 -9 -1 116 -235 802 -164 -313 603 -667
2672 -667 -40 1023 -656 -127 73 -365 497 -89 -48 254 -587 155 -53 -438 699 -492 -7 135 -557
2691 -557 334 -342 -861 405 -556 -78 984 -794 -145 69 -737 510 -185 -268 104 -559 8 -184 8
2710 8 218 -676 6 418 -415 332 -176 -900 1039 -119 -34 876 -401 89 167 -191 474 255 -71 330
2730 330 -177 466 240 -20 488 -383 260 627 -531 677 327 -808 775 132 -315 607 -298 -46 458
2749 458 -345 359 -89 -78 191 -54 609 -9 -71 450 -887 -74 647 -901 470 193 -1099 294 -121
2768 -121 -528 372 -209 -465 -130 -285 37 -317 -34 47 -512 352 -133 -801 609 -610 -206 849 -573
2787 -573 -6 376 -891 139 288 -407 414 -258 -204 -8 180 348 -366 117 74 -594 749 -24 -760 733
2807 733 -300 -565 1005 3 -68 1140 -313 -78 417 395 158 51 638 -11 211 617 -603 116 603
2826 603 -686 396 600 -788 555 280 -639 617 -88 -360 405 -244 -213 -139 237 -100 -422 524 -417
2845 -417 -261 908 -602 -620 676 -890 -148 587 -912 345 335 -684 85 -122 -523 6 73 -100 -463
2864 -463 223 -191 -583 588 14 -774 1105 -116 -684 1133 -659 -442 697 -214 -104 446 -1 -266
2882 -266 261 231 -275 2 560 -434 81 588 -736 397 564 -650 754 340 -562 652 -284 -516 559
2901 559 -184 -89 35 -14 -336 -60 240 -415 -226 714 -697 -57 1231 -777 -93 442 -1067 239 702
2920 702 -659 1 245 -426 -226 455 -53 -647 317 189 -784 672 383 -642 664 65 -313 825
2938 825 -336 -450 687 -431 71 481 -170 28 197 62 -68 79 424 -818 81 603 -610 518
2956 518 696 -764 494 219 -784 717 -111 -544 425 -26 -320 193 185 -212 -139 273 -341 -502 781
2975 781 -416 -705 791 -616 -158 773 -700 211 303 -530 123 229 -171 119 7 -251 -27 193 184 -356
2995 -356 418 -219 -949 748 -184 -776 610 -513 -322 805 -154 -407 284 -237 211 275 -81 124 14
3014 14 267 -160 253 315 -673 426 452 -810 827 229 -940 601 -4 -510 872 167 -287 -282 -99 75
3034 75 -341 119 -42 -318 206 -215 -92 556 -667 310 228 -614 648 582 -589 -29 236 -402 289 173
3054 173 -224 -398 -100 178 -431 117 165 -709 133 -116 -283 360 -599 -208 303 -497 84 310 -898 82
3074 82 -49 -186 280 131 63 -474 4 384 -492 290 338 -722 -27 103 -620 289 -518 -514 219 -625 -271
3095 -271 289 -339 -91 352 -62 -94 110 542 -210 -129 727 -199 114 765 -383 428 317 -388 351 258 -502
3116 -502 454 15 221 379 -183 205 -3 -78 63 -168 415 -227 -471 550 -688 -273 794 -243 -89
3135 -89 198 -356 219 162 -62 79 -135 -12 92 -301 110 -106 -205 20 -440 51 -168 -723 236 -469 -472 272
3157 272 -331 -280 173 -323 -41 76 -179 75 -328 247 219 -34 422 -226 -190 533 -268 453 104 -354 495
3178 495 96 -231 504 -34 57 357 -249 209 164 47 431 -349 384 121 -232 491 -268 -7 661 -30 249
3199 249 364 44 474 330 -275 187 -119 -98 368 -140 254 -100 24 135 -534 -26 36 -654 235 -310 -319
3220 -319 273 -617 -384 170 -561 -54 168 -516 -13 -255 48 49 -247 47 -379 -223 -2 -544 230 134 -723
3241 -723 480 -74 -420 289 -392 -484 263 -242 84 133 6 413 -135 188 185 -160 384 133 181 305 -256
3262 -256 481 376 -283 711 351 -345 661 -191 -208 347 64 21 -95 10 177 -180 325 4 -590 490
3282 490 -94 -255 231 -309 -284 200 -616 406 -47 -265 285 57 -196 310 -177 -105 -144 -53 176 -394 205
3303 205 -145 -739 277 -61 -430 290 -372 -384 318 -416 -50 138 -196 150 90 102 61 -183 226 -232 -53
3324 -53 425 -222 120 423 -230 406 335 -58 612 -94 -73 415 -206 143 89 -170 -240 -220 -18 -192 -211 164
3346 164 -413 71 439 -523 -232 633 -620 -114 328 -405 -38 102 -223 -22 -158 84 -56 -248 116 -353
3366 -353 80 85 -422 311 -230 -546 452 -373 -168 426 -461 -49 412 -272 216 -185 -135 10 14 160 -50 -7
3388 -7 412 -146 369 310 -246 456 72 -570 549 1 -157 734 -267 -140 127 -107 77 -59 267 175 -168
3409 -168 266 -111 -445 323 -254 124 245 -535 295 -82 -535 273 -251 -261 129 -263 -195 136 8 -68 -287
3430 -287 87 -173 -367 221 12 -283 363 -362 -279 693 -475 171 424 -241 266 301 -172 26 120 131 -231
3451 -231 98 329 -384 142 245 -442 296 374 -287 299 -264 -369 544 -167 95 490 -336 141 -33 13 172
3472 172 -81 270 -329 -128 368 -511 -239 422 -666 61 87 -577 299 97 -511 428 -133 10 -66 -201
3492 -201 191 -65 186 215 -157 375 -39 -131 510 -337 -193 511 -425 34 363 -266 25 -58 -122 159 -254
3513 -254 62 224 -197 89 -177 69 45 -167 320 179 -202 498 -102 -303 454 -291 -42 556 -151 149
3533 149 189 -49 -58 -107 36 -151 0 42 -118 -202 181 -563 71 102 -591 242 -69 -353 432 -16 -169 295
3555 295 -137 128 200 118 58 -126 314 475 -80 667 15 -173 489 -182 31 191 -321 211 -178 -327 174
3576 174 -71 -263 34 -34 99 -52 -74 184 -258 254 172 -126 398 -197 -269 332 -296 -160 212 -334 135
3597 135 -50 -431 27 -268 -324 16 -149 5 -105 83 171 -418 174 187 -467 376 21 -435 335 -141 152
3618 152 131 -18 217 32 -59 541 -241 -35 274 -124 243 -13 -86 342 -170 211 400 -419 127 -20 -461
3639 -461 96 91 -69 -39 -382 259 -197 121 233 -345 -91 225 -195 272 20 64 359 -311 108 262 -170
3660 -170 178 159 -503 156 -285 -89 19 -183 295 -184 -206 431 -181 -26 238 -121 167 32 -7 273 -468
3681 -468 173 145 -672 251 170 -336 188 -238 93 -227 -177 204 -205 -253 253 -163 -135 193 -359 37 -42 -182
3703 -182 127 -94 109 60 -391 224 141 -291 47 103 3 -18 -30 244 -182 -247 364 -227 1 299 -387 202
3725 202 63 -104 229 -3 63 72 -243 296 220 -234 200 118 -24 312 -102 237 -1 -149 451 -169 154 303
3747 303 -172 82 239 -277 236 -58 -98 59 -548 127 -224 -236 196 -314 -216 351 -455 -169 -14 -217 24
3768 24 -46 -105 83 -157 -6 -69 -296 36 -90 33 162 -512 81 125 -301 62 -207 -274 179 -326 292 -50
3790 -50 -41 121 -190 -405 268 21 14 175 -258 -11 -9 2 201 -285 221 176 -289 260 24 -27 214 65 116 163
3814 163 -204 141 -275 -106 329 -206 -194 83 -174 249 -29 37 44 -178 185 -37 -160 86 -95 -223 299
3835 299 -316 -25 140 -266 166 265 -181 238 -189 -2 110 44 344 -216 -80 4 -357 81 222 -394 159
3856 159 -307 -66 361 -188 17 -28 -254 167 123 63 141 -354 -301 -153 -236 305 -145 -205 210 -484 79 301
3878 301 -404 315 -141 -173 306 -3 53 35 -109 -28 -34 -42 107 -205 -126 -342 -136 439 -226 -201 410 -130 297
3901 297 477 -249 -21 -50 -58 225 -67 5 -164 -49 327 110 5 191 -510 -23 133 -202 347 49 -412
3922 -412 310 -402 -17 585 -68 -13 -81 -128 171 -31 265 -197 -368 32 -209 40 236 -318 -77 344 -305
3943 -305 508 6 -416 28 -352 -72 294 -199 -48 -253 -66 -200 -107 187 15 -287 128 -97 -125 323 -437
3964 -437 -248 97 -197 224 222 -279 121 -127 -261 479 -5 83 -62 -167 314 -2 199 -104 -295 290 83
3985 83 -140 375 -51 250 251 -148 220 297 -229 119 142 180 262 -30 -30 -287 -5 364 -270 134 7 -372 324
4008 324 37 -308 744 85 -308 360 -184 -88 -264 -117 -79 -408 174 75 -68 140 -134 36 -56 -372 65
4029 65 197 -595 342 79 -294 454 -170 -179 348 -12 100 52 -12 -42 -182 153 310 -179 53 -107 -386 263
4051 263 -220 53 184 -457 51 127 -344 128 -67 -167 55 -296 310 3 125 333 -251 -93 285 -319
4071 -319 183 -75 -183 353 4 -135 265 -48 70 224 -43 303 -36 -159 55 -183 118 -8 -131 187
4091 187 -231 -13 244 -238 247 111 -211 390 14 227 337 81 202 66 78 384 -137 -74 84 -196 216
4112 216 7 38 153 -136 -240 283 -178 22 301 -340 171 -177 -146 22 -57 82 80 -177 66 -285 -140 74
4134 74 -241 -22 222 -268 176 -239 -415 302 -196 -211 -166 -196 6 -240 -214 -191 -175 122 71 -120 180 -136 -280
4157 -280 215 -506 104 269 -141 134 -273 -91 183 -160 105 148 -213 196 -38 -64 -6 -167 121 80 -273
4178 -273 63 -147 -70 421 -229 47 320 -279 305 -246 -72 398 86 95 126 20 446 -38 -188 287 -163
4199 -163 238 198 -26 389 -92 157 335 -401 227 173 -292 156 -65 93 321 -98 6 -37 -164 67 -521
4220 -521 -203 262 -453 70 209 -326 99 -198 -74 181 -125 216 -84 -292 281 -301 -319 330 -250 -28
4240 -28 -230 -211 130 -86 -97 173 -298 181 110 -259 442 2 -104 130 14 133 225 -252 173 126 -136 301
4262 301 -333 -115 194 -150 96 -65 -125 204 -34 -91 190 -211 174 -80 -121 211 -201 259 35 -315 160
4283 160 -118 152 316 -104 -92 -18 -346 190 -129 -144 295 -162 -142 -63 77 206 -15 -276 42 -321 -112 135
4305 135 -316 142 -19 -199 340 -263 -91 -54 -421 179 -29 -31 209 -228 -171 -18 -70 258 -75 -345 106 -103
4327 -103 230 251 -344 27 118 -102 276 -6 -208 40 -228 29 225 33 157 -201 -44 78 -84 377 -40
4348 -40 -252 315 -183 67 284 -151 -27 -149 6 562 -205 254 -93 -177 73 222 -3 69 -247 98 77
4369 77 69 437 -289 -159 72 -33 -25 291 -242 -79 -200 -134 190 160 39 -92 -469 80 -35 146 306 -66
4391 -66 -181 77 193 559 -93 -201 376 -319 270 185 -203 102 -97 -201 275 157 56 238 -451 20 225
4412 225 -30 371 -221 -186 112 -101 458 -86 -328 158 -220 -28 417 -357 -224 -22 -324 315 24 -143
4432 -143 -20 -563 127 242 -81 252 -188 -361 -43 -343 262 -192 -633 276 -329 -114 188 -260 109 265
4452 265 -29 220 -44 -69 -138 -138 127 471 6 395 -104 -39 140 -275 325 285 -163 235 -269 244 366 -260
4474 -260 -15 112 48 213 129 -24 69 -361 272 107 -69 218 -164 -157 383 -82 238 -32 -282 218 -172 -18
4496 -18 208 -23 -2 10 -300 -2 1 -100 -281 -405 241 -92 -135 256 -465 -234 339 -181 207 50 -401 25
4518 25 -73 -24 262 -224 -65 101 -80 18 -88 118 32 -532 312 -121 -125 253 -161 -334 256 -47 26 136 -323
4541 -323 240 -89 47 280 -92 20 37 -237 362 17 71 73 7 216 286 -193 367 -40 -182 111 -111 -266
4563 -266 99 -146 162 -189 34 134 -222 176 -218 22 170 -252 44 330 -217 555 241 -427 317 -50
4583 -50 -65 204 -131 194 -73 -114 114 19 75 49 -347 99 162 -37 182 -121 -101 143 -405 129 205 -427 52
4606 52 -47 -193 122 -118 155 -112 -202 135 -119 81 217 -410 -41 93 -259 238 -55 -22 191 -188 234
4627 234 -29 -381 95 24 -256 53 -365 -172 15 -282 268 84 -98 351 -121 262 213 -144 368 -17 -161
4648 -161 63 -144 13 -52 -4 151 -83 -143 86 -185 106 -53 -257 128 -130 -107 184 -292 -14 155 -26
4669 -26 323 71 -110 112 -103 -15 235 -73 452 -17 -147 333 -159 -55 -27 -305 24 -124 -32 244 -37
4690 -37 104 -118 -279 302 -110 -18 55 -248 25 259 -382 311 84 -66 204 -150 104 279 -3 86 40 -34
4712 -34 296 77 133 -20 -200 179 79 32 291 -160 242 204 -323 315 -40 -77 315 -199 64 44 -51 11 61
4735 61 -26 332 -331 484 -61 -349 286 -368 -308 321 -324 -55 216 -224 113 9 -233 81 -334 -131 53
4756 53 -215 77 -422 -72 344 -487 -11 35 -268 373 -49 -189 64 -256 18 -57 -342 111 43 -196 -23
4777 -23 -242 182 -75 -5 14 -247 -131 366 -267 150 238 -221 344 78 40 386 40 20 238 -188 312 -90
4799 -90 -151 160 43 59 170 -300 206 -266 -205 440 -290 28 226 -290 60 -31 -138 128 -197 35 142 -209
4821 -209 60 -66 -171 179 -210 19 85 -400 169 85 -176 382 -185 -185 125 -331 140 -68 -203 98 -289
4842 -289 -174 4 -285 51 -133 -206 265 -129 54 145 -404 39 119 -393 335 -249 48 287 -121 -14 -3
4863 -3 -178 136 -241 75 175 5 120 -287 4 314 -286 184 182 -264 179 69 -154 235 35 -103 56
4884 56 -52 158 -6 -15 217 -71 168 187 -70 145 -42 -106 282 -138 87 96 -467 210 200 2 127 -125 91
4907 91 140 -14 145 -82 -130 162 -349 54 94 -96 340 -172 -165 124 -262 180 -78 -394 -49 191 -163 221
4929 221 -86 -76 20 -86 44 72 -178 40 -316 -48 360 -106 230 69 -328 187 -121 36 212 -468 57
4950 57 -69 -234 129 -1 27 46 -197 194 -15 -187 44 -159 45 368 -242 156 -88 -156 174 -129 124
4971 124 230 -387 93 191 -108 42 -132 -135 99 106 106 -117 -227 -137 -407 -309 559 -108 110 -55 -225 104 -26
4994 -26 169 104 -282 -65 178 -154 280 -21 -222 -45 152 344 177 -205 39 -224 46 397 33 170 -41
5015 -41 -435 283 74 -12 54 -286 186 -43 -244 378 -59 -52 -67 -178 285 96 -128 14 -327 -31 553 -346
5037 -346 -57 -188 -230 206 -131 61 -36 -496 -3 -69 -250 228 -65 -234 -23 -215 248 185 -196 299 -241
5058 -241 -63 430 -106 131 79 -283 184 5 65 145 -102 184 167 140 444 -164 -133 280 -37 119 187 -419
5080 -419 137 -295 -2 267 -36 -286 2 -242 -128 91 -26 139 -90 370 -74 -139 337 -296 -219 256 -347
5101 -347 286 43 -397 320 24 -259 245 -142 -201 185 -99 -4 -58 183 341 -345 -107 30 -211 322 -349
5122 -349 -236 249 -248 183 51 -397 248 -107 -112 224 -223 -83 -14 -144 -78 268 90 155 -379 99 -14 -138
5144 -138 119 -105 -264 200 6 246 55 -168 179 -46 142 477 -132 113 -69 -247 302 -66 36 -38
5164 -38 -208 158 13 -33 150 -310 -245 227 -134 94 246 -297 195 -167 -145 243 -139 -35 252 -9 279
5185 279 98 88 126 -321 71 33 -173 42 -19 -139 184 -202 95 24 -151 245 -296 -212 94 -107 -2 -15
5207 -15 -304 11 -118 1 -8 -264 -64 92 -178 133 -311 -224 333 -332 -93 131 -33 303 26 -291 220
5228 220 -123 -240 48 -207 75 133 -168 241 -98 -57 -115 -234 202 -56 -225 320 -232 77 199 -405 218
5249 218 59 -107 -29 -49 -119 -130 -111 -22 -65 -21 109 -15 124 67 -460 267 -339 -123 253 -78 220 139 -202
5272 -202 460 231 -425 218 -101 -63 473 113 161 -142 298 269 -351 62 158 -313 200 -209 -243 265 -240 -77
5294 -77 49 -42 -52 -103 -325 198 33 -8 27 -22 225 -317 -188 410 -371 96 -100 -379 166 -182 -98 181 -152
5317 -152 -30 109 -115 -32 22 -183 -20 55 127 76 -209 128 48 -244 243 -111 109 189 -199 35 313 -28
5339 -28 276 225 -105 152 22 127 -67 -13 234 -245 77 190 -134 154 -113 -194 340 -167 -103 298 -204 87
5361 87 -67 -119 32 -58 -104 331 -70 29 -286 -83 347 -2 15 -14 -282 235 -118 -14 275 -267 34 284
5383 284 -191 -11 161 -205 204 -34 -11 32 65 225 -65 -193 -56 -193 59 148 -273 286 103 -212 354
5404 354 25 -144 226 -108 5 65 -238 189 -38 -11 -12 -168 29 -50 -81 249 19 73 118 -207 319 -73 -326
5427 -326 411 -2 -55 248 -177 93 7 -210 -72 55 -324 151 -349 -60 -76 -355 193 -187 10 235 -306
5448 -306 124 -80 -488 -1 -97 -179 223 -142 127 -115 -286 61 -59 -79 93 -184 -26 9 -99 314 -219
5469 -219 -50 200 -395 -20 232 -98 132 -99 -100 17 111 210 123 -97 187 -300 -52 215 -309 151 8 -216
5491 -216 192 -119 -329 105 -259 337 -9 -309 246 -113 -154 -101 47 29 97 -400 261 42 105 18 -249 236
5513 236 -197 -388 233 47 -39 253 -163 37 64 89 161 -16 -71 198 -4 113 240 -259 32 21 23 261 -241
5536 -241 172 13 -310 280 -134 96 60 -282 -79 302 108 -7 75 -103 -202 -282 181 -76 -278 249 -80
5557 -80 6 251 -218 -5 67 -284 81 -13 -302 59 -195 240 199 20 103 -88 -117 -121 9 223 -3 -430 137
5580 137 0 121 307 -91 -135 38 -122 207 183 -41 -55 -275 -138 186 -121 121 -92 -18 296 -116 104
5601 104 123 -517 69 125 113 359 -163 -78 299 -39 118 -67 -19 12 -359 -71 -4 -38 86 -220 -104 268 -151
5624 -151 129 165 -319 119 -75 -4 103 -101 -126 -112 -150 237 198 -95 -152 -195 283 101 35 290 -364 70 97
5647 97 -65 -82 170 -282 122 17 -89 366 -23 -8 114 28 249 -49 139 142 -409 143 231 37 183 -58
5669 -58 -13 167 -157 2 -118 -13 -48 11 -287 22 -286 -74 245 -184 337 -47 -222 -112 -159 -125 276 -186
5691 -186 -69 -189 -71 23 0 223 -115 -306 142 95 -28 115 78 -40 22 -247 182 14 -88 123 -199 -86
5713 -86 60 -101 28 -269 -79 105 -109 95 33 -142 75 -107 -194 378 -412 -54 -5 -311 59 -23 -304 157
5735 157 -239 142 -95 -56 -59 13 -67 251 -97 108 295 -178 523 95 -156 49 -220 17 71 1 141 127 -310
5758 -310 4 -42 -73 63 -179 -60 54 -50 309 62 -86 191 -358 -40 41 -80 343 -230 -98 199 -175
5779 -175 4 -115 119 105 -399 -161 71 -447 211 -147 -107 351 -109 123 282 -340 -3 25 -54 41 -171 8
5801 8 -168 -389 33 -106 -213 278 -211 60 121 -281 162 167 -280 359 -87 -306 249 -173 -48 38 -412 87
5823 87 -82 161 205 -195 63 -74 -60 330 -143 151 245 -253 156 -31 -299 141 -109 -243 117 23 110 280
5845 280 -110 115 -172 -10 71 -198 149 -108 0 259 -153 -131 193 -174 187 -36 18 54 -43 106 358 -247
5867 -247 99 9 -213 189 -14 -62 -47 -112 128 37 -149 465 -12 144 249 -88 109 143 -193 319 -25 -34 28
5890 28 -206 256 -31 -138 11 -70 -1 4 -455 38 -115 18 358 -160 -57 200 -323 169 -180 -104 -96 -63 141
5913 141 -92 -268 255 236 -133 167 -269 -134 203 -344 34 146 -305 136 -133 -189 305 -109 71 89 -369
5934 -369 166 -65 -135 -72 -181 -32 -43 -117 61 -25 -96 144 -330 -38 -32 -259 -21 -6 -237 188 -25 -76 192
5957 192 -364 201 -44 -64 18 -164 -14 -35 23 250 113 -68 168 -157 213 -63 -27 319 -30 -85 204 -245
5979 -245 111 300 -9 229 -134 -173 115 -73 -101 59 -6 0 -214 56 155 -272 -29 228 -376 80 -126 -192
6001 -192 48 -185 -198 -84 -174 -79 -216 56 151 -357 -12 -65 -244 322 -201 -202 15 -216 87 157 -131 229 3
6024 3 -47 270 -286 25 114 -107 96 -173 145 208 -283 14 55 -58 227 -104 -80 234 -302 102 216 -25
6046 -25 53 27 -137 327 40 -182 -69 -91 295 164 42 164 -289 95 210 -114 28 103 -127 52 -354 -44
6068 -44 56 -31 109 -92 63 216 -69 -231 9 72 149 0 -173 70 132 375 173 28 267 -71 -180 321
6090 321 -289 -59 240 -11 174 -5 57 246 -333 41 -64 -83 212 -126 20 75 -257 -67 161 -302 312
6111 312 -99 -109 292 -363 -172 120 -128 94 -104 -101 206 -101 167 15 -351 -96 -25 -220 88 -232 -63
6132 -63 192 -331 186 179 -223 124 -112 -67 120 -228 -21 -65 195 138 -26 90 51 -221 213 -158 90 429
6154 429 -127 -98 132 -234 130 190 6 150 82 -193 155 -241 7 209 -243 251 -52 129 52 11 371 35
6176 35 -23 256 -63 -139 56 -212 294 51 -203 87 107 239 95 -258 242 -114 -208 280 -285 -114 -6 -269
6198 -269 -105 59 -96 110 -83 -38 293 -145 -11 25 -128 17 -202 116 171 -94 125 -65 -276 195 -141
6219 -141 -251 87 -240 267 120 -154 363 -263 101 -16 -144 194 -97 -60 124 -76 108 181 -283 107 -31
6240 -31 -412 301 -42 153 199 -99 46 178 -33 18 -216 -25 52 -224 157 -31 -264 45 -138 26 233
6261 233 -155 71 66 -191 3 -102 75 -74 83 32 65 -39 382 -266 82 12 -137 301 -51 -197 -142 87
6283 87 94 225 -196 37 138 33 159 -18 104 249 -186 127 -67 -11 92 -180 -23 91 -372 17 170
6304 170 60 269 -92 -152 -4 -97 225 113 -365 118 -245 62 70 -130 212 -27 -224 85 -12 39 152 -174
6326 -174 -110 254 -227 124 -20 -11 -25 51 18 94 -72 214 -237 -161 316 -232 233 206 -271 170 -37 -191 -104
6349 -104 -123 84 -46 -67 172 9 98 210 -105 133 -45 -118 122 -49 -56 103 -130 -54 326 -96 -37 -126 213
6372 213 118 -108 93 -261 21 -19 -219 -143 129 -126 86 28 -274 223 -306 -407 -6 -97 -64 28 -41 -172 -328
6395 -328 173 83 -64 41 16 -111 203 -182 -85 242 -167 140 190 -174 296 39 -327 -52 -84 -33 97 164
6417 164 -49 -32 89 81 8 210 49 -324 254 162 48 273 -118 -13 50 29 191 175 -235 174 56 56 157
6440 157 -163 182 -87 -19 10 -276 302 -149 -227 252 24 -157 -23 -71 98 89 116 114 204 -80 159 -164 -125 84
6464 84 127 -6 -172 85 47 -207 29 193 -220 -60 167 -282 118 49 -12 -40 -102 306 -53 -31 232 -15 231
6487 231 -4 -69 112 -81 -150 86 -161 0 321 -58 363 -68 -83 185 -56 123 159 -87 -1 44 30 151
6509 151 -216 56 -105 -106 -34 -160 -6 -16 25 260 -73 -180 216 166 -281 23 146 38 -75 -73 100 197 24
6532 24 72 -67 86 141 -188 176 -293 -18 181 13 -161 287 -169 171 149 -6 87 -93 -8 232 -73 233
6554 233 208 -88 249 -168 7 55 -329 122 19 66 242 -98 -16 -21 -12 356 24 -199 84 -118 -28 -140 -134 99
6578 99 -140 142 -59 -139 89 35 -275 83 35 -253 165 11 -44 82 -91 -43 -154 67 287 131 202 16
6600 16 -158 157 -59 51 141 -113 127 46 65 326 -28 -14 110 -141 -98 222 -195 -64 -190 -161 -123 -258 -41
6623 -41 -53 -67 70 -111 -102 47 -302 -66 119 -61 140 196 55 -188 -296 81 50 -119 39 -179 -8 -124
6645 -124 46 -42 -138 -101 -58 -48 -160 150 -36 -65 206 -294 160 63 -97 239 -346 196 6 50 208 -5 69
6668 69 100 61 21 140 30 192 -129 -368 292 -206 144 -65 -182 96 42 -262 253 70 -4 44 -32 293 -128
6691 -128 -10 284 -168 68 317 50 93 155 18 101 -172 -5 41 -132 177 -239 -114 -59 -145 41 166 4
6713 4 216 40 6 86 -157 3 33 -277 202 115 143 87 33 -43 37 14 119 -214 -140 220 -81 -71 80 17 160
6738 160 -104 -102 252 -255 222 16 -101 63 167 -111 234 20 181 0 71 196 27 -276 -88 -209 139
6759 139 142 -143 185 -192 -206 9 38 -231 52 -281 217 205 72 89 80 -80 129 -121 238 33 -178 131 18
6782 18 -63 197 -20 251 -63 -136 294 145 -72 -123 -198 289 20 -48 127 -161 -14 163 -74 117 56 -116
6804 -116 303 -157 -46 63 99 70 162 -261 59 -132 -149 -152 52 70 94 -34 50 -263 -163 114 -76 274 -71
6827 -71 -126 225 -34 -106 291 -283 136 -239 -11 106 39 -173 71 9 99 90 -276 -93 -134 42 16 150 -8
6850 -8 144 -118 -220 -131 -52 -65 9 38 -165 -90 121 7 133 67 -68 31 63 -261 125 -169 -257 7 -58 -81 -45
6875 -45 9 -179 98 12 159 89 253 -67 237 293 -216 -108 179 -269 -18 84 26 166 -105 -182 -12 -108 65
6898 65 131 94 -15 -167 121 204 -50 96 -68 -143 294 36 -112 111 -116 -144 273 -98 -2 16 -107 266 7
6921 7 5 -7 136 -136 -76 53 -103 -41 -34 -9 -210 44 -2 21 190 0 -27 -59 159 41 -45 -66 -46 48 197 51
6947 51 60 145 -218 -82 299 91 -42 177 -134 156 86 -215 58 -174 -127 34 -107 158 33 4 -57 154 231
6970 231 -67 74 164 -141 273 174 -221 12 41 -169 9 93 -187 -67 -367 39 208 -44 -79 -310 18 -14
6992 -14 -102 193 -110 -90 -11 62 -100 194 -254 13 164 -268 25 -38 -42 33 -73 139 274 -30 196 2 121
7015 121 60 102 23 160 114 167 109 -194 31 81 -27 142 -76 171 50 107 -102 137 176 150 -12 158 -65
7038 -65 -103 103 -78 -8 133 129 -135 -66 91 162 -247 -99 98 -204 90 -102 -264 50 8 47 -190 105 137
7061 137 -20 -49 6 -52 -89 -11 -221 112 -33 -156 34 -202 104 -84 0 -213 -14 9 -133 -204 -74 108 -107
7084 -107 148 13 -198 218 -52 -95 -17 -4 241 -85 30 -74 26 109 40 -29 5 47 192 -49 -127 -19 73
7107 73 -174 -74 132 -111 115 -28 -53 117 24 10 258 -103 204 -296 -182 -86 30 -12 -109 -2 125 -83
7129 -83 39 53 -131 255 -81 -78 51 -72 -18 206 -42 -23 125 -187 -48 -104 67 -73 -48 140 -93 141 201
7152 201 -7 -120 75 -177 135 73 16 96 -33 69 167 -95 141 -132 -132 156 -58 108 -68 78 176 78 -29
7175 -29 40 -74 197 208 -74 99 -43 27 6 137 -118 219 -85 -242 58 10 70 -94 -255 -12 18 10 34 15
7199 15 47 -228 -37 189 -55 213 -89 82 32 168 135 -56 -107 187 45 -80 79 -246 -20 -45 -276 18
7221 18 41 -41 261 -70 -229 131 145 147 106 11 209 2 -113 -107 -54 -25 -64 -163 -84 -51 34 16 215 15 12 -101 26
7248 26 -24 -106 -17 -5 177 -118 55 -168 -158 12 42 -259 88 71 78 105 -156 109 283 -26 -51 -141 -197 12 -134
7273 -134 5 34 -29 226 18 -119 137 37 -66 -25 -49 86 -109 -204 243 19 -82 84 -177 173 71 -161
7295 -161 147 70 -35 250 -25 31 -37 166 149 -18 -205 200 -14 -98 149 -128 143 -62 165 27 -102 60
7317 60 69 -164 -38 -222 -17 -57 -97 140 -158 -31 1 100 4 -46 -243 -113 1 -214 43 -38 -219 254 -124
7340 -124 157 -14 39 133 -85 -76 87 -62 -63 79 -330 203 -108 -99 0 -273 -148 -116 -269 -139 -68 -164 32 9
7364 9 170 132 -262 106 -162 183 67 -301 29 -205 -87 134 -90 -113 182 -108 -3 -81 -39 120 -46 74
7386 74 215 -92 201 27 -56 202 -54 -7 137 -92 145 98 -172 -52 -25 42 -95 -18 165 68 98 94 -42 362
7410 362 -193 -275 -141 142 -80 126 -110 -167 203 76 80 46 53 4 113 7 320 -201 -62 42 2 112 -156
7433 -156 -68 102 2 85 -22 -23 182 -253 53 -89 -179 -32 112 -190 99 10 -101 62 -153 -95 19 -140
7455 -140 115 -159 42 -24 11 -124 -82 -40 155 -34 -141 -59 -48 -87 -138 -52 159 -8 217 177 -276 208 118 -361
7479 -361 163 136 67 -29 -13 137 36 129 125 -18 220 -246 12 136 71 158 -159 -69 -208 -84 -25 -69 76 -128
7503 -128 -43 9 -12 -43 -102 -135 -16 55 -43 103 -269 96 -102 256 -77 -223 35 -125 -187 87 -149 52 -62
7526 -62 75 142 140 178 -4 -12 31 232 44 97 -31 -122 2 -15 -142 256 96 12 -33 -101 328 -36 109 135 -66
7551 -66 12 48 -149 -26 90 29 -9 -105 230 20 39 251 20 -161 -38 -77 -77 -99 -31 59 -61 -29 -96 -106 8
7576 8 51 -89 89 -113 20 33 -113 -251 -266 -129 -19 -83 94 -115 103 82 -88 -4 -54 102 35 46 150 160
7600 160 31 -96 -59 173 50 86 121 238 -76 -10 184 119 151 89 -228 133 7 -57 88 -40 22 -26 34 78
7624 78 70 108 15 92 -188 -183 171 69 -149 -104 38 -178 -109 81 -307 -69 51 -242 -52 -102 -157 -38 -136 165
7648 165 133 31 94 -86 -48 91 -52 80 -30 148 -17 -126 42 -43 -128 -193 72 108 -5 -46 55 92 47
7671 47 -107 40 -112 182 -177 32 -35 -193 155 -43 126 98 165 54 -175 148 -99 -49 -214 69 -25 -72
7693 -72 31 -145 76 24 36 76 67 11 163 -122 -268 -49 35 194 191 -14 106 -251 -189 -12 -64 15 -25 -159 98
7718 98 169 -118 -113 -157 181 173 -128 101 9 117 -88 -198 26 66 0 9 -37 -80 2 165 108 -92 5 -15 -100 42
7744 42 106 32 -25 -112 -102 130 -126 229 -31 -75 -79 -97 172 89 -21 154 106 46 51 78 194 119 -65 -60 69 -291
7770 -291 199 -55 -91 -2 -254 144 -30 -241 113 35 -101 110 -19 -271 -90 87 180 36 -87 71 11 -28
7792 -28 29 -94 165 73 4 -82 -26 111 -102 -42 89 -88 208 69 -227 182 -3 2 135 125 -115 82 33 176
7816 176 86 -122 248 67 -77 198 -22 79 47 97 -115 123 9 -127 8 42 105 93 158 0 69 56 -98
7839 -98 -133 94 -2 190 44 19 47 93 192 -48 -132 25 -21 -280 -28 -98 34 89 -79 179 -43 -274 -178 -165
7863 -165 237 -49 -25 -204 44 -55 82 15 116 163 -135 129 90 17 120 -141 -150 -18 93 112 84 85 -9 96
7887 96 -40 125 77 9 11 219 -23 42 72 -34 -68 95 156 38 -46 79 -46 -74 115 22 115 31 84 -61 131
7912 131 73 -208 107 88 -269 32 16 -75 -107 88 -95 -36 120 -5 -90 98 26 -20 142 -170 -83 -236 -7
7935 -7 151 -206 65 44 -185 -9 127 -234 41 117 -98 42 -21 -148 44 -35 -47 -156 136 160 -131 167 68
7958 68 -286 -25 -97 -88 -148 18 -8 72 -27 -166 105 -53 -89 17 -69 -176 -31 205 29 13 15 101 -281 -83 -3
7983 -3 -18 99 -246 46 66 -49 12 -84 -168 84 -208 2 -32 -43 13 1 30 -17 -15 56 -74 -190 107 -139 -82 57
8009 57 -115 120 71 -14 75 84 48 16 47 63 31 37 -47 -76 91 -182 -75 298 -166 -168 -178 13 152 60 -21 152 43
8036 43 -263 -3 -75 20 36 -243 19 -152 38 90 -179 86 3 60 61 82 -28 -70 -44 -96 80 -38 113 -253
8060 -253 123 -13 -91 224 86 -45 -8 -106 -69 152 -17 80 37 24 -45 90 36 -36 -58 -1 -57 -6 33 -40 -185
8085 -185 124 -143 -200 -4 -16 125 -169 -34 199 -42 -35 -95 241 -32 169 27 -111 -47 -27 -231 -38 180
8107 180 -15 -144 206 -120 72 -122 -166 179 -59 107 105 -239 -21 91 12 -69 -39 249 271 159 -105 -33 84
8130 84 53 101 -247 -82 -4 21 25 -124 24 -27 24 -212 46 38 0 -103 259 41 1 -193 39 21 51 -182 11
8155 11 -219 13 61 -68 -89 71 -165 62 110 -146 236 -6 -89 134 -151 -2 -25 102 -7 80 96 -73 -246
8178 -246 101 153 -52 19 -73 107 32 -108 -22 -39 18 -11 114
8191A14
##END NTUPLES=NMR FID
##END=
