##TITLE=1H_57-2021
 CDCl3, 8 sc, 
 27.07.2021
##JCAMPDX= 6.0         $$ Bruker NMR JCAMP-DX V2.0
##DATA TYPE= NMR FID
##DATA CLASS= NTUPLES
##ORIGIN= UXNMR, Bruker Analytische Messtechnik GmbH
##OWNER= root
$$ XWIN-NMR		Version 3.5
$$ Tue Jul 27 11:37:42 2021 Russian Standard Time (UT+4h)  she@DPX200
##.OBSERVE FREQUENCY= 200.131506
##.OBSERVE NUCLEUS= ^1H
##.DELAY= (6, 6)
##.ACQUISITION MODE= SIMULTANEOUS
##.ACQUISITION SCHEME= undefined
##.AVERAGES= 8
##.DIGITISER RES= 18
##SPECTROMETER/DATA SYSTEM= spect
##.PULSE SEQUENCE= zg30
##.SOLVENT NAME= CDCl3
##.SHIFT REFERENCE= (INTERNAL, CDCl3, 0, 15.7039)
##AUDIT TRAIL= $$ (NUMBER, WHEN, WHO, WHERE, WHAT)
$$ ##TITLE= Audit trail, XWIN-NMR		Version 3.5
$$ ##JCAMPDX= 5.01
$$ ##ORIGIN= Bruker BioSpin GmbH
$$ ##OWNER= she
$$ F:/spectra/data/she/nmr/H-F/1/audita.txt
$$ ##AUDIT TRAIL=  $$ (NUMBER, WHEN, WHO, WHERE, WHAT)
(   1,<2021-07-27 11:36:16.59 +0400>,<she>,<DPX200>,
      <created by zg, POWCHK disabled, PULCHK disabled
       configuration hash MD5:
       00 E9 B6 7A A2 85 ED C7 34 08 36 98 17 FE 4E 26
       data hash MD5: 16K
       E5 2C C3 02 9C F2 02 9A 8D 85 87 99 19 CB B5 50>)
$$ ##END=
$$ 
$$ hash MD5
$$ 46 E3 DA E5 D1 5A A4 6C F2 7D 53 1E 6B 3D 3B 09
##$RELAX= 
##$RELAX= 
##$RELAX= 
##$RELAX= 
##$RELAX= 
##$RELAX= 
$$ Bruker specific parameters
$$ --------------------------
##$DU= <F:/spectra>
##$EXPNO= 1
##$NAME= <H-F>
##$PROCNO= 1
##$TYPE= <nmr>
##$USER= <she>
##$AMP= (0..31)
100 100 100 100 100 100 100 100 100 100 100 100 100 100 100 100 100 100 
100 100 100 100 100 100 100 100 100 100 100 100 100 100 
##$AQSEQ= 0
##$AQ_mod= 1
##$AUNM= <au_zg>
##$AUTOPOS= <>
##$BF1= 200.13
##$BF2= 200.13
##$BF3= 200.13
##$BF4= 200.13
##$BF5= 200.13
##$BF6= 200.13
##$BF7= 200.13
##$BF8= 200.13
##$BYTORDA= 1
##$CFDGTYP= 0
##$CFRGTYP= 5
##$CHEMSTR= <none>
##$CNST= (0..31)
1 1 145 1 1 1 1 1 1 1 1 1 1 1 1 1 1 1 1 1 1 1 1 1 1 1 1 1 1 1 1 1 
##$CPDPRG= <>
##$CPDPRG1= <>
##$CPDPRG2= <>
##$CPDPRG3= <>
##$CPDPRG4= <mlev>
##$CPDPRG5= <mlev>
##$CPDPRG6= <mlev>
##$CPDPRG7= <mlev>
##$CPDPRG8= <mlev>
##$CPDPRGB= <>
##$CPDPRGT= <>
##$D= (0..31)
0 1.2 0 0 0 0 0 0 0 0.06 0 0.03 0 0 0 0 0.0002 0 0 0 0 0 0 0 0 0 0 0 0 
0 0 0 
##$DATE= 1627371376
##$DBL= (0..7)
120 120 120 120 120 120 120 120 
##$DBP= (0..7)
150 150 150 150 150 150 150 150 
##$DBP07= 0
##$DBPNAM0= <>
##$DBPNAM1= <>
##$DBPNAM2= <>
##$DBPNAM3= <>
##$DBPNAM4= <>
##$DBPNAM5= <>
##$DBPNAM6= <>
##$DBPNAM7= <>
##$DBPOAL= (0..7)
0.5 0.5 0.5 0.5 0.5 0.5 0.5 0.5 
##$DBPOFFS= (0..7)
0 0 0 0 0 0 0 0 
##$DE= 6
##$DECBNUC= <off>
##$DECIM= 32
##$DECNUC= <off>
##$DECSTAT= 4
##$DIGMOD= 1
##$DIGTYP= 9
##$DL= (0..7)
0 120 120 120 120 120 120 120 
##$DP= (0..7)
150 150 150 150 150 150 150 150 
##$DP07= 0
##$DPNAME0= <>
##$DPNAME1= <>
##$DPNAME2= <>
##$DPNAME3= <>
##$DPNAME4= <>
##$DPNAME5= <>
##$DPNAME6= <>
##$DPNAME7= <>
##$DPOAL= (0..7)
0.5 0.5 0.5 0.5 0.5 0.5 0.5 0.5 
##$DPOFFS= (0..7)
0 0 0 0 0 0 0 0 
##$DQDMODE= 0
##$DR= 18
##$DS= 0
##$DSLIST= <SSSSSSSSSSSSSSS>
$$ [...]
##$SUBNAM2= <"">
##$SUBNAM3= <"">
##$SUBNAM4= <"">
##$SUBNAM5= <"">
##$SUBNAM6= <"">
##$SUBNAM7= <"">
##$SUBNAM8= <"">
##$SUBNAM9= <"">
##$SW= 20.0188882624521
##$SWIBOX= (0..15)
0 0 2 0 0 0 0 0 0 0 0 0 0 0 0 0 
##$SW_h= 4006.41025641026
##$TD= 16384
##$TD0= 1
##$TE= 0
##$TE2= 300
##$TE3= 300
##$TEG= 300
##$TL= (0..7)
0 120 120 120 120 120 120 120 
##$TP= (0..7)
150 150 150 150 150 150 150 150 
##$TP07= 0
##$TPNAME0= <>
##$TPNAME1= <>
##$TPNAME2= <>
##$TPNAME3= <>
##$TPNAME4= <>
##$TPNAME5= <>
##$TPNAME6= <>
##$TPNAME7= <>
##$TPOAL= (0..7)
0.5 0.5 0.5 0.5 0.5 0.5 0.5 0.5 
##$TPOFFS= (0..7)
0 0 0 0 0 0 0 0 
##$TUNHIN= 0
##$TUNHOUT= 0
##$TUNXOUT= 0
##$USERA1= <user>
##$USERA2= <user>
##$USERA3= <user>
##$USERA4= <user>
##$USERA5= <user>
##$V9= 5
##$VALIST= <valist>
##$VCLIST= <CCCCCCCCCCCCCCC>
##$VD= 0
##$VDLIST= <DDDDDDDDDDDDDDD>
##$VPLIST= <PPPPPPPPPPPPPPP>
##$VTLIST= <TTTTTTTTTTTTTTT>
##$WBST= 1024
##$WBSW= 4
##$XGAIN= (0..3)
0 0 0 0 
##$XL= 0
##$YL= 0
##$YMAX_a= 207486
##$YMIN_a= -144829
##$ZGOPTNS= <>
##$ZL1= 120
##$ZL2= 120
##$ZL3= 120
##$ZL4= 120
##$ABSF1= 10
##$ABSF2= 0
##$ABSG= 5
##$ABSL= 3
##$ALPHA= 0
##$AQORDER= 0
##$ASSFAC= 0
##$ASSFACI= 0
##$ASSFACX= 0
##$ASSWID= 0
##$AUNMP= <proc_1d>
##$AZFE= 0.1
##$AZFW= 0.1
##$BCFW= 1
##$BC_mod= 2
##$BYTORDP= 1
##$COROFFS= 0
##$CY= 11.3945322036743
##$DATMOD= 1
##$DC= 2
##$DFILT= <>
##$DTYPP= 0
##$F1P= 2.36226072786647
##$F2P= -0.459571619588291
##$FCOR= 0.5
##$FTSIZE= 0
##$FT_mod= 4
##$GAMMA= 1
##$GB= 0.15
##$INTBC= 1
##$INTSCL= 1
##$ISEN= 128
##$LB= 0.24
##$LEV0= 0
##$LPBIN= 0
##$MAXI= 10000
##$MC2= 0
##$MEAN= 0
##$ME_mod= 0
##$MI= 1.114404
##$NCOEF= 0
##$NC_proc= 0
##$NLEV= 6
##$NOISF1= 3.799351
##$NOISF2= 2.8
##$NSP= 1
##$NTH_PI= 0
##$NZP= 0
##$OFFSET= 15.70392
##$PC= 1
##$PHC0= -12633.38
##$PHC1= 8.20099
##$PH_mod= 1
##$PKNL= yes
##$PPARMOD= 0
##$PSCAL= 0
##$PSIGN= 0
##$REVERSE= no
##$SF= 200.130013532006
##$SI= 16384
##$SIGF1= 3
##$SIGF2= 2
##$SINO= 400
##$SIOLD= 16384
##$SREGLST= <1H.CDCl3>
##$SSB= 0
##$STSI= 0
##$STSR= 0
##$SW_p= 3612.71676300578
##$SYMM= 0
##$S_DEV= 0
##$TDeff= 0
##$TDoff= 0
##$TI= <>
##$TILT= no
##$TM1= 0
##$TM2= 0
##$TOPLEV= 0
##$USERP1= <user>
##$USERP2= <user>
##$USERP3= <user>
##$USERP4= <user>
##$USERP5= <user>
##$WDW= 1
##$XDIM= 8192
##$YMAX_p= 0
##$YMIN_p= 0
$$ End of Bruker specific parameters
$$ ---------------------------------
##NTUPLES= NMR FID
##VAR_NAME=  TIME,          FID/REAL,        FID/IMAG
##SYMBOL=    X,             R,               I
##VAR_TYPE=  INDEPENDENT,   DEPENDENT,       DEPENDENT
##VAR_FORM=  AFFN,          ASDF,            ASDF
##VAR_DIM=   8192,          8192,            8192
##UNITS=     SECONDS,       ARBITRARY UNITS, ARBITRARY UNITS
##FACTOR=    0.0002496,     1,               1
##FIRST=     0,             0,               0
##LAST=      2.0444736,     0,               0
##MIN=       0,             -144829,         0
##MAX=       2.0444736,     207486,          0
$$ Real data points
##PAGE= N=1
##DATA TABLE= (X++(R..R)), XYDATA
$$ [...]
1872d03J355k041J257N30j879J826p19n54J666j896R95N49j770J683p28m99J678
1889A050k039J181N00j840K015j039n05J876k067O92Q42j943K080p07j082J954
1905I68j943M65J424k282J804l21j268J905j383K76Q73j451J311m41o93J595j632
1922g93O08J108k061J672j98j194K105j671J92J120j800J475k31j009J749j314
1938b42J19J233k144J663o2j473K039j317r4J324j727R59K36j184J738j435J74
1955a93J156j894J433j3j331J802j111n26J859k058Q78M70j247J291q37j06J181
1972G54j645J203j65j230K082j263m08J697j819P79N75j698J742p77o47J762j784
1989h42O99Q10j839K074r20q44J920j622K37R40j584J305k51q07J434j203P18
$$ plain form
1872 -403 952 -1089 168 698 -1181 645 -74 -628 1038 -858 137 686 -1084 599 -129 -628 1050
1889 1050 -989 192 692 -1148 867 -172 -677 1199 -868 -176 666 -1277 803 96 -986 968
1905 968 -975 -510 914 -1368 436 115 -1153 752 -631 -355 518 -933 378 -63 -756 839 -793
1922 -793 -185 923 -1138 534 336 -858 1247 -424 -232 888 -912 563 332 -677 1072 -242
1938 -242 -123 1110 -1034 629 567 -906 1133 -184 -278 1046 -681 278 514 -670 1068 -367 -193
1955 -193 963 -931 502 489 -842 960 -151 -677 1182 -876 2 472 -775 516 -321 -427 754
1972 754 -891 312 147 -1083 999 -264 -672 1025 -794 -15 560 -1138 604 -173 -820 942 -842
1989 -842 -143 667 -1172 902 -18 -862 1058 -564 -327 613 -971 334 83 -724 710 -493 225
2006B25L22j379J500o34o67J726j882O77J047j959J789n33r65J822j608N37R90
2023A008j812J443k69j110J771j570N38J026j917J458k34r88J658j403L14R88
2039I01j482J138r3j163J946j574R0J462k127J372Q6j276J597j088k3J017j570
2056g87J145J26j287J717j395K36J161j758J279j7j256J679j042j63J257j800
2072i05J004K90j369J743j015k64J132j438Q44L51j388J552q43m68J690j635P42
2089B3O31j766J748q32m57J462j582O85M43j280J666q60m70J597j530O05O46j658
2107i29J508l54q63J568j365L73P95j448J182k51o53J336j426O58N90j399J167
2124D89k35p78J559j417M70Q00j569J346k60j000J649j483K39J037j695J397k23
$$ plain form
2006 225 547 -832 668 34 -633 1093 -789 -112 935 -1024 765 232 -733 1089 -519 18 1008
2023 1008 -804 639 370 -740 1031 -539 -1 1025 -892 566 332 -656 1002 -401 -87 901
2039 901 -581 557 464 -699 1247 -327 -237 1225 -902 470 556 -720 877 -211 -234 783 -787
2056 -787 358 484 -803 914 -481 -245 916 -842 437 420 -836 843 -199 -362 895 -905
2072 -905 99 389 -980 763 -252 -516 616 -822 22 373 -1015 537 -306 -774 916 -719 23
2089 23 654 -1112 636 -196 -653 809 -773 -88 355 -925 741 -119 -589 1008 -522 83 729 -929
2107 -929 579 225 -638 930 -435 -62 733 -715 467 216 -437 899 -527 131 721 -678 489
2124 489 254 -524 1035 -382 88 888 -681 665 405 -595 1054 -429 -190 847 -848 549 326
2141C26j230J728j278Q1J204j854J284j23r65J522j265J62J241j558J003J7j121
2158h26J539r83k58J237j622J224m3r96J516j228n0J285j579J029P9j348J772
2175G48r71k71J218j551R94L16j326J524p85n71J390j466Q18M23j380J493o11
2192hn49J294j224M29M56j029J344o66n26J366j468P38M41j358J477n41o14J276
2210H38j299N67N56j335J617o66q29J618j506N70P38j656J420k85p45J299j074
2227a72L3P90j165R93k48p68J402j273J52R26j616J359j72r66J338j055J54Q26
2245E38j481J124j05q16J497j315L23R54j519Q96K44j186J491j101L0J021j368
2262g73P19N27j426J564q74l8J030j634J043K13j294J571q41k41J008j135P22
$$ plain form
2141 326 -904 824 -454 -373 831 -1023 261 138 -827 695 -570 -408 833 -725 278 295 -826
2158 -826 713 -270 -528 709 -913 311 268 -728 788 -440 -490 795 -784 245 324 -1024 748
2175 748 -223 -494 724 -827 167 483 -843 681 -104 -675 715 -751 67 490 -890 603 -8
2192 -8 -557 737 -487 -58 398 -631 713 47 -479 887 -581 157 598 -760 717 176 -438 838
2210 838 -461 106 662 -673 944 278 -551 1067 -439 131 869 -787 633 348 -397 902 -172
2227 -172 -139 651 -514 479 231 -537 865 -408 -256 670 -946 413 241 -725 613 -442 -288 538
2245 538 -943 181 76 -740 757 -558 -235 719 -800 96 340 -846 645 -456 -426 595 -773
2262 -773 -54 473 -953 611 -263 -301 729 -905 138 351 -943 628 -213 -454 554 -581 141
2279A41L10j105J314r87q5J225j510Q73K32j161J442p18n26J505j564P91L57j359
2297h25J399o14l88J268j401O83M93j181J172n57k88R35j151N73M32j147J406
2314H09p25n31J285j336K66R53j418J220l91o30J295j175J25P46j305J159j96
2331A51r24J481j195J74P06j102R00j06m55R33r67N41L49j215J200m76p81J460
2349F74j050OJ137j684J165K3j039J397o66l74R11j273R18R8j054J579r36m7Q58
2368F43j308R79J39j175J236q87J17J030j372Q92Q3j117J341p86k58J252j414
2385f05R16K22j301J239o66j64J113j454R38L04j347J551q96k18J223j355N27
2402B7N41j073J197q14k27J245j348P03J85j171J360o10o39J432j199L33O90j307
$$ plain form
2279 141 451 -654 660 -327 -412 813 -697 176 408 -753 689 -29 -555 950 -614 177 534 -825
2297 -825 574 -40 -428 840 -561 122 615 -566 606 49 -239 696 -455 118 550 -597 809
2314 809 84 -447 838 -498 -232 721 -697 523 132 -498 797 -378 -253 493 -812 347 151
2331 151 -773 708 -487 -313 393 -709 191 85 -370 563 -404 137 486 -729 471 -5 -786 674
2349 674 -376 -370 767 -917 248 271 -768 629 -37 -411 500 -773 145 243 -811 768 -168 -215 643
2368 643 -665 314 453 -722 514 -373 -256 774 -598 294 377 -740 601 -185 -443 809 -605
2385 -605 311 533 -768 471 -195 -359 754 -700 238 542 -805 746 -150 -368 855 -500 27
2402 27 568 -505 692 -122 -349 896 -452 251 436 -735 625 15 -624 808 -391 -58 632 -675
2420f75J051m28n53J256j042L46M81j165J122k59o55J181j121L72O26j310R94
2437B21l43o68J225j004L03P00j196R72k96p43J349q92R1P76j373R82Mp38J189
2456E59p96mP57j268J032P7r90J371j008j22J141j387R25o8p98J053m29j32P79
2475F92j298R74r2p03J291j076l3J081j388Q50L50j211J362q83r6Q90j230P95
2493B75L7q90J070p11k01J180j288O12M11j042J077o95l95J140j043K88N51j038
2511f62J085n56j68P87r98M75L81j232J379n09m67J290j309M49N07j164J239n05
2529B2l47P33q78L39N66j186J183k62p88J251r83J89O87j139R05j89o29J070r79
2548d35M71L18j082J073k86o74J269r74J43P67r67M62J72o65J012q70J18N87j082
$$ plain form
2420 -675 376 -52 -605 651 -391 -45 436 -729 393 134 -521 660 -461 -89 537 -773 221
2437 221 -122 -790 435 -569 -266 434 -762 210 -86 -829 520 -372 -281 495 -878 104 108 -630 559
2456 559 -237 -241 516 -752 280 357 -633 738 -270 -392 749 -638 287 219 -579 474 45 -87 692
2475 692 -606 368 276 -427 864 -212 -245 836 -552 298 648 -563 799 -84 -180 710 -520 275
2493 275 312 -578 492 -219 -420 760 -528 84 495 -547 530 -165 -560 580 -463 -175 376 -662
2511 -662 423 -133 -301 486 -512 -37 344 -888 491 -18 -485 805 -504 -55 452 -712 527 22
2529 22 -325 408 -470 -131 435 -751 432 170 -618 633 -350 -161 526 -613 292 103 -526 544 -435
2548 -435 36 354 -728 345 59 -615 654 -320 -177 590 -377 85 257 -408 604 -266 -148 439 -643
2567f43J027P4r49J200q01j1Q46j217P47J12q74J200q71R9P40j250R73L4r72J256
2587G20o96l49J073j386Q40rp98J096o58k41Q47r08N47Q4n94P88n09k82R16r26
2607d45N35J38j002J215o10k93R10j070O20K59j119J357n98m16R14q87L83N13
2625D04j069J047l39l36P18q56M03L42q62R45l20m69R43q38K95M84j017J028l40
2644A63o07R80q97J99N90j053Q77L5p57J152j057K68P43j196R68j70n56Q15n82
2663h5M6N01q14O10K78r78J024p51O6O39q09N07ko40Q18n11k31P13q21P54p7o38
2685d01Q78n42k47R86j226O07J75q23R39m99j89R35j072M90L06j002J068n58j95
2704c70Q89r31L20L31o86Q38m02j87O43q70L64K78p27Q53l54k34P85q57M04L75
$$ plain form
2567 -643 384 458 -491 709 -92 -103 743 -474 273 385 -489 711 -160 -61 679 -571 402 436 -536 720
2587 720 24 -325 748 -638 202 193 -605 491 -167 -408 439 -469 78 162 -432 356 -153 -435 481 -445
2607 -445 90 228 -774 441 -169 -462 448 -622 -2 257 -862 495 -103 -519 395 -492 -109 404
2625 404 -665 382 43 -293 425 -431 -28 314 -548 397 77 -392 551 -287 8 492 -525 503 163
2644 163 -444 536 -361 -162 428 -625 252 287 -470 682 -375 -107 636 -560 408 238 -318 497 -85
2663 -85 -39 462 -352 258 536 -442 582 -169 -103 536 -273 234 232 -408 410 -101 -332 381 -440 314 237 -401
2685 -401 477 -65 -312 674 -552 55 230 -593 346 -153 -342 593 -479 11 317 -685 383 -175 -370
2704 -370 519 -412 -92 239 -447 391 -11 -198 445 -425 -61 217 -510 343 -11 -245 540 -317 87 462
2724D62r47P99m15k06P37r29M85L30r31Q39r7m54P63p87K44N15p61O88j85o72
2744e22J117p65m7O48q54P37k20k32M47l18l0N67r07N24N7n79P28m01J79M13q12
2765b70M95J21q10R59o69L2O40r65P91l6q70R52n07o9N50j004Q69l3o40P93n10
2786a81j07N37n82L70K22p91P34k55j84N08p98P62M4p58Q52m82j54M98o93K93
2806a65L16q99J039m00j65O53q92N17L8m52Q23m45l01Q67r49O50L4o14N37K0o03
2827c91P95o18K33K88p99P70k24l39P92o87J02M52p53O47k22k77P15p54K31M93
2847D54q02O57k44l63Q64p84J92N98r93P02m4o25P02m86R8L93p05O86l69k89P89
2868D31o37P2N15p79M13J69p20J080p99l2M58m41L63K5m86P69o17r4O03p29M82
$$ plain form
2724 462 -485 314 -101 -307 430 -499 -14 316 -615 224 127 -327 436 -351 -107 408 -353 335 150 -522
2744 -522 595 -170 -217 431 -423 314 94 -138 309 -9 -39 528 -379 145 202 -377 351 -50 129 542 -270
2765 -270 225 346 -464 495 -174 -142 498 -467 324 288 -582 370 -137 -206 344 -660 209 176 -464 329 -181
2786 -181 -288 249 -333 37 259 -532 202 -53 -237 271 -527 235 279 -479 373 -109 -263 235 -458 -165
2806 -165 151 -748 291 -109 -274 379 -513 4 42 -410 413 -32 -333 534 -415 235 269 -345 192 212 -391
2827 -391 404 -214 19 307 -492 278 54 -285 507 -180 -78 374 -379 268 46 -231 484 -270 -39 454
2847 454 -348 309 65 -298 566 -218 -26 572 -421 281 237 -388 314 -172 -74 319 -386 300 -69 -358 431
2868 431 -206 -134 381 -398 15 184 -536 544 -255 -287 171 -270 93 118 -368 401 -216 -310 293 -436 46
2889D6J25o35P25m49m0M12n96L87J88p42Q50l84n4P46j028M20K88n92M87k29k45
2910c20M80l35K11J80n50P87l50j12M97p43M97J17o72P92m59j76M85n25K76L27
2930D07p75O67l74j18P84r06K32L55n39M74j62l15P82p52J8M98o71N76o2m97Q58
2951D80n13n8K79o40M78J05m74N86k98k21M67n34M50j73j63O78o75K33L90q32
2971d35M73J24n79O20j55l24P21q69O28k09l55O75l61k46N94o24M99L6o49P01
2991B65m57M5M92p74M71J79o34O39m07o0N80o75L51K09p59Q14k43m07Q61o68K05
3012B7K15n86N03r2k06M93n54K65L84p46O91l81j25N37o38L12K69r24O47o2l59
3033c30P92n47QM63o18N96k31m24O60n59J2L83n82O79k29m05P16o27J52L83o62
$$ plain form
2889 46 171 -464 261 -188 -228 184 -412 -25 163 -579 271 -113 -167 579 -449 -29 259 -333 154 -75 -320
2910 -320 160 -175 36 216 -334 453 103 -9 488 -255 242 359 -313 479 20 -156 329 -196 80 407
2930 407 -368 299 -75 -193 591 -315 -83 272 -267 207 45 -270 512 -240 -222 276 -395 181 119 -378 480
2951 480 -33 -91 188 -452 26 131 -343 243 -55 -276 191 -343 107 -66 -229 449 -226 7 397 -435
2971 -435 38 162 -417 203 48 -276 445 -424 204 -5 -360 315 -46 -292 302 -322 177 213 -436 265
2991 265 -192 -147 345 -429 42 221 -413 226 -181 -241 339 -336 15 224 -535 279 36 -371 490 -178 27
3012 27 242 -344 159 67 -139 354 -200 65 449 -297 394 13 -112 425 -213 99 368 -556 91 29 -330
3033 -330 462 -85 -77 386 -232 364 133 -291 369 -190 -178 205 -377 302 73 -332 384 -243 -91 292 -370
3054c70O65j80k62M86n03KN01o39M26J8n23O60m90J64K75o11M62L6m00M40l04
3075a47l9M61n32K93J69o09P11m05k40Q12p79K45L68o54N90j90j20N49q05M06
3095H4M9m94M93j40l14O30m92K45Ol65O18m88o6N83o71M74J12n56N76k25k24N68
3117D03o50K62J16k70L71q1l59N32n16J49M86p75O53m00j48N51n90K42L02o72
3137c94O77l17k58N92m30k3L40o63N86j46k02M42k39k59L59m59M42j59P4K11m60
3158b86J71L22l91L06j4n02N67k46j15M58n41L27L6m86O27l48J76K45o01K99K10
3179B14l98L93m56R7N50n83L24J24o17P08l81p0L76l53MJ50l77N38k18j77M91
3200C39o70L08R8m42M84j4l31M99m79K32K22n11O08j82l81P07o78K13K45o57O14
$$ plain form
3054 -370 295 115 -147 339 -164 -162 339 -300 126 144 -379 281 -209 -45 230 -381 81 117 -283 157 -147
3075 -147 -186 275 -257 36 205 -404 307 -98 -338 474 -305 -60 308 -346 244 54 -66 483 -322 84
3095 84 133 -361 132 -8 -322 308 -184 61 67 -298 320 -168 -234 349 -322 152 264 -292 284 59 -165 403
3117 403 -247 15 131 -139 232 151 -208 324 -192 -43 443 -332 321 -79 -227 324 -266 -24 278 -394
3137 -394 283 -34 -292 300 -130 -153 187 -476 110 -36 -238 204 -35 -294 65 -394 48 -111 -37 174 -286
3158 -286 -115 207 -184 122 108 -394 173 -73 -188 270 -271 56 92 -394 233 -115 61 306 -295 4 214
3179 214 -184 209 -247 -150 400 -183 141 265 -352 356 -25 -95 281 -72 -68 82 -295 243 25 -152 339
3200 339 -331 -23 75 -367 117 103 -228 271 -208 24 246 -265 343 161 -220 487 -191 22 267 -390 224
3221B24k58r8M48m25k9L39m70L85k2k79N20m46K52J1l48M39k81j28L71m46Q1M25
3243B65n23M50l8m16N64m30J23R4k49L71k85k61M63l14K7L99n73K87K85m35M42
3264B46l35M1J75k87K35J75l71N03n29RK88l10K99r4j37L64l57j1L89p22O59l5
3286A95m22N25k80j47M16m92L19J71n16M53k96j12N34n69M19J02n76M54j32j55
3306a09M42m82P0K57l95M21o4l22N04n20J19M69n17L87l88m9M38n53K98J87m93
3327c00L82k0k80M58n12K87K08m86K60L3k69N83o64J56L23o61O57j45l64O25l46
3348g5M2K10m98N08j85j15L08k61j39L40m81M35k0k70N32m64J76J91l94K48Ok87
3370a93N09l60r4L42l26K33N2l28N22m67m2L46l70L39k7m33O30k64p1L67n47K44
$$ plain form
3221 224 -34 -132 316 -109 -138 201 -269 116 94 -185 335 -111 141 152 -196 243 -38 -166 205 -241 -160 265
3243 265 -258 192 154 -262 302 -128 -5 89 -160 211 -74 -335 128 -186 -159 240 -333 -46 239 -196 246
3264 246 -89 -48 127 -160 75 250 -121 382 -147 -138 150 -160 139 45 -92 272 -85 -96 293 -429 230 195
3286 195 -227 298 18 -129 287 -205 114 285 -231 222 -74 -186 348 -221 198 300 -276 178 46 -109
3306 -109 333 -149 -79 178 -217 204 140 -182 322 -198 -79 390 -127 260 -128 -177 261 -292 6 193 -300
3327 -300 82 62 -218 240 -272 15 223 -263 -3 30 -239 344 -320 -164 159 -502 155 10 -354 271 -75
3348 -75 -33 177 -321 187 2 -113 195 -66 -205 135 -346 89 69 -201 331 -133 43 234 -160 88 94 -193
3370 -193 316 -44 -138 204 -122 111 163 -165 357 -110 -152 194 -176 163 136 -297 333 69 -2 365 -182 62
3392F2R1m98N08j53k12L53m88K00J95l04K53p8j51M32k80J58R8n73N15j70j79
3413b21N21m80J91J20n53P05j63l95P52o40J97K85o72L55J07l13L82k97n7K39
3433F3k26L84k11l32N79m41L00J79o55M57r0k14M40m06Q0K62m83L87j00l22O19
3454B70l92N6K58n89O28m5n55M15k55J46K54n12N24q2l96N80l42mL19n47L41N4
3476A26k09M50m59P5L47m66L81j07k54L77l37K01N1m49L55Q1l17L44l05KL75n28
3498b66K07K33m19N18m20j49N07n03K65J00l76M35k25k0L09k95J12O0k66L29k00
3519f4p5M59l65K7K29m44K22j52M3M87m71J50K22m33K90k61N6L94m39O6K54m41
3541b46M22j08k04L67m22J01K73k33P2J08k86K78k85P6L96m58L31Pl77M67l91
$$ plain form
3392 62 153 -345 163 10 -202 151 -337 -137 58 -246 7 -71 -222 210 -70 88 186 -387 128 -42 -221
3413 -221 300 -180 11 131 -422 283 120 -275 477 -163 34 319 -353 2 109 -204 178 -119 -176 63
3433 63 -163 221 10 -322 257 -184 116 295 -360 97 7 -207 233 -173 -93 169 -314 73 -27 -349 270
3454 270 -122 -66 192 -397 231 186 -369 46 -209 -63 191 -321 203 121 -275 305 -37 -41 278 -269 72 126
3476 126 -83 367 -92 -17 330 -136 245 138 -116 261 -76 125 176 -273 82 163 -154 190 -115 -113 262 -266
3498 -266 -59 174 -245 273 -147 -296 211 -292 -27 73 -303 132 -93 -113 196 -99 13 73 -193 136 -64
3519 -64 -139 320 -45 -18 211 -233 -11 -163 -120 367 -104 46 268 -165 125 -136 -80 314 -125 -59 195 -246
3541 -246 176 68 -136 231 -191 -90 183 -50 22 130 -156 122 -163 -87 309 -149 182 189 -188 279 -112
3562a12Q6K56o46N14m1k73L22k51Q5M94o84K61J83m03N73k91l47O18m76K51P2
3583A91m91M74j92j17M87n13M5K54k68M21l02M3J70m52L84o6l64N86l82k08M72
3604A72l09J88O4m36M32q7m0J80m91L70j1k72L26l0j97L86l69J56J7j79L26k37
3626d1k17N40n27J32J70l27L55j74j80N48n16J81K89l90J43J00q7K58l76J17K84
3647B82m78M02j98l07N05l73Q9L04m94L54n6k83M21k30j4J68k35L93m06O3K73
3668A80k30J6K97m19K09j7k36L33j67L4L16m18J23J44n52O69l58k20M20l53K30
3689AL17o38M74j49k39N69n27J24K37k86L64l68r0L46m31K61K7l09K17j21P6K39
3711I4k55N6K20k97M14l80k6J36j43K15K07l50J54l0r0K12k96J97J33k54L06j05
$$ plain form
3562 -112 -26 230 -416 98 57 -216 106 -145 -60 434 -250 11 194 -209 364 73 -274 344 -132 119 191
3583 191 -300 174 -18 -135 352 -161 -116 138 -130 291 -11 32 202 -250 134 68 -296 290 -92 -300 172
3604 172 -137 51 115 -321 111 24 -16 164 -327 43 32 -240 86 56 -141 245 -124 32 49 -130 196 -41
3626 -41 -258 282 -245 -113 57 -270 85 -89 -269 279 -237 -56 233 -157 -14 86 -1 257 -119 -2 282
3647 282 -196 206 8 -299 206 -167 -78 226 -268 86 30 -253 168 -62 -76 92 -143 250 -156 -93 180
3668 180 -50 -34 263 -156 53 36 -200 133 -34 0 316 -102 21 165 -387 282 -76 -296 124 -229 1
3689 1 318 -320 154 5 -234 335 -192 -68 169 -117 247 -121 -211 135 -296 -35 -8 -317 -100 -221 -145 94
3711 94 -161 -105 115 -182 232 -148 -174 -38 -181 34 241 -109 45 15 -75 137 -159 38 171 -83 223 118
3733A18k98L78l18m4M53n74M25j24j45M33l27J22O3j69L54k02m36L58j45O2J27
3754A11k79M07j34k93L63l07J11K53l23J26k1j15J37o0pJ01n02M90K1k04L68k34
3776IO2J88n45L11L31o13N03k88o9L16l93J22J87m04M05k32J38R6l30K43J00l46
3798b09M73m33p1L66l60K89o8k20L75k25l9K99l06K06M2l03L72l14L8L60n39K70
3820CR0m38M56j50j3J81j72%J17k09L32j28m1J68k44k9J40l54M65k1m47N38k49
3843ej90K88j89M24l16j97L30j68M1J88l85K08M3k78K87j20K0M24m48J52L7l68
3865b22K88j56j11K42l2J6M2j14K38k68j12M18m04J77K01l52K05l5j63L42m82
3886b82J59J48j96L11k72J09J30o7m8J40m16O22k95l07L68m38K85R2k10J20L01
$$ plain form
3733 118 -180 198 -120 -164 289 -285 140 16 -129 304 -23 99 162 -7 347 145 -291 67 -78 -16 111
3754 111 -168 239 105 -188 175 -132 -21 232 -91 35 14 -101 36 -24 -31 70 -432 58 79 -125 243 9
3776 9 71 259 -286 25 356 -257 246 -42 -111 205 -188 -66 121 -283 122 -110 28 124 -206 37 137 -209
3798 -209 264 -169 -240 126 -234 55 -13 -233 142 -83 -122 177 -129 77 119 -184 188 -126 -88 272 -267 3
3820 3 93 -345 111 -39 -52 129 -43 -43 74 -135 197 69 28 196 -48 -77 63 -291 174 153 -294 244 -5
3843 -5 -195 93 -96 328 12 -185 145 -23 18 206 -179 29 72 -206 81 -39 -19 405 -43 109 146 -222
3865 -222 66 -90 -201 41 9 25 67 -47 191 -77 -189 229 -175 2 203 -149 56 21 -142 200 -282
3886 -282 -123 25 -171 140 -132 -23 107 40 -8 132 -284 338 43 -264 104 -334 -49 43 -167 -47 254
3907B54k68K59m09J79K4j00K43o4j10O7j65R7J73k35K04k00q8K08k44K55K5j90
3929h5J69j39m7L49l99K39J95m69N42k60k16L05j23r1L17m33M92j84m82L48Q1
3950A09k58J92o6J64K6l44K18j44q2K20l22L41K2j50K37l25Q8L08m87L83r5j34
3972i9J33j09j16J52p9K93K8k91K93l27k6M48l95J03Q7k65L43k38R8j10j59L34
3994I8Q7m22M80j76j89J94k71J89M9j10J58k9k50K03o2J02Rk91M29l16r1L25k09
4017i3K89p5j30P1Nk48L21j75m0J72m03L66J89k76K49k64K8K62m07K77R3k97P6
4040a0J2r6K99l21J27n3k0K22j92L9oj02J07P3k48L90m31R2K39j87J11l6j80K87
4064A16j12j57L30k79L47l73MK61k03j1R8l1j12J34k0J88j45j89J27o5P7N9k88
$$ plain form
3907 254 -14 245 -164 15 39 -61 182 118 8 75 -90 7 180 -55 149 -51 -139 69 -175 80 105 -85
3929 -85 84 -55 -102 247 -152 87 282 -187 355 95 -121 184 61 -30 287 -146 346 162 -320 28 109
3950 109 -149 43 -23 141 167 -177 41 -103 -185 35 -287 54 76 -74 163 -162 -74 234 -253 130 35 -99
3972 -99 34 -75 -191 -39 -118 175 203 -88 205 -122 -148 300 -95 8 95 -170 173 -65 33 -77 -236 98
3994 98 185 -237 243 67 -122 72 -199 -10 39 -71 87 58 -192 11 -51 51 60 -231 198 -118 -209 116 -93
4017 -93 196 121 -9 62 67 -181 140 -35 -75 97 -306 60 249 -27 222 -42 -14 248 -159 118 211 -86 -10
4040 -10 2 -94 205 -116 11 -42 -62 160 -32 7 1 -101 6 79 -169 221 -210 -118 121 -66 45 9 -171 116
4064 116 4 -153 177 -102 245 -128 -124 137 -66 -77 21 -10 -122 12 -8 180 35 -154 -27 -92 -15 44 -244
4087b44M75j69J5J5j63j8L10k08M1m8j76K51k98J51J69j90K35j05j18L28l46L67
4109B74k49k10K25J85k26K97l73J16N9j64N0J71j48J19j49J07L9q6J5l1l0J53
4131A44k10j3J47k85K95m3m2N7l9p8K35k27K07Pk38K42j08m2J2j23K98j04k62
4154a70K76j75l8L58l08M7J62l66M81k00l01L47k40K78k8l84M19j58o3K54j49
4175D2l0k7k61L06k8j52M45n28M03l7k15J20R8k54Q4J56kK5o4K58l08j07L60m86
4199b02J58J03j88J91j07k39M87j66k4l1q9J95l2j66J71m2j29K17j76K04j01j39
4221a05L45l85K2M56o03L19m6j71N23m22OK6qK0p2N3J04k07j0J29n8J81R2k23
4245c4K30m8k92K57m08K57J67k53L06k17j61L19k81J95J36k20J16j05m2L22m50
$$ plain form
4087 -244 231 62 77 92 -71 -89 221 13 54 6 -170 81 -217 -66 103 -87 148 43 -75 253 -93 274
4109 274 25 -185 40 225 -1 296 -77 39 98 -66 -16 155 7 126 -23 84 123 37 52 21 -9 144
4131 144 -66 -79 68 -217 78 35 -7 50 11 -67 168 -59 148 155 -83 159 51 9 21 -102 196 92 -170
4154 -170 106 -69 -107 251 -57 -10 152 -214 267 67 -234 113 -127 151 123 -261 158 0 -63 191 42
4175 42 12 -15 -276 30 2 -150 295 -233 170 133 -82 38 136 -118 -34 122 120 145 81 339 31 -76 284 -202
4199 -202 -44 59 -129 62 -45 -284 203 37 13 -18 -107 88 56 -110 61 19 -110 107 -69 135 34 -105
4221 -105 240 -145 -123 333 -270 49 3 -168 355 -67 -61 -35 -43 -23 -95 -42 62 -145 -155 -26 -84 97 189 -34
4245 -34 196 148 -144 113 -295 -38 129 -124 182 -35 -196 123 -158 37 173 -47 69 -36 -78 244 -206
4266b06o4L38j70R9j08J25K32m26L25J43n75M38j36j09K02l68J09K93k87M24l55
4287g6N8J92l27J00K71j88J75j20j87K79k15R9P5k77KK60k88K92m8m2L0m32M49
4310H2j18R0K06l18l8K49l31L27J03l86K68k48l5K07j66K40j92j96J69LJ2J73
4332A01k57L09j47p6J38k13J91O0k03J38M9j87K13p1j45L00l75L27j25p6J05j58
4354a02M34l42L4k2J1j14K66j43P7R9k94O4J45l60M04mk36J36j81J12J35k60K37
4377I6n5j85K60j89J14K51l36JJ9l2L08k21NL2p1J61j25r0L12l60L6mp9J23J1
4402a8j96L42j24k85L93k38K28j65j45K47k07r0N35l52J74n4r0J82k47q9M63m42
4424a78K7J24o9K24j22NN8l8K8J39k65R2Rp1J88k26J31mj59K30q8j39K92k11K01
$$ plain form
4266 -206 -270 68 -102 -3 -111 14 246 -180 145 288 -287 151 15 -94 108 -260 -151 142 -145 279 -76
4287 -76 -18 174 -153 -53 218 30 205 85 -102 177 -38 61 136 -141 -139 121 -167 125 77 35 65 -367 82
4310 82 -36 54 260 -58 -96 153 -178 149 252 -134 134 -114 -149 58 -108 132 -60 -256 -87 -84 -72 101
4332 101 -156 153 6 -70 68 -145 46 106 -97 41 90 -97 116 45 -100 200 -175 152 27 -49 56 -102
4354 -102 332 -10 24 2 13 -101 165 22 99 198 -96 -32 113 -247 157 153 -83 53 -128 -16 119 -141 96
4377 96 41 -144 116 -73 41 292 -44 -43 -24 -56 252 31 36 68 -3 158 33 -57 255 -105 -69 -73 -152 -29 -18
4402 -18 -214 128 4 -281 112 -126 102 -63 -208 39 -168 -258 277 -75 99 45 -45 137 -110 -199 264 -178
4424 -178 -151 -27 -96 128 6 11 69 31 59 198 -67 25 34 -37 151 -75 56 52 -107 123 35 -104 188 -23 178
4449A78j87j33N41m07l4K64k73Q8n7j79K96q3M4K19m59Q4J03k5O2n3j73J78j8
4472b4mJ70j73Nr4j14L05j65L7J78j80K19j79j48M73l36N2J42k51L73l15o9K43
4495A45j85k0O5j0J13Q9l70J62mr9J84k00L15j61j51K74k30J95jk61J19J01l20
4518b50L59l27K57R9j96J43pj73K66j64j01K50l61K03J4k49L45l5j39L09n36J23
4540a70K45j49K35j74o6K37l48J04L46l74L13j64j61L91k24r9M0j56J78M6j24
4561g4J09j03J23O9l49L08j4j60K90k96J92m1k49L75j39j21J67j03N4J42m87L63
4583E6m1j66L63n31K04K17o8j32j55L54n7j08P3KJ1q8o0J12K23k79r5P3q7L49
4607A70j81j66K72k17l4Q4k7J60r3l8O0k9r1K55l55J95J15k80M17j38j46J16k28
$$ plain form
4449 178 -9 -142 399 -8 -42 222 -51 37 -20 -199 97 14 58 277 -182 -98 5 -20 42 -11 -184 -6 -24
4472 -24 -28 142 -31 -26 -120 -234 71 -94 -57 121 -59 160 -19 -167 306 -30 22 164 -87 286 -29 -98 145
4495 145 -40 -60 5 -5 108 197 -173 -11 -15 -114 70 -130 185 24 -127 147 -83 112 111 -150 -31 70 -250
4518 -250 109 -218 39 138 -58 85 78 -95 171 7 -94 156 -205 -2 12 -237 108 73 -66 243 -293 -170
4540 -170 75 -74 161 -13 -79 158 -190 -86 260 -114 199 35 -126 265 41 -58 -18 -174 4 50 -74
4561 -74 35 -68 55 124 -225 83 69 -91 199 -97 95 54 -195 180 41 -80 87 -16 38 180 -307 56
4583 56 15 -151 212 -319 -115 102 34 -98 -253 101 44 -64 9 11 22 -66 -126 -14 209 -70 -165 -92 -179 170
4607 170 -11 -177 95 -122 -156 -72 -99 61 -32 -70 -10 -39 -130 125 -230 -35 80 -200 217 79 -67 49 -179
4630a79J28p1j90L84o1P0j44Q2l6J24k06L63l52Q9L26l55J82r4q5J80j53r4J23
4653C1j95K14Jj25J34m6P6J03k99J67N0l14K49j06p0K84m55J12K98j43J24m4r2
4676d6K55j82P9K5k66L30j31j15K12l21L11N4l33K98k92l1L30k82J20J86l56J74
4698A9J4k53K62j14p3K36l34L06n9j75L80k80r8J86l40M18M0k41L29l15m9L03
4720A62k34K73k10k14M30j87j21L59n28K56J01l21L28j16R4j6m6K17j20p4L06
4741C39n20J68J44j95M8R2k16J01M7j14L84k71J1R7k95L52l74K58j10j21J15O1
4763Ak18M14j49K8p7j32K76q6j40J27O1k26J37j95O9j12N0L88l29O6K87m57K67
4786E0qj03J50m4j48K35j06j04R5j41R8l6qK71l17M0J81k70K27k05m6K73k50K16
$$ plain form
4630 -179 -51 -122 -312 72 11 81 -63 19 -17 107 -99 264 -88 1 327 -28 154 60 -25 155 2 -92 31
4653 31 -164 50 51 -74 60 14 90 193 -106 61 111 -203 46 -60 -130 154 -301 -189 109 -34 90 46 -46
4676 -46 209 27 106 131 -135 195 64 -51 161 -160 151 205 -128 170 -122 -153 177 -105 15 201 -155 19
4698 19 33 -220 42 -72 -145 91 -243 63 4 -171 209 -71 -169 17 -323 95 135 -106 223 -92 -141 162
4720 162 -72 201 -9 -223 207 20 -101 258 -270 -14 87 -234 94 -22 72 56 10 227 107 33 339
4741 339 -181 -13 131 -64 -16 76 -140 -39 8 -106 278 7 18 115 -180 172 -202 56 -54 -175 -60 1
4763 1 -217 197 48 76 -1 -133 143 57 -83 44 105 -121 16 -179 -110 -222 -172 216 -113 -47 240 -217 50
4786 50 42 -61 89 45 -103 132 26 -78 17 -124 -26 -62 -70 201 -116 -76 105 -165 62 -143 -189 84 -166 50
4810E0Q2k13K34j30j1J88k06o8K87k18J35k11j64L69k04J8J64l09L71o1j71K79
4832B11o7j47L62n06K24m7j90L70j48l0J04l43K55J17m44N53l27j3O4j03K20j5
4854A00j94J75j44N2L0j27J30J43l21K36j97M3L86l85M6K18l60J20r5J80m4k23
4876b31L46l7j69K26j3k90M28l92K07q4q8J74Ok62L21k30J07J06l52M28j57j00
4898e6J08j76J02K56m11L24k0JJ01l45J85q7nJ24l2k23L64j60k22K70l46L17J76
4921B45l65K80j10r4P0j75J86r1j3K14j96k19L75l34J58O0o6J49k75J62J48j57
4943d8J53n4l20L98j71n7L89n60L14m0k06M08k13j58L32l73M24k15j76J68j45
4964a50L88j55o5K3L4j56J03qj16J23j92L00J3k95J51l5j87N46m81K81r3j57K67
$$ plain form
4810 50 132 -81 153 23 12 200 -6 -74 213 -5 130 -81 -245 124 -80 -62 102 -207 164 103 -68 211
4832 211 144 -3 359 -147 77 30 -160 210 62 32 136 -207 48 165 -279 274 -53 -66 -2 -105 115 100
4854 100 -94 81 -63 -11 19 -108 22 165 -156 80 -117 -74 312 -73 -27 191 -169 -49 -144 36 -8 -231
4876 -231 115 78 -91 135 122 -168 260 -132 75 -9 -97 77 83 -179 142 -88 19 125 -227 201 44 -56
4898 -56 52 -124 -22 234 -177 147 127 128 229 -116 69 -18 -23 101 69 -154 210 50 -172 98 -248 69 245
4921 245 -120 160 50 -44 26 -149 37 -54 -67 147 -49 -268 107 -227 -69 -9 -75 74 -201 -39 109 -48
4943 -48 105 51 -269 129 -42 -99 290 -270 44 4 -202 206 -7 -165 167 -206 218 3 -173 -5 -150
4964 -150 238 83 18 41 75 -81 22 14 -102 21 -171 129 142 -153 -2 -37 -224 322 -159 122 29 -128 139
4987A39k10J35J79k04n4J59l46K34j11m0R2j22K04K0n3N6K5k32L94m24K33J71
5009B45m57L63q1k99L63k09O6J85l61L25j62N7m2Oq4J67j69K61k86m4M10k82p9
5032a07Q6J04P6r4k43K92Pl1L8m01L73P9k47K84k50p9K68j15J5P5j84Qk5r9J30
5057d0n3J24j34L9N6J4j31L37k70J77J11l84J23L0o1Q8j57J18M5k51K08K16l01
5080i6K52k05R6L8r1K2k13J60Q4j26k7L90l48J92n8L8M5k34J4K11l41K17p0r5
5104a45N27m79J25L0k1r9K14j73J18M9M1Pk42J63P3k75K25N7k17J30l16J32J33
5127E7k20M02l12m8J82k78J04J37j10J56j97l6K80j64j2J36j27K6LO2J09m07K98
5150D1J01j82J23q7k4J34j79J39k8j83Q6M6r7L63l83K7J63l7J11j55nrl7J64j04
$$ plain form
4987 139 -71 64 243 39 -15 144 -202 32 -79 -119 -27 -149 55 75 22 78 103 -129 265 -159 74 245
5009 245 -212 151 70 -229 134 -75 -9 176 -185 140 -22 35 -7 -1 -85 82 -87 174 -112 -156 254 -28 -107
5032 -107 -21 83 159 65 -178 114 121 90 128 -273 100 179 -68 216 -34 -113 155 40 55 130 -54 -46 -71 -170 -40
5057 -40 -93 31 -103 -64 -8 6 -125 212 -58 119 230 -154 -31 -1 -62 26 -131 -13 32 -219 -11 205 -96
5080 -96 156 -49 47 85 -6 16 -197 -37 47 -79 -106 284 -64 128 70 108 153 -81 -67 144 -197 20 -50 -145
5104 -145 382 -97 28 58 37 -62 152 -21 97 146 187 194 -48 115 188 -87 138 195 -22 108 -208 -76 57
5127 57 -163 239 -73 -121 61 -217 -113 24 -86 70 -127 -163 117 -47 -59 77 -50 -24 -21 41 150 -257 41
5150 41 142 -40 83 -4 -28 106 -73 66 38 -145 -59 -13 -110 253 -130 -103 60 23 134 -21 -26 -35 -72 92 -12
5175a2q6J31k7j55O7j0J26P1j10J11j15j02K79k02j08J57l5J12nj76K13j60L8
5198Bl2l2L32j08k62J84j56o1K28l60K40j0L6K43j95J3L0j08J56o1p0J09l37K21
5222BJ51l72K28J62l34K30m8M5P4n5K6oj30K30l14J25K6o2K54k39j53K10j14O5
5246Ao4R7Q7K8k25J06j11k8K80j71J14k31NJ94k51R7L12k34k2J6k6K05l32P2J16
5271C5r8J93m1l20M20M4m68L07j17nj2J44J48k14l5K3r5K69j49r3K42k3k58K39
5295A36k17QMq1K86n3k78M39k57O0Q2k86J51j3j72K36k38O7L26n12L64j14j58
5318b20M27l44J71J08k44K22j16k03M14l41r6L14j91K29N2k86L46k82J07j52j2
5339i7P0J52k84K18k37K10N2j61K33r7l03K95J6j80K16j99J82n9n3J29k72J58
$$ plain form
5175 -12 -98 33 6 -149 -82 -92 34 105 -5 106 -9 -111 168 -34 -142 15 -20 92 87 -89 124 -36 2
5198 2 -30 -62 270 162 -100 84 -72 -133 95 -265 -25 -35 1 244 49 62 92 -16 140 79 9 118 -219 2
5222 2 153 -219 9 171 -163 67 19 64 138 83 109 103 -27 203 -111 14 40 -22 232 -7 -160 50 -64 1
5246 1 -63 34 121 149 -76 30 -81 -109 171 0 114 -117 -112 82 -169 -72 240 6 -16 0 -26 179 -153 -81 35
5271 35 -63 130 89 -231 189 233 -235 72 -45 -50 -62 82 230 16 -19 4 -91 178 29 -64 178 155 -103 136
5295 136 -81 -73 -69 -150 136 83 -195 244 -13 47 129 -157 -6 -19 -191 45 -193 -126 200 -312 52 -62 -220
5318 -220 207 -137 34 142 -102 120 4 -199 215 -126 -222 92 -99 130 182 -104 242 -40 67 -85 -97
5339 -97 -27 125 -159 59 -178 32 84 -77 156 59 -244 51 67 -113 103 -96 86 27 -26 103 -169 -11
5361a1K19k11J63j33k09K08J10j12J63k14p3J4K2l2o9K9L33k48J89r9Nj35L05
5384B14k28R6j49O8Q0r9J12k02P8J83p1l2kj10L8P7j58J43k0n7l7j21J92p4l7
5409a16L71l55j1J95l03K66j78%J50j7K25o9m12M02j19r4J89k11jJ10O4j71O9
5432a6j4K3o9l7J03p4M3M2j5J15k65J51J39j34j08Q2o2K19r5j94L32q7J03k52
5456g0M2L67l80L3N6j14O2Lq2J32j02K55jj66q8K5j31J92%j58L8M0j09L81k18
5481GK22j91o8p6PN6J7o2K10j91j63K44n0l3PQ7kK0k82N59k45j63J82j97J78k
5507G1q8J56j49N5q3q6M03j38k16K36j16R1j26m4J02k8q8K36j54R7j7l32K37J08
5531A27j58R6p6J8L9j26J24k62M0J96PJ00j13j47K80kl00R0K8J5j13N0J17J8k14
$$ plain form
5361 -11 208 -3 160 27 -182 26 136 24 187 -27 -100 -86 -64 -96 -165 -136 197 -51 138 39 44 -91 214
5384 214 -14 82 -67 1 81 -18 94 -108 -30 153 82 50 48 -62 -24 53 -105 38 18 -39 -76 -197 -5 -79 -116
5409 -116 255 -100 -111 84 -219 47 -131 -131 19 2 227 158 -254 148 29 -65 124 -87 -88 22 86 -85 -16
5432 -16 -30 -7 -76 -113 -10 -84 -41 1 -14 101 -164 -13 126 -8 -116 -34 -96 123 28 -166 166 79 182 -70
5456 -70 -28 339 -41 -8 48 -66 -4 -1 -83 49 -53 202 201 35 -53 -28 -159 33 33 -125 -87 -47 -156 225 7
5481 7 229 38 -30 -106 -99 -43 -26 -88 122 -69 -232 12 -38 -71 -64 23 21 41 -241 318 73 -90 92 -105 73 71
5507 71 -17 139 -10 45 -38 -124 279 141 -75 161 45 136 10 -34 68 40 -48 188 34 131 114 -218 19 127
5531 127 -31 65 -11 7 46 -80 44 -218 -178 18 25 125 12 -135 145 143 -157 -67 -39 -24 -137 -87 30 48 -166
5556a66M42m15K48J18l61J80Mj56m0NJ01J33k19K27Q1l79L22Rr6K6j92J54j30
5579a04J0L3j5K21j9k99K59m4p9J53r4j87J12m9q0K06k65L27j4j60J43o5j22J57
5603B5oR7j64j22M20l50m1K30k6o5q6P6K58l89J52O2j19O9m0j55K20J20j30o2
5627b6q4L16k05j98K30o1Jn3M2J98j33j81J92l1JK31l73J55O1k16J50j37K59N0
5651A88k69J7K55l85K14QO0k4k26K90j25j06J88k2o7o2kJ90p4j31R9O6k02L52
5675B32l29J23K04n24L73j73j9K70k39J20n4j26K35j81j48O6J04J54k28R4K62
5696B16k56l5J38j13J1L8q2J79l2L7N1l53L53p7q9J02k53J35K4k6n7J41j05K49
5720A96j71M2P5l0OQ4k75L28k49r8J88k29J95J03k86J44j4M4K7j00j12K20l14
$$ plain form
5556 -166 276 -139 109 227 -134 46 50 -106 -146 -141 -40 93 -126 101 182 -197 125 134 38 64 -128 26 -104
5579 -104 -94 -61 -76 145 126 -173 86 42 -37 116 22 -165 -53 -102 -182 24 -241 86 72 -88 55 -10 -132 25
5603 25 19 116 -48 -170 250 -100 -141 89 63 -2 -88 -12 246 -143 9 71 -48 21 -19 -174 46 166 36 -26
5627 -26 -110 206 1 -197 33 -28 -27 -80 -38 160 27 -154 38 7 8 239 -134 21 82 -134 16 -121 138 188
5651 188 -81 -64 191 -194 20 28 88 64 -162 128 3 -103 85 63 -4 -66 -68 122 48 -83 16 82 -120 232
5675 232 -97 26 230 -294 79 -94 -113 157 -82 38 -16 -142 93 -88 -236 -170 -66 88 -140 -46 216
5696 216 -40 -75 63 -50 -39 -1 -83 96 64 101 152 -201 152 75 -14 88 -165 -30 -6 -32 -89 52 -53 196
5720 196 25 67 142 112 118 202 -73 255 6 -92 96 -133 62 165 -121 23 9 53 80 -20 -132 88 -226
5743b26L92j80k5L00l68J17O6k47M89k2l15J56j24N3m3j45Q3rk1J63j72L0J80
5766A32j00j1J25k70J47j37J18K8j97J84m0j42K62j49k3J97j68q0L32l02J24m8
5788a8kK54l80J04J18j60l7K2P0N0j47L15j71o6K66j69l3M8k28K31J79k41j1m6
5812e2J61K6k96L1J89QM3k19j9J83j32J41P3j32rP3p3J15l68K68K1k36J60K2o7
5837h9J95mk77L80l04L15k97j45J54J9N9l4J00J38j95j6N0k67R7J10L4Q4J92n75
5861b76J25J59N5J60k87J18j09j70K21o4N5mJ0j30L73l12L53k70M2N8j40m3K30
5884A54m77M37J2j26mj52K35p6o0O2m7j09J49j99J13K13l74L59j24j87L45m48
5906c04K86j9j54J52j14J32J04p7Q6q5l9J83j33j39M03l27L4J73j48J30k09O0
$$ plain form
5743 -226 166 -14 -39 261 -107 10 76 -171 318 296 -19 137 13 66 23 -122 -39 -48 -69 94 -78 -48 132
5766 132 32 21 146 -124 23 -114 4 32 -165 19 -21 -163 99 -50 -73 124 -44 -124 208 -94 30 -18
5788 -18 -20 234 -146 -42 76 -84 -121 -99 -29 21 -126 189 18 -48 218 49 16 64 -164 67 246 5 -6 -52
5812 -52 109 135 -161 -130 59 67 110 -109 -128 55 -77 64 137 5 -4 69 -4 111 -257 11 32 -204 -44 -22 -89
5837 -89 106 102 -175 205 -99 216 -81 -226 -72 -53 6 -28 72 210 15 -1 49 -218 -121 -11 23 107 299 -276
5861 -276 -151 8 63 223 -64 54 -55 -225 -4 -68 -13 -17 -7 -137 236 -76 277 7 49 107 -33 -76 154
5884 154 -323 114 126 0 -4 -156 79 3 -57 5 -42 -151 -2 -201 -88 125 -249 110 -14 -201 144 -304
5906 -304 -18 -37 -191 -39 -153 -21 83 6 92 7 -32 151 18 -121 282 -45 -11 162 14 144 -65 -5
5928em0OQ7J32l15R2q2R8L4%Q9n4j5K20j43j99J78r3j16K46l44J13K05k01L18
5953B11k46o6J34k21K85j09r7J94k19J70L0k01J96k68J8M12k56J81k0k59J51K68
5975B88l30K0Rk43L89l11L04k6k36L64k99p4K42k74J46LMJ44j27p4J20j19j0R
5999h1n7L18l98J55J84l4K12l11ol8j06J21J22k55L23j06m9m2K8J10l4j34J68
6022I0m8k72K90N6j01J5j15J51o8k5Q4M0j28oo0rL52l77K51j34j4J89l20K26j25
6047e8J15j71L9j2L3l1L21j02j78p5m6N0J5oJ74J54l50J70k8j38J49o3j80L00
6071H2j48Q6Q5k50K90r5r0P7p9O1n3N9J08k90J31J58Q6j96m4j23L19k52j26L03
6095I9j64R9pq7M2j5m7J95Lj35n9L3J58k40p0L84m15O9L80m79L60k2m5J5k72R4
$$ plain form
5928 -5 -45 -39 48 180 -135 -43 -125 -27 7 7 96 42 27 247 104 -95 83 -10 -126 120 -224 -111 94 -107 211
5953 211 -35 -101 33 -188 97 -12 -109 85 -134 36 66 -135 61 -207 -189 223 -33 148 128 -131 20 288
5975 288 -42 -22 -13 -256 133 -178 126 100 -136 228 -71 -145 97 -177 -31 -28 -24 120 -7 -81 39 -80 -90 -81
5999 -81 -138 180 -218 -63 121 87 299 -12 -18 -56 -162 -41 81 -174 149 43 -6 -48 -20 90 56 -78 90
6022 90 42 -230 60 116 15 30 -85 66 -2 -27 57 97 -31 -37 -97 -106 246 -131 120 -14 -28 161 -159 67 -58
6047 -58 57 -114 -75 -87 -54 -85 236 134 -44 -119 -165 -115 -100 -106 68 222 -128 42 14 -124 25 -38 -218 82
6071 82 -66 20 105 -145 145 50 -40 37 -42 19 -34 25 133 -157 -26 132 218 22 -22 -145 174 -78 -204 99
6095 99 -65 34 27 -60 -18 -33 -80 115 118 -17 -76 -43 115 -125 -195 189 -226 -157 223 -256 104 82 37 52 -220 -126
6121a26J28r5M2K5O3R1j89J03J02k98K63j43p8QR9kO0k38J05o2o9L57k31R1R4
6146A00k19J14J94k61J94k09RJ32o5O4m5k24K11J3j53K51j20J83k29j6L25k43
6168FK00O2l45j00K56k23K10k31K94o7k4Q8p4j77J00o1LO1q5JJ29P2j09M5j73
6193a42K66l11J57J10j59J67j76J26J31k24R2J95k68J38j04J09Pj56k2J32r5J13
6215H6l2p1J31k40O3K65k35O8l4P2J6j58j45K56j53L4J99n4K8k10J42O8j17J61
6239A40k26J17P5j38J34J4k55J66Qj35K0K90k25l2R7lr3Q5K4q1rJ07p8L3n3n1
6265f9J59Ro4J0j89l8K32k25K43j39O0Q5K0j22n7J13Q2r4j16J79j04J3m1J84l9
6290I2p6j26J86k29K33Q0k72N7K7j6J8J09j85K08k68Q3M9k7Oq8J5K62k57K92k34
$$ plain form
6121 -126 2 -93 -51 -26 37 128 -61 42 144 -154 109 -34 -112 -104 -5 -7 53 -185 -80 -142 -211 146 -85 6 100
6146 100 -119 -5 189 -72 122 -87 -78 54 -11 53 8 -216 -5 8 -145 106 -14 169 -60 -76 249 6
6168 6 206 268 -77 -177 79 -144 66 -165 129 62 38 126 52 -125 -25 -86 -83 -22 -107 -106 23 95 -14 31 -142
6193 -142 124 -187 -30 80 -79 88 -88 38 169 -55 37 232 -36 102 -2 107 114 -42 -64 68 -27 86
6215 86 54 -17 114 -126 -63 202 -33 35 1 73 89 -69 -214 42 -111 -77 122 68 96 -114 28 96 -21 140
6239 140 -86 31 106 -32 102 116 -139 27 35 -100 -80 210 -15 -47 50 47 -46 39 63 -18 -27 80 2 35 -18 -69
6265 -69 90 99 35 45 -144 -182 50 -175 68 -71 -11 74 94 -28 -85 28 110 16 -100 79 -25 -12 -53 131 92
6290 92 16 -110 76 -153 80 160 -112 -55 -28 -44 -26 83 -102 106 -162 -79 -30 -57 -51 -139 -124 138 -119 173 -61
6315f1K1J76j88M6nn4P5J39k05J78k82K72o0m6p9J56j76N7J3k5j07K49J3j00Q7
6340I4j56J26M1j78K39l17J60o4J67j65R9k5j13J61Pj59K78m03K31mk16K29j33
6363a01J84P7k69J71m1j4R1N6j89j0Kn0L35l35l8K35r2P8k9j38K41j00j09j2K28
6388A71j94k19O4K84j46%m3N8m4N1L1O0p8j48K43j70Q0l6j33K49j1j08Ok28L89
6413A28r2Q2J1k39J64J34j88j6N3o7o3K02o6O6j44O8q6o4J64Kj4l0j78L57j21
6438F3k52J71n1L8J53l4J17j67r0Q0k34L80j35j16P3q3n7J71r0J2J51m4Qj27K05
6463A42j21j9j03K81k46Q3J3O6l5N2l9j60N3j17J49NM2k5l6N8o9J10k9j54J62
6488F3J01j85L6kq4J39j67K89k11L4q6P0N8J09j74NJ53o7j75o5K48m9j18K24p7
$$ plain form
6315 -61 -40 136 -52 -6 -11 -65 10 149 -56 122 -160 112 52 6 -73 83 -93 -36 -23 -48 -155 94 107 7 94
6340 94 -62 64 105 -73 166 -151 9 -55 112 -53 46 21 -92 69 76 -83 195 -208 23 19 -197 32 -101
6363 -101 83 160 -109 62 21 7 98 154 -35 -45 -43 -93 242 -93 -131 104 12 90 61 -77 164 64 -45 -57 171
6388 171 -23 -242 -178 106 -40 -40 -83 -25 -69 -18 13 73 -5 -153 90 -80 0 -36 -169 80 69 -39 -33 -261 128
6413 128 36 118 129 -110 54 188 0 -16 37 -30 -93 109 43 109 -35 33 -53 -117 47 49 35 5 -173 184 63
6438 63 -189 -18 -69 -31 122 88 205 38 -52 28 -206 174 39 -77 -4 -87 -144 27 -63 -51 100 56 64 -63 142
6463 142 21 2 -101 180 -66 17 30 96 61 113 74 -86 -33 -150 -1 4 46 21 -15 43 -26 84 55 -99 63
6488 63 164 -21 15 13 -71 68 -99 190 -21 13 -73 -3 55 164 -10 -5 148 81 -94 -159 89 40 -78 146 69
6513F9o4J92l61L32p5j70J12p6O4Q1k77J32O1k4N2j10J50O1o6n1m6L5Q1l5j23
6538e6J75p6m9k2K6k6j5O9nk19K25J7KN4j0j41J41j73J97M4n7Pr5n%Jj72J47j72
6567a88K33l2o2K43j23j32Q8k6L7k68L2L17j63j02K64j48p4K37j56J10m2R7j68
6590b6N6J23j80O6j0j1OJ06l6j79K03j10O2j06jJ69j11k04J72k9J93q5o4R1j15
6615b0m8Q0j11K43k51Q0o3J08K5J8m2n9mM3L9j63R5m1J18l5J34k26K06k39m1J27
6641b7J9m3J02j9Q7j43K01j15j96K71p6k7N8r0J0L5j4L1o1l5J15k13K5K21j33
6666a7P1j74J27J66m21K48K19l30K40q6q2Q1k7j76K19r6m1R6m7J23j61P7J42k87
6690a36J49K9p5m4oQ5P6R0p9j7j69K93k57L3n8J56j95K94k06J34j63M2K25j88
$$ plain form
6513 69 5 197 -164 168 93 -77 35 -41 23 104 -173 -41 20 -4 48 -62 88 149 83 32 -14 21 102 67 -56
6538 -56 119 43 -6 -28 -2 -28 -43 26 21 -198 27 44 46 100 90 -51 90 -83 114 158 101 108 13 8 8 9 -163 -16 -188
6567 -188 45 13 -49 194 71 -61 27 1 38 -230 -198 119 -44 -146 118 -30 -104 133 -23 87 45 142 -26
6590 -26 30 153 -27 39 29 18 24 130 94 -85 118 8 70 -36 -37 132 21 -183 -11 -40 153 68 4 95 -20
6615 -20 -68 12 -99 144 -107 -27 -90 18 43 61 19 -40 -44 -1 38 -125 -30 -71 47 12 146 -80 126 -113 -154 -27
6641 -27 -8 -51 51 32 119 -24 177 62 -134 137 61 34 92 2 12 47 33 64 3 -32 83 -130 -105 116 -17
6666 -17 54 -120 7 173 -248 0 219 -111 129 43 -39 42 15 -161 58 -38 -79 17 -30 93 -68 9 151 -136
6690 -136 13 42 -33 -77 -83 2 78 168 89 72 -97 196 -61 -28 -86 70 -125 169 -37 97 -66 -24 201 13
6714A3j2P0r1J64j90J5K08j20j17R0q4R2j12N5J83k31n2J41p4K7P3k07J87l6O0
6739E2R8k30p5K74j79R3k2J24Jj00M2L3q7n5j13J21l1k2J70j42K5k3o2L7J39k34
6765a66J57O7j06K23k97J28nKn2K3j5J20r5J15Oj63J6k2R6J10j76J35r6j17K16
6790A04k38K2J84m7j19K36j43n8N4L8N4n3o6J18j35KN8l1J14j67K52j27j30J10
6814C2Rk35L11j24P4N0j52k6pm5K52l19J88O0k0J29k20M3j30J19k7J21j51P6o2
6839e4M4Q2q6m9R2o2P3l2j30K32j56j22M6J22p8J29p1k25M1J97P1jK0Op2o9L9
6866a3o2K60k14o9J67o7J92j26q3oL8L1L3j6M4r0p8M5Q3r4R4k43J03J13j8r3j3
6893h2l6R1j72J53J69j31J08m6j55J41o6K5K11j97j59J63m4L8j2j47L65k33M5
$$ plain form
6714 13 1 71 -20 144 -46 -31 177 57 -60 30 -54 38 -74 -19 164 -67 -119 22 -52 -25 48 -159 28 -8 52
6739 52 150 -80 -155 119 -60 33 11 135 136 36 78 111 24 -31 -144 -23 -54 -76 94 -48 -23 -46 -108 -71 68 -166
6765 -166 -9 58 -48 175 -122 6 1 3 -49 -26 -41 79 -16 99 105 -58 -42 -64 32 142 -34 101 5 -112 104
6790 104 -134 -112 72 25 -94 142 -1 -59 -5 33 87 34 -32 86 -49 -47 11 -20 94 -73 179 52 -78 32
6814 32 41 -194 117 -7 67 117 -35 -61 -68 -113 139 -180 8 68 48 177 -43 0 -130 -11 -38 83 -68 8 -54
6839 -54 -10 72 -14 -63 29 -33 40 8 -122 110 -46 -168 -122 0 -78 51 -20 -245 -204 -7 64 63 83 89 17 -52 -13
6866 -13 -75 185 -29 -98 69 2 194 68 -15 -21 17 48 81 65 109 19 -59 -14 69 -25 69 -174 -71 42 24 -69 -82
6893 -82 -118 -27 -199 -46 123 -8 100 54 -101 40 -26 -1 210 13 -146 17 -27 11 -1 -148 217 -16 29
6916B9j61O9J69m3J07p1j94R1Q9r4Q6q8N3j7k8J27k04J76j69J08L9J4j55OQ3p
6942A5M3j46J69j77J46j27L3M2J0k1K0J52k34J89j73M5J19j53l5K1r5J29j2K25
6966A85j49o7k8J46k9pj07P4R6j78j02K62j16J05p5m9P3J5j28J7o3K03j34J0Q8
6991D2j68J18L9m1n6J15j67J05R7m5k66L42j52K5n4K07k23O7J9j53K30j02O2O7
7015A08p2j84R1J39j63qJJ0J03k2N5J19j68k01J35P6M2j02J1nM2K4j34R3j72K01
7041A9M3j67PJ37Qm7Q6Kj21J27q8Q9j04J27k2L6k77J10m1K01k17K10lj79P4k0
7067a0J55j59R6Mj45M0m1Lj09K99k74J33R3r7j00J07l8L2K5L7n7j6M4M1j23P1
7093A1j01K2N9R2P8l29K80j7o4M5l04K49R1j49P4j06J22q5L4j55J49P8j20M4J23
$$ plain form
6916 29 -132 -63 106 63 170 99 -95 -4 85 -9 77 -11 42 25 -3 124 -80 96 -73 35 74 88 -67 -61 22 15
6942 15 58 -88 81 -96 50 -77 -44 -2 8 -13 7 159 -75 114 -59 -14 105 -48 -83 -62 -157 -28 -40 185
6966 185 36 -31 -59 87 58 51 -56 18 114 -64 -166 96 -20 85 10 -39 34 49 -79 -62 -125 78 -56 -46 42
6991 42 -126 -8 31 -10 -66 49 -118 -13 84 39 -227 115 -37 -12 -66 141 -82 -15 4 -149 81 -21 41 108
7015 108 36 -148 -57 82 -81 -89 -88 -78 25 3 58 177 9 -192 -57 19 61 -41 -30 -35 7 31 -103 -10 -182 19
7041 19 62 -105 -98 39 47 0 86 88 -33 94 6 95 -9 118 96 132 -145 -35 -76 125 -92 118 115 -64 10 -10
7067 -10 145 -14 82 86 -59 -19 -60 -57 -166 133 -141 -8 85 -12 -112 -5 -43 -11 14 51 -6 -22 22 63 -60 11
7093 11 -90 -68 -9 83 161 -168 112 95 31 76 -228 21 112 -37 37 -69 53 -32 2 -153 -4 74 -46 -2 121
7118A21r5J40k5j12j29J14R8j45j35J02J15j3O8k23P2k0J47N7k33J53l4j35J55
7141D3j14j25K91j74O7k9J14l3N0o3J0j96R7P3j36J58M8M9q2R0j4K6k11R1p1J84
7167A43j0k26mJ27N4m5j43J39l7KKL7m9J80l2j79R2j08L1J35r8kk9Q5j51J3P1
7194bj00lJ29j27j14J59J3L0R3j41J2j88K62L9j30J07j9K7n1k8M4R3n0m7J1R8
7220A17j09M8k6N5m7o6J22o6m1R7l4j0pJ34k50J97l51J74O5j3P8p4L7j16J84o5
7246C3N9m7K9j98nL0J97j14m6R2l4%j0M9L8p3J06k02O0J16k12O6R5j6m9L9J4n3
7274c6l7O4K8J50k65L10l71J49M6p4J92p0m9nj78O7O8l5K65j59p4L0j24K37j36
7299gn2N7J3m3Q1J07l5k21J04J30j49J21j57R2j25N1J66jp3N5q1j06m6R9o0l3
$$ plain form
7118 121 26 166 141 29 -100 14 112 -33 -168 -66 49 36 104 -119 -47 -67 80 137 -96 57 23 -112 43
7141 43 -71 -196 95 -79 -12 -41 73 40 90 27 37 -159 -62 11 -125 33 81 130 48 138 124 150 -61 30 -41 143
7167 143 133 -93 -97 30 84 39 -104 35 -2 0 2 39 -10 170 138 -41 51 -57 -26 109 11 9 -20 65 -86 -73 -2
7194 -2 -102 -105 24 -103 -217 -58 -45 -15 78 -63 -51 -239 23 62 -68 39 20 47 -4 -32 12 105 55 8 19 117
7220 117 8 56 30 85 38 -28 94 28 -13 84 50 40 33 167 -83 114 -237 -63 2 -11 67 -7 30 -86 98 33
7246 33 92 45 74 -124 -129 -99 98 -16 -62 30 -4 -4 -14 35 73 0 106 -96 -36 80 -132 -66 29 13 -36 3 17 -36
7274 -36 -73 -9 19 169 -96 214 -157 -8 38 -36 156 86 37 32 -146 -79 -11 -46 219 60 -14 16 -108 129 -7
7299 -7 -59 -2 11 -32 49 156 121 -100 4 134 -15 106 -51 41 -84 -33 133 132 59 114 33 -73 -119 -20 -80 -113
7325a13j0J77p4o2K5J12J01j58J9J65j36J7m0J18j44j8o1o3K89n6j87J9L3J14
7349F7l1p5P7k9K7P4r6o6oK2o5R1K32k70R6r6J54j47P6n5k3l4M0J5j19J25Nj1
7377b2J4k34L28mL5k03J69r0R5K2p0l7J95j59M0j48l1J15o6R4l3M2j46ol1P2Q
7404e1m1P9j22P9j25J07J35n2kK7k23J46o3J95j91n6J93K9R5l35K37j41J43o7
7428dJ47j14N5j2O0k17M0n6J11j23l4J30p0L61l09l4J09o2J30l5k39P3K7R4q4
7453e6J76n8L4j16o6J33j94J16J0j93J31J06O2k41L14j42j06p5J19J62j41L9k0
7476fO5R8j63O4Nj24l2M6J12r6Q2O6j7k35P8Q3k05J69K4J38k5K1q8j01R0j78L7
7503i2K30j85J66j25M4J34j31oj05K07k42N2nP9M3q3O1j71J35m9J27n2k5O8j0
$$ plain form
7325 -113 -123 54 -20 -82 -57 55 156 -2 17 182 46 63 23 141 -3 -21 -82 -145 144 88 -99 -80 -47 67
7349 67 36 -39 38 9 36 110 14 -52 -58 -36 -101 -10 222 -48 48 -48 106 -41 35 -20 -43 -77 -37 -22 -141 -16 -11 -22
7377 -22 -8 -242 86 82 117 -86 83 -7 88 110 40 3 198 39 79 -69 -100 15 -51 43 10 52 -94 -100 -131 -59 -51
7404 -51 -92 -13 -135 -56 -181 -74 61 9 7 34 -189 -43 -106 89 -102 -158 35 64 159 -176 61 -80 63 -4
7428 -4 143 29 84 72 132 -85 -45 -101 10 -113 -147 -17 -87 274 -35 -69 40 -22 108 73 -166 -93 -66 28 -56
7453 -56 120 62 96 -20 -86 47 -147 -31 -21 -214 -83 23 85 -156 158 16 -90 -165 -46 116 -25 14 -6
7476 -6 59 157 -6 58 63 -61 -93 -47 65 -31 51 117 100 -135 -57 26 -179 -10 14 152 127 148 60 -41 49 -129 -92
7503 -92 138 -47 119 -6 38 172 41 35 -70 137 -105 -53 -58 21 64 -19 42 -129 6 -43 84 32 7 75 65
7528F5j97K23p0m6R7R1r2p3k1Q3j32l2J9QK8NQ6p9J27k02P3J72o7l7L2K3o2mJ0
7557B8j1J13j17M0j05K5%m5Q1Q9q2m8J16ll10J64K73j97J76j82J09j89J13nkJ45
7583A76j07O9o2rN4l08K40k52J21l4P3J8J7JJ23j36J77j69j62L74l19O4n3j8J8
7608a04K46j30Oj8J8p2N9m5J75l6j52j00J95o3pJ33j11rm0O8l2p4M8J30Q7J56
7634C28l63Op3m2K58qj09kn9J61o5q4J16j37j7M8qJ19M7p9o2j3J24j41J03p9M7
7661A6j40N4J45j30J97j19k6o8M6K06j84j6K7K43l77J09J47j85J03n9P6j61N6
7684d0k9M7M1j5PM8M8j34j14K55m7l5nn2L4j8p5p5J72K0J14j01l0K5l4J9K5r2
7712d1o4J05m5J10j74J54p3L4K1j4q8R1l1O0r1O5J6J4l2j30m2J56m4k23K82p4
$$ plain form
7528 65 -132 91 21 -25 72 163 71 -2 -23 60 -72 -104 -85 -77 -49 -44 42 -37 90 -112 -39 133 66 29 61 84 22 18 28
7557 28 17 130 13 53 -52 -27 -27 -72 9 98 16 -32 84 81 -229 -65 208 11 187 5 114 -75 38 33 31 176
7583 176 69 138 76 67 121 -187 53 -199 -78 -112 -39 -21 -4 -3 120 -16 161 -8 -170 204 -115 -51 -104 -122 -104
7608 -104 142 12 18 0 18 -54 5 -40 135 99 -53 -153 42 -21 -28 105 -6 -15 -55 13 -19 -93 -45 85 172 328
7634 328 -35 -29 -102 -144 114 106 -3 -5 -64 97 32 -52 64 -73 -90 -42 -50 69 116 37 -25 -38 86 -55 48 -31 16
7661 16 -124 -70 75 -55 142 23 -3 -71 -25 181 -3 -19 8 251 -126 -17 130 -55 48 -11 65 -96 -40
7684 -40 -69 -22 19 4 11 59 107 -27 -141 114 67 32 27 -25 9 -9 -84 -159 13 33 147 46 16 41 7 26 51 -41
7712 -41 -105 0 -45 65 -109 45 -28 6 27 13 -75 16 -15 45 -46 19 35 49 17 -113 -155 1 -43 -266 16 -58
7738e8J34q7q4J48n7j71M6Q6K9J53m5j53O5J37j93J6J76j64k09K38m0j49L57r0
7762H5j7j6j24N0N0q2n7K54o4j70J34j5n4J7j6l7p8J19Q1o2J36k74K15j70J31
7787C6j06j00L44j37Q5J3k16K41q9k41J60L9q8m5J06j7l5J74n3k0J02m3j08p8
7811g6J0J15l16K91m5j2J7J8J03j07p7N2k8J16q4K9O3jj71K9J52j40P0j36Q6L3
7837iL1j41J48Pj2K0p0r2J96Kn9k7j05J93j30J14k4N6k33J54J42j86L7n0R9qp4
7864b1j14J01J29Q8k34J50L5j27m2J65q3J2j14j6J05P7n3k0p3O8Q0k23M6o4J28
7889@M9L8j9j77R6N4PJ02k77J27J47j56k55K06J83k8j38J57M0j67q9J4L2R9j29
7914h4K66j97j13J76m6M0q4J37M3j61K9oj40L4J91l3J52o1j59m7j50K02q7J06
$$ plain form
7738 -58 76 -11 -95 53 -4 -175 -129 -43 -14 139 94 -59 6 143 -50 -34 142 -22 -231 7 -33 -182 175 85
7762 85 68 52 -72 -22 28 -54 -111 143 79 -91 43 28 -26 -9 -25 -62 -140 -21 60 -2 134 -140 75 -95 36
7787 36 -70 -170 174 37 122 135 -81 160 71 -170 -10 29 -59 -104 2 -15 -50 124 71 51 153 110 2 -76
7811 -76 -66 49 -267 24 -21 -33 -16 2 105 -2 -79 -27 -55 61 -23 6 69 68 -103 -74 78 -62 8 -128 -42 -9
7837 -9 22 -119 29 36 24 44 -26 -118 78 80 21 -6 -111 82 -48 66 42 98 -135 19 161 -25 12 -38 61 53 -21
7864 -21 -135 -34 95 183 -51 99 134 7 -35 130 47 59 -55 -71 34 111 58 38 -35 33 113 -110 -64 -128 0
7889 0 49 87 68 -109 -13 41 48 150 -127 0 147 -9 -264 -58 125 97 -41 116 156 -11 -100 -86 -54 45 -84
7914 -84 182 -15 -128 48 2 42 -42 95 138 -23 6 0 -140 -106 85 52 204 143 -16 -63 -213 -11 -98 8
7938HN0j63P8J46k19Q4J53p1P0j46kQ9jk39L51j67J51q3k84L23l5N1j36K7q5J16
7964F6l3n6J38j07J32l00K24j7n9k1J07n8j50Q4j9O4k6J9n7J48L1k36J27L4J36
7989A71k38K61k13J11j67r9L44n1rj77q0J30J86j67N8l9J9Kn0j0J80j27r4n6K67
8014A52j13n9j26K6M1O0L0m9o4K81j46k88K05N6J33q7r1R8k6p4O4j34J22K4k64
8039b29J52j7P4R9l2L4l4P4j08J7m0j2J67k37O5MJ13J7j61P5j3r2K8J69q8RJ6
8066E0j05R4j39J56Pq9q2J29m0K09k19R0p4N7m8J40j38K5N8k4K1p3R7q5j5Ok3
8093a5k69L43j51J67j35O3q1M8N9j50M2l4J01j22K00J18j92J9J0M2o0J18k82L28
8117A67j20r6Q1N2j28Q8J67l90J75kn6RJ42j24N5Jq0J87k41R4L9M3j71J24o2J47
$$ plain form
7938 8 58 -105 -27 119 -100 -16 137 66 136 -10 -12 77 76 -163 188 21 172 89 -195 128 93 144 8 35 -50 66
7964 66 33 -23 115 8 140 -160 64 47 -12 -33 74 16 -134 -50 -69 -5 -31 -12 -69 79 110 -126 1 35 171
7989 171 -67 194 -19 92 -75 -174 170 119 110 -67 -147 -17 169 2 60 21 40 42 -8 -18 162 35 -59 -115 152
8014 152 39 -20 -146 -120 -79 -19 11 -38 -102 179 33 -255 -50 6 139 52 -39 59 33 -41 23 -111 11 35 -229
8039 -229 -77 -94 -20 79 47 81 47 121 13 30 -10 -22 145 -92 -27 -23 90 107 -54 21 8 -84 -56 113 25 34 50
8066 50 -55 39 -100 56 63 -26 -108 21 -19 190 -29 61 -13 44 -4 136 -2 23 81 57 78 5 102 17 2 8 -15
8093 -15 -284 59 -92 75 -60 3 -78 -30 29 -121 -79 -113 -12 -134 66 184 -8 11 21 63 3 121 -161 167
8117 167 47 -49 32 84 -44 44 211 -179 -4 -6 -62 -53 89 -35 20 21 -59 128 -113 -19 20 63 -108 16 -46 101
8143A01j77J80k37J11Lk9J61j78N3m9pj89L12j34K15k49M6P9q1%J63j60j13Q9
8167i0R4j89J09J83p7J8q2L9j90K18k6P2P2j39M1j15J15N4o7o6l9l2j0J90
$$ plain form
8143 101 -76 104 -133 -22 -19 -48 113 -65 -12 -61 -68 -257 55 -79 136 -113 -67 12 -69 -69 94 -66 -179 -90
8167 -90 4 -185 -76 107 30 48 -34 5 -185 33 7 79 151 12 53 -62 53 107 40 -26 -65 -97 -107 83
8191H3
$$ Imaginary data points
##PAGE= N=2
##DATA TABLE= (X++(I..I)), XYDATA
0@%%%%%%%%%%%%%%Qj6J6j6J6k4L2l2M0m8N6o4P2q6R8j11J27j45J64j86K08k33
36a24K63k95L29l65M06m51M99n52O10o73P43q19R01r92J092j205J328j464J621
55H52j797J997k229K499k818L206l687M299n103O213p841J0449j5247K6675r6528
70g9060o5769K53470j85957m5336J96244j30727n0788J51687p4025m8792Q8500
81I447j5438m9531N4977N995m2489L7867O871l1828L7747j7059q400L5218l9979
94a6602J6584K3129n1631M2146l576m2373N5730l1909k2591N8459n0756l174M7496
107B0932m7884K780L2013k6039q702J9278O575l3997J4887L5192n9623J9112M9008
120B3532p3888K5758M5055o8333K7005K9697m5522J8124J4308j5748KQ074P741
$$ plain form
0 0 0 0 0 0 0 0 0 0 0 0 0 0 0 0 8 -8 8 -8 8 -16 16 -16 24 -24 32 -32 40 -46 52 -59 68 -77 87 -99 109 -124
36 -124 139 -156 173 -192 214 -237 262 -290 320 -353 390 -429 472 -520 572 -633 695 -769 852
55 852 -945 1052 -1177 1322 -1496 1710 -1977 2322 -2781 3432 -4409 6040 -9207 17468 -79060
70 -79060 -144829 108641 -77316 -122652 73592 -57135 -107923 43764 -30261 -79053 9447
81 9447 -5991 -55522 -545 5450 -37039 828 7699 -24129 13618 -3441 -11841 23377 -16602
94 -16602 -18 23111 -28520 13626 10050 -32323 23407 -8502 -31093 27366 -23390 -26564 20932
107 20932 -26952 -24172 7841 -18198 -26900 -7622 -1047 -35044 -20157 15035 -44588 -25476 23532
120 23532 -50356 -24598 20457 -47876 -20871 8826 -36696 -18572 -4264 -20012 -20010 -11936 -4195
133d195j9546J2870J6050l1237K3984P458k9309L2279r602j3800K9281k4584Q221
146b130J3667k8001K6670q222j8785L3304k6351k163K6787l3269J2470J1532k4809
159a9300J5885l060p006P676r660J0593p325n631J9082k0623N944J4320k3521
172b2626J6836K0j3580J9380j4974L654J2178k2601K0447k691j8090K7966j7072
185a1153m614K2662k3309J0678P735j7490J8894r047k599J5280j8279J3715K308
198D781j6623K3409j2480n434K1228k1258Q529R011j8702J6668o680o075J4567
211A0941j7605R169M229j8688J9528r210r530J9162j7287L320Q558j4989J2004
224c98n736l539J1692j6017J1635J866j7035K2505j1435q607K4161k1412M543
$$ plain form
133 -4195 -23741 -10871 5179 -26058 -2074 5384 -23925 8354 -1248 -15048 14233 -10351 -2130
146 -2130 11537 -16464 10206 1984 -16801 16503 -9848 -12011 14776 -18493 -6023 5509 -19300
159 -19300 -3415 -6475 -13481 -5805 -15465 -4872 -12197 -17828 1254 -19369 -13425 895 -22626
172 -22626 -5790 -5770 -19350 30 -14944 -11290 888 -21713 -1266 -3957 -22047 5919 -11153
185 -11153 -15767 6895 -16414 -5736 1999 -15491 3403 -5644 -8243 7037 -11242 2473 4781
198 4781 -11842 11567 -913 -6347 14881 -6377 2152 11163 -7539 9129 2449 -3626 10941
211 10941 -6664 2505 6734 -11954 7574 -1636 -11166 7996 -9291 -5971 2587 -12402 -398
224 -398 -6134 -9673 2019 -13998 -2363 -497 -17532 4973 -6462 -15069 9092 -12320 -7777
237g777J5531k2001J4436J670j2289J5569r315J809P558j2640J4038n571o416
250e398J7592j6180N281J0925j8901J5367j589j2049J8208j3332M21J1662j7598
263e591J2059j005j2257J6341j2940k45J0525j7093J1652j965j2120J7466j3992
276i165o41J3959j9627J1106M320j6355J6394n807n217J1840j0343O677Q22o452
290h489J3182j1375L474J1666j8091J4110L050j5441J8677p254n585J4535j2673
303b14O571K708r791J4083j0736o80J4238j9797J0371O953k0317J7193l232j2400
317e050J5283r329j176N275p696P598p731O95Q994j7430J1993L535j9434J9780
331E307n391j3182J9432j1217k531J0874j0275O208k029j473P909j2742J0649
$$ plain form
237 -7777 7754 -14247 189 1859 -10430 5139 -4176 -2367 5191 -7449 6589 1018 -5398
250 -5398 12194 -3986 1295 12220 -6681 8686 7097 -4952 13256 -76 345 12007 -5591
263 -5591 6468 5463 -6794 9547 -3393 -3638 6887 -10206 1446 -519 -12639 4827 -9165
276 -9165 -9806 4153 -15474 -4368 -48 -16403 -9 -5816 -11033 807 -9536 -2859 -2037 -8489
290 -8489 4693 -6682 -3208 8458 -9633 4477 7527 -7914 10763 3509 -2076 12459 -214
303 -214 6357 9065 -726 13357 2621 1941 16179 -3618 6753 13706 -6611 10582 7350 -5050
317 -5050 10233 904 -272 5003 -2693 4905 -2826 -2131 6863 -10567 1426 4961 -14473 5307
331 5307 -84 -13266 6166 -5051 -7582 3292 -6983 -775 -2804 -4277 3632 -9110 1539
344A539K896j6513J9886o044j1900K1265j2684k907J4094j2631N245J873m986
357h67P855q969O338L196j4222J6571n664j1574K0079j3410l196J4615j4907N228
371A073L871q963Q390o672J732N059j2061J2362l689r934J7476j2242k311J4844
385H935j5408N846O194j1476R860l791j838O690r518Q983k170p861J4878j1510
399b186j010J3976j6731P325O605j4472J2028k959n820J0022q732M446K031q388
413c865J1777q178j811J2386j4677O679O231j4184J1964k527p034J0675q798K668
427A306L740r344J0042n988l405J1413j3442N517O249j4152J1607j671q966J2263
441E169p850pO247q442P301k959l334Q955j0156N082M791j2545J1980k764q130
$$ plain form
344 1539 4435 -12078 7808 1764 -10136 11129 -1555 -4462 9632 -2999 2246 4119 -867
357 -867 6988 -1981 4357 7553 -6669 9902 4238 -7336 12743 -667 -3863 10752 -4155 1073
371 1073 4944 -4019 4371 -2301 -569 4490 -7571 4791 1102 -8832 8644 -3598 -5909 8935
385 8935 -6473 -627 5567 -5909 3951 160 -1678 5012 -4506 4477 2307 -5554 9324 -2186
399 -2186 -3196 10780 -5951 1374 7979 -6493 5535 2576 -3244 6778 -1954 2492 4523 -3865
413 -3865 7912 -266 -2077 10309 -4368 2311 8542 -5642 6322 3795 -3239 7436 -1362 1306
427 1306 5046 -4298 5744 -244 -3649 7764 -5678 -161 6088 -8064 3543 1872 -7094 5169
441 5169 -2681 -2688 3559 -4883 2418 -541 -3875 5080 -5076 6 4797 -7748 4232 1468 -6662
456f662J3536r990P31Q313j2092Q501r6p778J1732q217L24Q418j1639Q177Q59
471D117q493J1480o504j382Q715r721N830J049o792R219o965Q31O163j0896R004
486E655j190q769J2585q570k330J0549j1718N082L206q838R108n093j045P159
500E791j0099P663M55r055J2568o895l363J1291j0977L898N040r887Q635l169
514A896l704Q132q749M083K399q715R669n040l759R817r829L178M436r007P823
529B630l016k612P040q553O024J574r869J2849o314n665J4171j2000J047R533
543F839j1595O043J436o170P235n704K720K638q021R573l873n357J2033r533Q48
558h88Q470j0676O092J841o594P122l800K03L067o299P450m689l062J0374j1704
$$ plain form
456 -6662 6874 -3116 -2385 5928 -6164 2337 2241 -5537 6195 -2022 -1698 6720 -4919 3258 4117
471 4117 -4376 7104 600 -782 7933 -1788 4042 5091 -1701 7518 553 1384 7547 -3349 5655
486 5655 4465 -4304 8281 -289 -2619 7930 -3788 1294 4500 -4338 4770 -323 -1368 5791
500 5791 -4308 3355 3810 -5245 7323 428 -2935 8356 -2621 1277 6317 -3570 5065 1896
514 1896 -1808 6324 -2425 1658 4057 -4658 5011 -29 -3788 6029 -3800 -622 3814 -5193 2630
529 2630 -386 -2998 4042 -4511 1513 3087 -6782 6067 -247 -5912 8259 -3741 -2694 6839
543 6839 -4756 1287 2723 -3447 3788 -1916 804 3442 -4579 4994 1121 -4236 7797 -1736 -888
558 -888 7582 -3094 2998 4839 -1755 5367 1567 1770 4837 -1462 5988 1299 -1763 8611 -3093
573c093K641Q512j3971P535K747j0211Q630l342k210M688o605O742k865n284J2101
588F015r715n17J1453j2266M454N916r002O509j336j562M396n839N978j487n675
603b678J0713q077j053J0161j1867M316N643j0895P475j76n813N742l398J191
617A284m93k254N869p959K796O114j2677Q753K024j2183J2056l839o800J0941
631C632q052R40N536q835P185j635m873Q748o476R96N642p314N544K0l459O094
647C693m679K472K277n177P148m060j541Q137r385M581M867j1571R515p24q553
662c000J0506n628k267O008o692L721o24m322P096p116J062N423r101N913L91
677A370o342P501m901m31N150p131N312k42n071P473n164J17N242p251N962q46
$$ plain form
573 -3093 -452 8060 -5911 1624 4371 -5840 2790 -552 -2762 1926 -4679 2063 -802 -6086 6015
588 6015 -3700 -4217 7236 -5030 -576 5340 -3662 2847 1511 -51 4345 -1494 4484 2997 -2678
603 -2678 8035 -42 -1095 9066 -2801 1515 7158 -3737 3738 3562 -2251 3491 93 1284
617 1284 791 -1463 4406 -3553 -757 5357 -7320 1433 3457 -8726 3330 -509 -7309 3632
631 3632 -4420 -3480 2056 -6779 406 -1229 -6102 2646 -3830 -2834 2808 -4506 1038 1058 -2401 3693
647 3693 -986 1486 3763 -1414 5734 1674 133 8270 -1115 3466 8333 -3238 6277 5553 -3000
662 -3000 7506 1878 -389 5619 -1073 2648 2024 -2298 4798 -2318 -1256 4167 -4934 979 1370
677 1370 -4972 2529 -2372 -2803 2347 -4784 528 286 -4785 2688 -2476 -2359 2883 -4368 1594 748
693G48n108R245o726J50P358r586N881K329p714Q102l142k662O838o928L382J929
709D096o245O897m097j515N985p565L923J510p116Q010m517k937P623q078K522
724a504L696p704O109j510l602O205n664J986K808n772N754k232k057N554n598
739c531L514J291n400P717m532j293Q148r408M214N098j0249Q348n5p217Q971
754E616m535j677N532n535L107o2k751M301m732K298J872o229O535k731m166P829
770D672o684Q65M709p446N262n77m851P262n782M57N306q160N704L52o299P814
786B604l995k095O254o246L336J253m557N640l803o9M943o588M482R58n639O936
802C414l572j588N148n264L084M12l859N521m750Q85M503p864O085K23p258Q888
$$ plain form
693 748 -4360 4885 -1841 -1691 5667 -3919 1962 4291 -3423 4679 1537 -1125 5713 -1215 2167 4096
709 4096 -2149 4748 651 -864 5121 -2444 1479 2989 -4127 3883 -634 -3571 4052 -4026 -1504
724 -1504 2192 -5512 597 -913 -4515 1690 -3974 -1988 820 -4952 802 -1430 -3487 2067 -3531
739 -3531 -17 1274 -4126 3591 -941 -2234 5914 -3494 720 5818 -4431 3917 3862 -3355 5616
754 5616 1081 -596 4936 -599 2508 2446 -305 3996 -736 1562 3434 -2795 3740 1009 -3157 4672
770 4672 -2012 -1147 3562 -3884 1378 801 -4050 3212 -2570 -2113 3193 -4967 737 1089 -5210 2604
786 2604 -1391 -3486 2768 -3478 -142 1111 -3446 2194 -1609 -1678 3265 -3323 1159 2117 -3522 3414
802 3414 -158 -1746 3402 -1862 1222 1634 -2225 3296 -1454 -569 3934 -3930 2155 2378 -4880 4008
818D008m159l522P810o736J667L547n952M710j884j913N184n811L255J452n919
833d263O959k955l022P052o066J770L313n626N176j815k339N649n847K966K317
848C269o442O625k068l508O752n549Q48L966o152M867j377k906N749n464J731
863C41L444p120O106j179m822P311n215j30M551n904L637k03l305N126m593R71
879i84L113o073N408j238m053O694m939l04N022o495M213L74m559O175m191R7
895a740M667o355M287P17n179O503l834r89N237n937L206J386m818N486l242j072
911a677M863n613L212R86m853N625l014j400M890n453L117J128m604N361l043
926d75r87M767n846L564J158n576O548k976k573O267o023J834L085n572M907j692
$$ plain form
818 4008 -151 -3673 4137 -2599 -932 2615 -3337 1373 -511 -2424 2760 -3051 204 1656 -4263
833 -4263 2696 -259 -3281 3771 -2295 -525 2788 -2838 2338 523 -1816 3833 -2014 952 3269
848 3269 -3173 3452 1384 -2124 4628 -921 -73 3893 -2259 2608 1231 -1675 4074 -1390 341
863 341 3785 -3335 2771 1592 -3230 4081 -1134 -1264 3287 -2617 1020 817 -2488 2638 -1955 -984
879 -984 2129 -3944 1464 226 -3827 2867 -2072 -2376 2646 -3849 364 738 -3821 2354 -1837 -1740
895 -1740 2927 -3428 859 1576 -3603 2900 -934 -1923 3314 -2623 583 1969 -2849 2637 -605 -1677
911 -1677 3186 -2427 785 1771 -3082 2543 -471 -1871 3019 -2434 683 1811 -2793 2568 -475
926 -475 -1462 3305 -2541 1023 2181 -3395 3153 177 -2396 3871 -2152 -318 2767 -2805 2102 410
942D10k309M964m748J982K036n140N216k001k440N527n109K004K491n298M896
957B481j845k657N618n401J770L237o343N020j040l759N720m251J94L209n058
972c105L948q65k859N143m606J002L400n470M204m88l729N545l940L47L591n138
988c020L958l49l323N431m370N21M180o190M280L86m591N875l390r10M562n133
1004b083L130N41l705M907l235m03M192n538L522R06m556N435l282q40M270n174
1020a913K838P69m073N215l401p12M621o325L489J629n686N717k138k349N023
1035B704m442J518J882m097M280k137j187M698n397K793J841n448N449j516l169
1050b228N053l846R03K311l717L412j931j315M268n179K549J987n640N350j493
$$ plain form
942 410 -1899 3065 -1683 299 2335 -2805 2411 410 -2030 3497 -1612 392 2883 -2415 2481
957 2481 636 -2021 3597 -1804 -34 3203 -3140 1880 840 -2919 2801 -1450 -1256 1953 -3105
972 -3105 843 -22 -2881 2262 -2344 -1342 2058 -3412 792 304 -3425 2120 -1820 -1473 2118 -3020
988 -3020 938 589 -2734 2697 -1673 -1152 3028 -3162 1118 1504 -3087 2788 -602 -1512 3050 -2083
1004 -2083 1047 1588 -2117 2790 -445 -848 3344 -2194 1328 2234 -2322 3113 -169 -1009 3261 -1913
1020 -1913 925 1694 -2379 2836 -565 -1277 3344 -2981 508 2137 -3549 2168 30 -2319 2704
1035 2704 -1738 -220 1662 -2435 1845 -292 -1479 3219 -2178 615 2456 -2992 2457 941 -2228
1050 -2228 2825 -1021 -118 2193 -1524 1888 -43 -1358 2910 -2269 280 2267 -3373 1977 484
1065D84l430N863m633P44L113m788L725r42k745N016m544J346K983n687M396j15
1081G86m325N434k811j112L472l574K220n37j335L619m155K154K485n829N259
1096A751o22m331O313l524r06M486m897K826M31l178M573l650O52L445n594L967
1112A742N63m975N694k640j745M479m393J864J388l466L459k334l86L081m530
1127b199L259N44m298M991k280j809M237l844J547R10k901L855l004m8L524n577
1143c093L873J203n622N926k078k714N498m628J072K609m625M008j394j857M347
1158B525m135J618J882m388L929r78k419M226l356O45K047l474L228j741r83L714
1174B340m304K110J659m890N113j481l398N694m021j6L386m172K894m16k210M337
$$ plain form
1065 484 -2946 2917 -1716 -972 2141 -2647 1078 136 -2609 2407 -2137 -791 2192 -3495 901 786
1081 786 -3539 1895 -916 -2028 1444 -2130 90 -447 -1782 1837 -2318 -164 2321 -3508 1751
1096 1751 1129 -3202 3111 -413 -1319 3167 -1730 1096 1527 -1651 2922 -728 -76 3369 -2225 1742
1112 1742 2305 -2670 3024 384 -1361 3118 -1275 589 1977 -1489 1970 -364 -750 2331 -2199
1127 -2199 1060 1604 -2694 2297 17 -1792 2445 -1399 148 1058 -1843 2012 -992 -1040 2484 -3093
1143 -3093 780 1983 -3639 2287 209 -2505 2993 -1635 -563 2046 -2579 1429 35 -1822 2525
1158 2525 -1610 8 1890 -2498 1431 453 -1966 2260 -1096 -451 1596 -1878 1350 -391 -1374 2340
1174 2340 -1964 146 1805 -3085 2028 547 -2851 2843 -1178 -1194 2192 -1980 914 498 -1712 2625
1190B625m040R77K968n243M051J45l587M834k814p96L420l919K434K7k400L648
1206B330l004M63K987m714L322N5l407M617k889m62L220m168K606L26k863L963
1222B382l261L50K949m781L639J76m095N091k701j367M155m411K090J061l614
1237b337L974k215j128L995m425J918J728m095L755j133j981L557k925J037J083
1252H08k774L068j720o45L232l706J931J195l676M208k259j032L737m129J876
1267A14J414l794M197k169j562M482m588J734K440n357M627o51l272M772k916
1282e29k13K939l737K783l81k120L339k940R43K286m092L210n49k330L554k671
1298e08O57J619l066K897j201j563L762m016J363K481m841L888k54l477M767l027
$$ plain form
1190 2625 -1415 -438 2530 -2713 1338 1483 -2104 2730 -84 -880 2540 -1379 1055 1082 -1318 2330
1206 2330 -674 -211 2776 -1938 1384 1439 -1968 2649 -240 -702 2518 -1650 956 1282 -1581 2382
1222 2382 -879 -529 2420 -2361 1278 1454 -2641 2450 -251 -1618 2537 -1874 216 1277 -2337
1237 -2337 1637 -578 -1706 2289 -2136 -218 1510 -2585 1170 37 -1944 1613 -1312 -275 808
1252 808 -1966 1102 -618 -1263 1969 -1737 194 1389 -2287 1921 -338 -1370 2367 -1762 114
1267 114 1528 -2266 1931 -238 -1800 2682 -1906 -172 2268 -3089 1538 887 -2385 2387 -529
1282 -529 -742 2197 -1540 1243 862 -1258 2081 -859 84 2370 -1722 1488 939 -1391 2163 -508
1298 -508 149 1768 -1298 1599 398 -1165 2597 -1419 -56 2425 -2416 1472 1218 -2259 2508 -519
1314e19n37L699m214K231L55k847L667k377m26K992l718K144O23l224L645j966
1330d72q62K760l284K010M57k355L250k598R6K724m023L029K68l577M720k523
1346c80j130L752l964J934J194l434L782j917j177L560l904J798J667l964L770
1361A587j255j941L670k918P26J545k818K570j356r02L045l547J919J022l296
1376a949L609j444j524L539l383J087J609l450L224q76k005L598l131Q51K192
1391A947l983L248o77k148L670k836M85K182l319K581m67k141L490k589K46K281
1407A970l650K647j66k261L262k387n7K205l358K536n74k079L649k806L9K591
1423A561l705K395L79l082L672k119n12K531l084J910L67k356L327k443l3K563
$$ plain form
1314 -519 -1056 2643 -1571 660 1015 -1832 1835 -542 -968 2024 -1694 450 1073 -2151 1494 -472
1330 -472 -1334 1426 -1858 152 609 -1746 1504 -1094 -998 1726 -2297 732 1000 -2577 2143 -380
1346 -380 -1510 2242 -1722 212 1406 -2028 1754 -163 -1340 2220 -1684 114 1781 -2183 1587
1361 1587 332 -1609 2061 -857 -131 1414 -1404 1166 -190 -1092 1953 -1594 325 1347 -1949
1376 -1949 1660 216 -1308 2231 -1152 -65 1544 -1906 1318 442 -1563 2035 -1096 -245 1947
1391 1947 -2036 1212 535 -1613 2057 -779 -294 1888 -1431 1150 683 -1458 2032 -557 -311 1970
1407 1970 -1680 967 801 -1460 1802 -585 -642 1563 -1795 741 167 -1912 1737 -1069 -1030 1561
1423 1561 -2144 251 630 -2452 1220 -899 -1411 1120 -1964 -54 313 -2043 1284 -1159 -1192 1371
1439A371l384K283L66k774L361j764n77K711l299J894M21k368L237j967n44L102
1455B069l572J972R02l172L395j201j308K981k899J205R31k676L040j502p48K816
1471B233l393J718J064l475L595j201j982L384k876O40J598k911K746j164j231
1486a255K739k693J060J203k964L339j432j689L649k988N82J921l300K602n31
1501B43j601L033k586M29J936l254K594m01k171L355k478K77K128l054K262k96
1517D16j718K758k378N21J873l276K527j20k449L558k599J5K577l496K036M40
1533F85k587K917j552l32K116k947K090J15k360L005j810j91K279l041J939N27
1549H53k606L129j663o44K757k975J552O87k314K624j527n78K508k721J482M91
$$ plain form
1439 1371 -2013 270 636 -2138 1223 -541 -1118 1593 -1706 188 609 -1759 1478 -489 -1033 2069
1455 2069 -1503 469 1371 -1801 1594 393 -915 2066 -833 372 1303 -1373 1667 165 -583 2233
1471 2233 -1160 558 1622 -1853 1742 541 -1441 1943 -933 -293 1305 -1606 1140 -24 -1255
1486 -1255 1484 -1209 -149 1054 -1910 1429 -3 -1692 1957 -1031 -449 1472 -1828 774 243
1501 243 -1358 1675 -911 -482 1454 -1800 794 393 -1778 1577 -901 -624 1504 -1550 712 416
1517 416 -1302 1456 -922 -401 1472 -1804 723 603 -1846 1712 -887 -872 1705 -1791 245 685
1533 685 -1902 1015 -537 -869 1247 -1700 390 505 -1855 1150 -660 -851 1428 -1613 326 853
1549 853 -1753 1376 -287 -931 1826 -1149 403 1090 -1224 1400 -127 -705 1803 -918 564 1055
1565A055k536K963j538p08K489k875J438Q85k429K707j420j005K586k834J374
1580A52J120k911K747j116j382K969k589O64J566k876K359q36j074K464k450Q63
1596c30J226k349K025o86j203K511k393O61J516k663K571q55j522K726k276O80
1612c61J630k958K384m06j894K955k158K28J710k614K006k21j592K726k007q7
1628f59K100k894K120m6k074K889k007K1J919k606J796r2j748K529j871N0K029
1645A456k906J877M81k222K642j456j38J754k357J374L71j955K461j827RK230
1661A794l191J892Q32k764K677j070j131K506k245Q07O98j842K057j174l81J880
1677A345k501J397P41k629K561p10j624K370j901N37J012j689J499q33m70J887
$$ plain form
1565 1055 -1481 1482 -56 -764 1725 -1150 288 1173 -1256 1451 31 -974 1612 -1222 152
1580 152 1272 -1639 1108 -8 -1390 1579 -1010 -346 1220 -1656 703 -133 -1207 1257 -1193 -330
1596 -330 896 -1453 572 -114 -1317 1194 -1199 -538 978 -1685 886 31 -1491 1235 -1041 -361
1612 -361 1269 -1689 695 289 -1605 1350 -808 -580 1130 -1484 522 301 -1291 1435 -572 -659
1628 -659 1441 -1453 667 621 -1453 1436 -571 -550 1369 -1237 559 467 -1281 1248 -623 -573 1456
1645 1456 -1450 427 908 -1314 1328 -128 -266 1488 -869 505 876 -1079 1382 -445 -436 1794
1661 1794 -1397 495 1327 -1437 1240 170 -961 1545 -700 107 805 -1037 1020 -154 -535 1345
1677 1345 -1156 241 982 -1647 914 204 -1420 950 -951 -414 598 -1091 408 -425 -895 992
1693I92k542J503O24k353K596r86j451K864k177K87J636k464K069n44j278K359
1709A135j948N40J492k583K142j27j889K592j670k55J634j853J249l92n74J565
1725A058j831O68J265k515K293n97j619K644j899J66J602k310J803j75j623K272
1741A202j788R0J907k721J755L54k183K577j452m24K025k429J246N14j828K149
1757I94j105n60J911j954J085L33j835K197j156m64J584k098J601p7j613K185
1773A028j469j34K092k782J483O01k154K366j161r27K176k188R37P87k201K171
1789F25r08q46K022k167Q74J275k249J831l51j126J933j565L94Q56j689J699q20
1806b12q38K185k106J091Q21k254J914k43j422K373j720J61J232j954K010p75
$$ plain form
1693 992 -1550 -47 577 -1776 820 -166 -1617 1247 -930 -643 993 -1471 598 54 -1224 1135
1709 1135 -813 -273 1219 -1364 778 651 -1238 1354 -316 -571 1063 -790 459 67 -507 1058
1725 1058 -773 -105 1160 -1355 938 341 -1278 1366 -533 -367 1235 -1075 728 553 -1070 1202
1741 1202 -586 -496 1411 -1310 445 799 -1384 1193 -259 -683 1342 -1087 159 673 -1155 994
1757 994 -111 -671 1240 -714 371 704 -1131 1066 -90 -554 1030 -1068 533 456 -1157 1028
1773 1028 -441 -575 1517 -1265 218 819 -1335 1031 -130 -1057 1119 -1069 -132 655 -1546 625
1789 625 -283 -1129 893 -1274 -400 875 -1374 457 106 -1020 913 -652 -258 598 -1091 608 -212
1806 -212 -1050 1135 -971 120 941 -1313 601 358 -1064 1309 -411 -250 982 -972 1038 263
1822B63j086K410k143N47J439k744K046J18j875K314j182m65J579j642Q81j85
1838B75r02J498j394L42J341k181J632m9j658K402j658k11J731k233J361L1j365
1855a038K090j546K6J563k327J639J45j750K195j241q40K239k262J139L43j535
1871a160J800q98o71K012j907P95O61j930K160q96r81J866j771R27N78j823J897
1888F59r77n56J801j828R17P33k015J932p91p32J989k177R59P95k007K084o75
1905A11j054K294j936L71J286k060J572k60j082J943j629M37J060j857J440m65
1921A71p06J768j747L82J368k100J630m10j059J773j354J95Q59j649J472k44j160
1938h11K207j788J23J377k119J435J99j431J689j020l86J645j943J128P9j443
$$ plain form
1822 263 -823 1587 -556 -9 1430 -1314 732 850 -1025 1289 107 -358 1221 -421 460 275
1838 275 -627 871 -523 -181 1160 -1021 611 562 -1096 1306 -352 -563 1168 -1065 296 327 -1038
1855 -1038 1052 -494 -468 1095 -1232 407 552 -1198 997 -244 -1084 1155 -1107 32 375 -1160
1871 -1160 640 -258 -929 1083 -824 -29 632 -1298 862 -34 -1015 851 -920 7 585 -1238 659
1888 659 -318 -874 927 -901 16 749 -1266 666 -125 -857 1132 -1045 -86 709 -1298 786 111
1905 111 -943 1351 -585 -214 1072 -988 584 324 -758 1185 -444 -7 1053 -804 636 171
1921 171 -535 1233 -514 -132 1236 -864 766 356 -703 1070 -284 -89 770 -879 593 349 -811
1938 -811 1396 -392 -269 1108 -1011 424 623 -808 881 -139 -525 1120 -823 305 384 -1059
1954a059J947j414J73J406k026J263K30j659J935r73l57J567j908J055J85j303
1970i38J721j186jJ414j992J264L68j685K033j136o67J947j963Q05O43j708J852
1987G71q04n38J617j793P93P26j711J435m58n32J634j634K94J027j312J215l41
2004C89q18J508j636Q50O33j861J887o92q55J976j870M79J076k012J769m41j013
2021f31J732j325R5R20j317J287k69j127J619j293M3J249j746J320j44j147J786
2038A052j448J91R09j681J357j19j100J673j338O6J379j835J072Qj152J568q34
2055b32l19J268j567J033J14j197J746j203n9J242j836J174L56j491J701j068
2071c38k49J394j316O38L86j333J535r35k45J248j577J046L85j534J450o29k42
$$ plain form
1954 -1059 888 -526 -353 1053 -973 290 520 -1139 796 -177 -534 1033 -875 180 365 -938
1970 -938 783 -403 -404 1010 -982 282 650 -1035 998 -138 -805 1142 -821 -16 627 -1081 771
1987 771 -33 -571 1046 -747 46 772 -939 496 38 -494 1140 -494 -200 827 -485 730 389
2004 389 -429 1079 -557 293 926 -935 952 260 -595 1381 -489 -10 1066 -946 823 382 -631
2021 -631 1101 -224 -129 791 -526 761 492 -635 984 -309 -266 983 -763 557 413 -734 1052
2038 1052 -396 -205 704 -977 380 261 -839 834 -504 -438 941 -894 178 186 -966 602 -232
2055 -232 -551 717 -850 183 297 -900 846 -357 -416 826 -1010 164 520 -971 730 -338
2071 -338 -587 807 -509 129 515 -818 717 -218 -463 785 -792 254 639 -895 555 -74 -316
2088c16J253j575Q31N02j466J381m21o25J464j595P44P46j687J689r24m33J465
2105A033j624O46P12j614J641m39q73J424j348N16P03j355J139l68p75J432j533
2122f83M45R34j588J496o68n03J337j390M56P67j545J508m39r80J668j510L65
2139c30J018j748J247P7r97J384j157J09J065j257J008j99j105J680j127j23J289
2156H34j656J057K13j135J247p43j16J227j713J062J38j207J645r34n36J442j513
2173f88R70K61j336J582q96j26J210j782J039K85j416J777q44n74J691j666N55
2190D2P79j370J196n44k74R10j139O38N20j394J353p82l04J403j613N39P93j491
2208g38J403n67n98J221j310O59N85j575J652p47p58J768j696N30Q32j615J280
$$ plain form
2088 -316 937 -638 193 695 -771 610 189 -436 1028 -567 177 923 -764 925 1 -432 1033
2105 1033 -591 55 767 -847 794 355 -518 906 -442 74 777 -578 561 193 -582 850 -683
2122 -683 -238 696 -892 604 -64 -567 770 -620 -164 603 -942 566 127 -853 815 -695 -330
2139 -330 688 -1060 187 264 -733 651 -506 -397 668 -589 419 220 -885 795 -332 -455 834
2156 834 -822 235 448 -687 560 -183 -299 928 -785 277 415 -792 853 -81 -617 825 -688
2173 -688 282 543 -793 789 -107 -233 977 -805 234 519 -897 880 36 -538 1153 -513 42
2190 42 821 -549 647 103 -171 739 -400 238 758 -636 717 -65 -369 1034 -579 -40 753 -738
2208 -738 665 98 -500 721 -589 70 655 -920 732 -15 -773 995 -701 -171 661 -954 326
2225C26j50j131J575r74J72M67j031J114k62p87J461j513L54J051j391R26j34
2242G3p60J287j017K46P78j421J180k36r64J658j341K61J057j654J231R8j173
2259f97J360q93m0J130j466P98R9q82J363j205R1J199j220P09K02j271J360p35
2277i8j72J067j360P60J88q69J368r88j72J348j603P54K17j192J559p68m59J187
2295G67j248N05N85j340J331o37n31J481j451N06N86j314J467q04k74J064j377
2312f84O98M24j328J303n29n85J357j411N39Q86j494J347o55o19J343j140M36
2329a12N27j244R49j57n91J224j103J83P50j049R91l15o98J347j189L23O77j338
2347h25J211j48r92J415j068K33R46j371R67j42r28J370p54k24J012j122P80o1
$$ plain form
2225 326 176 -955 620 -354 -182 285 -746 368 106 -681 780 -733 -379 672 -719 207 73
2242 73 -687 600 -417 -171 607 -814 366 130 -834 824 -517 -256 801 -853 378 476 -697
2259 -697 663 -230 -270 860 -606 192 291 -591 772 -433 -342 857 -363 346 548 -723 637 -98
2277 -98 -270 797 -563 197 385 -484 884 -104 -276 1072 -531 223 440 -752 807 39 -420 767
2295 767 -481 24 609 -731 600 -37 -568 913 -538 -32 554 -760 707 -97 -371 693 -684
2312 -684 14 438 -890 413 -116 -701 656 -755 -216 670 -824 523 -132 -751 592 -548 -112
2329 -112 415 -829 120 -37 -628 596 -507 -324 426 -623 368 53 -645 702 -487 -164 513 -825
2347 -825 386 238 -754 661 -407 -174 772 -599 368 226 -702 668 -86 -310 702 -420 360 299
2365B99r00J224o06k19R02j398Q52J73q03J091q40N6Q15j250P51K0r96J441r93
2384c81L5J039j352O22K31q51J143p14k68J292j259N57M14j265J213n05n23J205
2402F33j132N62J78j174J288n14l52J223j309N42L94j158J332n56o16J384j265
2419e40K94N14j094J171m34p22J449j200N04M27j308J216j38q20J241j027J22
2436c45P77j191R88j90n70R74q10Q2N68r06J035l60n75J114q79K10P50j117O83
2455B38Lo08J077r92M01O09j163R66q9p49J134j086N3Q64j232O51K08p58J064
2474E91r06J12P67j237J118k12q77J265q59k68J197j163L49M45j001J237n17o12
2492e71J038r95O42k6o52J171p14k48R13j301P90K51r34R52k74n20J029j135K59
$$ plain form
2365 299 -601 623 17 -202 700 -698 154 327 -476 615 -225 -169 646 -604 147 167 -829 612 -381
2384 -381 -346 693 -659 -37 194 -657 486 -228 -496 796 -463 94 508 -757 456 -49 -572 633
2402 633 -499 63 241 -933 355 -159 -511 712 -597 -55 339 -819 513 -43 -659 725 -540
2419 -540 -246 268 -826 345 -89 -811 638 -562 -58 369 -939 277 139 -681 560 -467 -345
2436 -345 432 -759 229 39 -531 443 -367 -285 283 -623 412 52 -523 591 -288 -78 672 -445 238
2455 238 241 -367 710 -282 119 728 -435 531 442 -307 827 -259 -206 658 -574 77 285 -473 591
2474 591 -315 -203 564 -673 445 233 -644 621 -238 -506 691 -472 -123 322 -679 558 41 -571
2492 -571 467 -528 114 88 -564 607 -107 -355 558 -743 47 298 -636 316 42 -478 551 -584 -325
2511c25K86n99Q65k84l01R61j185P30K04j123J272n67l85R04q74L21M96j010R07
2530B93j31n84J124r82K61N84j146R92k25o59J177q42QO10j113R77k72l67J115
2549H20j007J47P02j283Q66J20r47J242r70R9Q76j243Q00j41m93J179r69k44Q27
2568C81j015Q60j13o48J000p01J17O80r23N05j4o67J102q83l1Q45j106P91L0p57
2588e47R40p53N3O93q78N03L59j011R81n86n1N89p50L77K67q29R02m98l22J103
2608E42j089M91L11q83J069n56o04J301r91K15O25j197J032k93m32R23q14K65
2626h5N16q88Q35j29m48P23p20L99K23j012Q08M6n14J028r93L33M32j069R88l19
2646A54m61J051j064L76N97j099P75p7n94P87p93Q4O91r42P75r2o56J132q37o2
$$ plain form
2511 -325 -39 -638 227 -57 -358 603 -582 148 352 -771 501 -66 -451 453 -421 -100 396 -614 293
2530 293 162 -422 702 -280 -19 565 -581 411 186 -473 704 -138 -130 480 -633 344 72 -295 820
2549 820 -187 -40 662 -621 245 365 -582 660 -310 -211 665 -578 222 81 -412 767 -202 -446 381
2568 381 -634 226 113 -535 465 -236 -119 561 -362 143 129 -538 564 -319 -350 495 -611 180 210 -547
2588 -547 393 -360 -307 386 -492 11 370 -641 340 -246 -297 292 -458 -81 186 -643 259 -239 -561 542
2608 542 -547 -56 255 -628 441 -115 -719 582 -409 -194 431 -766 266 -27 -459 464 -350 -85
2626 -85 431 -457 378 249 -199 524 -196 203 426 -586 222 268 -246 782 -211 122 554 -515 473 154
2646 154 -307 744 -320 56 653 -446 329 252 -342 445 -348 -264 427 -515 260 168 -488 644 -193 -255
2666b55O70r14N95j7n98R05o40Q1O02q66K90L71p86Q01n51J80N39r11N84J18q51
2687f53J019n96o1P65j298R63J30p86J076p83j60Q08q80N10K13p03Q73o26k73
2706d62P86p40M35L45r65Q34k03l52P92o91L46K34p01R13p96m1Q20r41M12M37
2726D62j039Q55k40l98J041q36J43K89p16R18m51m27R99p93R5N75r79P97j32p35
2746e72Q82o12J91M72p50P36j61o00Q32n44j0N67r45P78j80n51R04o06J35K70
2766B36o76O53j6o65R37p62K47L98q72P00l9n21P98p30j35R41q63M71Q1o77P25
2787B31l99j0P69q76K72K20o67P74m37j21N13o33K95K38n35Q28m92k94P80q85
2807d29M74J92o10P14k72j31P91r68L25M47j013Q39k49l27Q33r65N25K67q66P58
$$ plain form
2666 -255 415 -499 96 79 -519 386 -254 -173 429 -437 -147 224 -562 239 -312 -132 407 -504 80 198 -653
2687 -653 366 -230 -291 474 -824 139 269 -517 559 -224 -384 424 -456 54 267 -436 437 -189 -462
2706 -462 324 -416 19 364 -601 233 30 -322 470 -221 125 359 -342 571 -225 -266 554 -387 25 462
2726 462 -577 278 38 -360 681 -155 -12 277 -439 479 28 -399 600 -193 -98 477 -502 295 163 -572
2746 -572 310 -302 -111 361 -389 347 186 -414 418 -126 -136 431 -514 264 84 -467 437 -169 -34 236
2766 236 -440 213 197 -468 469 -293 -46 352 -520 180 141 -380 418 -312 -447 494 -369 102 183 -494 231
2787 231 -168 -178 591 -285 -13 207 -460 314 -123 -244 269 -364 -69 169 -366 462 -30 -324 456 -429
2807 -429 45 237 -373 341 69 -62 729 -239 86 533 -480 359 110 -217 616 -349 176 443 -423 335
2827C35m20p5N39p54L47L51p50Q63l80l61P85p22J72M29o38M33j95k90P90r19
2847d60M68J68o68P26k48o2M74o21L4O45r28O00J09p11R43p36P3N56r04P30o5
2868A23n97P47l26k29O02p33N14N2n22P15n79j3N85n90M01K5n52P83o42J3N32
2889C09q04P57m6o51O25j88j46N89p63L98L44r57P98l15k06O22n57K85L14o31
2909b23N35l53k54Q27q17N24k8n34O17k13l30P01o50K04K80p12O65l19k69P11
2929C62p91M60J41p05Q73l23l28P31n77J43L22o93N93r5m94O31m06o5M96p99N36
2950A2J25n18P20n56K41K96p76O32m1m36M97k74j1L30p84P71j01k64N32n07J09
2971cK73n22L30J74o18O52m37L5L93o22N04K9o65Q00m32j42M87o25K93L29n24
$$ plain form
2827 335 -85 -160 379 -375 -28 323 -427 436 56 -305 480 -242 -70 359 -279 154 -41 -331 459 -460
2847 -460 8 176 -492 234 -14 -76 398 -223 -189 456 -472 128 237 -474 469 -267 -194 362 -542 188 123
2868 123 -474 273 -53 -282 320 -413 101 153 -369 346 -233 -246 339 -251 150 175 -377 406 -236 -223 309
2889 309 -495 262 216 -435 190 2 -144 445 -318 80 424 -533 265 -50 -256 366 -191 94 408 -223
2909 -223 312 -41 -295 532 -285 239 211 -323 294 81 -249 452 -198 6 286 -426 239 -80 -349 362
2929 362 -429 31 172 -533 340 17 -311 420 -157 -14 308 -385 208 113 -381 250 -156 -221 275 -524 12
2950 12 137 -381 339 -217 24 320 -456 176 135 -301 196 -78 -89 241 -543 228 127 -137 395 -112 -3
2971 -3 270 -252 78 252 -366 286 -151 -116 277 -345 159 188 -477 323 -109 -251 236 -389 -96 233 -291
2992b91N34l22j76O57o58M03J22o08P73n02k7M27n77N03j14n04P03k43k19O28
3012E09o59K10M51p69O01k14l63P10o40K62K76q55N93p1l27M08n84L65L02n26
3032c21M97j73k92P15p35K54L16p18Q12k56n28P04m78N5L47k50J58Qn63O77n24
3053b95K99K49o19N91k13l07N97l70j74N71o78N32p0n35P71m47m1M20m00K02l1
3074E2k45N19m61n1M77n88L85J01m69O12n40P0M25p31M49K39n09N57k95QJ90m26
3096b31K99L15q41P27j45k00O16q71L24L16o92N76j17l66O22n38L15P6n00O68
3116C53l48l18O61n46J07L11n54M80k09k99M99l81J77J89o37O06j69k31N85o67
3136c91K05M82q41N05J13l16L61m15J45M13n23L03J92m44M77l51J1K85p11N35
$$ plain form
2992 -291 243 -79 -255 402 -256 147 269 -339 434 -68 -95 332 -245 258 144 -360 343 100 -119 509
3012 509 -150 60 511 -258 343 129 -234 476 -164 98 374 -481 112 41 -286 122 -462 -97 205 -321
3032 -321 176 3 -289 426 -309 -55 261 -457 355 99 -429 275 -203 -148 199 -51 107 115 -448 229 -295
3053 -295 4 253 -366 225 12 -295 302 -68 -242 329 -349 183 113 -422 349 -98 -139 281 -119 83 52
3074 52 -193 326 -135 -186 291 -297 88 189 -280 332 -208 -138 287 -444 5 244 -265 292 -3 5 195 -231
3096 -231 68 383 -458 269 124 -76 540 -331 -7 309 -383 193 76 -290 332 -206 109 185 -315 353
3116 353 5 -313 348 -198 -91 220 -334 146 -63 -362 137 -244 -67 122 -515 91 -78 -309 276 -391
3136 -391 -186 296 -545 -40 73 -243 118 -297 -152 261 -262 41 233 -211 266 -85 -74 211 -500 35
3156C5K00m60N51m51J48L17m52L49m0l77O56m56r0K44o66N02J39m40O77n34J26
3177b2M73n94K43j00j34M48l95J8L30n09L82J09o85O24j78OK73m83L13l2l07L24
3199A04j83p4L99n33K07J61l15L01j43j99O10m68J44J38m72M14n2k38L51m30K61
3220a7J64n03M52k54M9L12o54L30K74n81M53j56j80P81o33j88O06o46N70k53j86
3241b60O59n28j16N07n19L70p1k77N07n65L58K33n45M35M7o46P70m71N9M98r04
3262d59O37jl70N59m29o3M48m67L79p4l90M84m76K48K57m43K49N0o19P25l55l0
3284a40M94o35K62J30m59N62l48J22L19o40L10M1m14O72k13l17N70n63L00J21
3304A74m87O10l83j02N34o32K70K88n91M65k43j62N65l89N5J96l82N56m10j42
$$ plain form
3156 35 235 -225 326 -125 23 340 -112 237 197 -180 476 20 -70 174 -492 10 149 -291 386 -148 -22
3177 -22 451 -143 100 0 -134 314 -81 -63 267 -242 140 249 -436 188 10 16 289 -194 119 87 -220 104
3199 104 -79 -153 246 -287 -80 81 -234 67 -76 -275 335 -133 11 149 -323 91 39 -199 152 -278 -17
3220 -17 147 -356 96 -158 -109 203 -451 -121 153 -428 25 -131 -311 470 -163 -351 255 -391 179 -74 -260
3241 -260 399 -129 -245 262 -257 113 42 -235 272 -293 65 298 -247 188 235 -411 359 -112 -53 445 -459
3262 -459 178 177 -193 366 -63 -126 322 -145 234 160 -230 254 -222 26 283 -160 89 139 -480 245 -110 -140
3284 -140 354 -281 -19 111 -348 214 -134 -12 307 -333 -23 18 -396 276 63 -254 316 -247 53 174
3304 174 -313 297 -86 -188 346 -286 -16 272 -319 146 -97 -259 306 -83 -28 168 -214 342 -68 -210
3324b10N77o97L47L27o45M24j44k34L31m80K91J90n16O70k04l29M95m94K08K47
3344A54l69K88Rk60L95l23Q1J40l52M54j40l74N61m16K14K64n20L09Qm58N81k92
3366d6R1L35o87M42Jk81K25p5j28L79n20M33l3n50O30l54J4L64n77M85j05l58
3388c15N80m30l2L96l61K70m6l34M17k27M4J07l22J19M39n20L77j66l25N15n61
3409c75M43L2l54L64p3j63L88m84K72J74m85M77k08rJ72m52K97J2k98M51j12l42
3431b73N65m79J38J63n23N08m1k82M52l62K23J48n01L84j92k52O91m93J42L23
3451C39m83K99mk68L61l5j41J59n13M27J04n01M69j75n6L63o03L73k9j72L53j50
3473A17k1n5l63M27l3l07O18m59P9L35n97L34l1k90L24l4j99L93n93M95j18k61
$$ plain form
3324 -210 367 -330 17 344 -301 123 -21 -255 76 -404 -113 77 -439 231 27 -302 193 -301 -93 154
3344 154 -215 73 82 -178 217 -106 -25 115 -237 217 77 -297 264 -152 62 326 -194 115 123 -335 246 -46
3366 -46 45 380 -307 135 136 -145 80 5 -123 256 -264 169 136 -414 216 -138 -124 240 -337 148 43 -315
3388 -315 265 -165 -197 199 -162 108 62 -272 145 -82 -38 69 -253 -134 305 -215 162 -4 -329 186 -375
3409 -375 68 100 -254 110 37 -126 262 -222 50 224 -261 216 8 -1 171 -281 16 28 -270 181 69 -273
3431 -273 292 -187 -49 114 -409 99 58 -224 228 -134 89 237 -264 120 -72 -324 367 -126 16 339
3451 339 -144 155 151 -117 244 209 68 227 -286 141 245 -256 213 38 -18 345 -258 115 86 -86 267 117
3473 117 96 41 -322 105 72 -235 383 -76 3 338 -259 75 44 -246 78 44 -155 238 -355 140 22 -239
3495b39L85j98k17M78l44J84O0l08L98l50k2K63k46J56J85k20J20k00r7M79m86
3516b19M5L61m99N76k11k01M89n21K63j5k66M18l23j7M15m38O7K96m80L46K0q5
3538B1J55m30J92J56k47J95L8l26M28k50k0L05m48L24J36m03M92o03L50J05k68
3559i8K91p6m34O30l41j05L12k80K17j43j88L77k87J50J66n97M28j66k36L91J57
3580A68k93L25n68L97Mm94N20j87q8M94n75K16K05l50N31m45K1L25m42K69m5l63
3602c75M79k56jK96m26K69J45m86O47k36k25M86n10O9L87l75L54k19k38O85n95
3623a25K35O9n11N33k40j22L13l28L12l4l36L32l08JM38l74K29o9k51K88L5k18
3645a31M48l33q3L42m85M42j51l21L67r1L1J21k97L81k27j49L82m96J53L22m73
$$ plain form
3495 -239 146 -52 -269 209 -135 49 109 -199 199 -151 -173 90 -156 0 185 -35 85 -115 -212 267 -219
3516 -219 -174 187 -312 264 53 -148 341 -180 83 68 -198 220 -103 -120 295 -143 -76 220 -260 86 106 21
3538 21 176 -254 -62 94 -153 42 80 -246 182 -68 -88 217 -231 93 229 -174 318 -285 65 170 -98
3559 -98 193 117 -317 313 -28 -133 179 -101 116 -27 -215 162 -125 25 191 -406 22 -144 -380 11 168
3580 168 -125 200 -368 29 33 -461 59 -128 -216 278 -297 -81 124 -226 305 -140 -119 206 -236 33 -12 -375
3602 -375 104 -152 -153 143 -283 -14 131 -355 292 56 -169 317 -193 -124 263 -112 242 23 -215 470 -125
3623 -125 110 179 -332 201 -39 -161 152 -176 136 102 -234 98 -210 -209 229 -145 84 15 -236 52 87 -131
3645 -131 317 -16 -99 243 -242 200 49 -272 95 4 35 156 -141 240 13 -136 246 -250 -97 225 -248
3666b48K39J06l44L74j65j41L35l77M36k30j56K01j79M1J48k95K53R2m19N43l33
3687a19N5J70l63J95K75l79M06k22n5J48l00R6J62k73L26k39mK57l13M05p1l51
3709a94L25j24j72N45m17Q8P5l42L73K6l91L87l77L07Jj74K82J2m16M65m57L30
3731A52n9j42L1J68k16L59m30Q8K67m05L73j85k19K52q5k3L22n87N03k18OJ61
3753A13j58K0J77k25N2Q4m25M86k87L4L16m16L30j3k57L45k82R1K99m37K40j9
3775F8j24KK2j26L95l68K94n9m14M07j81J08J56j98kJ46m34L42j47K8J88l55K06
3798d6K35l20K05m5k9K14m83L41M3k80K63N6k02K55k39J77J23m08L51j85j04K78
3820B00o7k69L28l44K96N5m31M10l38K19J36l16L50k03j00K62m54K52P4l60M70
$$ plain form
3666 -248 -9 97 -247 127 -38 -179 156 -221 215 -15 -171 30 -149 -108 40 -255 -2 90 -329 214 -119
3687 -119 -64 106 -257 -62 213 -166 240 18 -37 111 -189 -93 69 -204 122 -117 -121 136 -177 228 157 -194
3709 -194 131 7 -165 380 -37 51 126 -216 157 183 -208 179 -198 109 110 -64 218 230 -186 279 -178 152
3731 152 93 -49 -18 150 -66 293 -137 -49 218 -187 186 1 -218 34 -51 -74 248 -339 164 -54 -48 113
3753 113 -45 -25 152 -73 -21 63 -362 124 -163 -129 187 -229 101 88 -169 176 -106 -15 284 -153 87 68
3775 68 -56 -54 -32 -158 237 -131 163 104 -310 97 -84 24 180 -18 -20 126 -308 34 -113 -85 103 -252 -46
3798 -46 189 -131 74 29 0 214 -269 72 115 -165 98 154 -48 207 -32 145 268 -140 211 26 -78 200
3820 200 133 -136 192 -152 144 199 -232 178 -160 59 195 -121 229 26 -74 188 -266 -14 60 -300 170
3841A70l19l3J91k9j96L71l30K05k7k72N91m78l3M29l25K18j91k35M77k05q0K92
3863A91k26N9K46m01L95l34l5K46k57K08l0l63N40l47j0L60n13K08K34j58J55
3884A68l14k7N70n96L74j19l27M43p2p9K34l70J32K55l60J32j90O5K75l14J88
3905F8O5k26O9J15k96O24n65J95K74m73K45j33j11K14k58L63p6k13N9J26k0J41
3927A87k53P4L75n08R7o7KJ98k93K24L5l22M51j89m6L65o21J73K51k37Q4p4m9
3950a43J47j33k1M39n18L54j85k17L98j98oJ98j57L7k6o2M21l39jK73n74M16l8
3973F5k23L08l18J22K24k86J14O8l50M08p8j23K22k01O8K05k79J44o9o7L37l74
3995h3%J45l47L54j26j20K83k90K43lk74K25J01k20K97k24P2J80l75K23oj72L60
$$ plain form
3841 170 -149 -182 9 -20 -216 155 -175 30 3 -269 322 -156 -189 240 -85 133 -58 -293 184 -21 -101 191
3863 191 -35 24 270 -131 264 -70 -105 141 -116 92 62 -301 239 -108 -118 242 -271 -63 171 13 168
3884 168 -146 -173 397 -199 175 56 -271 172 100 21 255 -115 17 272 -88 44 -146 -81 194 -120 68
3905 68 133 -93 -24 91 -205 419 -146 49 323 -150 95 -38 -149 65 -193 170 94 -119 -60 66 46 187
3927 187 -66 8 383 -125 -28 -95 -93 105 -188 36 71 -251 200 11 -35 330 -291 -118 133 -104 -20 -94 -143
3950 -143 4 -129 -150 289 -229 125 -60 -277 121 -77 -83 115 -42 -5 -31 -93 328 -11 -12 261 -313 103 65
3973 65 -158 150 -168 -46 178 -108 6 74 -276 132 54 -69 153 -48 20 225 -54 90 21 -46 291 -83
3995 -83 -83 62 -285 69 -57 -177 106 -184 59 56 -218 7 108 -112 185 -39 33 213 -162 61 55 -117 243
4018B43l42J66oj26K59k34m9K42k43k7K27k07K29j98j81L39l50J05M52m89J76
4039a4R2j60J67j79j02K42j19J54J9m03M14m20J51L00m18L06J92k17Kk9j33K56
4061A01l43K30J05l53M97j68k46L56k98R0O1j33J71j64L9K55l04J01J48k73K20
4082I2j12O1K09j30j67Q3l2J71Nk87P3j35K92o0j15J43p3l8Q1j66P7J39j67K51
4106A95l42LM66n92M07j2j35J05j11k22M06k75J6K53l91K44k5j54L04k80M8J96
4128A04j08K62j58j19Qm0OK07l29J49M6j97K27j82j2K50k19j4K25k13J33j71k29
4151c74N49m72L29m8j65L72l21P4K17l02L46j55j80L34j58q1P7j64K05K51m65
4172a31L58l05Q7J86j91q3K20l18K72R2j49M4k76K68j0j68K19j63j2Q2j09J29
$$ plain form
4018 243 -99 67 61 -65 194 -40 -89 153 -90 -117 110 -97 132 -66 -247 92 -258 -153 299 -190 -14
4039 -14 78 -82 85 -94 -196 46 -73 81 100 -303 111 -309 -158 142 -276 30 222 5 7 -22 -155 101
4061 101 -242 -12 93 -260 237 69 -177 179 -119 -29 32 -101 70 -94 -55 200 -104 -3 145 -128 92
4082 92 -20 41 250 120 -47 36 4 175 180 -107 -34 -169 123 63 -52 91 18 -20 61 -105 -28 111 -56 195
4106 195 -147 -144 322 -270 137 125 -10 95 -16 -238 168 -107 -91 162 -229 15 -10 -164 140 -140 -92 104
4128 104 -4 258 100 -19 -11 -51 -45 162 -167 -18 28 -169 58 -124 -136 114 -105 -119 106 -107 26 -145 -374
4151 -374 175 -297 32 -16 -181 191 -130 -56 161 -141 205 50 -130 204 46 -35 42 -122 83 334 -131
4172 -131 227 -78 9 195 4 -79 141 -177 95 187 38 82 -194 74 64 -104 115 -48 -60 22 -87 42
4194D2r1p2L26k63QJ74j86N5R0j48J6l0n3L02m15J77R2k01J66k4r2L04l90J73
4218d0K70m18K80l0m2J55j36j74K06j55J02N9r0J61k26k6L69n71L87K6k90J27
4240e6Pj34L71k38j14J35R8k9j71Q1Q0k42J62J11k78K84j78n4J98k28L20N5k66
4263h6K23q2Q5l9r2L0O3l69M42j89J7J89m15L47l0j65K23j52j86M66k83R3N6k43
4287i7J36j67M6L53l19j33L79l71L28j98r9J30k16Q4L24l52J57L1j27L21j63k4
4309B3J79m05M13n8l89L51l88K50Q3k7Q8p7r2K00j71j25J79l00L25lj52K84k82
4332i4J48J88l63J74J0k66K99r5k28L54l19L15J0k47K30j77o5L57m41K77k9k00
4354a62L54m8k94K11j03J04K55l91Q2j4M8Mj45K08P1l57L41k62L9J30o1j9n5o9
$$ plain form
4194 42 -49 -121 205 -58 -50 124 -62 -7 83 -65 -49 -79 -132 170 -245 -68 24 -177 -11 -35 -127 177 -213 -40
4218 -40 230 -188 92 62 20 175 39 -135 71 -84 18 77 -13 148 -78 -104 265 -306 81 107 -183 -56
4240 -56 -49 -183 188 -50 -164 -29 69 40 -131 -50 30 -212 -50 61 -217 67 -111 -165 33 -195 125 180 -86
4263 -86 137 55 140 101 9 39 102 -267 175 -14 3 192 -223 124 94 -71 152 0 -186 280 -3 90 146 -97
4287 -97 39 -128 -82 271 -48 -181 198 -173 155 -43 -142 -12 -228 -144 180 -172 -15 16 -111 210 47 23
4309 23 202 -203 210 152 -237 114 -274 -24 59 32 120 43 -49 151 -20 -145 34 -266 59 56 -96 188 -94
4332 -94 54 242 -121 53 63 -203 96 1 -227 127 -192 123 133 -114 116 -61 -126 231 -210 67 38 -162
4354 -162 192 144 -150 61 -42 62 317 -74 8 -6 42 46 -99 109 180 -177 164 -98 -59 71 10 -9 -64 -133
4378a33K15q6k93K32j72J85K79k24k8k00K2J78J21l7l1k02K58j34j48K02r7K7
4400f6K43n17L10O2l09O41l55K8Q4l15L16l7j15O9k24K36J05l02J88J25k18J62
4422A11k45M3J94k68K12j31L1J64o7j45K53j94R6K43m55L43j89J18O8l84J65K16
4444A79k96L02j33k62L38k63M3J64k50K78l01J85R7j72K23Mk77J70P9r4J16l93
4466b63L41o6k12K99P1k42K32k03K07q6j33J57N0j51J06k41K04K3k70K42l02M6
4488a91K20k55K28O7j04R9q7j60J51j87J50J61k09K92j72l01N11k56o9M02m83
4509a93J46k5j6K11k78K56j11q7O8O4k37M32l70K43r0o5J93k13k44M61j91p2K23
4532A05k77K60N6k81L54k14N6J0q2o6O5j28K92j98r1M77m39K89k59L4J41j63J60
$$ plain form
4378 -133 82 -4 -297 -65 -237 -52 227 3 -25 -225 -203 -25 96 59 28 -174 84 -50 -198 4 -93 -66
4400 -66 177 -340 -30 32 -277 364 9 37 121 -194 122 85 -30 39 -185 51 156 -146 42 167 -51 111
4422 111 -134 -91 103 -165 47 -84 -53 111 44 -101 152 -42 54 297 -158 185 -4 114 182 -202 -37 179
4444 179 -117 185 52 -210 128 -135 -92 72 -178 100 -201 -16 81 -91 132 136 -141 29 108 14 130 -263
4466 -263 78 12 -200 99 170 -72 160 -43 164 78 -55 102 152 1 107 -134 70 93 -177 65 -237 -191
4488 -191 29 -226 2 69 -35 64 -23 -183 -32 -219 -69 92 -117 175 3 -298 213 -43 -112 290 -193
4509 -193 -47 -72 -88 123 -155 101 -10 -97 -29 35 -202 230 -140 103 13 -52 141 -72 -316 145 -46 -118 105
4532 105 -172 88 144 -137 217 3 59 69 -13 -79 -14 -142 150 -48 -139 338 -101 188 -71 -37 104 -59 101
4555A01L5k76K47o5k53L91l47N3J93l03J73J29k61M62k86j68J92n4N8M1k63M22
4577B21l70R6L88m82J14N2j93L90k51k25K61p3l8N4j65K13J0p5R7K4j24J50k13
4600a39L49j14j51K71l90J29K88k49J34o4k31K84k61Q9P4j39J67J54m25M72l40
4621i2K36J25l33R5n7K2O5j16K3J09k54L09J07l36K27n1q6K05k10J60j47j86L32
4644A47l21J74J58j86L3J70l14K94R5m25K81k47J2K76l15K82j28p8K26l91L25
4665F8n8j68K70j80M9J23j55j04J44J6J53k23nJ75l98J56J58k16K82k48N1M57
4687C47l74m7J19j00J53j58L8R8p2M2J40k84K50j88N7Q3j68K3J70j78J27q2j63
4710a67L64j79r0K69k88J50j7r3J45k87J66J39j57J32nj96K02l8M5p9j04l1K50
$$ plain form
4555 101 136 -140 107 42 -211 180 -167 -114 79 -224 -51 78 -183 279 -7 -175 17 -37 21 62 -201 221
4577 221 -149 -53 335 -147 -33 19 -174 216 -35 -260 1 -72 -110 -56 -221 -8 2 -73 24 48 -76 74 -139
4600 -139 210 96 -55 216 -174 -45 243 -6 128 64 -167 117 -144 -55 19 -120 47 201 -224 248 -92
4621 -92 144 269 -64 31 -26 -4 61 -55 -32 77 -177 132 239 -97 130 79 -7 198 -12 148 1 -185 147
4644 147 -174 0 158 -28 5 175 -139 155 250 -175 106 -141 -129 147 -168 114 -14 -92 134 -257 68
4665 68 10 -158 112 -68 -19 104 -51 -155 -11 5 158 -65 -70 105 -293 -137 21 -195 87 -161 -110 347
4687 347 -27 -74 45 -55 98 -60 -22 76 4 46 186 -98 152 -36 21 104 -64 -41 129 -49 78 -4 -167
4710 -167 197 18 -72 197 -91 59 42 -51 94 -193 -27 112 -45 87 82 -114 88 50 95 16 -88 -119 131
4733A31j78J94l34R5K95m08K52n8J8J06j38n8K12j51Q9J12j89K37l54P7J84k98
4755a64J97nl1J01j96l1J35l5O0K4k38K94k4RQ5m23K65n3j11K51j23j11K96j94
4779b2Q4j3l27M88l31j03M01k75O0O0o4P6N5q1J93l13J51J38k33m6J65j77K78
4802A64m04K74J59m93N32j13j97K23j15J46Q4m76J51J19k23K56l03J23J46k67
4822b14L08j45j45J36l0N6J89k30J30J0j11J81k91J34K96m53R3J24k35J36OO0
4844EJ67l52J96j72Q5L37n26L7K62j16%J37n1O5j61j11J94j82L57k26j63K63j65
4867a20lK86l17K60K2j42K01k67j21M59l37J30M7k96K39p4L7K75m20L12P6l68
4889a21J44j5o1J44l18J90J14k04K50j92o2L59o9j42J49k21P1K1k4K82k83j86
$$ plain form
4733 131 -47 147 -187 -92 203 -205 47 -11 7 113 -25 -83 129 -22 67 179 -10 227 -127 -50 134 -164
4755 -164 33 28 -3 98 -98 -129 6 -29 31 55 -183 111 87 96 181 -242 23 -30 -141 110 -13 -124 172 -22
4779 -22 62 49 -278 210 -121 -224 177 -98 -38 22 -42 34 89 8 201 -112 39 177 -56 -102 63 -114 164
4802 164 -240 34 193 -300 232 119 -78 145 30 176 260 -216 -65 54 -169 87 -216 -93 53 -214
4822 -214 94 -51 -196 -60 -90 -34 155 -75 55 65 -46 135 -156 -22 274 -179 -86 38 -197 -61 -55 5
4844 5 172 -180 16 -156 -71 266 -260 -223 39 -77 -77 60 9 74 -87 -198 -4 -186 171 -55 -218 45 -120
4867 -120 -123 163 -154 106 128 -14 187 -80 -201 258 -79 51 98 -198 41 -33 4 279 -141 171 247 -121
4889 -121 23 8 -53 91 -227 -37 77 -127 123 -69 -131 228 159 17 166 -55 16 37 13 295 12 -174
4911a74J03k2O7R4k75M12r3j43J26Lm8L4NKj08J5R9k50J48j14r6L23j98r4K62
4936G8k30K9R4j74L19k59L9qj7J64j25r2K48k18J46J72l56K19J06j13J82k29L
4959b2L25l80J97m8k13K46k51J87J83k14J3J25k01J73j19k1J97j73Q8Mk09J05
4981hK2P4r4p1M0K04k31J66j53r5L31k56n5K84k51J33N4j13P3k29J33J80k35J14
5005A7p8J2P7kj21K03k68K80n0k56K84r1j48J31j64R7J36j61K37k86K72k75l7
5028a91K71j03j49K40Mj86K81l08K9Q3q5K23j71N3O3j05P3OMJ31k45K48k2k73
5052a29J09O3j72J94j51r8K97p3n9J7n5K12p3l0N1j80J50k4n5K81l85o2K97j95
5076g0J92j24j13R9Q0m5R2j41Q9K25l58L56l44j9J48qk1p1nJ78q8j05J54j12j39
$$ plain form
4911 -174 -71 -93 -26 68 -207 205 112 -31 95 98 50 84 89 91 -17 -2 97 -153 -5 -119 -215 108 -90 -184 78
4936 78 -152 -123 -29 -203 116 -143 -104 -112 -129 35 -90 -182 66 -152 -6 166 -190 29 135 22 204 -25 -22
4959 -22 303 -77 120 72 -141 105 -146 41 224 10 23 148 -53 120 1 -20 177 4 92 96 -113 -8
4981 -8 14 88 -6 -77 -37 167 -64 102 -51 -146 185 -71 -126 158 -93 40 94 -19 54 -175 -42 138 -97 17
5005 17 -61 -49 28 26 -95 108 -160 120 70 -186 98 7 -141 -10 -174 -77 59 -102 135 -151 121 -154 -191
5028 -191 80 -23 -172 68 72 -114 167 -141 -112 -29 -114 109 -62 -9 54 -51 22 28 32 163 -82 166 144 -129
5052 -129 -20 43 -129 65 -86 -184 113 40 -19 -2 -57 155 82 52 103 -77 73 49 -6 275 -110 -172 125 -70
5076 -70 122 -2 -115 -16 64 19 111 -30 59 284 -74 282 -62 -81 67 59 38 -33 -38 140 52 -53 101 -11 -150
5101a50p9K17oJ53k72K75l58Q9L14j93O9p4MJ22j97o4K76k48K45m8j95K02k09
5124a27m7M1P9J49Q7j17J22l57J11J54j73j1J21j14K03j25k4J26L2o5l4r7J01
5147C5J0o6J65j41jQ8j38Q2o2rJ37j11J73m3j90L51k96o4Q0n0jJ53k89K30L2j67
5173i2J44p2o5L45m23J47m5J38K65l73O2k9j05J84o4j61K42k59K55q5k69M28j69
5196aJ02P0o2r5l8j93J82Pj54K76j5j5q2j74K40p3j0Q8k18N5J34j79J60j45J62
5221B2J51k76J36o4n8L92l09j1Q0k87L15N0k05l2O3n7K04k27j2L11k19K82l55
5244a06j82N80m00k0K53k03J85j52j93M19j61K5K15l53K00N7m62M55k01p4M53
5265C35n40kL15j02P5j85N8Q3l9J5J7j57K80r7j20J50j14J6R5j44J49K2j56Kn4
$$ plain form
5101 -150 -229 -12 -18 135 -137 138 -220 -131 183 -10 59 -15 -11 111 -86 -150 126 -122 123 75 -120 82 -127
5124 -127 -174 -133 -54 95 182 65 187 -170 -59 95 -78 -89 32 -82 121 -4 -28 98 130 65 31 -66 35
5147 35 45 -21 144 3 2 90 -48 34 -28 -37 100 -11 162 119 -71 280 -16 -80 0 -50 -51 102 -187 43 75 -92
5173 -92 52 -20 -85 260 -163 -16 -61 77 342 -31 31 2 -103 81 17 -144 98 -161 94 9 -260 168 -1
5196 -1 101 171 109 14 -24 -217 -35 -28 -182 94 79 64 -18 -192 48 -25 -35 53 -165 -110 24 -155 5 -140 22
5221 22 173 -103 33 -31 -89 303 -6 -17 63 -224 91 141 -64 -96 -33 -90 114 -113 -125 186 -33 249 -106
5244 -106 -288 292 -108 -128 125 -78 107 -45 -238 181 20 45 260 -93 107 164 -298 157 -44 -118 335
5265 335 -205 -207 108 6 81 -104 -46 37 -2 13 30 -127 153 56 -64 86 -28 -12 83 -61 88 110 -46 -44 -98
5290i8R5J04k01K20M8j64J21m0k33K67j50K09k29J8j0Q3k6LLq6O5k9L10m79Q1
5315a18K29j83J2MM8J29m7J4j7j58J00M7j51K15l17J00O4j13K92j56N0m4K4K7
5339E1J27k31J25N6j39K88l29j37K21j97M3K25j66k4M2k1K42k70K11p0k29Q4R1
5362goJ20j90PQ9OK15j08j35O4j65J55j22j53J49K5j7K96l18J01P8k66J80qk7
5387c7L41l77R4R5j44J95j52j12K47k48L2J75k42K83k63L20k0l05M3Q4N7R3j70
5410a1j04J76l03K48J2j77R2J10k19P7P9J21J59m28J03J62j91K49j64j6Q9j77
$$ plain form
5290 -98 -3 101 -100 120 168 4 125 85 -148 119 -31 178 -51 -33 -43 40 14 17 20 -66 -1 -30 280 -199 -118
5315 -118 111 -72 -60 -56 -8 121 74 88 71 -87 13 60 -91 124 -193 -93 -29 -142 150 -6 44 0 24 51
5339 51 178 -53 72 128 -11 277 -52 -189 32 -165 -122 103 -63 -87 -45 -66 176 -94 117 47 -182 -98 -7
5362 -7 -13 107 -83 -76 13 19 234 126 -9 55 -110 45 -77 -230 -81 -56 -73 223 -95 6 84 -182 -2 -10 -37
5387 -37 304 -73 21 116 -28 167 15 -97 150 -98 -66 109 -133 150 -113 207 187 -118 -75 9 66 159 -11
5410 -11 -115 61 -242 6 18 -159 -67 43 -176 -99 -20 101 260 -168 -65 97 -94 155 -9 -25 64 -113
$$ [...]
8191d0
##END NTUPLES=NMR FID
##END=
