##TITLE=1H_56-2025
 200.13MHz, CDCl3,
 8 sc
 
 28.5.2025
##JCAMPDX= 6.0         $$ Bruker NMR JCAMP-DX V2.0
##DATA TYPE= NMR FID
##DATA CLASS= NTUPLES
##ORIGIN= UXNMR, Bruker Analytische Messtechnik GmbH
##OWNER= pz
$$ XWIN-NMR		Version 3.5
$$ Wed May 28 14:36:15 2025 Russian Standard Time (UT+4h)  she@DPX200
##.OBSERVE FREQUENCY= 200.1313
##.OBSERVE NUCLEUS= ^1H
##.DELAY= (6, 6)
##.ACQUISITION MODE= SIMULTANEOUS
##.ACQUISITION SCHEME= undefined
##.AVERAGES= 8
##.DIGITISER RES= 18
##SPECTROMETER/DATA SYSTEM= spect
##.PULSE SEQUENCE= zg30
##.SOLVENT NAME= CDCl3
##.SHIFT REFERENCE= (INTERNAL, CDCl3, 0, 14.3821)
##AUDIT TRAIL= $$ (NUMBER, WHEN, WHO, WHERE, WHAT)
$$ ##TITLE= Audit trail, XWIN-NMR		Version 3.5
$$ ##JCAMPDX= 5.01
$$ ##ORIGIN= Bruker BioSpin GmbH
$$ ##OWNER= she
$$ F:/spectra/data/she/nmr/H-C/1/audita.txt
$$ ##AUDIT TRAIL=  $$ (NUMBER, WHEN, WHO, WHERE, WHAT)
(   1,<2025-05-28 14:34:55.60 +0400>,<she>,<DPX200>,
      <created by zg, POWCHK disabled, PULCHK disabled
       configuration hash MD5:
       00 E9 B6 7A A2 85 ED C7 34 08 36 98 17 FE 4E 26
       data hash MD5: 16K
       CB 7F 16 C9 8B 4D 05 24 8A E5 CB 40 3C 68 FA A7>)
$$ ##END=
$$ 
$$ hash MD5
$$ 74 E0 31 4A C3 20 C3 21 5A 5A E9 9E A3 A4 A1 62
##$RELAX= 
##$RELAX= 
##$RELAX= 
##$RELAX= 
##$RELAX= 
##$RELAX= 
$$ Bruker specific parameters
$$ --------------------------
##$DU= <F:/spectra>
##$EXPNO= 1
##$NAME= <H-C>
##$PROCNO= 1
##$TYPE= <nmr>
##$USER= <she>
##$AMP= (0..31)
100 100 100 100 100 100 100 100 100 100 100 100 100 100 100 100 100 100 
100 100 100 100 100 100 100 100 100 100 100 100 100 100 
##$AQSEQ= 0
##$AQ_mod= 1
##$AUNM= <au_zg>
##$AUTOPOS= <>
##$BF1= 200.13
##$BF2= 200.13
##$BF3= 200.13
##$BF4= 200.13
##$BF5= 200.13
##$BF6= 200.13
##$BF7= 200.13
##$BF8= 200.13
##$BYTORDA= 1
##$CFDGTYP= 0
##$CFRGTYP= 5
##$CHEMSTR= <none>
##$CNST= (0..31)
1 1 145 1 1 1 1 1 1 1 1 1 1 1 1 1 1 1 1 1 1 1 1 1 1 1 1 1 1 1 1 1 
##$CPDPRG= <>
##$CPDPRG1= <>
##$CPDPRG2= <>
##$CPDPRG3= <>
##$CPDPRG4= <mlev>
##$CPDPRG5= <mlev>
##$CPDPRG6= <mlev>
##$CPDPRG7= <mlev>
##$CPDPRG8= <mlev>
##$CPDPRGB= <>
##$CPDPRGT= <>
##$D= (0..31)
0 0.7 0 0 0 0 0 0 0 0 0 0.03 0 0 0 0 0 0 0 0 0 0 0 0 0 0 0 0 0 0 0 0 
##$DATE= 1748428495
##$DBL= (0..7)
120 120 120 120 120 120 120 120 
##$DBP= (0..7)
150 150 150 150 150 150 150 150 
##$DBP07= 0
##$DBPNAM0= <>
##$DBPNAM1= <>
##$DBPNAM2= <>
##$DBPNAM3= <>
##$DBPNAM4= <>
##$DBPNAM5= <>
##$DBPNAM6= <>
##$DBPNAM7= <>
##$DBPOAL= (0..7)
0.5 0.5 0.5 0.5 0.5 0.5 0.5 0.5 
##$DBPOFFS= (0..7)
0 0 0 0 0 0 0 0 
##$DE= 6
##$DECBNUC= <off>
##$DECIM= 32
##$DECNUC= <off>
##$DECSTAT= 4
##$DIGMOD= 1
##$DIGTYP= 9
##$DL= (0..7)
0 120 120 120 120 120 120 120 
##$DP= (0..7)
150 150 150 150 150 150 150 150 
##$DP07= 0
##$DPNAME0= <>
##$DPNAME1= <>
##$DPNAME2= <>
##$DPNAME3= <>
##$DPNAME4= <>
##$DPNAME5= <>
##$DPNAME6= <>
##$DPNAME7= <>
##$DPOAL= (0..7)
0.5 0.5 0.5 0.5 0.5 0.5 0.5 0.5 
##$DPOFFS= (0..7)
0 0 0 0 0 0 0 0 
##$DQDMODE= 0
##$DR= 18
##$DS= 0
##$DSLIST= <SSSSSSSSSSSSSSS>
$$ [...]
##$SUBNAM0= <"">
##$SUBNAM1= <"">
##$SUBNAM2= <"">
##$SUBNAM3= <"">
##$SUBNAM4= <"">
##$SUBNAM5= <"">
##$SUBNAM6= <"">
##$SUBNAM7= <"">
##$SUBNAM8= <"">
##$SUBNAM9= <"">
##$SW= 18.0517328524113
##$SWIBOX= (0..15)
0 0 2 0 0 0 0 0 0 0 0 0 0 0 0 0 
##$SW_h= 3612.71676300578
##$TD= 16384
##$TD0= 1
##$TE= 0
##$TE2= 300
##$TE3= 300
##$TEG= 300
##$TL= (0..7)
0 120 120 120 120 120 120 120 
##$TP= (0..7)
150 150 150 150 150 150 150 150 
##$TP07= 0
##$TPNAME0= <>
##$TPNAME1= <>
##$TPNAME2= <>
##$TPNAME3= <>
##$TPNAME4= <>
##$TPNAME5= <>
##$TPNAME6= <>
##$TPNAME7= <>
##$TPOAL= (0..7)
0.5 0.5 0.5 0.5 0.5 0.5 0.5 0.5 
##$TPOFFS= (0..7)
0 0 0 0 0 0 0 0 
##$TUNHIN= 0
##$TUNHOUT= 0
##$TUNXOUT= 0
##$USERA1= <user>
##$USERA2= <user>
##$USERA3= <user>
##$USERA4= <user>
##$USERA5= <user>
##$V9= 5
##$VALIST= <valist>
##$VCLIST= <CCCCCCCCCCCCCCC>
##$VD= 0
##$VDLIST= <DDDDDDDDDDDDDDD>
##$VPLIST= <PPPPPPPPPPPPPPP>
##$VTLIST= <TTTTTTTTTTTTTTT>
##$WBST= 1024
##$WBSW= 4
##$XGAIN= (0..3)
0 0 0 0 
##$XL= 0
##$YL= 0
##$YMAX_a= 404574
##$YMIN_a= -453222
##$ZGOPTNS= <>
##$ZL1= 120
##$ZL2= 120
##$ZL3= 120
##$ZL4= 120
##$ABSF1= 10
##$ABSF2= 0
##$ABSG= 5
##$ABSL= 3
##$ALPHA= 0
##$AQORDER= 0
##$ASSFAC= 0
##$ASSFACI= 0
##$ASSFACX= 0
##$ASSWID= 0
##$AUNMP= <proc_1d>
##$AZFE= 0.1
##$AZFW= 0.1
##$BCFW= 1
##$BC_mod= 2
##$BYTORDP= 1
##$COROFFS= 0
##$CY= -3
##$DATMOD= 1
##$DC= 2
##$DFILT= <>
##$DTYPP= 0
##$F1P= 0
##$F2P= 0
##$FCOR= 0.5
##$FTSIZE= 0
##$FT_mod= 4
##$GAMMA= 1
##$GB= 0.15
##$INTBC= 1
##$INTSCL= 1
##$ISEN= 128
##$LB= 0.25
##$LEV0= 0
##$LPBIN= 0
##$MAXI= 10000
##$MC2= 0
##$MEAN= 0
##$ME_mod= 0
##$MI= 1.114404
##$NCOEF= 0
##$NC_proc= 0
##$NLEV= 6
##$NOISF1= 3.799351
##$NOISF2= 2.8
##$NSP= 1
##$NTH_PI= 0
##$NZP= 0
##$OFFSET= 14.38212
##$PC= 1
##$PHC0= -1551.452
##$PHC1= 8.992201
##$PH_mod= 1
##$PKNL= yes
##$PPARMOD= 0
##$PSCAL= 0
##$PSIGN= 0
##$REVERSE= no
##$SF= 200.129724274929
##$SI= 16384
##$SIGF1= 3
##$SIGF2= 2
##$SINO= 400
##$SIOLD= 16384
##$SREGLST= <1H.CDCl3>
##$SSB= 0
##$STSI= 0
##$STSR= 0
##$SW_p= 3205.1282051282
##$SYMM= 0
##$S_DEV= 0
##$TDeff= 0
##$TDoff= 0
##$TI= <>
##$TILT= no
##$TM1= 0
##$TM2= 0
##$TOPLEV= 0
##$USERP1= <user>
##$USERP2= <user>
##$USERP3= <user>
##$USERP4= <user>
##$USERP5= <user>
##$WDW= 1
##$XDIM= 8192
##$YMAX_p= 0
##$YMIN_p= 0
$$ End of Bruker specific parameters
$$ ---------------------------------
##NTUPLES= NMR FID
##VAR_NAME=  TIME,          FID/REAL,        FID/IMAG
##SYMBOL=    X,             R,               I
##VAR_TYPE=  INDEPENDENT,   DEPENDENT,       DEPENDENT
##VAR_FORM=  AFFN,          ASDF,            ASDF
##VAR_DIM=   8192,          8192,            8192
##UNITS=     SECONDS,       ARBITRARY UNITS, ARBITRARY UNITS
##FACTOR=    0.0002768,     1,               1
##FIRST=     0,             0,               0
##LAST=      2.2672688,     0,               0
##MIN=       0,             -453222,         0
##MAX=       2.2672688,     404574,          0
$$ Real data points
##PAGE= N=1
##DATA TABLE= (X++(R..R)), XYDATA
$$ [...]
$$ plain form
2030 269 -197 -512 760 -1062 -168 1337 -1359 -14 1336 -1112 623 895 -1245 905 343 -772
2046 -772 1191 -657 -660 1139 -1081 -335 738 -1073 46 548 -891 867 -320 -489 1121 -720 -84
2063 -84 1453 -1207 178 1388 -1476 360 710 -1139 543 107 -385 610 -864 137 754 -1313 631
2080 631 404 -1501 1135 415 -1300 1172 -34 -708 1133 -592 -260 751 -800 372 219 -1089
2096 -1089 925 -104 -941 1001 -621 -435 913 -950 459 931 -1206 804 494 -1478 1203 179
2112 179 -998 1318 -232 -764 727 -687 -51 192 -800 750 -78 -993 1284 -675 -552 1692 -672
2129 -672 -458 1258 -863 96 865 -879 367 149 -303 1037 -535 -326 831 -1054 8 1012 -1185
2146 -1185 500 412 -852 852 70 -610 1531 -175 -636 1367 -565 -23 883 -891 281 203 -781
$$ packed form
2030B69m66l15J272j822Q94J505k696J345J350k448J735K72k140K150n62j115
2046g72J963j848lJ799k220P46J073j811J119N02j439J758j187j69J610j841O36
2063h4J537k660J385J210k864J836L50j849J682m36m92R95j474J001O17k067J944
2080F31k27j905K636p20j715K472j206o74J841j725L32J011j551J172j53j308
2096a089K014j029q37J942j622J86J348j863J409M72k137K010l10j972K681j024
2112A79j177K316j550n32J491j414O36K43r92J550q28r15K277j959J23K244k364
2129f72K14J716k121R59P69j744J246k18m52J340j572K09J157j885J062J004k197
2146a185J685q8j264J704p82o80K141j706m61K003j932N42R06j774J172p8r84
$$ plain form
2163 -781 677 -238 -277 1086 -1192 -154 1190 -1408 241 1034 -1181 425 841 -967 651 96 -477
2180 -477 847 -439 12 857 -929 610 330 -1082 660 12 -913 987 -247 -624 1160 -511 -117
2197 -117 1218 -825 351 681 -989 679 -15 -669 877 -601 -290 544 -873 173 491 -1173 659
2214 659 153 -1356 1178 158 -1132 1194 -184 -289 1027 -258 106 296 -629 454 -154 -962 1104
2231 1104 -596 -763 1038 -975 -459 1134 -876 229 804 -669 720 292 -761 937 -258 -370
2247 -370 942 -756 25 667 -961 493 223 -1015 823 -344 -776 1221 -558 -591 1016 -868 -207
2264 -207 1077 -889 150 589 -557 755 -285 -340 855 -862 73 563 -1230 430 476 -1552 535
2281 535 300 -1174 713 31 -641 826 -271 144 659 -669 414 108 -995 1003 -121 -923 714
$$ packed form
2163g81J458r15l9J363k278J038J344k598J649P93k215J606M16j808J618n55n73
2180d77J324j286M51Q45j786J539k80j412J742o48r25J900j234l77J784j671L94
2197a17J335k043J176L30j670J668o94o54J546j478L11Q34j417J046L18j664J832
2214F59n06j509K534j020j290K326j378j05J316j285L64J90r25J083o08q08K066
2231A104j700j67J801k013N16J593k010J105N75j473J389m28j053J698j195j12
2247c70J312j698P81O42j628J454k70j238J838j167m32J997j779l3J607j884O61
2264b07J284j966J039M39j146J312j040n5J195j717R35M90j793J660M6k028K087
2281E35k35j474J887o82o72J467j097M15N15j328J083l06j103J998j124q02J637
$$ plain form
2298 714 -543 -539 989 -772 -18 843 -1074 151 534 -917 743 307 -646 628 -77 -313 581 -706
2316 -706 322 223 -1011 807 101 -1008 867 -235 -911 1118 -373 -454 876 -278 55 648 -623
2333 -623 728 -54 -463 740 -346 -249 727 -755 -206 914 -899 135 412 -833 553 -108 -731
2350 -731 811 -360 -342 979 -624 -239 661 -626 296 220 -540 636 -244 -649 1030 -824 -437 1045
2368 1045 -1034 -118 979 -876 178 538 -744 400 2 -343 602 -360 206 681 -1053 314 482
2385 482 -1266 339 158 -1145 714 -202 -494 805 -437 99 614 -592 27 516 -693 694 165
2402 165 -413 569 -317 -332 737 -869 242 495 -1013 445 298 -1003 554 358 -641 670 -1 -192
2420 -192 607 -255 408 273 -588 623 177 -918 983 -284 -832 789 -340 -397 567 -482 164 394
$$ packed form
2298G14j257MJ528j761P54Q61j917J225L83j451J660m36r53J274p05k36Q94j287
2316g06J028r9j234J818p06j109J875j102o76K029j491q1J330j154L33N93j271
2333f23J351p82m09J203j086R7R76j482N49J120j813J034K77j245J386o61o23
2350g31J542j171J8J321j603L85R00j287R22p6p60J176q80m05J679j854L87J482
2368A045k079R16J097j855J054L60j282J144l98l45R45r62N66M75j734J367J68
2385D82j748J605j81j303J859r16k92J299j242N36N15j206O19M89j209J387n29
2402A65n78R82q86j5J069j606J111K53j508J458j47j301J557j96r99J311o71j91
2420a92P99q62O63j35q61J211m46j095J901j267n48J621j129n7R64j049O46K30
$$ plain form
2438 394 -512 640 25 -425 921 -257 -248 779 -584 -77 694 -635 203 210 -735 632 -104 -914 796
2457 796 -250 -576 728 -547 -39 678 -454 83 314 -212 696 51 -77 746 -786 -174 762 -1007
2475 -1007 -34 858 -916 100 312 -720 435 124 -327 683 -349 37 745 -686 517 541 -695
2492 -695 588 242 -817 823 36 -454 734 -414 -146 528 -880 158 398 -845 490 134 -621
2509 -621 745 -269 -159 505 -529 152 535 -858 761 211 -1200 661 0 -676 608 -40 -666
2526 -666 663 -475 74 382 -519 632 -63 -622 1113 -76 -443 800 -489 -220 766 -810 -18
2543 -18 313 -819 290 123 -522 562 -260 -485 715 -477 27 463 -607 280 338 -490 522 -16
2561 -16 -679 930 -421 -508 943 -673 -194 572 -621 -139 423 -276 687 -39 -364 484 -392 83 889
$$ packed form
2438C94r06J152o15m50J346j178RJ027j363N07P71j329Q38Pr45J367p36q10J710
2457G96j046l26J304j275N08P17j132N37K31n26R08o45j28Q23j532O12R36j769
2475a007R73Q92j774J016K12j032J155l11m51J010j032L86P08j431J203K4j236
2492f95J283l46j059J640p87m90J188j148K68O74j408J038K40j243J335l56p55
2509f21J366j014J10O64j034O81L83j393J619n50j411J861o61o76J284o48o26
2526f66J329j138N49L08r01J151o95n59J735j189l67J243j289K69R86j576P92
2543a8L31j132J109j67o45J084q22k25J200j192N04M36j070Q87N8q28J012n38
2561a6o63J609j351q7J451j616M79P66j193M82N62o99R63p26l25Q48q76M75Q06
$$ plain form
2580 889 -673 345 416 -581 207 250 -833 451 -84 -376 480 -477 31 639 -513 43 496 -702 550
2599 550 19 -692 705 -332 -179 736 -504 108 620 -746 -28 326 -702 22 272 -534 558 -253
2617 -253 -328 599 -593 355 328 -790 355 283 -734 748 33 -683 497 -186 -594 597 -408 5
2635 5 307 -554 205 -55 -547 571 -477 -266 743 -464 -33 835 -497 24 570 -778 451 62
2653 62 -495 556 71 -514 494 -452 -311 402 -395 218 159 -488 446 33 -405 836 -106 -407 787
2672 787 -498 -166 781 -782 32 281 -625 212 11 -353 501 -395 -48 679 -608 370 469 -579 334
2691 334 410 -531 529 66 -583 598 -357 -63 430 -501 -84 344 -517 319 95 -502 600 -107 -250
2710 -250 721 -627 -120 497 -559 386 652 -469 385 -58 -609 352 -279 -225 136 -450 -97 448 -478
$$ packed form
2580H89j562J018P1r97P88M3j083J284n35k92Q56r57N08O08j152N56M53j198J252
2599E50n31p11J397j037J53R15j240O12N12j366P18L54j028P24K50q06J092q11
2617b53p5R27j192R48k7j118J145p2j017J482p15p16J180o83m08J191j005M13
2635EL02q61P59k60m92J118j048K11J009j207M31Q68j332N21N46j348J229l89
2653F2n57J051m85n85J008r46J41P13p97O13n9o47R34m13m38J241r42l01J194
2672G87j285L32R47j563Q14K49r06Q37k01l64Q54q96L47P27j287R78R9j048R13
2691C34P6r41J060m63o49J181r55K94M93r31M17M28q61Q36k24n97J102p07j43
2710b50R71j348N07O17j056R45K66j121Q54m43n51R61o31N4L61n86L53N45r26
$$ plain form
2729 -478 326 155 -616 695 -117 -608 720 -133 -413 517 -366 129 302 -553 377 186 -848 615 -335
2748 -335 -328 551 -275 5 408 -393 377 178 -833 427 165 -469 450 17 -440 541 -338 -210 320 -534
2768 -534 314 178 -583 274 -317 -484 692 -351 -326 813 -470 -116 597 -384 187 453 -397 331 -325
2787 -325 -368 478 -383 -127 420 -515 38 259 -791 376 38 -386 635 -63 -304 442 -316 -102 690
2806 690 -561 -150 513 -412 193 -87 -375 297 -350 -43 527 -572 272 389 -462 471 357 -756 447
2825 447 406 -558 509 49 -334 338 -125 37 182 -528 458 -130 -662 301 59 -361 648 -118 -258 585
2845 585 -534 -144 363 -472 514 313 -457 381 -55 -489 479 -192 -198 460 -506 203 1 -722 436 44
2865 44 -606 825 -59 -324 940 -98 -229 490 -472 -25 209 -280 241 -338 -361 635 -259 -114 673 -621
$$ packed form
2729d78Q04j71p71J311q12m91J328q53k80R30q83M95J73q55R30j91j034J463r50
2748c35PQ79q26K80M03q01P70j99j011J260k62o34R19m33m57R81q79J28N30q54
2768e34Q48j36p61Q57n91j67J176j043K5J139j283L54P13r81N71K66q50P28o56
2787c25m3Q46q61K56N47r35N53K21j050J167l38m24J021o98k41P46p58K14P92
2806F90j251M11O63r25O05k80k88O72o47L07N70j099Q44J17q51R33j14j113J203
2825D47m1r64J067m60l83O72m63J62J45p10R86n88n32R63k42m20J009p66j40Q43
2845E85j119L90N07q35R86k01p70Q38m36m34R68o71oO58r66P09k02p23J158l92
2865D4o50J431q84k65J264j038j31P19r62M47K34m89N21n79k3R96q94J45P87j294
$$ plain form
2885 -621 105 572 -580 227 296 -456 513 29 -203 517 -108 -19 519 -490 157 206 -607 183 -105 -517
2905 -517 552 -315 -252 550 -362 -268 709 -409 243 468 -665 220 -115 -438 360 -75 -108 234 -473 -106
2925 -106 90 -748 375 244 -838 360 244 -409 664 -268 -160 282 -216 115 153 -396 287 143 -575
2944 -575 460 -136 -422 492 -327 -285 419 -508 40 66 -530 307 104 -543 559 -16 -442 530 -269 44
2964 44 321 -381 9 90 -233 324 -170 -590 848 -271 -297 510 -170 16 694 -184 78 234 -306 620
2984 620 -49 -307 530 -482 -153 444 -547 -109 295 -540 275 186 -520 210 139 -329 478 -280 -159 412
3004 412 -524 -55 458 -524 220 67 -482 447 -225 -392 509 -554 -381 287 -678 328 494 -489 239
3023 239 216 -504 302 -94 -1 323 -436 155 180 -382 369 110 -568 228 -90 -559 627 -173 -45 480 -490
$$ packed form
2885f21P26M67j152Q07O9p52R69m84k32P20o25Q9N38j009O47M9q13P90k88m12
2905e17J069q67O3Q02r12R4R77j118O52K25j133Q85l35l23P98m35l3L42p07L67
2925a06J96q38J123j31j082J198j16o53J073r32J08M42m98L31L8n49O83j44p18
2944e75J035n96k86R14q19M2P04r27N48K6n96Q37k03o47J102n75m26R72p99L13
2964D4K77p02L90Q1l23N57m94m20J438j119k6Q07o80J86O78q78K62J56n40R26
2984F20o69k58Q37j012L29N97r91M38M04q35Q15q9p06P30p1m68Q07p58J21N71
3004D12r36M69N13r82P44j53n49R29o72j67R01j063J73O68r65J006J66r83P28
3023B39k3p20Q06l96R3L24p59N91K5n62P51k59o78P96l18m69J186q00J28N25r70
$$ plain form
3044 -490 18 415 -540 258 153 -336 485 -138 -371 546 -196 -32 381 -515 212 269 -608 295 34 -686
3064 -686 249 147 -430 661 -38 13 507 -196 320 309 -426 493 -137 -549 586 -179 -396 544 -463 -15
3084 -15 432 -394 -44 170 -259 268 -30 -415 541 -288 -224 646 -453 21 390 -545 126 69 -491 494 -285
3105 -285 -540 379 -337 -332 527 -399 -90 112 -220 238 161 -530 404 -120 -376 476 -549 77 457 -724
3125 -724 178 325 -565 484 92 -599 397 -220 -231 397 -331 273 353 -465 279 132 -428 261 -14 -383
3145 -383 529 -196 -282 334 -493 25 544 -438 112 275 -401 433 5 -358 542 -208 110 311 -465 190
3165 190 402 -472 374 103 -654 367 -220 -280 380 -108 -300 249 -420 90 83 -420 467 53 -333 601 -311
3186 -311 -306 588 -427 -165 258 -489 12 -45 -559 268 -56 -475 561 -383 -153 426 -352 191 330 -312
$$ packed form
3044d90N08L97r55P98j05m89Q21o23k33R17p42J64M13q96P27N7q77R03k61p20
3064f86R35j02n77J091o99N1M94p03N16j1p35R19o30m12J135p65k17R40j007M48
3084a5M47q26L50K14m29N27k98l85R56q29O4Q70j099M74L69r35O71n7n60R85p79
3105b85k55R19p16NQ59r26L09K02l32M58p7o91R34n24k56Q52j025O26L80j181
3125g24R02J47q90J049l92o91R96o17j1O28p28O04Q0q18P44j47n60O89k75l69
3145c83R12p25q6O16q27N18N19r82N50J63o76Q34m28l63R00p50L18K01p76O55
3165A90K12q74Q46k71p57J021n87o0O60m88j92N49o69N10pn03Q87m14l86R34r12
3186c11NQ94j015K62M23p47N01n7n14Q27l24m19J036r44K30N79p78N43J39o42
$$ plain form
3206 -312 269 141 -277 411 -152 -183 690 -163 -253 519 -408 -173 486 -441 355 335 -74 282 -149 -252 420
3227 420 -345 -102 439 -590 185 316 -743 293 165 -511 349 -179 13 302 -290 266 365 -715 -11
3246 -11 256 -315 450 -115 -472 648 -104 -128 526 -327 220 332 -599 187 177 -618 381 -95 -375 304 -188
3267 -188 51 482 -449 290 205 -640 519 156 -330 580 -26 -350 340 -419 -195 439 -274 149 140 -374 315
3288 315 -367 -190 429 -294 -212 642 -480 77 494 -365 205 133 -320 377 -40 -134 316 -397 -298 339 -327
3309 -327 -132 64 -222 348 -115 -367 468 -263 -295 451 -365 -245 577 -306 12 432 -492 193 72 -296
3329 -296 132 -127 -187 45 -251 114 421 -448 141 363 -635 372 206 -370 246 135 -426 373 -364 -196
3349 -196 248 -648 377 328 -264 356 124 -301 550 -9 -161 428 -322 69 288 -667 334 209 -207 380
$$ packed form
3206c12N81j28m18O88n63l1Q73q53r0P72r27K35O59r27P96k0m09L56m31j03O72
3227D20p65K43N41j029P75J31j059J036j28o76Q60n28J92K89n92N56R9j080P04
3246a1K67n71P65n65l57J120p52k4O54q53N47J12r31P86j0p95R99m76k80O79m92
3267a88K39M31r31P39q5q45J159l63m86R10o06l24O90p59K24O34p13M23rn14O89
3288C15o82J77O19p23Q2Q54j122N57M17q59N70p2m53O97m17r4M50p13R9O37o66
3309c27J95J96k86N70m63k52Q35p31l2P46q16J20Q22q83L18M20r24O85j21l68
3329b96M28k59o0K32k96L65L07q69N89K22r98J007j66n76O16j11n61P99p37J68
3349a96M44q96J025m9n92O20k32m25Q51n59j52N89p50L91K19r55J001j25m16N87
$$ plain form
3369 380 -52 -240 643 -176 -187 285 -410 289 264 -523 573 185 -537 574 151 -416 562 -315 -358 370
3389 370 -288 95 32 -474 158 -54 -463 266 -352 -328 276 -184 131 159 -579 209 359 -258 509 -233 -189
3410 -189 461 -243 -270 570 -393 224 324 -440 43 172 -264 374 -292 -254 512 -350 -70 613 -481 134
3430 134 414 -190 420 282 -342 134 -251 -233 305 -284 -15 421 -412 14 269 -391 330 54 -32 524 -213
3451 -213 -184 400 -364 -88 249 -463 149 230 -526 167 68 -214 640 -157 31 525 -215 253 133 -418 552
3472 552 206 -392 421 44 -66 499 -252 -96 178 -152 2 260 -475 239 25 -375 543 -159 -342 401
3492 401 -291 -141 463 -262 35 312 -359 430 127 -248 304 -125 -354 320 -300 -78 297 -179 166 13
3512 13 -323 389 -153 -304 515 -46 -154 463 -119 72 369 -341 126 155 -337 182 -26 -98 255 -297 -204
$$ packed form
3369C80m32j88Q83q19j1M72o95O99k5p87J096l88p22J111m23n67R78q77m3P28
3389C70o58L83o3n06O32k12m09P29o18K4O04m60L15K8p38P88J50o17P67p42M4
3410a89O50p04k7Q40r63O17J00p64M83J29m36O38o66L8P66q62K80O83j094O15
3430A34K80o04O10j38o24M76l85J8N38n89K69M36q33M26K55o60P21k76q6N56p37
3451b13K9N84p64K76L37p12O12Q1p56O93r9k82Q54p97J88M94p40M68j20n51R70
3472E52l46n98Q13l77j10N65p51J56K74l30J54K58p35P14k14m00R18p02j83P43
3492D01o92J50O04p25K97K77o71P89l03l75N52m29k29O74o20K22L75m76L45j53
3512A3l36P12n42j51Q19n61j08O17n82J91K97p10M67K9m92N19k08p2L53n52R3
$$ plain form
3533 -204 202 -292 46 201 -288 64 126 -179 457 -85 -88 311 -376 161 368 -337 110 244 -483 169 29
3554 29 -293 444 -114 -227 384 -197 37 432 -175 201 286 -421 233 97 -268 394 -118 -185 261 -470 -2
3575 -2 400 -123 245 122 -394 528 -42 -335 333 -200 188 419 -161 174 232 -271 156 96 -475 229 -61
3596 -61 -210 335 -170 -152 186 -237 186 222 -181 148 -11 -310 245 -96 -240 331 -7 -73 350 -201 144
3617 144 206 -355 234 -62 -118 275 -202 -248 569 -441 61 453 -393 267 77 -350 182 -141 -213 296 -320
3638 -320 -61 394 -469 43 212 -210 350 235 -491 60 25 -209 493 -104 -157 289 -537 119 159 -301 149
3659 149 22 -103 185 -197 -179 632 -337 -42 321 -283 31 436 -329 219 368 -236 166 -80 -57 372 -267
3680 -267 49 279 -384 164 22 -351 260 1 -212 351 78 -74 335 -203 84 249 -325 212 -186 -203
$$ packed form
3533b04M06m94L38J55m89L52O2l05O36n42lL99o87N37K07p05M47J34p27O52j40
3554B9l22P37n58j13O11n81K34L95o07L76Q5p07O54j36l65O62n12o7M46p31M68
3575bM02n23L68j23n16R22n70k93O68n33L88K31n80L35N8n03M27o0n71P04k90
3596f1j49N45n05J8L38m23M23L6m03L29j59k99N55l41j44N71l38o6M23n51L45
3617A44O2n61N89k96n6L93m77m6Q17j010N02L92q46O60j90m27N32l23p2N09o16
3638c20K59M55q63N12J69m22N60j15p26N51l5k34P02n97n3M46q26O56M0m60M50
3659A49j27j25K88l82J8Q11r69K95L63o04L14M05p65N48J49o04M02k46K3M29o39
3680b67L16K30o63N48j42l73O11k59k13N63k73j52M09n38K87J65n74N37l98j7
$$ plain form
3700 -203 272 71 -302 385 -260 -201 245 -301 25 276 -404 150 183 -173 400 -45 -33 509 137 114 312
3721 312 -443 30 -12 -223 465 -103 -285 286 -374 -390 442 -353 -95 311 -399 170 82 -351 437 -143 -191
3742 -191 361 -213 -29 349 -381 17 310 -330 -25 -25 -523 284 -24 -259 361 -231 -34 435 -161 119 355
3763 355 -40 199 286 -84 315 -387 -23 178 -128 42 144 -387 -29 171 -254 247 183 -341 136 -6 -175
3784 -175 210 -167 7 237 -159 134 -65 -337 386 29 -383 227 -319 -121 396 -321 63 177 -408 180
3804 180 268 -140 137 50 -90 358 -42 110 156 -260 229 6 -332 257 -144 -324 317 -62 -369 161 -266
3825 -266 -220 365 -63 -61 446 -387 -28 99 -102 441 -265 -166 423 -334 -115 11 -319 59 72 -131 446 -208
3847 -208 -225 298 -145 -160 385 -319 69 281 -102 346 99 -109 212 95 -108 215 -175 -302 262 -164 3
$$ packed form
3700b03M75k01l73O87o45N9M46n46L26K51o80N54L3l56N73m45J2N42l72k3J98
3721C12p55M73m2k11O88n68j82N71o60j6Q32p95K58M06p10N69q8m33P88n80m8
3742a91N52n74J84L78p30L98K93o40L05%m98Q07l08k35O20n92J97M69n96K80K36
3763C55l95K39Q7l70L99p02L64K01l06J70J02n31L58K00m25N01o4n24M77j42j69
3784a75L85l77J74K30l96K93j99k72P23l57m12O10n46J98N17p17L84J14n85N88
3804A80Q8m08K77q7j40M48m00J52M6m16M89k23l38N89m01j80O41l79l07N30m27
3825b66M6N85m28KN07q33L59J27k01N43p06R9N89p57K19J26l30L78J3k03N77o54
3847b08j7N23m43j5N45p04L88K12l83M48k47k08L21j17k03L23l90j27N64m26J67
$$ plain form
3868 3 219 -418 295 157 -223 291 -150 -45 343 -189 149 175 -193 -52 322 -220 119 -92 -319 235 54
3889 54 -158 182 -190 32 121 -97 78 81 -234 203 26 -169 518 -297 42 -9 -41 19 30 -212 365 5 -357
3912 -357 145 -197 -279 249 -83 -31 325 -377 166 11 -319 259 -70 -197 330 2 -237 310 -211 -189 277
3933 277 -238 43 226 -309 325 231 71 411 -289 -18 190 -349 176 316 -302 76 261 -562 333 85
3953 85 -464 151 -125 -126 241 -242 40 337 11 314 219 -158 361 -111 -253 312 -176 -32 280 -466 -232
3974 -232 294 -376 169 -91 -61 310 39 -34 223 -92 145 568 -218 308 240 -229 -32 171 -72 259 -267
3995 -267 -26 381 -237 -147 339 -283 -15 2 -269 167 -69 -207 461 -148 -231 300 -39 128 298 -332 28
4016 28 152 -386 98 -123 -340 235 -2 14 70 -305 77 17 -195 264 117 -161 435 -80 -175 432 -247 -10
$$ packed form
3868CK16o37P13j38l80N14m41J05L88n32L38K6l68J41L74n42L39k11k27N54j81
3889E4k12L40l72K22Q9k18J75Ll15M37j77j95O87q15L39n1l2O0J1k42N77l60l62
3912c57N02l42q2N28l32N2L56p02N43j55l30N78l29j27N27l28k39N47n21K2M66
3933B77n15K81J83n35O34r4j60L40p00K71K08n39N25J40o18L78J85q23Q95k48
3953H5n49O15k76jL67m83K82K97l26L03r5l77N19m72j42N65m88J44L12p46K34
3974b32N26o70N45k60L0L71k71p3K57l15K37M23p86N26o8m69J97K03k43L31n26
3995b67K41M07o18R0M86o22K68J7k71M36k36j38O68o09q3N31l39J67J70o30L60
4016B8J24n38M84k21k17N75k37J6N6l75L82o0k12M59j47k78N96n15r5O07o79K37
$$ plain form
4038 -10 230 -185 -147 209 -269 290 -55 -53 180 -179 -300 220 -52 42 278 -422 71 163 -286 351 -8 -208
4060 -208 211 -210 -13 213 -161 -17 75 -316 199 153 -184 325 -14 -245 132 -39 153 63 -249 87 308
4081 308 -294 319 78 -228 324 102 -78 195 -209 -7 155 -185 402 345 -68 118 -69 -166 -63 120 -19
4102 -19 195 -277 -159 199 -392 58 228 -278 151 -205 -384 343 -163 44 283 -298 50 365 -394 9
4122 9 19 -346 317 -20 -245 353 -121 -139 282 -94 95 79 -127 177 -8 -174 109 -286 -1 398 -73 -55
4144 -55 494 -110 226 -5 -379 57 2 -160 222 143 -115 207 -285 -422 291 -248 238 52 -339 303 -69
4165 -69 -285 268 -14 -218 100 -280 -188 306 -239 61 -66 -326 201 -58 -133 326 -207 -188 294 -159 95
4186 95 241 -262 -39 267 -51 173 -56 -96 291 -238 -202 329 -225 -24 225 -120 165 -108 -107 290 -99 -133
$$ packed form
4038a0K40m15L8L56m78N59l45KK33l59j21N20k72R4K36p00M93R2m49O37l59k00
4060b08M19m21J97K26l74J44R2l91N15m6l37N09l39k31L77j71J92r0l12L36K21
4081C08o02O13k41l06N52k22j80K73m04K02J62l40N87n7m13J86j87r7J03J83j39
4102a9K14m72J18L58n91M50J70n06M29l56j79P27n06K07K39n81L48L15p59M03
4122IJ0l65O63l37k25N98m74j8M21l76J89j6k06L04j85j66K83l95K85L99m71J8
4144e5N49o04L36k31l74M36n5j62L82p9k58L22m92j37P13n39M86j86l91O42l72
4165f9k16N53k82k04L18l80R2M94n45L00j27k60N27k59p5M59n33J9M82m53K54
4186I5J46n03K23L06l18K24k29m0L87n29L6N31n54K01K49l45K85k73JL97l89l4
$$ plain form
4208 -133 388 -42 -50 244 -121 183 340 -273 25 27 -302 -47 -125 -162 -31 -66 -108 189 -126 130 -91 -286 205
4231 205 -107 -268 159 -120 -46 358 -152 158 88 -216 196 93 -375 366 -73 -214 146 -255 -23 280 -207
4252 -207 141 113 -146 -78 13 -154 246 -133 -176 161 -161 -225 20 -108 295 89 -361 209 -127 -22 291 -46
4274 -46 -23 216 -315 146 311 -322 8 213 -171 185 -47 -72 349 -75 -30 258 -234 53 397 -241 188
4295 188 170 -283 330 31 -132 391 95 -82 293 -369 158 144 -218 113 77 -178 93 37 -103 132 -312
4316 -312 -4 220 -312 41 315 -283 282 62 -271 252 -272 -62 76 -164 -30 289 -180 41 -30 -364
4336 -364 165 -146 -182 -9 -144 28 177 -189 17 226 -279 -42 -16 -256 143 117 -32 213 -134 -129 187 -195
4358 -195 -158 169 -265 146 -37 -197 239 -178 -146 234 -80 -95 -151 -106 52 -14 -5 41 25 -161 253 137 -146
$$ packed form
4208a33N21m30qK94l65L04J57o13K98Kl29K55p8l7J31l5m2K97l15K56k21j95M91
4231B05l12j61M27k79P4M04n10L10p0l04M12j03m68P41m39j41L60m01K32L03m87
4252b07L48k8k59O8R1j67M00l79m3L37l22o4K45j28M03k06m50N70l36J05L13l37
4274d6K3K39n31M61J65o33L30K05l84L56k32k5M21m24M5K88m92K87L44o38M29
4295A88j8m53O13k99j63N23k96j77L75o62N27j4l62L31l6k55K71n6j40K35m44
4316c12L08K24n32L53K74n98N65k20l33N23n24K10J38k40J34L19m69K21p1l34
4336c64N29l11l6J73j35J72J49l66K06K09n05K37K6k40L99k6j49K45l47NL16l82
4358a95L7L27m34M11j83j60M36m17L2L80l14j5n6M5J58o6RM6j6j86M14j16k83
$$ plain form
4381 -146 218 46 -187 263 -127 -270 289 -217 125 127 -378 188 -56 88 517 -356 192 173 -257 210 -182
4402 -182 -325 20 -20 -106 153 -126 -194 425 -62 -113 187 -302 228 314 -144 281 -102 -237 273 -269 36 379
4424 379 -273 119 168 -148 174 253 -286 153 -81 -69 23 24 2 141 -147 91 103 -375 18 -28 128 72 -193
4447 -193 -3 96 -189 93 254 58 153 264 -273 291 8 -132 372 -136 46 290 -41 7 121 -287 165
4468 165 72 -241 304 -20 56 375 -17 -77 165 -117 -19 318 -7 155 185 -294 130 -14 -204 79 -215 -70
4490 -70 272 -315 -66 196 -179 192 -224 -236 -13 -171 -70 100 -216 -99 152 -180 91 76 -306 220 -42
4511 -42 -224 224 -224 -4 -69 -314 87 57 -136 172 185 -99 164 -23 48 85 -95 90 98 -84 7 204 -116
4534 -116 217 -70 44 110 73 -103 230 -49 138 271 -96 -55 174 -218 21 -127 -230 235 -28 -8 214
$$ packed form
4381a46L64j72k33M50l90j43N59n06L42Kn05N66k44J44M29q73N48j9m30M67l92
4402a82j43L45m0q6K59k79o8O19m87n1L00m89N30Q6m58M25l83j35N10n42L05L43
4424C79o52L92M9l16L22P9n39M39k34J2R2Jk2J39k88K38J2m78L93m6J56n6k65
4447a93J90R9k85K82J61j96R5J11n37N64k83j40N04n08J82K44l31M8J14m08M52
4468A65r3l13N45l24P6L19l92o0K42k82R8L37l25J62L0m79M24j44j90K83k94J45
4490g0L42n87K49K62l75L71m16j2K23j58J01J70l16J17K51l32K71j5l82N26k62
4511d2j82M48m48K20o5k45M01l0j93L08J3k84K63j87P1L7j80J85Qj82R1J97l20
4534a16L33k87J14O6l7j76L33k79J87J33l67M1K29l92K39j48j03M65k63K0K22
$$ plain form
4555 214 108 36 0 -173 154 12 -208 21 -23 -214 267 -40 -187 68 -87 86 188 -73 88 53 -78
4576 -78 201 -46 11 143 87 -64 51 -239 100 174 -161 80 122 -114 175 78 -69 442 -279 119 11 -120
4598 -120 124 203 67 -8 46 -209 239 -94 -189 275 35 62 172 -91 41 167 -78 505 147 -140 -5 -180
4620 -180 -181 424 -236 119 -56 -63 77 -99 -4 134 -110 -46 136 29 -233 291 -50 111 173 -121 28 92 -223
4643 -223 15 283 -42 262 34 6 -161 -231 87 212 -158 162 -135 -69 273 15 -80 90 -110 -45 157 -57
4665 -57 270 135 -180 156 -43 -24 149 -76 -256 149 49 43 350 -160 -46 40 -272 -18 -60 -23 261 -65
4687 -65 -38 236 -185 146 53 -253 196 -16 -112 133 105 -227 248 -157 -19 181 -163 86 149 -111 49 1
4709 1 -222 130 -48 -171 -86 142 -78 18 -19 67 -139 -153 -10 66 26 120 -2 102 275 -207 -69 -191 -70
$$ packed form
4555B14j06p2l6j73L27j42k20K29m4j91M81l07j47K55j55J73J02k61J61l5j31
4576g8K79k47N7J32n6j51J15k90L39P4l35K41M2k36K89r7j47N11p21L98j08j31
4598a20K44P9j36p5N4k55M48l33r5M64k40K7J10k63J32J26k45N83l58k87J35j75
4620a80jO05o60L55j75pJ40j76R5J38k44O4J82j07k62N24l41J61O2k94J49O4l15
4643b23K38K68l25L04k28k8j67p0L18J25l70L20k97O6L42k58r5J70k00O5K02k14
4665e7L27j35l15L36j99J9J73k25j80M05j00oL07n10J14Q6l12K54m2L7K84l26
4687f5K7K74m21L31r3l06M49k12r6K45k8l32M75m05J38K00l44K49O3k60J60m8
4709Ak23L52j78j23Q5K28k20R6l7Q6k06j4J43P6m0R4j22J04J73m82J38j22J21
$$ plain form
4732 -70 140 188 -177 94 -120 -59 123 -105 -4 178 -177 -3 327 5 295 68 -132 202 41 -11 165
4753 165 -56 243 -24 -81 70 52 -229 -19 -82 39 64 -131 -47 -108 45 -30 95 -141 57 239 -195 196
4775 196 -12 -70 88 -95 -181 282 -118 58 110 -187 122 -63 -99 -58 -93 -76 260 -84 -55 44 -188 160 -94
4798 -94 15 195 23 -28 209 232 -21 279 -148 -89 147 -117 -134 -73 -102 99 9 -165 296 -117 -14 -18 -221
4821 -221 -252 11 100 -17 -227 59 150 16 -60 202 -61 -73 312 32 161 38 -199 -88 76 -253 147 8
4843 8 -191 -86 121 -274 102 53 -80 -173 76 109 42 126 15 170 -135 292 -183 83 191 -54 -78 215 -185
4866 -185 129 5 -204 118 4 -63 -13 -121 -33 323 -66 96 201 -144 231 137 -34 96 -103 144 311
4887 311 42 5 36 26 -65 86 -51 180 -231 -89 148 3 8 14 -208 -167 108 -138 118 130 29 35 5 -165
$$ packed form
4732g0K10M8l65K71k14O1J82k28J01J82l55J74L30l22K90k27k00L34j61n2J76
4753A65k21K99k67n7J51j8k81K10o3J21K5j95Q4o1J53p5J25k36J98J82m34L91
4775A96k08n8J58j83q6M63m00J76N2k97L09j85l6M1l5J7L36l44K9R9k32L48k54
4798i4J09J80j72n1K37K3k53L00m27N9K36k64j7O1k9K01r0j74M61m13J03mk03
4821b21l1K63Q9j17k10K86R1j34p6K62k63j2L85k80J29j23k37J11J64l29M00j39
4843Hj99J05K07l95L76m9j33r3K49L3o7Q4j11J55l05M27m75K66J08k45k4K93m00
4866a85L14j24k09L22j14o7N0j08Q8L56l89J62J05l45L75r4j71J30j99K47J67
4887C11k69l7L1j0r1J51j37K31m11J42K37j45NOk22M1K75k46K56J2j01Ol0j70
$$ plain form
4911 -165 28 -57 113 -47 -173 45 84 -437 12 29 -33 115 -102 -45 115 15 -5 52 -98 6 61 169 -57
4934 -57 -69 -352 161 -145 -264 130 26 232 -216 -114 -67 181 5 24 -41 -47 32 -38 -3 90 14 6 -128 -95 44
4959 44 -143 -206 141 -118 -57 176 -84 41 157 -48 -15 199 -54 28 113 -14 -12 -39 -73 118 -52 -6 81 -68
4983 -68 176 -166 74 157 -91 -157 19 -126 -373 216 -79 8 -243 -56 99 70 -138 -71 -124 -104 -155 91 -46
5006 -46 111 97 -251 -31 -39 33 30 -49 171 156 -91 -78 -139 58 39 -121 -86 -3 -215 104 -59 72 -64 111 -115
5031 -115 -35 -315 -118 211 138 54 272 -62 176 7 -139 53 -98 49 -26 118 -165 -17 53 -46 -170 -140
5053 -140 -28 96 29 269 59 -150 -142 -84 68 -12 -80 200 261 -67 29 97 25 194 -10 -247 -135 -84 56 70
5077 70 -88 34 80 -17 212 -25 52 -171 -232 158 -142 -106 -43 39 -49 -211 -48 -120 13 -1 -170 108 -19 -78
$$ packed form
4911a65J93q5J70j60j26K18L9n21M49J7o2J48k17N7J60j00k0N7j50J04N5J08k26
4934e7j2k83N13l06j19L94j04K06m48J02M7K48j76J9o5oP9p0L5R3p6qj34L3J39
4959D4j87o3L47k59O1K33k60J25J16k05L3K14k53Q2Q5j27Kk7l4J91j70M6Q7j49
4983f8K44l42K40Q3k48o6J76j45k47N89k95Q7k51J87J55k9k08O7n3K0n1K46j37
5006d6J57j4l48K20qP2lp9K20j5k47J3o1J97j9j60L5Q3k12L19j63J31j36J75k26
5031a15Q0k80J97L29p3q4K18l34K38j69j46J92j51J47p5J44k83J48P0r9j24L0
5053a40J12J24o7K40k10k09QN8J52q0o8K80O1l28R6O8p2J69k04k37J12N1J40J4
5077G0j58J22M6r7K29k37P7k23o1L90l00L6O3Q2q8j62J63p2J33j4j69K78j27n9
$$ plain form
5101 -78 125 -102 -69 77 -94 20 104 51 146 -56 -45 71 -219 -105 115 -132 31 10 41 25 67 -168 122
5124 122 -9 -108 149 -137 -24 234 -153 129 41 14 14 -6 43 -22 -74 -107 160 -76 99 208 -237 150 -56
5147 -56 18 74 201 -135 63 -149 -60 2 -186 20 -26 -66 190 75 49 100 -116 -232 33 -67 -115 186 -64
5170 -64 69 -62 15 102 97 -57 -25 -20 -65 -156 -92 -14 55 143 -215 -38 189 -55 86 -78 82 -65 83 16 -2
5195 -2 114 52 -25 -97 24 -169 56 105 55 176 -44 -151 -47 -26 106 111 -73 42 97 73 128 35 -35 25 -142
5220 -142 -86 -144 -320 68 26 -200 -8 -40 -31 -47 -116 -255 197 -66 130 43 19 77 210 -109 -9 -34 -53 85
5244 85 -133 -179 -23 -131 167 -41 -47 103 58 -235 -22 -55 -140 107 -60 117 -54 110 58 52 -151 151 -73
5267 -73 88 -42 -3 -100 84 -107 -56 109 -39 170 103 -47 113 -66 51 121 86 39 -1 91 -13 -84 -63 -113
$$ packed form
5101g8K03k27L3J46j71J14Q4n3R5k02J1J16k90J14K20k47J63k1L1j6M2k35K90
5124A22j31r9K57k86J13K58l87K82q8k7%k0M9o5n2l3K67k36J75J09m45L87k06
5147e6P4N6J27l36J98k12Q9O2j88K06m6m0K56j15k6N1k16j16K65j00m8L01k50
5170f4J33j31P7Q7nj54L2Nm5r1O4P8O9Q8l58J77K27k44J41j64J60j47J48o7j8
5195bJ16o2p7p2J21j93K25M9n0J21k20j07J04K1J32Nj84J15N5k4N5r3p0O0j67
5220a42N6n8j76L88m2k26J92l2Rj6o9j39M52k63J96q7k4N8J33l19J00k5j9J38
5244H5k18m6J56j08K98k08oJ50m5k93K13l3q5K47j67J77j71J64n2ok03L02k24
5267g3J61j30L9r7J84j91N1J65j48K09o7j50J60j79J17P0l5m7m0R2j04p1K1n0
$$ plain form
5291 -113 1 130 -50 -14 -83 -11 128 -45 31 -323 204 132 119 -86 -80 -1 -36 -49 115 111 -98 32 -115 24
5315 24 31 -75 47 -38 -113 101 74 -47 -409 150 -97 -92 111 139 79 -29 -29 -114 146 -20 -20 -104 -52 53 -306 -132
5341 -132 143 -52 -57 145 35 -143 -58 -34 40 62 -97 130 -239 -70 176 -244 265 -123 -59 -133 35 -214 74
5364 74 14 155 -62 170 133 -41 13 56 74 -89 62 47 -106 -1 -160 143 197 -150 11 -46 74 -8 13 84
5388 84 -67 117 120 17 -23 53 -82 -55 59 -54 81 1 -317 -80 7 39 2 93 -79 -10 97 -60 82 -81
5412 -81 122 48 -164 -39 76 -32 -124 66 26 -50 159 -10 71 -178 5 173 138 35 88 -245 57 30 -128
5435 -128 -4 11 -83 -38 -65 -233 27 137 12 136 -17 -85 93 -110 33 111 -44 21 114 42 -73 -34 -134
5458 -134 73 10 -42 186 -252 -12 -45 -76 137 43 179 -95 -62 21 10 -164 145 120 -162 44 -46 -21 -86 -240
$$ packed form
5291a13J14J29j80L6o9P2J39j73P6l54N27p2j3k05OP9l5j3J64mk09J30j47J39
5315B4Pj06J22q5p5K14k7j21l62N59k47NK03K8o0j08%q5K60j66%q4N2J05l59J74
5341a32K75j95nK02j10j78Q5K4P4K2j59K27l69J69K46m20N09l88O4p4J68k49K88
5364G4o0J41k17K32l7j74N4M3J8j63J51j5j53J05j59L03N4l47J61n7J20q2K1P1
5388H4j51J84Lj03m0P6j35K7J14j13J35q0l18K37Q7L2l7R1j72O9J07j57J42j63
5412h1K03p4k12J25J15j08r2J90m0p6K09j69Q1k49J83J68l5j03N3l33L02k7j58
5435a28J24J5r4M5k7j68K60J10j25J24j53o8J78k03J43P8j55O5R3p2j15L9j00
5458a34K07o3n2K28m38K40l3l1K13r4J36k74L3Q3j1j74L09k5k82K06r0K5o5j54
$$ plain form
5482 -240 -46 92 106 -100 -74 -111 55 92 19 36 -59 3 84 0 -162 102 -127 -41 24 68 -22 28 47 31 -74 -56
5508 -56 57 22 -21 129 -110 12 -123 40 -45 -101 240 135 -24 -68 28 -64 89 39 101 211 115 -213 -36 144
5532 144 26 17 -8 9 61 -48 168 109 62 -1 41 27 53 -35 128 98 -88 71 73 191 -162 -111 26 60 56 -213
5558 -213 -117 -217 -25 -43 -25 125 -94 23 80 -93 -77 132 2 68 14 202 -1 64 -98 -222 199 298 -50
5581 -50 -23 -138 -141 -44 220 -49 187 -75 -22 -70 16 93 -196 117 -106 52 185 196 25 -29 -268 -3 228 -164
5605 -164 -3 83 51 120 -107 -35 -17 -47 44 106 87 -53 186 10 -153 45 -78 -50 13 7 128 -92 175 131 -59
5630 -59 -126 -287 -166 34 126 -120 -24 -167 61 191 -15 -103 25 71 129 -2 29 68 9 47 79 30 39 -81 151
5655 151 -62 173 -160 -111 152 -262 -170 -291 0 26 53 -15 -4 -121 -11 140 -132 63 224 -36 214 67
$$ packed form
5482b40J94J38J4k06K6l7J66L7p3J7r5O2Q1q4j62K64k29Q6O5M4r0N0J9j6j05J8
5508e6J13l5m3J50k39J22j35J63q5n6L41j05j59m4R6r2J53n0O2J10r6l28J77J80
5532A44j18rk5J7N2j09K16n9m7o3M2j4K6q8J63l0j86J59KJ18l53N1J37L4mk69
5558b13R6j00J92j8J8J50k19J17N7j73J6K09j30O6n4J88k03O5j62j24M21R9l48
5581e0K7j15lR7K64k69K36k62N3m8Q6P7k89L13k23J58J33J1j71n4k39K65K31l92
5605a64J61Q6l2O9k27P2J8l0R1O2j9j40K39j76j63J98j23K8O3oJ21k20K67m4j90
5630e9o7j61J21K00R2k46R6j43K28J30k06q8J28M6N8j31L1L9n9L8L2m9Rj20K32
5655A51k13K35l33M9K63m14R2j21K91K6K7o8J1j17J10J51k72J95J61k60K50j47
$$ plain form
5677 67 -77 -5 131 -73 79 130 -9 122 55 81 218 -80 227 -16 150 74 69 -145 15 93 -66 67 124
5700 124 39 17 -102 233 204 12 67 -61 -80 -69 -163 -16 90 -43 -64 -5 -31 94 7 -18 96 34 -112 27
5724 27 121 -43 70 -100 99 157 20 -166 72 37 54 -19 219 139 62 46 -6 59 50 -5 134 -27 3 8 228 69
5750 69 -231 -64 -33 -98 -55 38 51 102 -231 -90 -112 -78 -69 -125 53 93 -271 130 183 235 -280 -115 147 -38 59
5775 59 25 97 -64 -59 -32 -130 73 77 3 -210 29 329 95 75 -73 -196 -98 57 -86 78 -143 76 32 -27 21
5800 21 23 -170 -82 -142 -58 -119 -74 -66 84 -68 -123 -43 17 51 -102 -88 -25 -116 10 96 -8 69 -264 147 197 92 -98
5827 -98 -16 -74 -223 -18 -9 124 -66 30 110 13 95 -183 -114 79 1 -16 -219 -181 39 15 94 -139 15 178 234
5852 234 32 -30 94 52 116 83 25 -37 86 -58 90 -51 332 203 48 179 280 -26 -117 -18 97 -173 -93
$$ packed form
5677F7j44P2J36k04J52N1j39J31o7K6J37k98L07k43J66p6nk14J60P8j59J33N7
5700A24q5k2j19L35k9j92N5j28j9J1r4J47J06j33k1N9k6J25q7k5J14o2j46J39
5724B7R4j64J13j70J99N8j37j86K38l5J7p3K38q0p7j6n2O5rn5J39j61L0NK20j59
5750F9l00J67L1o5M3R3J3N1l33J41k2L4Rn6J78M0l64M01N3N2n15J65K62j85R7
5775E9l4P2j61NK7r8K03Mp4k13K39L00k34k0j48j23R8J55j43J64k21K19m4n9M8
5800B1Kj93Q8o0Q4o1M5QJ50j52n5Q0O0L4j53J4O3r1J26Q6j04P7l33M11N0j05j90
5827i8Q2n8j49K05RJ33j90R6Q0r7Q2k78O9J93p8j7k03L8K20k4P9k33J54J63N6
5852B34k02o2J24m2O4l3n8o2J23j44J48j41L83j29j55J31J01l06r1R9J15k70Q0
$$ plain form
5875 -93 28 51 -103 -14 -31 -30 49 41 158 85 210 -70 100 -142 -160 62 -211 -7 56 138 -113 -72 -11 55 -117
5900 -117 -32 1 -198 59 203 -9 -57 136 70 -30 -386 -52 -85 -64 -99 -123 110 -52 54 131 160 -27 117
5923 117 -44 14 -70 59 -6 -24 -180 51 -197 -60 69 1 187 105 -16 57 -43 28 38 30 199 25 105 66
5947 66 240 7 166 14 81 12 86 24 131 275 13 -223 67 60 -12 -71 -109 -126 2 -23 37 -19 -94 1 83 52
5973 52 -2 4 56 113 234 43 -124 47 -107 82 -86 97 8 -46 111 175 -110 75 -92 144 -55 -47 21 -130
5997 -130 -28 74 -64 0 -4 31 132 -63 59 256 11 -92 55 -41 171 -17 -208 -280 185 1 393 -42
6019 -42 162 197 -139 2 90 48 -161 -41 23 -73 -149 76 -78 145 54 61 24 -180 -77 -205 -84 -130 52 244
6043 244 174 55 -96 130 -215 -260 20 9 -61 -221 -2 25 215 -52 -105 32 -48 108 59 62 201 -5 -127
$$ packed form
5875i3J21K3j54Q9j7JP9qJ17p3J25k80J70k42j8K22k73K04O3Q2k51M1O1O6j72
5900a17Q5L3j99K57J44k12m8J93o6j00l56L34l3K1l5k4K33j62J06P7K9j87J44
5923A17j61N8q4J29o5j8j56K31k48J37J29o8J86q2j21P3j00P1J0qJ69j74Q0l9
5947F6J74k33J59j52O7o9P4o2J07J44k62k36K90pp2n9l8j7J28k5O0n6p5R5Q2l1
5973E2n4ON2N7J21j91j67J71j54J89j68J83q9n4J57O4k85J85j67K36j99QO8j51
5997a30J02J02j38O4mL5J01j95J22J97k45j03J47r6K12j88j91p2M65j84L92m35
6019d2K04L5l36J41Q8m2k09J20O4r6p6K25j54K23r1Pl7k04J03j28J21m6J82J92
6043B44p0j19j51K26l45m5K80j1p0j60K19K7J90k67n3J37q0J56m9LJ39k06j22
$$ plain form
6066 -127 121 5 79 21 140 89 -244 111 145 -256 106 -60 -99 30 -189 -7 58 33 -161 -90 -174 50 -79
6089 -79 51 48 123 25 -105 -128 -148 -54 87 -79 -207 -20 -90 -178 178 39 -94 23 -125 -71 -15 107 -12 -55
6113 -55 -24 -101 -103 -322 -139 -13 48 56 182 -26 -104 -237 -299 157 -29 -133 -49 89 -102 -141 -13 138 18 2
6137 2 303 55 -189 -22 8 -59 -43 -86 -38 -25 -49 98 99 -118 -55 -103 32 209 -66 109 118 23 43 80 -30 192
6163 192 79 371 -48 -34 147 -199 5 43 199 -72 128 63 -106 -179 -102 -22 -173 -41 -26 -97 3 -72 201
6186 201 -199 -303 -16 45 161 -77 -31 131 49 274 -53 -44 -4 52 67 -113 18 116 -104 113 -52 -69 -47 51
6210 51 -62 33 -3 -80 -111 22 88 -179 256 200 -73 93 -87 156 114 147 165 163 -88 -112 -75 -131 24 164 -148
6235 -148 -2 165 55 -52 -35 179 -5 65 220 -160 55 40 -84 76 57 -164 -107 -172 15 156 -189 -239
$$ packed form
6066a27K48j16P4n8J19n1l33L55L4m01L62j66l9J29k19J82O5k5j94P1q4K24j29
6089g9J30lP5r8j30k3k0R4J41j66j28J87p0q8L56j39j33J17j48N4N6J22j19m3
6113e5L1p7kk19J83J26O1QJ26k08p8j33o2M56j86j04Q4J38j91l9J28J51j20j6
6137BL01k48k44J67L0o7J6m3M8J3k4J47Jk17O3m8J35J77k75J75Rr5K0L7j10K22
6163A92j13K92m19J4J81l46K04L8J56k71K00o5j69p3P7Q0j51J32J5p1J00p5K73
6186B01m00j04K87O1J16k38M6J62q2K25l27RM0N6J5j80J31R8k20K17j65j7K2R8
6210E1j13R5l6p7l1J33O6k67M35n6k73J66j80K43m2L3J8kk51k4L7n6J55J40l12
6235a48J46J67j10j07J7K14j84P0J55l80K15j5j24J60j9k21N7o5J87J41l45n0
$$ plain form
6257 -239 -89 -92 284 57 173 283 80 168 107 -98 202 -264 214 158 -222 -86 -154 2 95 -35 168 171 38
6280 38 -218 -81 -42 -69 121 -2 67 -25 106 -127 -15 54 -37 -186 -27 19 -71 -122 -130 87 10 -113 -90 -36 4
6305 4 -30 0 -96 173 181 2 -79 -47 12 -22 74 -2 -258 -90 255 -85 152 20 -29 8 -74 -6 -79 44 -67 -3
6331 -3 -142 -202 38 25 -118 295 -151 9 247 -141 94 87 -177 -86 50 -44 14 116 -95 33 -296 208 -38
6354 -38 167 134 -15 147 149 -53 13 -47 -247 78 203 -46 103 61 -55 -139 10 150 66 66 -65 -37 71 -20
6378 -20 137 58 103 15 -247 -73 -46 -144 -3 -81 -4 -226 68 39 76 -48 126 49 154 -66 -245 26 20 123
6402 123 8 85 -142 131 0 -139 -28 -14 -52 97 71 -65 62 44 32 -39 12 -74 7 -12 38 -135 -80 -109 -47
6427 -47 48 33 46 2 24 -88 148 -3 77 108 -136 42 58 181 -341 150 -73 97 91 -340 -66 -92 -49 -21 -60
$$ packed form
6257b39J50lL76k27J16J10k03Q8o1k05L00m66M78n6l80J36o8J56R3j30K03Lj33
6280C8k56J37L9k7J90j23O9r2J31k33J12O9r1j49J59M6r0n1qK17p7j23K3N4M0
6305Dl4L0r6K69Qj79q1L2N9l4R6p6k56J68L45l40K37j32m9L7q2O8p3J23j11O4
6331cj39o0K40j3j43M13m46J60K38l88K35pk64R1J36r4N8J02k11J28l29N04k46
6354c8K05l3j49J62Kk02O6o0k00L25J25k49J49m2j16q4J49J40q4%j31K8J08r1
6378b0J57p9M5q8k62J74K7r8J41p8P7k22K94k9L7j24J74p7J05k20j79K71oJ03
6402A23j15P7k27K73j31j39J11J4l8J49k6j36J27j8j2p1N1q6Q1j9N0j73N5k9O2
6427d7R5j5J3m4K2j12K36j51Q0L1k44J78J6J23n22M91k23J70om31K74k6M3K8l9
$$ plain form
6452 -60 -65 166 36 7 -14 -193 143 44 -81 88 135 -51 -51 -11 97 37 -184 -104 121 228 68 144 -41 164
6476 164 -81 117 174 132 39 92 0 -49 188 -30 49 -50 -235 205 -45 -16 160 -24 -74 263 -78 -151 -150 -152 -73
6501 -73 139 104 207 -1 -143 72 171 -40 -160 -9 112 -200 216 39 42 22 30 -98 -6 -2 37 -26 -105 20 276
6526 276 58 -176 3 -73 -6 90 70 -35 309 -146 171 -192 -139 103 -106 -77 -36 201 -147 -49 63 110 99
6549 99 -132 14 16 91 -55 -30 50 -143 -74 55 -37 -197 11 131 -129 54 77 -64 -106 -7 -81 12 -16 -61 77
6574 77 -89 78 332 -117 79 -67 30 60 -8 166 14 -58 -52 243 -150 259 -78 -124 78 127 55 19 188 -68
6598 -68 -8 63 70 43 -114 73 1 162 304 -94 -129 189 28 -162 -29 -254 -77 -86 21 34 246 94 197 19
6622 19 -54 134 -3 18 -116 -18 153 -27 -12 124 -23 11 41 -66 -159 178 40 57 172 94 -224 166 15
$$ packed form
6452f0nK31j30k9k1j79L36r9j25J69M7j86%M0J08o0k21Q0K25J07j60P6j85K05
6476A64k45J98N7m2r3N3r2m9K37k18P9r9j85M40k50K9J76j84n0L37l41p3JkP9
6501g3K12l5J03k08j42K15R9k11j20J51J21l12M16j77Lk0Qj28R2ML9o3p9J25K56
6526B76k18k34J79p6O7R6k0j05L44m55L17l63N3K42k09K9M1K37l48R8J12M7j1
6549I9k31J46KP5j46K5Q0j93O9J29r2j60K08J20k60J83K3j41m2R9p4R3k8m5J38
6574G7j66J67K54m49J96j46R7L0o8J74j52p2OK95l93M09l37m6K02M9p2l6J69k56
6598f8O0P1Pk7j57J87p2J61J42l98l5L18j61j90J33k25J77rJ07J3K12j52J03j78
6622A9p3J88j37K1j34R8J71j80J5J36j47L4L0j07r3L37j38J7J15p8l18L90j51
$$ plain form
6645 15 42 20 113 5 46 -21 115 72 -108 64 -81 22 124 -49 -17 -10 -139 -79 -100 137 162 -9 181 -65
6669 -65 -223 115 13 -46 -165 -67 28 199 103 -107 43 70 82 99 -163 116 -163 -208 105 -55 -77 38 -109
6692 -109 38 148 -152 -217 52 -164 33 -12 -158 -104 -81 233 -94 -6 91 -30 -176 136 -62 146 123 50 -70
6715 -70 111 75 -50 18 244 -107 -30 -29 -122 -148 61 56 64 20 -150 22 121 131 -148 -54 130 99 20 -7 -106 112 164
6742 164 -106 28 -61 -121 17 -355 284 -3 109 -7 -19 -57 75 140 10 -30 -115 99 -16 19 75 17 -86
6765 -86 145 154 -40 54 -75 125 31 -22 -65 41 -148 187 63 129 -36 -135 -140 172 -9 34 63 91 -184 141 -229
6790 -229 -25 -70 44 25 -123 -29 -159 -179 74 294 -88 73 -10 -50 94 -91 112 -241 -294 106 -85 -84 37
6813 37 -38 -58 -107 69 -102 58 170 -180 -76 -15 126 37 -71 -55 145 -13 126 -11 -319 169 10 -56 -103
$$ packed form
6645A5K7k2R3j08M1o7J36m3j80J72j45J03J02j73L2Pj29O0k1K37K5j71J90k46
6669f5j58L38j02n9j19R8R5J71r6k10J50K7J2J7k62K79k79m5L13j60k2J15j47
6692a09J47J10l00o5K69k16J97m5j46N4K3L14l27Q8R7j21j46L12j98K08k3p3j20
6715g0J81l6j25O8K26l51P7Jr3k6K09nQm4j70J72R9J0k79R4J84l1p9k7r9K18N2
6742A64k70J34q9o0J38l72O39k87J12j16j2l8J32O5j30m0q5K14j15L5N6n8j03
6765h6K31Rj94R4j29K00r4n3m3J06j89L35j24O6j65r9nL12j81M3K9K8k75L25l70
6790b29K04m5J14j9j48R4j30k0K53K20l82J61q3m0J44j85K03l53n3M00j91JJ21
6813C7p5k0m9J76j71J60J12l50J04O1J41q9j08J6K00j58J39j37l08M88j59o6m7
$$ plain form
6836 -103 4 -87 50 76 -35 163 -345 61 178 61 213 43 204 -55 -41 114 94 88 -119 -9 -114 45
6858 45 49 -32 31 54 -51 -27 -4 79 91 -112 -206 -84 -53 62 200 -110 -119 -62 -135 305 -32 -98 -71 83 -16 -225
6884 -225 97 -36 -91 133 96 126 48 98 163 120 -97 -244 10 -245 -157 81 139 11 -91 43 -117 257 -35
6907 -35 -8 195 41 180 -131 -117 98 28 67 64 125 -78 -30 246 -129 -93 -15 132 -42 33 165 11 -137 161
6931 161 38 -138 0 101 143 41 -114 -370 -63 -84 -89 32 -104 -46 -117 127 91 -21 51 70 204 72 -19
6954 -19 -111 -53 -89 23 25 -25 228 80 -194 166 41 -34 20 -142 -151 -230 -60 -56 -87 135 115 -176 -79 -101 77 68 58
6981 58 117 119 9 -112 -47 40 -264 143 138 -68 55 -8 -144 -136 110 -83 165 181 29 -38 10 161 -13 -55 143
7006 143 62 -29 133 50 138 -70 -140 125 -12 -40 151 63 -139 9 10 10 95 -140 57 46 -133 -68 47 24 83
$$ packed form
6836a03J07r1J37K6j11J98n08M06J17j17J52j70J61k59J4J55k0ok07J10j05J59
6858D5Mq1O3K3j05K4K3Q3J2k03r4J22L1J15J38l10rN7p3M40l37o6K7J54r9k09
6884b25L22j33n5K24l7L0p8N0O5m3k17j47K54k55Q8K38N8j28j02J34j60L74k92
6907c5K7K03j54J39l11J4K15p0L9lO1k03M8K76l75L6P8J47j74P5J32j54j48K98
6931A61j23j76J38J01M2j02j55k56L07k1nJ21j36N8p1K44l6j12P2J9J34j32r1
6954a9r2N8l6J12Kn0K53j48k74L60j25p5N4j62rp9J70Ml1K22k0k91R7k2J78rj0
6981E8N9Kj10j21O5Q7l04M07nk06J23o3j36QK46j93K48J6j52o7M8J51j74m2J98
7006A43q1r1J62q3Q8k08p0K65j37k8J91q8k02J48J%Q5k35J97j1j79O5J15k3N9
$$ plain form
7031 83 -138 -95 152 -47 -59 86 -68 -218 28 -111 -5 -107 -119 -123 35 85 5 221 97 -126 -40 -41 158 -145
7055 -145 95 32 -149 -134 -176 72 -78 16 -209 279 165 130 113 -70 -81 -153 -29 171 -135 -178 -95 -53 -76 120
7079 120 -148 -97 78 -91 52 65 -118 65 26 -56 -30 51 -64 252 156 -17 -111 183 95 121 -35 -53 -95 141
7103 141 -52 -85 35 -18 30 -153 103 -162 81 34 -103 -124 30 -200 116 76 -34 -46 -15 -107 147 178 6
7126 6 -21 -27 -16 -118 99 141 27 43 37 -54 36 -164 119 -132 -38 10 39 -215 -230 214 -30 120 -31 170 103 -159
7152 -159 -96 96 173 66 198 30 -65 -85 -1 35 157 -317 46 3 -66 37 -58 73 -59 -109 173 52 -39 -75
7176 -75 -168 -146 127 229 8 111 -34 -91 58 -97 -122 -163 -3 -159 33 48 125 -40 9 107 -45 64 -20 -117
7200 -117 58 71 164 -189 108 119 -58 12 -111 164 -26 23 -47 14 -38 -127 57 -48 67 -119 70 -94 -58
$$ packed form
7031H3k21M3K47j99j2J45j54j50K46j39J06j02j2mJ58N0q0K16j24k23Q6jJ99l03
7055a45K40o3j81J5m2K48j50R4k25M88j14l5j7j83j1p2J24K00l06m3Q3M2k3J96
7079A20k68N1J75j69J43J3j83J83l9q2K6Q1j15L16r6j73r4K94q8K6j56j8m2K36
7103A41j93l3J20n3M8j83K56k65K43m7j37k1J54k30L16m0j10j2L1r2K54L1j72
7126Fk7oJ1j02K17M2j14J6or1R0k00K83k51R4M8K9k54j5M44k44J50j51K01o7k62
7152a59O3J92P7j07J32j68r5k0Q4L6J22m74L63m3o9J03r5J31j32n0K82j21r1l6
7176g5r3K2K73J02k21J03j45n7J49j55k5m1J60j56J92J5P7j65M9R8j52J09q4r7
7200a17J75J3R3l53K97J1j77P0j23K75j90M9p0O1n2q9J84j05J15j86J89j64L6
$$ plain form
7223 -58 121 -200 26 -115 -8 3 246 99 -108 186 -97 -81 -19 21 -21 -25 -184 140 -311 171 -179 -14 174
7246 174 175 -26 -8 -90 87 3 -48 47 146 192 -190 93 -66 -18 22 29 -39 17 65 193 -104 -89 60 -134 132 70
7272 70 -146 41 39 -60 15 -115 45 168 -30 -9 -31 273 -56 219 132 -132 -174 15 -60 66 203 123 -193 46
7296 46 93 -48 -141 1 -277 -128 -21 134 -29 22 -13 -20 -31 -9 203 95 3 -68 75 37 41 25 33 13 140 -142
7322 -142 -150 64 -203 -185 -79 38 -70 -34 2 -70 -66 -128 -15 96 -88 158 74 70 103 -4 -31 -31 188 -144 85
7347 85 -61 -79 130 120 -98 311 67 229 -100 20 21 -57 177 -128 4 -140 102 34 -8 20 -40 -63 -12 -61
7371 -61 197 177 -169 67 -28 -226 93 -57 16 31 104 86 75 22 -77 -88 8 -49 22 -124 -7 -245 -7 -19 268
7396 268 83 38 -238 6 99 19 -237 2 211 122 108 97 -51 -63 -191 -38 336 5 33 -44 40 2 -45 -105
$$ packed form
7223e8J79l21K26j41J07J1K43j47k07K94k83J6O2M0m2mj59L24m51M82l50J65J88
7246A74Jk01J8q2J77q4n1R5R9M6l82K83j59M8M0Po8N6M8J28k97J5J49j94K66o2
7272G0k16J87kr9P5j30J60J23j98K1k2L04l29K75q7k64m2J89p5J26J37q0l16K39
7296D6M7j41r3J42k78J49J07J55j63N1l5pj1K2K12j08r2p1J43l8Mj6Qk0J27k82
7322a42qK14k67J8J06J17j08L6L6p2Mo2J13J11j84K46q4mL3j07k7%K19l32K29
7347H5j46j8K09j0k18M09k44J62l29J20Jp8K34l05J32j44K42o8m2K8o0k3N1m9
7371f1K58k0l46K36r5j98L19j50P3J5P3j8j1n3r9j1R6n7P1j46J17k38K38j2K87
7396B68j85m5k76K44R3q0k56K39K09q9j4j1j48j2j28J53L74l31K8p7Q4l8m7o0
$$ plain form
7420 -105 -164 -50 113 127 108 -86 72 -34 136 -18 147 -6 60 -128 246 -15 -37 -168 42 -109 167 67
7442 67 -28 103 -175 104 171 95 133 224 -105 80 -51 -99 66 182 11 81 -136 -117 170 -9 142 -101 17
7465 17 81 -107 -50 -18 1 -119 -73 -243 -117 1 88 -33 89 161 -39 299 82 -128 114 -64 -41 -44 -47 -99 -129
7490 -129 -241 -47 37 121 -189 43 -34 60 -161 84 84 -177 325 -100 9 -7 125 43 -5 36 -13 52 19 -10 -157
7515 -157 89 -11 -180 25 -111 -120 59 92 37 -137 -10 62 119 -35 -146 -93 -222 -106 66 102 164 55 361
7538 361 93 77 -175 -16 59 106 28 30 116 -7 -219 69 89 -117 -50 11 -247 57 -27 195 98 18 -171 -223 -204
7563 -204 191 121 22 97 -19 -20 11 -161 -2 -110 -168 -124 52 -245 -100 -9 -83 52 -84 -131 212 -90 219 78
7587 78 26 -61 226 116 -296 94 -154 30 -13 42 228 28 0 -114 81 -123 -7 -128 13 -43 197 235 -140
$$ packed form
7420a05n9J14J63J4j9j94J58j06J70j54J65j53O6j88L74k61k2j31K10j51K76j00
7442F7r5J31k78K79O7p6L8R1l29J85j31m8J65J16j71P0k17J9K87j79J51k43J18
7465A7O4j88N7L2J9j20M6j70J26J18Q7j21J22P2k00L38k17k10K42j78K3lln2l0
7490a29j12J94Q4Q4l10K32p7R4k21K45%k61N02m25J09j6J32q2m8M1m9O5l3k9j47
7515a57K46j00j69K05j36rJ79L3n5j74J27P2N7j54j11N3j29J16J72L6O2j09L06
7538C61k68j6k52J59P5M7p8KQ6j23k12K88K0k06O7O1k58L04q4K22r7q0j89n2J9
7563b04L95p0r9P5j16jL1j72J59j08n8M4J76k97J45R1p4J35j36m7L43l02L09j41
7587G8n2q7K87j10m12L90k48J84m3N5J86k00k8j14J95k04J16j21J41n6K40L8l75
$$ plain form
7610 -140 -19 -99 35 -101 -162 -81 19 -87 -128 193 164 -144 -66 -55 107 115 -60 81 -73 170 -105 157 1
7633 1 -14 -120 321 115 -135 9 132 -31 -171 -126 118 -45 -26 -19 132 43 149 183 -64 -135 151 -149 -127 -81
7657 -81 0 54 -102 -37 209 -44 -12 -34 -22 27 -18 -116 76 -1 -43 33 14 -129 207 47 12 132 -80 -3 -210
7682 -210 -125 133 155 27 -183 -20 -221 -11 52 -17 150 -56 50 68 52 -116 23 -8 162 -87 231 -3
7704 -3 130 -21 -71 -302 101 121 -213 118 38 98 15 -1 37 -50 142 -257 84 52 39 54 -252 177 57 -56
7728 -56 -191 105 105 83 -109 -140 78 -7 -59 21 -331 82 -173 -109 206 227 -36 -56 104 62 -37 146 -149 -60 -55
7753 -55 -35 -116 -115 -11 -125 266 -113 -206 18 -92 -35 114 -172 177 -67 -131 -79 129 37 120 6 -123 -123 101
7777 101 -105 123 -2 47 -38 -215 77 100 -59 106 -129 -30 34 -88 1 -22 -40 -57 -32 -138 228 95 -160
$$ packed form
7610a40J21q0J34j36o1Q1J00j06m1L21k9l08P8J1J62Qj75J41j54K43k75K62j56
7633Aj5j06M41k06k50J44J23j63j40M5K44j63J9PJ51q9J06L4k47p1K86l00K2M6
7657h1Q1N4j56O5K46k53L2k2J2M9m5r8J92p7m2P6j9j43L36j60l5J20k12P7k07
7682b10Q5K58K2j28k10J63k01K10O3o9J67k06J06J8j6j68J39l1J70k49L18k34
7704cJ33j51n0k31M03K0l34L31q0O0q3j6L8q7J92l99L41l2j3J5l06M29j20j13
7728e6j35K96%k2j92l1K18q5n2Q0l52M13k55O4L15K1k63k0J60m2r9J83k95Q9N
7753e5K0q1JJ04j14L91l79r3K24j10N7J49k86L49k44o4N2K08r2Q3j14j29%K24
7777A01k06K28j25M9q5j77K92K3j59J65k35R9O4j22Q9k3j8j7K5j06L66j33k55
$$ plain form
7800 -160 -26 39 13 52 122 19 33 40 170 -219 -150 71 144 -35 -144 -72 -179 -279 70 -181 -7 -55 -143 -93
7824 -93 111 25 124 8 -148 55 -66 -40 290 83 -83 -33 5 20 -124 39 11 0 106 -86 -100 -177 -127 -34
7848 -34 64 20 -55 174 -116 34 3 -71 -25 -124 -17 37 61 -168 -109 35 -113 124 30 181 -177 -35 71 42
7872 42 -23 109 -147 -225 9 -123 -47 -120 183 -316 -27 -151 -107 44 272 273 131 -140 74 -140 -107 -36 -171
7895 -171 -177 -9 121 -66 -157 -65 180 -123 -138 -191 -161 56 -197 55 189 -93 -140 -38 -34 61 52 80 116 -30 -232
7920 -232 89 79 -87 210 26 133 -58 -67 222 95 75 55 17 39 43 12 -35 86 -34 -65 -172 -102 -104 64 -346
7945 -346 -25 324 -27 231 0 -61 -49 57 103 123 133 122 41 119 72 25 16 -28 -98 70 163 43 50 -24 -131 -12
7971 -12 185 266 -5 -20 29 -201 36 53 70 60 -29 -20 130 28 6 135 245 6 -187 23 7 42 145 -167
$$ packed form
7800a60J34O5k6L9P0j03J4PJ30l89O9K21P3j79j09P2j07j00L49k51J74m8q8N0
7824i3K04q6R9j16j56K03j21K6L30k07j66N0L8J5j44J63k8j1J06j92j4p7N0R3
7848c4R8m4p5K29k90J50l1p4M6r9J07N4K4k29N9J44j48K37r4J51l58J42J06k9
7872D2o5J32k56p8K34j32P6p3L03m99K89j24M4J51K28Jj42k71K14k14L3P1j35
7895a71oJ68J30j87r1R2K45l03j5n3L0K17k53K52J34k82m7J02MR5rK8L6j46k02
7920b32L21j0j66K97j84J07j91rK89j27k0k0l8K2Ml1m7J21j20l1j07P0kJ68m10
7945c46L21L49l51K58k31o1J2J06M6K0J0j1q1P8m7m7rm4p0J68R3j20Pp4j07J19
7971a2J97Q1k71j5M9k30K37J7J7j0q9RJ50j02k2J29J10k39j93K10j6L5J03l12
$$ plain form
7995 -167 155 110 65 50 53 14 45 -109 -58 112 224 -188 -167 206 -129 100 22 -11 -115 27 -140 -68 29 -242
8019 -242 -14 -91 -231 -22 38 146 133 -74 37 -54 -283 -157 -11 -9 -70 -167 23 42 -94 -18 -242 -60 129
8042 129 -201 -209 -23 47 84 -270 33 -21 -25 -63 92 -30 59 -32 -90 133 82 63 -112 -186 -33 13 115 -123 -127 93
8068 93 168 26 -54 80 -39 -114 281 78 78 243 62 187 81 -16 52 126 -118 72 -3 -184 32 -112 89
8091 89 112 -158 10 -103 -157 -47 213 -318 134 -72 -45 -93 -106 -41 81 17 25 -229 8 127 11 -12 -101 61
8115 61 109 -111 -174 100 -74 -2 232 -96 -10 53 -155 -118 -28 -210 -18 156 -38 86 -34 -146 151 -26 37
8138 37 6 29 62 -15 53 -153 179 -63 60 25 -80 83 102 -42 134 -7 -88 93 89 -87 -110 124 19 -133
8162 -133 -124 157 -309 -67 242 28 166 253 -13 -103 -147 -36 86 -30 1 -29 179 -30 -68 165 169 -303 -145
$$ packed form
7995a67L22m5m5j5Ll9L1j54N1J70J12m12K1L73l35K29p8l3j04J42j67P2R7k71
8019b42K28p7j40K09O0J08j3k07J11r1k29J26J46Ko1r7J90J9j36P6k24J82J89
8042A29l30qJ86P0L7l54L03n4ml8J55j22Q9r1n8K23n1j9j75p4J53M6J02k38mK20
8068I3P5j42q0J34j19p5L95k03%J65j81J25j06r7O8P4k44J90p5j81K16j44K01
8091H9K3k70J68j13n4J10K60n31M52k06K7m8j3O5J22o4Qk54K37J19j16k3q9J62
8115F1M8k20o3K74j74P2K34l28Q6O3k08L7R0j82J92J74j94J24j20j12K97j77O3
8138C7l1K3L3p7O8k06L32k42J23l5j05J63J9j44J76j41q1J81mj76k3K34j05j52
8162a33RK81m66K42L09k14J38Q7k66r0m4J11J22j16L1l0K08k09l8K33Mm72J58
$$ plain form
8185 -145 -318 128 80 -139 5 117
$$ packed form
8185a45j73M46m8k19J44J12
8191A17
$$ Imaginary data points
##PAGE= N=2
##DATA TABLE= (X++(I..I)), XYDATA
$$ plain form
0 0 0 0 0 0 0 0 0 0 8 -8 8 -8 16 -16 24 -24 32 -40 48 -59 72 -88 104 -120 144 -168 193 -225 258 -297 340
31 340 -388 440 -500 565 -637 714 -800 895 -998 1113 -1236 1370 -1516 1678 -1854 2047
47 2047 -2256 2487 -2740 3018 -3327 3664 -4044 4468 -4943 5485 -6106 6828 -7677 8693
61 8693 -9934 11491 -13512 16250 -20180 26326 -37359 63221 -252953 56695 404574 -356396
73 -356396 -165612 275078 -41741 -243100 210443 154609 -196957 38082 297748 -129041
83 -129041 -183768 249019 128923 -227653 -54519 93563 -20417 -71005 -8083 -13073 -80516
94 -80516 -6329 122426 -51787 -108713 151811 87448 -148769 44269 180782 -61352 -109705
105 -109705 113804 41523 -151640 43192 117915 -196077 -71873 219832 -89346 -185379
$$ packed form
0@%%%%%%%%Qj6J6j6K4l2M0m8N6p2Q8j07J31j60J92k24K64l12L61m18M83n55O37
31C40p28Q28r40J065j202J351j514J695j893K111k349K606k886L194l532L901
47B047m303M743n227N758o345O991p708Q512r411J0428j1591J2934j4505J6370
61H693j8627K1425k5003K9762l6430M6506o3685J00580l16174L09648L47879p60970
73c56396J90784M40690l16819k01359M53543n5834l51566K35039K59666m26789
83a29041n4727M32787j20096l56576J73134J48082j13980n0588O2922m990o7443
94h0516P4187J28755j74213n6926K60524o4363k36217J93038J36513k42134m8353
105a09705K23509p2281j93163J94832P4723l13992J24204K91705l09178r6033
$$ plain form
115 -185379 183163 50754 -195030 79028 157737 -113844 -60486 138195 -3599 -108229
125 -108229 85386 52421 -140265 27784 112850 -113646 -46819 113373 -29227 -66784 42165
136 42165 20182 -15446 -2688 7171 -3425 -22380 31199 26459 -72340 -14499 78600 -5335
148 -5335 -63658 12500 64307 -8329 -50091 54166 33147 -71663 50468 58532 -118610 8643
160 8643 120220 -90929 -87915 95133 9181 -93055 23007 53758 -64115 -12321 100509
171 100509 -37770 -79354 115254 37132 -114276 46852 73814 -74975 -10413 48232 -36862
182 -36862 -34588 25745 8335 -48267 -16223 52917 -10813 -47231 40273 26915 -25687 13851
194 13851 23827 4723 -5703 2282 33566 -19206 -38277 51498 -2590 -71956 34249 24515
$$ packed form
115a85379L68542j32409k45784K74058P8709k71581N3358J98681j41794j04630
125a08229J93615l2965j92686J68049Q5066k26496O6827J60192j42600l7557J08949
136D2165k1983l5628J2758R859j0596j8955N3579m740r8799N7841R3099q3935
148e335n8323P6158N1807p2636m1762J04257k1019j04810J22131Q064j77142J27253
160H643J11577k11149L014J83048q5952j02236J16062L0751j17873N1794J12830
171A00509j38279m1584J94608p8122j51408J61128K6962j48789O4562N8645q5094
182c6862K274O0333j7410n6602L2044O9140o3730l6418Q7504j3358n2602L9538
194A3851R976j9104j0426P985L1284n2772j9071Q9775n4088o9366J06205r734
$$ plain form
206 24515 -65078 5018 38117 -33817 -22743 39612 14564 -43569 16732 58868 -40253 -17302
218 -17302 72130 -24315 -41420 60625 -7265 -52501 30554 11247 -39929 -7604 16736 -7541
230 -7541 -28555 11641 21774 -31578 5374 39822 -22259 -2637 36912 -7449 -3797 12942
242 12942 -535 5159 -13654 -5226 16386 -28719 -13743 25703 -24938 -18708 26023 -5096 -13997
255 -13997 12378 15760 432 -10638 24525 18063 -33389 16505 30863 -44015 -2033 33019
267 33019 -35584 -16164 24053 -13854 -18399 7999 11664 -7993 -11105 26958 7425 -25577 26524
280 26524 16908 -30291 14809 15305 -24912 2280 5574 -9867 -3335 -7721 6816 1378 -17107
293 -17107 16097 8740 -18913 16033 10822 -13767 8208 4216 -3286 -512 -8492 9320 -3377
$$ packed form
206B4515q9593P0096L3099p1934J1074O2355k5048n8133O0301M2136r9121K2951
218a7302Q9432r6445j7105J02045o7890m5236Q3055j9307n1176L2325K4340k4277
230g541k1014M0196J0133n3352L6952L4448o2081J9622L9549m4361L652J6739
242A2942j3477N694j8813Q428K1612m5105J4976L9446n0641O230M4731l1119q901
255a3997K6375L382j5328j1070L5163o462n1452M9894J4358p4878M1982L5052
267C3019o8603J9420M0217l7907m545K6398L665j9657l112L8063j9533l3002N2101
280B6524r616m7199M5100M96m0217K7192L294j5441O532m386J4537n438j8485
293a7107L3204p357k7653L4946n211k4589K1975l992p502K774p980J7812j2697
$$ plain form
306 -3377 -20531 18690 921 -25481 21045 7254 -22069 14760 10149 -11170 2108 4949 3906
319 3906 -9232 -6323 16522 -13983 -15548 24491 -10972 -18605 25898 -3086 -14126 18149 3531
332 3531 -3365 4174 2408 7412 -8797 -4207 13579 -16177 -9108 16420 -16043 -9222 14093 -7908
346 -7908 -1963 6556 -465 10058 -2874 -1095 18220 -9870 -4769 17229 -14382 -8570 12301
359 12301 -11894 -8940 2599 -1942 -38 -8652 5178 14392 -13841 6984 21169 -16498 5670
372 5670 20976 -17928 -1889 13798 -10923 -7328 -1570 -1467 -2656 -12047 6122 4578 -15219 13861
386 13861 10404 -16114 14671 13061 -11518 7870 5127 -4010 2686 -8034 789 1217 -16302 4865
400 4865 2667 -17762 7546 5670 -11298 6789 5445 -729 3314 -801 10381 -456 -12922
$$ packed form
306c377j7154L9221j7769k6402M6526j3791k9323L6829m611k1319J3278K841j043
319C906j3138K909K2845l0505j565M0039l5463p633M4503k8984j1040L2275j4618
332C531o896P539j766N004j6209M590J7786k9756P069K5528l2463O821K3315k2001
346g908N945Q519p021J0523j2932J779J9315k8090N101K1998l1611N812K0871
359A2301k4195K954J1539m541J904q614J3830R214k8233K0825J4185l7667K2168
372E670J5306l8904J6039J5687k4721L595N758J03j189r391J8169j544j9797K9080
386A3861l457k6518L0785j610k4579J9388k743r137O696j0720Q823M28j7519K1167
400D865k198k0429K5308j876j6968J8087j344o174M043m115J1182j0837j2466
$$ plain form
413 -12922 16264 25 -21217 13736 824 -19794 11139 2221 -15101 5433 7312 -1286 -5151
426 -5151 2376 15587 -6689 -6681 18451 -7106 -7721 18409 -10992 -11612 16294 -3610 -9157 1202
440 1202 -1113 6597 -4572 -7593 11341 -3151 -3978 10887 -8783 -3784 13452 -3841 -5809 -767
454 -767 2255 7999 -11766 -5216 16327 -10208 -4695 16794 -14133 -5231 21559 -8273 -12279 10610
468 10610 4125 -5069 -5012 5444 2500 -11536 9599 6497 -21520 10417 16269 -20708 2065 13993
482 13993 -10708 2336 6023 -5654 1199 519 3543 275 -10575 7589 6288 -12131 3634
495 3634 2878 -6264 6390 -2126 -3637 4450 -5071 7221 3637 -16894 11347 12456 -18167 3732
509 3732 10149 -12049 2632 7210 -9071 -6034 6125 7029 -13128 -8624 19784 -4382 -15704
$$ packed form
413a2922K9186j6239k1242L4953j2912k0618L0933q918j7322K0534J879q598l865
426e151P527J3211k2276QK5132k5557o15K6130k9401o20K7906j9904n547J0359
440A202k315P710j1169l021J8934j4492q27J4865j9670M999J7236j7293j968N042
454g67L022N744j9765O550K1543k6535N513K1489l0927Q902K6790k9832m006K2889
468A0610o485r194N7J0456k944j4036K1135l102k8017L1937N852l6977K2773J1928
482A3993k4701J3044L687j1677O853o80L024l268j0850J8164j301j8419J5765
495C634p56r142J2654q516j511Q087r521J2292l584k0531K8241J109l0623K1899
509C732O417k2198J4681M578j6281L037J2159R04k0157M504K8408k4166j1322
$$ plain form
522 -15704 18503 -2123 -13914 21789 1464 -17785 12921 9232 -7751 -2537 1284 3451 -4308
535 -4308 -3573 3949 -9974 -946 12131 -11870 -5433 11618 -3230 1671 2954 -6194 10735 3301
549 3301 -8628 8927 -2970 -6709 12353 -5934 -13723 7386 3204 -7134 -5441 3192 6010
562 6010 -7956 3174 11095 -14294 5196 21934 -18142 -6310 22076 -8364 -9573 9728 -5188
575 -5188 -6204 4647 372 -7165 -5033 10919 2219 -14289 8480 8944 -9919 8341 3670 -10782
589 -10782 10300 3323 -9973 3704 -1728 -1572 5361 -9087 -1857 7896 -4288 -579 2477 -1689
603 -1689 3598 120 1596 440 -6906 9030 2660 -17067 8491 6983 -17207 6698 6567 -15251
617 -15251 5701 9518 -8942 -836 7454 3289 -4345 -769 9141 -5901 -4955 12615 -9174 -10218
$$ packed form
522a5704L4207k0626j1791L5703k0325j9249L0706l689j6983N214L821K167p759
535d308P35P522j3923R028J3077k4001O437J7051j4848M901J283r148J6929p434
549C301j1929J7555j1897l739J9062j8287p789K1109m182j0338J693Q633K818
562F010j3966J1130P921k5389J9490J6738m0076J1832K8386l0440j209J9301j4916
575e188j016J0851m275p537K132J5952q700j6508K2769M64j8863J8260m671j4452
589a0782K1082o977j3296J3677n432J56O933j4448P230R753j2184L709L056m166
603a689N287l478J476j156p346J5936o370j9727K5558j508k4190K3905j31k1818
617a5251K0952L817j8460Q106Q290m165p634L576R910j5042R46J7570k1789j044
$$ plain form
631 -10218 15006 -5870 -10763 10372 -3217 -3881 7697 -3240 201 4793 -926 3664 -1396 -1588
645 -1588 5914 -2931 -1982 936 -5143 3845 -1768 -8926 7714 -1808 -7936 11604 -3354 -8444 14470
660 14470 -172 -9069 8992 2296 -4191 1387 1280 -240 -5391 1971 4275 -12131 1611 10615
674 10615 -12803 -357 11188 -10048 1050 9545 -7712 1464 6039 -3265 1064 -289 -23 2432
688 2432 -3961 1712 1017 -5273 5089 -1285 -5770 7580 -3358 -4207 8985 -6028 -3094 10173
702 10173 -6595 -2601 8244 -4985 -1440 4401 -2225 -39 -293 1932 1158 -5977 4807 3076
716 3076 -9918 6177 3622 -11108 6621 3090 -9989 5776 2205 -6237 4356 7 -1646
729 -1646 2831 -1668 2140 162 -2144 5238 -3201 -2636 6719 -5877 -1532 6770 -8185 172 6571
$$ packed form
631a0218K5224k0876m893K1135j3589o64J1578j0937L441M592n719M590n060j92
645a588P502q845R49K918o079Q988n613p158J6640r522o128J9540j4958n090K2914
660A4470j4642q897J8061o696o487N578j07j520n151P362K304j6406J3742R004
674A0615k3418J2446J1545k1236J1098Q495j7257R176M575r304M329j353K66K455
688B432o393N673o95o290J0362o374m485J3350j0938q49J3192j5013K934J3267
702A0173j6768L994J0845j3229L545N841o626K186k54K225p74p135J0784j731
716C076j2994J6095k555j4730J7729l531j3079J5765l571q442J0593m349j653
729a646M477m499L808j978k306P382q439N65R355j2596M345Q302j4955Q357O399
$$ plain form
744 6571 -8506 1716 5587 -6760 2396 3480 -3567 2466 219 326 1654 -3089 4218 -31 -6191
759 -6191 6795 -1267 -7664 7931 -2275 -6755 7867 -2769 -4414 6342 -2604 -1153 3402 -1910
773 -1910 2165 377 -1502 4401 -2994 2 4799 -6036 1823 4413 -7843 3230 3284 -8044 4278
788 4278 1402 -6894 4862 34 -3902 4062 -1059 -114 2236 -2235 3492 -391 -2751 6177 -3369
803 -3369 -3082 7518 -5507 -2814 7248 -6338 -1799 5591 -5575 159 3057 -3489 2272 9
817 9 -681 3260 -3184 2165 3846 -5483 3813 2293 -6968 4519 509 -6833 5329 -1106 -5172 4836
833 4836 -2271 -2134 3799 -3013 1359 2137 -2550 4008 -529 -1777 5448 -3427 -1007 5163 -5844
848 -5844 640 4062 -7082 2121 2874 -6792 3194 1272 -4489 3725 -542 -1560 2982 -1733 2124
$$ packed form
744F571j5077J0222L871j2347R156J084p047O033k247J07J328m743P307m249o160
759f191J2986q062o397J5595j0206m480J4622j0636j645J0756q946J451M555n312
773a910M075j788j879N903p395K996M797j0835P859K590j2256J1073N4j1328J2322
788D278k876q296J1756m828l936P964n121R45K350m471N727l883k360Q928r546
803c369K87J0600j3025K693J0062j3586M539P390j1166N734K898o546N761k263
817Io90L941o444N349J681r329R296j520r261J1487m010p342J2162o435m066J0008
833D836p107J37N933o812M372P78m687O558m537j248P225q875K420O170j1007
848e844O484L422j1144R203P53r666R986j922n761Q214m267j018M542m715L857
$$ plain form
863 2124 1177 -3663 5263 -842 -4496 6939 -2580 -4477 7484 -3747 -4024 5805 -3239 -1836 3026
878 3026 -3012 1091 362 -1628 3211 -2938 -2 5178 -5195 775 5223 -5413 1922 3194 -5654
893 -5654 3456 1012 -4551 3641 -1697 -2551 4228 -3904 -998 3850 -3508 1073 1551 -2685 3659 -940
909 -940 -1088 4678 -4129 941 5843 -6888 921 5842 -7060 569 3611 -5652 1139 1772 -2324
924 -2324 413 -1667 2907 1453 -4791 5008 2276 -6052 6448 1238 -6808 6070 885 -5266 3231
939 3231 -1192 -1458 2011 -4018 996 978 -3779 3451 -462 -3917 5245 -406 -2034 3152 -2114 2286
955 2286 2259 -5332 4027 1721 -5929 5228 -505 -6829 5865 284 -5358 2473 712 -339 -48
970 -48 -1025 3511 -1919 -1302 6866 -4774 -2951 9683 -4263 -4668 7186 -3054 -2523 3716 -3061
$$ packed form
863B124r47m840Q926o105l654J1435r519j897J1961j1231k77R829r044J403M862
878C026o038M103p29j990M839o149K936N180j0373N970M448j0636P335J272q848
893e654R110k444n563Q192n338q54O779q132K906M848p358M581M78m236O344m599
909i40j48N766q807N070M902j2731P809M921j2902P629L042r263O791O33m096
924b324K737k080M574j454o244R799k732q328J2500n210q046J2878n185o151Q497
939C231m423k66L469o029N014j8m757P230l913l455R162n651j628N186n266M400
955B286k7p591R359k306p650J1157n733o324J2694n581n642P831j761j051K91
970d8r77M536n430O17Q168j1640J823J2634j3946m05J1854j0240N31O239o777
$$ plain form
985 -3061 -824 467 -857 1903 -3852 -173 4995 -4741 -370 4614 -4190 2015 2942 -3826 2918
1000 2918 182 -2259 4167 -4148 -1944 6548 -4689 -2590 5245 -3801 -1090 3017 -2220 -190 152
1015 152 1417 1831 -5035 3238 5134 -7460 2857 5621 -7638 2843 5422 -7123 692 3923
1029 3923 -2769 -829 -863 1455 498 -3850 3481 397 -5315 5748 562 -5984 5347 757 -3167
1044 -3167 3719 -2012 77 3535 -4144 1279 1794 -4952 3172 923 -5252 2665 1032 -2043 661
1059 661 -1457 2283 628 -3634 5373 -325 -5245 7716 -236 -7070 6931 721 -5844 3677 92
1074 92 -2740 486 -281 605 -2674 -489 4974 -4474 -2019 7009 -3988 -1544 6016 -4118 -380
1089 -380 4578 -3295 655 1121 -2561 2781 -1928 -2757 3689 -2648 -1252 2476 -2891 763 1338 -2008
$$ packed form
985c061K237J291j324K760n755L679N168r736M371M984q804O205R27o768O744
1000B918k736k441O426q315K204Q492j1237K099P835r046K711M107n237K030L42
1015A52J265M14o866Q273J896j2594J0317K764j3259J0481K579j2545P815L231
1029C923o692J940l4K318r57m348P331l084n712J1063n186o546J1331m590l924
1044c167O886n731K089L458p679N423N15o746Q124k249o175P917j633l075K704
1059F61k118L740j655m262R007n698m920J2961p952o834J4001o210o565R521l585
1074I2k832L226p67Q86l279K185N463r448K455R028j0997K444P560j0134L738
1089c80M958p873L950M66l682N342m709q29O446o337J396L728n367L654N75l346
$$ plain form
1105 -2008 2751 -1832 -988 5577 -4397 -1375 7121 -4640 -1584 6153 -4430 -1370 4314 -2364 -1618
1120 -1618 318 387 380 -3837 2265 2448 -5702 3185 3158 -6627 3764 3610 -5523 3022 2113 -3437 2576
1137 2576 -607 -1308 1991 -2355 763 825 -3394 2384 29 -3344 2833 -1330 -846 3631 -3237 1116
1153 1116 3730 -4711 2542 3435 -5251 2727 2591 -4583 1637 877 -2366 486 -974 736 -720 -2737
1169 -2737 3666 -1131 -4061 6150 -898 -4334 6064 -903 -3383 4869 -1480 -1850 2585 -1857 252
1184 252 40 -1948 2195 -1883 -1534 3207 -2934 -190 3255 -3838 1484 2618 -3926 3088 1349 -3780
1200 -3780 4147 116 -3336 3694 -879 -2147 2326 -1556 -17 105 -1524 2218 -2339 -1177 4224
1215 4224 -3745 -1021 5269 -4172 -491 5054 -4040 -235 3639 -3015 699 1002 -1322 1370 -1395
$$ packed form
1105b008M759m583Q44O565r974L022Q496j1761L056P737j0583L060N684o678P46
1120a618J936O9pm217O102J83q150Q887k7r785J0391j54r133Q545r09n550O013
1137B576l183p01L299m346L118O2m219N778k355l373O177m163M84M477o868M353
1153A116K614q441P253Q93q686P978j36p174O220p60l243K852j460J710j456k017
1169b737O403m797k930J0211p048l436J0398o967k480Q252o349l70M435m442K109
1184B52k12j988M143m078L49M741o141K744L445p093N322J134o544P014j739n129
1200c780P927m031l452P030m573j268M473l882J539J22j629L742m557J162N401
1215D224p969K724O290r441L681N545r094L805L874o654L714L03k324K692k765
$$ plain form
1230 -1395 -51 1566 -3247 1475 1407 -4146 2795 808 -3846 3778 -332 -2899 4221 -1310 -1384 3826
1246 3826 -2028 -194 2586 -2196 845 553 -1788 1428 -1764 -341 2375 -3628 745 2594 -4400
1261 -4400 2146 2605 -4774 2584 2129 -3597 2672 970 -1910 1678 -711 83 324 -2353 2048 -665
1277 -665 -2927 3489 -1760 -2971 4131 -1974 -2222 3984 -2403 -128 2944 -2379 902 1599 -2087 1915
1293 1915 -115 -1490 2374 -1969 -405 1591 -3084 1254 1036 -3621 2549 315 -3196 3862 -392
1308 -392 -2685 4035 -974 -1603 2855 -1098 -149 999 -1355 1177 -1117 -1419 2507 -3117 -783 3353
1324 3353 -4011 -296 3520 -3817 576 2746 -2915 1380 1292 -1325 1671 -683 -46 1791 -2245 788
1340 788 1191 -2880 1845 14 -3147 2553 -651 -1940 2934 -1784 -801 3097 -2261 470 2689 -2660
$$ packed form
1230a395J344J617m813M722o8n553O941j987m654P624m110k567P120n531p4N210
1246C826n854J834K780m782L041k92k341L216l192J423K716o003M373J849o994
1261d400O546M59p379P358m55n726O269j702k880L588k389P94K41k677M401k713
1277f65k262O416n249j211P102o105k48O206o387K275L072n323L281O97l686M002
1293A915k030j375L864m343J564J996m675M338k18m657O170k234l511P058m254
1308c92k293O720n009o29M458l953R49J148k354K532k294l02L926n624K334M136
1324C353p364L715L816p337M393K170n661M295q8k617K996k354O37J837m036L033
1340G88M03m071M725j831l161N700l204j289M874m718R83L898n358K731K219n349
$$ plain form
1356 -2660 1461 1534 -1873 1398 -106 -655 1252 -2303 725 1384 -3891 1781 1079 -4301 2840 1243
1372 1243 -3813 2730 610 -2385 1843 -103 -183 938 -1290 1491 -680 -1909 2908 -1184 -2270
1387 -2270 3465 -1700 -1925 2909 -2069 -380 2104 -2117 952 1025 -1869 2350 -251 -1755 2667 -884
1403 -884 -727 2095 -1664 611 888 -1960 1858 -718 -2154 3204 -1798 -2374 3729 -2030 -1878 3170
1419 3170 -1555 -659 1931 -579 589 -350 190 2193 -2400 14 2901 -3370 191 2863 -3948 409
1435 409 2433 -2994 448 798 -1347 1431 -689 -187 2042 -1703 1059 1829 -2583 1668 1534 -2369
1451 -2369 1364 -326 -1131 1839 -2253 -441 2116 -2999 755 2304 -3416 1178 2125 -2179 1077
1466 1077 967 -262 830 -864 905 471 -2550 2295 182 -3934 2644 670 -3647 2355 225
$$ packed form
1356b660M121P3l407L271j504n49J907l555L028O59n275N672p02n380P141j597
1372A243n056O543k120k995M228j946q0J121k228K781k171j229M817m092j086
1387b270N735n165k25M834m978J689K484m221L069P3k894M219k601j504M422l551
1403h84J57K822l759K275K77k848L818k576j436N358n002n76O103n759J52N048
1419C170m725Q96K590k510J168r39N40K003m593K414K887o271L561K672o811M357
1435D09K024n427L442L50k145K778k120N02K229l745K762P70m412M251j34l903
1451b369L733j690q05K970m092J812K557n115L754J549n720M594R47m304L256
1466A077j10j229J092j694J769m34l021M845k113m116O578j974m317O002k130
$$ plain form
1481 225 -2502 1840 -161 -734 843 -590 1355 -94 -1654 2413 -420 -1993 2637 -1107 -1423 2325
1497 2325 -1787 -424 1427 -1919 1109 172 -2297 2596 -19 -2078 2501 -495 -1089 1807 -669
1512 -669 -34 664 -647 1739 -982 -1195 3187 -1850 -1986 3567 -2168 -1623 3070 -1943 -1185 2020 -943
1529 -943 36 35 -208 1357 -1384 221 2194 -2418 831 2413 -2729 490 1673 -2345 676 162 -1727
1546 -1727 1337 -1137 -917 1944 -1810 42 1775 -1784 802 1211 -1031 1103 -413 -297 1666 -1823
1562 -1823 230 1645 -3126 717 1831 -3388 755 1549 -2813 740 975 -1012 623 -24 595 848
1578 848 -1517 2017 378 -2371 2666 26 -2768 2553 -545 -1825 2037 -928 -878 1333 -1694 428
1594 428 541 -1544 1281 150 -1261 1852 -574 -318 1722 -1286 615 858 -2103 1600 315 -2516
$$ packed form
1481B25k727M342k001n73J577j433J945j449j560M067k833j573M630l744l16L748
1497B325m112J363J851l346L028r37k469M893k615k059M579k996n94K896k476
1512f69O35O98j311K386k721k13M382n037j36N553n735N45M693n013P58L205k963
1529i43R79jk43J565k741J605J973m612L249J582n142L219J183m018L021n14j889
1546a727L064k474K20K861l754J852J733l559K586M09k242K134j516J16J963l489
1562a823K053J415m771L843J114n219M143P94m362L553K35j987J635o47O19K53
1578H48k365L534j639k749N037k640k794N321l098j280L862k965N0K211l027K122
1594D28J13k085K825j131j411L113k426K56K040l008J901K43k961L703j285k831
$$ plain form
1610 -2516 2367 -170 -2428 1873 -327 -1776 1731 -315 -560 447 -343 1452 -309 -524 2452 -1285
1626 -1285 -791 2715 -1857 -599 2547 -2176 -541 1652 -1758 140 413 -1147 924 -325 -546 1170
1642 1170 -1080 709 1458 -1469 1307 616 -1637 1791 -348 -1670 2157 -1106 -1286 1984 -1676 -792
1658 -792 1782 -1523 -101 919 -965 615 -266 -66 1266 -1341 562 1533 -2464 1202 1570 -2983
1674 -2983 1043 802 -2173 1076 383 -1499 1083 -212 -253 897 -897 984 182 -1121 1512 -263
1690 -263 -1258 2129 -613 -751 2062 -1356 -144 1590 -1791 170 1121 -1857 685 274 -1310 952
1706 952 -345 -425 817 -1157 1070 594 -1486 1687 432 -1898 2091 -275 -1840 1994 -493 -1505
1722 -1505 1587 -682 -562 639 -982 604 -376 -695 1568 -988 -231 2060 -1284 189 2088 -1636
$$ packed form
1610b516M883k537k258M301k200j449L507k046k45J007p90J795j761k15K976l737
1626a285M94L506m572J258L146m723J635K193l410J898K73j560K071j249k21J716
1642A170k250J789P49k927K776o91k253L428k139j322L827l263j80L270l660Q84
1658g92K574l305J422J020j884J580q81K00J332k607J903R71l997L666L68m553
1674b983M026k41k975L249o93j882K582j295m1J150j794J881q02j303K633j775
1690b63r95L387k742j38K813l418J212J734l381J961R51k978K542m11j584K262
1706I52j297q0J242j974K227m76k080L173j255k330L989k366j565L834k487j012
1722a505L092k269J20J201j621J586r80l19K263k556P57K291l344J473J899l724
$$ plain form
1738 -1636 352 1342 -1975 779 630 -1759 783 -411 -1142 957 -905 -289 793 -1069 882 425
1754 425 -1094 1554 -387 -903 2036 -1133 -769 1964 -1437 -452 1342 -1648 -211 673 -1275 235
1770 235 42 -429 756 -1050 511 1032 -1643 1286 1225 -2031 1389 894 -1847 1453 56 -1386 1213
1787 1213 -519 -858 903 -1130 236 262 -1120 938 24 -938 1645 -462 -552 1826 -1150 56 1409
1804 1409 -1536 831 1199 -1841 870 365 -1585 624 -299 -986 723 -775 310 481 -1089 1249
1820 1249 -152 -1186 1919 -415 -1300 2294 -486 -838 1705 -797 -511 886 -899 384 -42 -819
1836 -819 1113 -872 -653 1422 -1296 77 1541 -1446 585 1111 -1353 1161 554 -1117 1206 -315
1852 -315 -1040 1326 -866 -721 1066 -1085 21 399 -983 794 -367 -714 1457 -1189 -312 1956
$$ packed form
1738a636J988R90l317K754j49k389K542j194p31K099j862O16J082j862J951m57
1754D25j519K648j941n16K939l169L64K733l401R85J794k990J437Q84j948J510
1770B35j93m71J185j806J561N21k675K929o1l256L420m95k741L300j397j442K599
1787A213j732l39J761k033J366K6j382K058r14r62K583k107r0K378k976J206J353
1804A409k945K367L68l040K711n05j950K209r23o87J709j498J085J71j570K338
1820A249j401j034L105k334q85L594k780l52K543k502K86J397j785J283m26p77
1836h19J932j985K19K075k718J373J464k987K031N26k464K514o07j671K323j521
1852c15p25K366k192J45J787k151J106L78j382J777j161l47K171k646Q77K268
$$ plain form
1868 1956 -1440 21 1935 -1422 390 1207 -1290 307 334 -675 663 -734 37 851 -1460 938
1884 938 726 -1893 1091 849 -1436 1445 408 -1108 1320 -513 -105 986 -1184 482 481 -1484 634
1901 634 120 -1338 964 -558 -355 917 -1064 84 762 -1428 1162 797 -1617 1295 579 -1225
1917 -1225 1335 273 -965 785 -331 -137 -17 -880 908 -167 -1066 1754 -341 -1040 2056 -761
1933 -761 -826 1818 -666 -77 983 -1020 407 106 -739 883 -700 -878 1103 -1012 -614 949 -1224
1950 -1224 312 673 -1222 1082 -160 -798 1387 -442 -530 1474 -912 -251 1287 -840 32 632 -898
1967 -898 527 -240 -389 1000 -1135 -168 1342 -1669 148 1463 -1667 630 1130 -1216 786 639
1983 639 -580 553 -306 2 706 -1134 536 596 -1620 970 -35 -1256 1120 -175 -836 1117 -929
$$ packed form
1868A956l396J461J914l357J812Q17k497J597K7j009J338j397P71Q14k311K398
1884I38k12k619K984k42k285K881j037j516K428j833M08J091k170J666jj965K118
1901F34n14j458K302j522K03J272j981J148O78k190K590l65k414K912p16j804
1917a225K560j062j238J750j116J94J20q63J788j075q99K820k095o99L096k817
1933g61o5K644k484N89J060k003J427l01q45J622j583j78J981k115L98J563k173
1950a224J536L61j895K304j242o38K185j829q8K004k386O61J538k127Q72O00j530
1967h98J425p67j49J389k135R67J510l011J817J315l130K297N00k346K002j47
1983F39j219J133q59L08P04j840J670O0k216K590j005j221K376j295o61J953k046
$$ plain form
2000 -929 99 1338 -1050 457 988 -1274 575 433 -1033 787 -142 -610 635 -881 356 371 -1621
2017 -1621 1082 188 -1633 1418 254 -1526 1606 124 -935 1039 -217 -26 298 -785 733 -289
2033 -289 -1217 1191 -611 -1121 1303 -1151 -848 1318 -1192 -69 794 -968 584 287 -592 1167 -56
2050 -56 -776 1147 -836 -298 788 -914 102 71 -1009 865 -213 -951 1553 -780 -608 1812 -963
2067 -963 -426 1316 -826 -21 787 -638 355 -112 -301 760 -840 129 1038 -1329 304 1009 -1592
2084 -1592 468 693 -1371 843 58 -737 1010 -224 -328 1120 -958 424 512 -1159 851 135 -887
2101 -887 768 -500 -644 963 -1037 -26 919 -1408 402 1036 -1116 666 609 -950 1013 138 -419
2118 -419 601 -529 343 719 -1106 740 43 -1423 1206 -297 -1255 1287 -351 -976 982 -403
$$ packed form
2000i29J028J239k388J507N31k262J849j42j466J820r29m68J245j516J237J5j992
2017a621K703q94j821L051j164j780L132j482j059J974j256J91L24j083J518j022
2033b89r28K408j802n10K424k454L03K166k510J123Q63j762J552k97q79J759j223
2050e6p20J923j983N38J086j702J016l1j080J874j078p38K504k333J72K420k775
2067i63N37J742k142Q05Q08j425R93m67j89J061j600R69R09k367J633P05k601
2084a592K060K25k064K214p85p95J747j234j04J448k078J382Q8j671K010p16j022
2101h87J655j268j44J607k000J011R45k327J810O34k152J782n7j559J963q75n57
2118d19J020j130Q72L76j825J846o97j466K629j503r58K542j638o25J958j385
$$ plain form
2134 -403 -147 756 -434 417 53 -898 765 -458 -772 960 -621 -274 802 -1244 40 380 -1385
2151 -1385 501 105 -1274 1026 -198 -806 1110 -310 -285 1051 -315 642 430 -897 685 -203 -646
2168 -646 1104 -637 -798 1386 -1085 -343 1344 -1017 142 836 -821 553 -24 -82 675 -461 -56
2185 -56 978 -1101 209 549 -1238 637 99 -1352 1028 32 -765 1028 -576 -368 962 -539 210
2202 210 830 -706 616 169 -658 732 -371 -357 849 -730 47 679 -1485 279 595 -1324 958
2219 958 377 -1206 774 -50 -441 970 -343 331 466 -765 700 228 -1092 1096 -411 -691 1042
2236 1042 -584 -530 983 -997 -361 543 -980 222 332 -585 793 -158 -554 769 -516 59 695
2253 695 -914 434 538 -1125 591 169 -1050 800 -172 -944 938 -379 -396 637 -404 216 400
$$ packed form
2134d03K56R03j190Q51l64r51J663j223l14J732j581L47J076k046J284L40j765
2151a385J886l96j379K300j224o08J916j420K5J336j366R57k12j327J582q88m43
2168f46J750j741j61K184k471P42J687k361J159O94j657J374n77n8P57j136M05
2185e6J034k079J310L40j787J875n38j451K380r96p97J793j604K08J330j501P49
2202B10O20j536J322m47q27J390j103J4J206j579P77O32k164J764L16j919K282
2219I58n81j583J980q24l91J411j313O74J35j231J465m72j320K188j507k80J733
2236A042j626N4J513j980O36R04j523J202J10r17J378r51l96J323j285N75O36
2253F95j609J348J04j663J716m22j219J850r72p72J882j317j7J033j041O20J84
$$ plain form
2270 400 -481 1064 -213 -371 1238 -886 -241 1079 -1131 -125 896 -1086 50 443 -1042 436
2286 436 222 -441 503 -471 -297 857 -611 342 547 -751 477 145 -637 1063 -177 -662 925 -770
2304 -770 -333 793 -959 201 583 -932 241 182 -535 727 -201 -230 682 -663 259 576 -1102 623
2322 623 635 -1269 665 277 -1102 740 -301 -583 422 -505 -55 250 -546 524 301 -576 1044 -279
2340 -279 -523 1161 -404 -302 821 -658 -84 692 -867 410 50 -945 620 -219 -647 853 -291
2357 -291 -14 784 -552 476 661 -702 714 -144 -849 1025 -293 -760 1022 -519 -531 823 -558
2374 -558 37 338 -715 577 -109 -238 972 -425 12 1118 -896 132 990 -911 253 500 -802
2391 -802 274 -113 -867 527 -351 -350 723 -728 189 460 -515 443 326 -533 888 126 -185 751 -697
$$ packed form
2270D00q81J545j277j58J609k124O45J320k210J006J021j982J136L93j485J478
2286D36k14o63R44r74J74J154j468R53K05j298J228l32p82J700j240m85J587j695
2304g70M37J126j752J160L82j515J173n9p17J262r28k9R12j345R22L17j678J725
2322F23J2j904J934l88j379J842j041k82J005r27M50L05p96J070k23q77J620j323
2340b79k44J684j565J02J123j479N74P76j559J277l60r95J565q39m28J500j144
2357b91K77P98j336J028J85j363J416q58p05J874j318m67J782j541j2J354j381
2374e58N95L01j053J292o86j29J210j397M37J106k014J028Q58j901J164K47j302
2391h02J076l87p54J394q78JJ073j451R17K71r75R58j17q59J421p62l11R36j448
$$ plain form
2410 -697 78 946 -727 155 672 -941 247 187 -754 253 18 -368 547 -493 429 645 -960 541
2428 541 796 -793 906 287 -745 898 -187 -638 571 -341 -187 407 -650 248 56 -653 705
2445 705 61 -510 1142 -340 10 751 -479 200 481 -856 512 116 -847 538 119 -946 616
2462 616 -345 -374 579 -562 119 175 -454 735 -83 -678 1038 -613 -423 1171 -475 -404 662 -857
2480 -857 12 448 -600 371 -167 -558 647 -573 -201 877 -869 108 888 -668 180 488 -693 476
2498 476 33 -481 839 -607 -275 529 -637 5 612 -731 143 167 -437 499 -261 -213 801 -500 58
2517 58 894 -704 376 715 -900 331 430 -708 319 -218 -426 346 -463 127 411 -620 235 288 -710
2536 -710 806 -65 -461 941 -123 -433 773 -363 -176 377 -609 253 105 -695 287 -202 -408 633
$$ packed form
2410f97P75Q68j673Q82N17j613J188o0r41J007k35l86R15j040R22K16j605J501
2428E41K55j589J699o19j032J643j085m51J209r12J54N94j057Q98j92p09J358
2445G05o44n71J652j482L50P41j230O79K81j337J368l96r63J385m19j065J562
2462F16r61k9R53j141O81N6o29J189q18n95J716j651J90J594j646P1J066j519
2480h57Q69M36j048R71n38l91J205j220L72J078j746R77P80j556Q48L08j181J169
2498D76m43n14J320j446L32Q04j166O42O07j343Q74K4o04R36p60M8J014j301N58
2517E8Q36j598J080L39j615J231R9j138J027n37k08P72q09N90K84j031Q55N3r98
2536g10J516q71l96J402j064l10J206j136J87N53r86Q62j48q00R82m89k06J041
$$ plain form
2554 633 -346 -269 555 -606 50 653 -704 625 575 -744 607 55 -514 650 -311 -160 605 -427
2572 -427 22 141 -566 580 -94 -680 787 -234 -285 905 -345 -234 909 -386 79 495 -510 517
2590 517 43 -370 436 -224 -401 623 -591 -36 551 -642 533 231 -621 694 -139 -288 838 -378
2608 -378 -25 675 -373 -40 427 -637 -39 195 -719 365 -237 -219 460 -555 4 630 -890 375
2626 375 444 -724 592 333 -563 531 -50 -329 433 -563 -133 495 -613 194 155 -669 544 -25 -527
2645 -527 641 -169 -183 762 -203 39 512 -432 274 611 -594 586 -84 -540 445 -199 -77 328 -713
2664 -713 328 148 -675 518 190 -679 760 14 -583 637 -324 -71 557 -402 81 154 -713 292 -248
2683 -248 -455 534 -524 -400 831 -715 -97 630 -747 262 366 -694 546 83 -486 562 -121
$$ packed form
2554F33r79P7Q24j161O56O03j357J329n0j319J351n52n69J164r61J51P65j032
2572d27M49J19p07J146o74n86J467j021n1J190j250J11J143j295M65M16j005J027
2590E17m74m13Q06o60j77J024j214N55N87j193J175l02q52J315q33j49J126j216
2608c78L53P00j048L33M67j064N98K34r14J084o02J8O79j015N59O26j520J265
2626C75O9j168J316k59q96J094n81k79P62r96M30O28j108Q07l9q24J213n69n02
2645e27J168q10j4R45r65K42M73r44P06L37j205J180o70m56R85o44J22M05j041
2664g13J041j80q23J193l28q69J439p46n97J220r61K53O28r59M83P3q67J005n40
2683b48k07R89j058J24J231j546O18P27j377J009J04j060J240m63n69J048o83
$$ plain form
2700 -121 -155 506 -370 -294 425 -671 219 -163 -597 489 -242 -188 636 -538 -213 819 -412 30 439
2719 439 -602 324 359 -454 268 -214 -220 521 -439 -155 148 -642 367 96 -884 632 267 -725 826 -183
2739 -183 -261 702 -538 -192 410 -644 275 464 -650 390 -128 -453 355 -181 -302 528 -469 152 454
2758 454 -653 321 383 -512 545 111 -425 442 -267 -199 486 -417 119 89 -667 565 8 -731 645 -173
2778 -173 -545 727 -288 -461 469 -276 37 449 -229 279 94 -580 546 -195 -421 471 -449 -218 325
2797 325 -592 212 218 -620 549 142 -406 582 -326 -297 581 -313 -133 196 -436 267 23 -328 415 -326 -204
2818 -204 658 -503 -212 665 -592 -63 616 -460 323 188 -467 634 -186 -167 395 -270 -9 541 -490
2837 -490 151 271 -766 423 86 -618 564 -206 -206 605 -444 -18 377 -560 382 478 -422 384 108 -301
$$ packed form
2700a21l4O61q76P6P19j096Q90l82m34J086p31N4Q24j174L25J032j231M42M09
2719D39j041R26L5q13P22m82oP41r60K84L03p90J009k71r80J516l65r92J551j009
2739a83p8R63j240L46O02j054R19J89j114J040n18l25Q08n36j21Q30r97O21L02
2758D54j107R74O2q95J057m34n36Q67p09O8O85r03N36l0p56J232n57p39J376q18
2778a73l72J272j015j73R30p45L13M12o78N08j85o74J126p41k26Q92r20K31N43
2797C25r17Q04Oq38J169m07n48R88r08K9Q78q94J80L29o32P03k44l51P43p41J22
2818b04Q62j161K91Q77j257N29O79j076P83j35o55J101q20J9N62o65K61N50j031
2837d90O41J20j037J189l37p04J182p70%Q11j049M26L95r37R42R6r00Q06k76m09
$$ plain form
2857 -301 606 -281 -231 464 -453 113 244 -914 358 -37 -608 477 -157 -558 686 -12 -31 433 -244
2876 -244 518 294 -248 382 -42 -542 601 -259 -533 435 -503 -399 290 -379 -136 341 -334 269 153 -368
2896 -368 678 -181 -366 644 -508 -160 417 -480 261 214 -500 392 -175 -645 644 -103 -342 686 -409
2915 -409 -97 609 -242 427 159 -351 447 -121 23 524 -486 -194 481 -610 -18 398 -614 253 50
2934 50 -467 278 -162 -239 437 -283 141 349 -456 395 392 -671 479 4 -534 262 -272 -188 444 -516 -215
2955 -215 437 -591 -41 208 -536 491 -35 -456 499 -82 54 530 -328 136 273 -568 507 158 -601
2974 -601 568 -60 -689 471 -335 -72 370 -61 84 464 -398 278 5 -401 632 -303 -365 685 -293
2993 -293 -132 471 -486 -49 217 -502 543 -197 -529 474 -147 -377 489 -365 -6 387 -295 236 189 -450
$$ packed form
2857c01R07q87N0O95r17N66J31j158J272l95n71J085o34m01J244o98j9M64o77
2876b44P62k24n42O30m24n00J143q60k74R68r38J04O89o69K43M77o75O03j16n21
2896c68J046q59j85J010j152L48N77q97P41m7p14Q92n67m70J289p47k39J028j095
2915d09L12P06q51O69k68n10P98n68J44N01j010K92O75j091N92M16j012Q67k03
2934E0n17P45m40p7O76p20M24K08q05Q51lj063J150m75n38P96n34Q4O32r60L01
2955b15O52j028N50K49p44J027n26m21R55n81J36M76q58M64J37q41J075l49p59
2974f01J169o28o29J160q06K63M42m31J45L80q62O76k73m06J033r35o2J050r78
2993b93J61O03r57M37K66p19J045p40l32J003o21k30Q66q54L59L93o82N31m7o39
$$ plain form
3013 -450 487 78 -391 526 -468 -454 428 -514 -54 458 -644 57 323 -458 545 -92 -223 590 -226 115
3033 115 524 -472 282 485 -678 236 261 -609 431 -94 -536 616 -420 -186 502 -550 68 411 -360
3052 -360 544 168 -155 534 -76 -159 605 -617 16 578 -621 71 120 -617 146 -60 -308 402 -94 -168
3072 -168 211 -393 123 364 -495 413 133 -471 675 -19 -490 665 -221 -165 397 -325 -21 0 -543 368
3092 368 69 -424 204 -42 -249 645 -320 -106 482 -553 -35 252 -601 451 -189 -835 451 -95 -325
3111 -325 394 -210 -17 485 -275 44 -40 -398 420 -157 -242 653 -487 -341 699 -511 -62 335 -563 217
3131 217 -88 -391 377 -105 -522 139 -247 -2 523 -484 128 486 -418 297 -16 -442 319 14 -453 607
3151 607 -462 -214 105 -501 76 383 -664 51 9 -413 437 -168 -47 537 -620 -25 488 -528 356
$$ packed form
3013d50R37m09m69R17r94J4Q82r42M60N12j102P01K66p81J003o37j31Q13q16L41
3033A15M09r96P54K03j163R14K5q70J040n25m42J152j036K34O88j052O18L43p71
3052c60R04l76l23O89o10q3P64j222O33N62j199O92M9p37P63k06k48P10m96p4
3072a68L79o04N16K41q59R08k80o04J146o94m71J155q86N6N62p22L04K1n43R11
3092C68k99m93O28k46k07Q94r65K14N88j035N18K87q53J052o40o46J286n46k30
3111c25P19o04J93N02p60L19q4l58Q18n77q5Q95j140J46J040j210M49L97q98P80
3131B17l05l03P68m82m17O61l86K45N25j007O12L58r04P15l13m26P61l05m67J060
3151F07j069K48L19o06N77L07j047P15m2m22Q50o05J21N84j157N95N13j016Q84
$$ plain form
3170 356 61 -673 275 257 -254 433 -42 -204 543 -259 -20 314 -561 558 248 -270 711 -58 -433 705
3190 705 -344 -7 416 -423 156 192 -477 510 109 -412 324 -274 -345 620 -118 70 559 -304 289 245 -619
3211 -619 325 -38 -320 415 -422 -171 531 -367 -300 300 -452 136 -26 -421 418 145 -309 730 -297 -211
3231 -211 492 -431 163 591 -509 211 72 -462 242 -295 -318 203 -236 -415 425 -613 193 299 -524 337
3251 337 247 -291 428 -89 -274 369 -342 -46 251 -427 28 158 -493 194 79 -235 337 -227 -165 316 -562
3272 -562 75 319 -449 430 155 -450 315 -9 -401 466 19 -177 348 -483 -15 112 -373 450 190 -356
3292 -356 515 13 -508 344 -306 -172 452 -353 131 461 -562 118 233 -459 334 62 -219 336 -264 -212
3312 -212 144 -441 297 122 -374 415 -235 -525 549 -178 -215 575 -267 57 403 -298 61 62 -447 478 -172
$$ packed form
3170C56k95p34R48j8n11O87m75j62P47q02K39L34q75J119l10n18R81p69l75J138
3190G05j049L37M23q39N79L6o69R87m01n21P36n98p1R65p38J88M89q63N93m4q64
3211f19R44l63k82P35q37K51P02q98O7O00p52N88j62l95Q39k73m54J039j027Q6
3231b11P03r23N94M28j100P20j39n34P04n37k3N21m39j79Q40j038Q06J06q23Q61
3251C37r0n38P19n17j85O43p11K96K97o78M55J30o51O87j15l14N72n64O2M81q78
3272e62O37K44p68Q79k75o05P65l24l92Q67m47j96N25q31M68J27m85Q23k60n46
3292c56Q71n02n21Q52o50J34O24q05M84L30j023O80J15o92P93k72k81N55o00N2
3312b12L56n85P38j75m96P89o50k90J074p27l7P90q42L24L46p01L59Jn09R25o50
$$ plain form
3333 -172 -334 559 -347 -132 479 -411 38 187 -487 289 440 -393 208 -101 -487 420 -141 -69 356 -258
3353 -258 60 129 -560 30 105 -304 366 -202 -204 427 -300 -149 612 -428 234 362 -313 259 138 -500 252
3374 252 -150 -298 299 -373 -107 540 -587 38 133 -662 222 28 -533 479 6 -435 281 -297 18 175
3394 175 -264 198 -34 -543 607 -204 -316 334 -507 -218 474 -495 -9 371 -597 434 -40 -561 494
3413 494 -11 -487 449 -222 -234 261 -79 243 85 -430 441 15 -255 588 -246 -257 438 -277 15 487 -504
3434 -504 214 97 -267 326 -24 -329 360 -234 -468 324 -390 181 303 -271 166 9 -403 369 24 -219
3454 -219 530 -225 -251 625 -251 157 366 -652 119 74 -578 250 -193 -235 331 -144 -53 289 -473 93 344
3475 344 -512 340 53 -270 328 57 12 477 -379 164 249 -525 266 507 -444 250 227 -477 433 -163 -184
$$ packed form
3333a72j62Q93r06K15O11q90M49J49o74P76J51q33O01l09l86R07n61P2M25o14
3353b58L18O9o89N90P5m09O70n68kO31p27J51P61j040O62J28o75N72j21o38P52
3374B52m02j48N97o72K66O47j127O25R5p95Q84j94n61J012m73m41P16n78L15J57
3394A75m39M62k32n09J150q11j12O50q41K89O92r69M86L80r68J031m74n21J055
3413D94n05m76R36o71j2M95l40L22j58n15Q71m26k70Q43q34j1O95p15K92M72r91
3434e04P18j17l64N93l50l05O89n94k34P92p14N71J22n74M37j57m12P72l45k43
3454b19P49p55k6Q76q76M08K09j018P71m5o52Q28m43m2N66m75R1L42p62N66K51
3475C44q56Q52k87l23N98k71m5M65q56N43Q5p74P91K41r51O94k3p04R10n96k1
$$ plain form
3496 -184 536 -415 276 416 -341 220 235 -422 552 -61 -377 515 -153 -125 305 -485 101 324 -261 256 -44
3517 -44 -393 499 -94 -497 490 16 25 238 -235 55 254 -172 241 -145 -360 452 -189 -247 483 -512 -385
3538 -385 244 -454 171 193 -339 455 -159 -315 296 -58 0 257 -276 55 342 -509 339 52 -574 350 -94
3559 -94 -523 411 -336 -236 699 -511 -169 329 -243 400 192 -43 521 51 -68 399 -188 -282 326 -426
3579 -426 208 170 -171 227 123 -317 344 -71 11 343 -115 4 229 -264 266 241 -402 364 -194 -445 375
3600 375 -220 -106 165 -373 138 259 -428 334 258 -348 285 -17 -292 286 -85 124 343 -290 221 207 -498
3621 -498 135 -63 -422 255 -80 -330 317 -155 -74 393 -339 29 292 -51 445 155 -157 323 -147 -245 337
3642 337 -382 -222 271 -325 65 168 -477 243 -80 -371 113 -168 -152 263 -467 45 219 -304 220 202 -311
$$ packed form
3496a84P20r51O91J40p57N61J5o57R74o13l16Q92o68K8M30p90N86K23n85N17l00
3517d4l49Q92n93m03R87m74RK13m73K90J99m26M13l86k15Q12o41n8P30r95J27
3538c85O29o98O25K2n32P94o14j56O11l54N8K57n33L31K87q51Q48k87o26R24m44
3559i4m29R34p47J00R35j210L42M98n72O43k08k35N64m70j19M67n87r4O08p52
3579d26O34l8l41L98j04m40O61m15Q2L32m58J19K25m93N30k5o43P66n58k51Q20
3600C75n95J14K71n38N11J21o87P62p6o06O33l02k75N78l71K09K19o33N11j4p05
3621d98O33j98l59O77l35k50O47m72Q1M67p32L68K63l43M96k90l12M80m70r8N82
3642C37p19J60M93n96L90J03o45P20l23k91M84k81J6M15p30N12J74n23N24j8n13
$$ plain form
3663 -311 297 -130 -235 390 -465 -232 284 -336 42 180 -186 75 150 -116 146 -246 -177 329 -328 -4 404
3684 404 -518 234 0 -455 376 117 -429 197 -18 -193 224 -297 -28 346 -348 -11 81 -271 335 194
3704 194 -261 269 -389 33 510 -321 22 488 -282 -2 217 -560 209 82 -226 364 -97 -367 350 -203
3724 -203 192 214 -242 462 179 -283 456 -117 -457 303 -194 -220 309 -141 58 214 -437 244 133 -110 31
3745 31 65 -35 245 -352 -4 269 -509 52 188 -495 303 -215 -287 141 -31 -151 463 -208 -51 420 -410
3766 -410 249 154 -186 259 166 -270 577 -180 -260 380 -217 -37 160 -395 -66 204 -211 291 -174 -40 449
3787 449 -180 24 287 -257 160 86 -103 54 124 -138 232 -206 -23 247 -269 141 317 -323 -19 91 -401
3808 -401 162 51 -109 255 -45 -93 417 -52 227 302 -171 96 316 -230 253 123 -148 314 19 -301 19
$$ packed form
3663c11O08m27j05O25q55K33N16o20L78J38l66K61P5k66K62l92O9N06o57L24M08
3684D04r22P52k34m55Q31k59n46O26k15j75M17n21K69L74o94L37R2l52O06j41
3704A94m55N30o58M22M77q31L43M66p70K80K19p77P69j27l08N90m61k70P17n53
3724b03L95K2m56P04k83m62P39n73l40P60m97k6N29m50J99J56o51O81j11k43J41
3745C1L4j00K80n97L48K73p78N61J36o83P98n18p2M28j72j20O14o71J57M71q30
3766d10O59r5l40M45r3m36Q47p57q0O40n97J80J97n55L29K70m15N02m65J34M89
3787D49o29K04K63n44M17p4j89J57P0k62L70m38J83K70n16M10J76o40L04J10m92
3808d01N63j11j60L64l00m8N10m69K79P5m73K67K20n46M83j30k71M62k95l20L20
$$ plain form
3829 19 -254 103 50 -378 317 15 -116 174 -188 -356 395 -115 -19 141 -311 -10 -11 -294 243 29 -266 368
3851 368 -380 -127 408 -277 70 591 -190 94 438 -348 197 62 -176 297 33 -248 112 -132 -139 79 -203
3872 -203 4 -11 -155 124 -92 -126 262 -423 -28 566 -424 29 196 -371 45 181 -244 153 -183 -100 337
3893 337 -89 130 224 -404 63 345 -297 278 107 24 495 -8 -34 236 -241 11 398 -333 132 78 -304
3914 -304 248 147 -178 37 -166 -148 180 -52 4 207 -291 79 139 -368 369 130 -218 366 -263 -117 487
3935 487 -262 -70 9 -87 70 -73 -169 217 50 -249 219 -70 -44 230 -241 -126 375 -12 217 -2 16 153
3957 153 -58 -312 189 -185 -119 90 -48 -18 -48 -322 89 -2 -208 402 60 6 311 -163 10 244 -121 13
3979 13 101 -139 458 168 -92 540 -180 -62 328 -324 8 310 -163 160 104 -352 115 24 -110 117 -98
$$ packed form
3829A9k73L57n3m28O95l02j31K90l62j68P51n10R6J60m52L01jk83N37k14k95O34
3851C68p48K53N35o85L47N21p81K84L44p86N45j35k38M73k64k81L60k44pK18k82
3872b03K07j5j44K79k16l4L88o85L95N94r90M53J67n67M16J36m25L97l36Q3M37
3893C37m26K19R4o28M67K82o42N75j71q3M71n03k6K70m77K52L87p31M65n4l82
3914c04N52j01l25K15k03J8L28k32N6K03m98L70O0n07P37k39l48N84o29J46O04
3935D87p49J92P9r6J57j43r6L86j67k99M68k89K6K74m71J15N01l87K29k19J8J37
3957A53k11k54N01l74O6K09j38L0l0k74M11r1k06O10l42n4L05m74J73K34l65J34
3979A3Q8k40N97k90k60O32p20J18L90o52L32L02m73L23n6m56M67r1j34K27k15
$$ plain form
4000 -98 116 240 -491 172 -209 -210 -8 49 -300 299 -331 -133 381 -152 164 306 -301 -90 325 -397 115
4021 115 85 -197 110 -255 -99 200 -89 61 172 -272 -42 54 10 491 -70 -268 286 -235 -191 26 -279
4042 -279 17 68 -122 278 78 -118 230 -77 -268 354 -79 -110 238 -305 -224 264 -463 -53 231 -159 379
4063 379 2 -14 219 103 -258 345 -192 176 97 -295 271 67 -335 314 -274 -150 39 -136 -56 199 -295
4084 -295 269 131 -332 314 -152 -124 313 -35 -337 257 -264 -133 182 -249 42 271 -183 148 30 -233
4104 -233 286 -244 -104 451 -262 -170 324 -190 113 -43 -134 304 -208 -329 -7 -140 -31 238 -8 124 73
4125 73 -274 284 239 -177 189 26 42 121 -453 -35 242 -340 28 -23 -575 418 -171 -178 280 -14 -142 280
4147 280 -90 119 16 -351 146 77 42 24 -215 -255 261 -154 -71 166 -273 5 277 -365 25 -60 -331 218
$$ packed form
4000i8K14J24p31O63l81jK02N7l49N99o30J98N14n33L16J42o07K11M15p22N12
4021A15l0k82L07l65J56K99k89J50J11m44K30R6m4M81n61j98N54n21M4K17l05
4042b79K96N1j90M00k00j96L48l07j91O22m33l1L48n43Q1M88p27M10K84l90N38
4063C79l77j6K33j16l61O03n37L68p9l92N66k04m02O49n88J24J89j75Q0K55m94
4084b95N64j38m63O46m66K8M37l48l02N94n21J31L15m31K91K29m54L31j18k63
4104b33N19n30J40N55p13R2M94n14L03j56r1M38n12j21L22j33J09K69k46J32n1
4125G3l47N58m5m16L66j63J6P9n74M18K77n82L68n1n52R93n89pM58k94j28M22
4147B80l70K09j03l67M97o9l5j8k39m0N16m15Q3K37m39K78K72o42L90q5k71N49
$$ plain form
4169 218 89 -73 121 -7 0 181 -46 220 124 -331 26 154 -317 192 -119 -49 348 -83 -21 72 -241 -266
4191 -266 205 -339 102 73 172 249 -59 -242 496 -123 -66 125 -324 189 -258 -179 193 -58 -233 313 -227 -5
4213 -5 192 -220 179 -6 -225 263 0 -153 75 102 49 205 -61 25 243 -409 -48 166 -345 219 52 -40
4235 -40 183 -9 -58 159 98 -8 177 -430 319 13 -415 346 133 -241 202 90 -340 -39 -103 106 158 -447
4257 -447 224 177 -287 187 58 99 251 -166 -97 26 -395 185 40 -155 -68 -148 -393 -9 -187 -265 168 74
4279 74 60 106 -88 13 185 -298 151 12 -87 173 -70 -295 331 -212 -185 110 -257 -9 298 -161 230 74
4301 74 -450 294 -123 -61 196 -274 84 457 -78 -38 183 -71 54 -143 -276 202 -207 -26 196 -163 124
4322 124 92 -218 45 124 -528 211 -121 -167 269 -105 -87 241 -419 -51 120 -45 37 -12 -45 225 18 -32 189
$$ packed form
4169B18j29j62J94j28PJ81k27K66r6m55L57J28m71N09l11P0L97m31O2R3l13k5
4191b66M71n44M41k9R9P7l08j83P38o19N7J91m49N13m47P9L72k51j75N46n40K22
4213eJ97m12L99j85k19M88k63j53K28K7n3J56k66Q6K18o52L61K14n11N64j67r2
4235d0K23j92m9K17o1j06J85o07P49l06m28P61k13l74M43j12m30L01o4K09N2o05
4257d47O71m7m64M74j29M1J52m17O9J23m21N80j45j95Q7q0k45L84j78p8M33r4
4279G4j4M6j94J01J72m83M49j39r9K60k43k25O26n43K7K95l67K48L07m59L91j56
4301G4n24P44m17O2K57m70L58L73n35M0K21k54J25j97j33M78m09J81K22l59K87
4322A24l2l10K63P9o52P39l32m6M36l74J8L28o60L68J71j65Q2m9l3K70k07n0K21
$$ plain form
4345 189 7 59 141 -185 202 166 -60 140 -217 -143 221 -181 -53 291 -232 58 84 -110 22 282 -112 223
4367 223 116 -238 43 32 -130 109 -111 -19 128 -236 142 23 -167 -14 -343 -109 62 -120 39 171 -228
4388 -228 -21 147 -188 141 138 -187 196 112 -200 506 44 44 241 -249 137 92 -275 128 116 -111 308 -98
4410 -98 -260 255 -14 -321 150 -122 -169 46 -77 55 -51 -164 189 -234 -38 293 -245 91 -12 -99 134
4431 134 -91 -181 9 -139 -243 378 -120 -44 340 -184 -47 226 -84 206 231 -190 209 -38 -233 233 -187
4452 -187 -57 -56 -278 -16 281 -375 22 75 -333 21 -30 132 122 -119 69 104 -131 119 86 -302 6 69 -239
4475 -239 306 -218 -106 337 11 7 186 42 164 43 -368 -27 -68 -207 337 25 16 260 -202 46 105 -161
4497 -161 73 237 -310 154 -48 -200 282 13 -156 311 52 -15 -41 -220 306 -90 -72 261 -180 -159 217
$$ packed form
4345A89j82N2Q2l26L87l6k26K00l57P4L64m02J28L44n23K90K6j94J32K60l94L35
4367B23j07l54K81j1j62K39k20R2J47l64L78j19j90J53l29K34J71j82J59J32l99
4388b28K07J68l35L29ll25L83q4l12P06m62%J97m90L86m5l67M03j2k27M19m06
4410i8j62N15k69l07M71k72m7K15j23J32j06j13L53m23J96L31n38L36j03q7K33
4431A34k25r0J90j48j04O21m98P6L84n24J37K73l10K90K5m21L99k47j95M66m20
4452a87J30Jk22K62K97o56L97N3m08L54n1J62j0k41J88L5k35K50l3l88L08O3l08
4475b39N45n24J12M43l26mJ79j44J22j21m11L41m1j39N44l12rK44m62K48N9k66
4497a61K34J64n47M64k02j52M82k69j69M67k59o7k6j79N26l96J8L33m41K1L76
$$ plain form
4518 217 -63 0 150 -228 202 116 -151 153 20 -12 137 36 -62 199 -78 -12 273 -132 98 -26 -137 82
4540 82 -149 -187 104 -250 -195 235 -233 103 130 -263 268 135 -337 -79 -77 -152 114 -96 -38 57 -319 152 0
4563 0 -347 169 83 -199 -80 -156 7 160 -260 11 193 17 216 -201 -293 61 25 -188 141 85 -213 117
4585 117 -127 -39 -78 -119 192 -26 -311 1 -119 -230 6 -180 -197 236 -140 -2 204 -58 169 -30 -80 17
4607 17 -90 -180 312 -184 -83 182 -175 112 257 -34 189 37 -68 408 72 -136 231 -285 -45 190 -94
4628 -94 60 -48 -275 -5 48 46 205 -19 -323 338 29 -205 -6 -110 68 31 -300 -49 148 -207 175 -52
4650 -52 -78 198 -218 -111 91 -57 81 139 -263 212 61 -177 74 -53 -75 298 -191 -153 265 -27 6 -110
4672 -110 -72 -100 61 -97 116 -136 98 193 -118 220 101 -102 80 7 -152 74 -120 -140 35 65 -164 263
$$ packed form
4518B17k80O3J50l78M30q6k67L04j33l2J49j01r8K61k77O6K85m05K30j24j11K19
4540H2k31l8K91l54N5M30m68L36K7l93N31j33m72K58Kp5K66k10N8R5l76M71j52
4563@l47N16q6k82J19p6J63J53m20K71J82j76J99m17r2L54l6k13L29n6k98L30
4585A17k44Q8l9m1L11k18k85L12j20j11K36j86j7M33l76J38K06k62K27j99n0R7
4607A7j07r0M92m96J01K65l57K87J45k91K23j52j05M76l36k08L67n16K40K35k84
4628i4J54j08k27K70N3kJ59k24l04O61l09k34J99j04J78l7l31K51J97l55L82k27
4650e2k6K76m16J07K02j48J38N8m02M75j51k38K51j27k2L73m89L8M18k92L3j16
4672a10L8k8J61j58K13k52K34R5l11L38j19k03J82p3j59K26j94k0J75L0k29M27
$$ plain form
4694 263 -148 153 158 -95 278 132 -48 176 -262 -332 363 -161 -9 66 -7 140 -44 -131 145 36 -185 316
4716 316 -70 -57 98 -133 -180 138 -64 49 5 -240 61 -147 -198 207 55 52 277 114 26 23 -48 167 -67
4739 -67 -62 210 -100 48 46 -211 46 5 -113 159 205 -399 208 216 -61 243 36 -200 -4 -124 -31 76 -34
4762 -34 78 -161 -93 244 204 -353 53 -200 67 10 -137 -307 73 -37 7 225 -150 138 -50 -117 15 -33
4784 -33 -84 -9 -247 -3 25 19 41 51 -20 310 101 -172 -69 -103 70 -185 -242 46 84 109 271 -126 -93 -17 5
4809 5 -388 336 -186 102 73 -278 57 61 -160 324 -54 -112 304 -113 90 169 65 -8 -158 -279 -88 36 -6
4832 -6 -16 -104 100 285 238 13 188 -30 101 -52 -180 -2 71 -209 -58 10 -104 21 -148 -65 -48 -211 45
4855 45 140 39 100 66 -43 129 -23 -42 112 53 -42 -10 120 83 39 -178 12 34 -48 199 29 59 110 -102 -205
$$ packed form
4694B63m11L01Nk53L73j46j80K24m38p0O95n24J52P5p3J47j84q7K76j09k21N01
4716C16l86J3J55k31m7L18k02J13m4k45L01k08n1M05j52lK25j63q8lp1K15k34
4739f7NK72l10J48kk57K57m1j18K72M6o04O07Qk77L04k07k36J96j20R3J07j10
4762c4J12k39O8L37m0n57M06k53K67n7j47j70L80j10M4K18l75K88j88o7J32m8
4784c3n1P5k38K44K8oK2J0p1L30k09k73J03l4J73k55n7K88L8K5J62l97L3P6K2
4809El93P24n22K88k9l51L35Mk21M84l78n8M16m17K03P9j04p3j50j21J91J24m2
4832fj0q8K04J85m7k25J75k18J31j53j28J78P3k80J51O8j14J25j69Q3J7j63K56
4855D5R5j01O1l4j09J72j52j9J54n9r5L2J30l7m4k17J90K2q2K47j70L0N1k12j03
$$ plain form
4880 -205 74 -187 -95 -55 -36 69 -78 -87 23 -96 85 -50 -279 -142 -154 -136 96 40 -20 281 -159 153 -75
4903 -75 -38 51 169 -256 -55 199 -25 68 -40 -60 84 -102 184 134 -315 -56 107 -270 90 156 -160 186
4925 186 -41 -214 92 -20 44 136 -37 -128 258 -18 -28 23 -283 77 -168 -227 28 -39 -13 142 8 113 -47
4948 -47 -44 -94 27 80 226 42 224 43 -41 -36 15 227 -38 -102 -29 -98 114 -217 163 71 169 -81 -59 1 -91 -3
4974 -3 -137 -25 -90 162 0 2 50 -29 -172 93 -11 -142 37 4 -220 158 -207 146 26 205 139 67 -172
4997 -172 58 -40 20 -68 -161 -17 147 -70 16 38 126 226 -207 -92 245 -91 143 28 -195 110 -193 -168 58
5020 58 63 0 33 -31 -187 95 -27 156 87 -166 -34 -60 -193 49 -95 -67 196 -276 -41 -36 59 -14 -4 -74 226
5045 226 86 139 120 -117 14 173 6 -50 43 -21 -10 -66 -176 53 -174 -169 52 -33 1 209 -101 197 81 -43
$$ packed form
4880b05K79k61R2M0J9J05j47rJ10j19J81j35k29J37j2J8K32n6o0L01m40L12k28
4903g5L7Q9J18m25K01K54k24R3j08k0J44j86K86n0m49K59J63l77L60O6l16L46
4925A86k27j73L06j12O4R2j73r1L86k76j0N1l06L60k45n9K55o7K6J55j34J05j60
4948d7Ln0J21N3J46j84J82j81q4NN1K12k65o4P3o9K12l31L80r2R8k50K2O0r2Q8
4974cj34J12o5K52j62KM8p9j43K65j04j31J79l3k24L78l65L53j20J79o6p2k39
4997a72K30r8O0q8r3J44J64k17Q6K2Q8J00m33J15L37l36K34j15k23L05l03K5K26
5020E8No3L3o4j56K82j22J83o9k53J32k6j33K42j44K8K63m72K35NR5p3J0p0L00
5045B26j40N3j9k37J31J59j67n6R3o4J1n6j10K29k27NK21q5L4K08l10K98j16j24
$$ plain form
5069 -43 34 -182 -186 193 -85 -53 96 -176 134 159 -128 -9 -22 -230 63 89 -109 93 63 -40 41 -175 -50
5092 -50 186 12 47 -19 -36 35 -97 -170 187 -53 146 52 -154 -154 77 95 -119 81 64 -13 -110 -3 87 -76 18
5117 18 83 -15 -36 -109 -150 -20 149 -199 75 -96 -154 36 -100 -8 95 135 8 64 -60 71 96 -151 74 54
5141 54 -4 14 5 -85 73 11 -52 45 27 67 1 47 187 129 77 -15 -217 -74 75 -141 145 169 -18 176 -26 -61
5167 -61 169 -190 -150 115 216 44 117 73 44 -95 -288 -10 -196 65 151 66 99 184 99 -86 -208 134 223 174
5191 174 74 -139 -62 75 168 -82 -73 -98 16 11 130 -92 -74 -71 40 152 -224 176 184 -84 31 149 -122 192
5215 192 41 87 -117 39 -257 -73 5 155 39 15 115 105 70 101 38 -146 -11 -70 -174 17 -137 1 198
$$ packed form
5069d3P7k16mL79k78L2J49k72L10K5k87J19j3k08K93K6j98K02l0j03Q1k16J25
5092e0K36j74L5o6j7P1j32p3L57k40J99r4k06%K31J8k14K00j7p7r7J07R0j63R4
5117A8O5r8k1p3m1J30J69l48K74j71n8J90j36R2J03M0j27N6j24J31K5k47K25k0
5141E4n8J8rr0J58o2o3R7j8M0o6M6J40n8n2r2k02J43J49k16K86K4j87J94k02l5
5167f1K30l59M0K65J01j72P3m4k9j39j93K78j86K61Q6q5L3Q5q5j85j22L42Q9m9
5191A74j00k13P7J37R3k50Rk5J14nJ19k22J8LJ11J12l76M00Qk68J15J18k71L14
5215A92j51M6k04J56k96J84P8J50j16k4J00j0l5L1o3j84J35n9j04J91j54J38J97
$$ [...]
8191A19
##END NTUPLES=NMR FID
##END=
