##TITLE=1H_56-2021
 CDCl3, 8 sc, 
 27.07.2021
##JCAMPDX= 6.0         $$ Bruker NMR JCAMP-DX V2.0
##DATA TYPE= NMR FID
##DATA CLASS= NTUPLES
##ORIGIN= UXNMR, Bruker Analytische Messtechnik GmbH
##OWNER= root
$$ XWIN-NMR		Version 3.5
$$ Tue Jul 27 11:24:38 2021 Russian Standard Time (UT+4h)  she@DPX200
##.OBSERVE FREQUENCY= 200.131506
##.OBSERVE NUCLEUS= ^1H
##.DELAY= (6, 6)
##.ACQUISITION MODE= SIMULTANEOUS
##.ACQUISITION SCHEME= undefined
##.AVERAGES= 8
##.DIGITISER RES= 18
##SPECTROMETER/DATA SYSTEM= spect
##.PULSE SEQUENCE= zg30
##.SOLVENT NAME= CDCl3
##.SHIFT REFERENCE= (INTERNAL, CDCl3, 0, 15.7039)
##AUDIT TRAIL= $$ (NUMBER, WHEN, WHO, WHERE, WHAT)
$$ ##TITLE= Audit trail, XWIN-NMR		Version 3.5
$$ ##JCAMPDX= 5.01
$$ ##ORIGIN= Bruker BioSpin GmbH
$$ ##OWNER= she
$$ F:/spectra/data/she/nmr/H-F/1/audita.txt
$$ ##AUDIT TRAIL=  $$ (NUMBER, WHEN, WHO, WHERE, WHAT)
(   1,<2021-07-27 11:22:33.67 +0400>,<she>,<DPX200>,
      <created by zg, POWCHK disabled, PULCHK disabled
       configuration hash MD5:
       00 E9 B6 7A A2 85 ED C7 34 08 36 98 17 FE 4E 26
       data hash MD5: 16K
       0B 5B 5B 3E E3 E8 63 B5 B2 11 9D 9E 3F AD 70 E9>)
$$ ##END=
$$ 
$$ hash MD5
$$ E1 A0 42 76 8C 1D 16 00 34 8E 8F DF 32 28 59 92
##$RELAX= 
##$RELAX= 
##$RELAX= 
##$RELAX= 
##$RELAX= 
##$RELAX= 
$$ Bruker specific parameters
$$ --------------------------
##$DU= <F:/spectra>
##$EXPNO= 1
##$NAME= <H-F>
##$PROCNO= 1
##$TYPE= <nmr>
##$USER= <she>
##$AMP= (0..31)
100 100 100 100 100 100 100 100 100 100 100 100 100 100 100 100 100 100 
100 100 100 100 100 100 100 100 100 100 100 100 100 100 
##$AQSEQ= 0
##$AQ_mod= 1
##$AUNM= <au_zg>
##$AUTOPOS= <>
##$BF1= 200.13
##$BF2= 200.13
##$BF3= 200.13
##$BF4= 200.13
##$BF5= 200.13
##$BF6= 200.13
##$BF7= 200.13
##$BF8= 200.13
##$BYTORDA= 1
##$CFDGTYP= 0
##$CFRGTYP= 5
##$CHEMSTR= <none>
##$CNST= (0..31)
1 1 145 1 1 1 1 1 1 1 1 1 1 1 1 1 1 1 1 1 1 1 1 1 1 1 1 1 1 1 1 1 
##$CPDPRG= <>
##$CPDPRG1= <>
##$CPDPRG2= <>
##$CPDPRG3= <>
##$CPDPRG4= <mlev>
##$CPDPRG5= <mlev>
##$CPDPRG6= <mlev>
##$CPDPRG7= <mlev>
##$CPDPRG8= <mlev>
##$CPDPRGB= <>
##$CPDPRGT= <>
##$D= (0..31)
0 1.2 0 0 0 0 0 0 0 0.06 0 0.03 0 0 0 0 0.0002 0 0 0 0 0 0 0 0 0 0 0 0 
0 0 0 
##$DATE= 1627370553
##$DBL= (0..7)
120 120 120 120 120 120 120 120 
##$DBP= (0..7)
150 150 150 150 150 150 150 150 
##$DBP07= 0
##$DBPNAM0= <>
##$DBPNAM1= <>
##$DBPNAM2= <>
##$DBPNAM3= <>
##$DBPNAM4= <>
##$DBPNAM5= <>
##$DBPNAM6= <>
##$DBPNAM7= <>
##$DBPOAL= (0..7)
0.5 0.5 0.5 0.5 0.5 0.5 0.5 0.5 
##$DBPOFFS= (0..7)
0 0 0 0 0 0 0 0 
##$DE= 6
##$DECBNUC= <off>
##$DECIM= 32
##$DECNUC= <off>
##$DECSTAT= 4
##$DIGMOD= 1
##$DIGTYP= 9
##$DL= (0..7)
0 120 120 120 120 120 120 120 
##$DP= (0..7)
150 150 150 150 150 150 150 150 
##$DP07= 0
##$DPNAME0= <>
##$DPNAME1= <>
##$DPNAME2= <>
##$DPNAME3= <>
##$DPNAME4= <>
##$DPNAME5= <>
##$DPNAME6= <>
##$DPNAME7= <>
##$DPOAL= (0..7)
0.5 0.5 0.5 0.5 0.5 0.5 0.5 0.5 
##$DPOFFS= (0..7)
0 0 0 0 0 0 0 0 
##$DQDMODE= 0
##$DR= 18
##$DS= 0
##$DSLIST= <SSSSSSSSSSSSSSS>
$$ [...]
##$SUBNAM2= <"">
##$SUBNAM3= <"">
##$SUBNAM4= <"">
##$SUBNAM5= <"">
##$SUBNAM6= <"">
##$SUBNAM7= <"">
##$SUBNAM8= <"">
##$SUBNAM9= <"">
##$SW= 20.0188882624521
##$SWIBOX= (0..15)
0 0 2 0 0 0 0 0 0 0 0 0 0 0 0 0 
##$SW_h= 4006.41025641026
##$TD= 16384
##$TD0= 1
##$TE= 0
##$TE2= 300
##$TE3= 300
##$TEG= 300
##$TL= (0..7)
0 120 120 120 120 120 120 120 
##$TP= (0..7)
150 150 150 150 150 150 150 150 
##$TP07= 0
##$TPNAME0= <>
##$TPNAME1= <>
##$TPNAME2= <>
##$TPNAME3= <>
##$TPNAME4= <>
##$TPNAME5= <>
##$TPNAME6= <>
##$TPNAME7= <>
##$TPOAL= (0..7)
0.5 0.5 0.5 0.5 0.5 0.5 0.5 0.5 
##$TPOFFS= (0..7)
0 0 0 0 0 0 0 0 
##$TUNHIN= 0
##$TUNHOUT= 0
##$TUNXOUT= 0
##$USERA1= <user>
##$USERA2= <user>
##$USERA3= <user>
##$USERA4= <user>
##$USERA5= <user>
##$V9= 5
##$VALIST= <valist>
##$VCLIST= <CCCCCCCCCCCCCCC>
##$VD= 0
##$VDLIST= <DDDDDDDDDDDDDDD>
##$VPLIST= <PPPPPPPPPPPPPPP>
##$VTLIST= <TTTTTTTTTTTTTTT>
##$WBST= 1024
##$WBSW= 4
##$XGAIN= (0..3)
0 0 0 0 
##$XL= 0
##$YL= 0
##$YMAX_a= 574812
##$YMIN_a= -390723
##$ZGOPTNS= <>
##$ZL1= 120
##$ZL2= 120
##$ZL3= 120
##$ZL4= 120
##$ABSF1= 10
##$ABSF2= 0
##$ABSG= 5
##$ABSL= 3
##$ALPHA= 0
##$AQORDER= 0
##$ASSFAC= 0
##$ASSFACI= 0
##$ASSFACX= 0
##$ASSWID= 0
##$AUNMP= <proc_1d>
##$AZFE= 0.1
##$AZFW= 0.1
##$BCFW= 1
##$BC_mod= 2
##$BYTORDP= 1
##$COROFFS= 0
##$CY= 11.3945322036743
##$DATMOD= 1
##$DC= 2
##$DFILT= <>
##$DTYPP= 0
##$F1P= 2.36226072786647
##$F2P= -0.459571619588291
##$FCOR= 0.5
##$FTSIZE= 0
##$FT_mod= 4
##$GAMMA= 1
##$GB= 0.15
##$INTBC= 1
##$INTSCL= 1
##$ISEN= 128
##$LB= 0.24
##$LEV0= 0
##$LPBIN= 0
##$MAXI= 10000
##$MC2= 0
##$MEAN= 0
##$ME_mod= 0
##$MI= 1.114404
##$NCOEF= 0
##$NC_proc= 0
##$NLEV= 6
##$NOISF1= 3.799351
##$NOISF2= 2.8
##$NSP= 1
##$NTH_PI= 0
##$NZP= 0
##$OFFSET= 15.70392
##$PC= 1
##$PHC0= -12634.76
##$PHC1= 10.40099
##$PH_mod= 1
##$PKNL= yes
##$PPARMOD= 0
##$PSCAL= 0
##$PSIGN= 0
##$REVERSE= no
##$SF= 200.130013532006
##$SI= 16384
##$SIGF1= 3
##$SIGF2= 2
##$SINO= 400
##$SIOLD= 16384
##$SREGLST= <1H.CDCl3>
##$SSB= 0
##$STSI= 0
##$STSR= 0
##$SW_p= 3612.71676300578
##$SYMM= 0
##$S_DEV= 0
##$TDeff= 0
##$TDoff= 0
##$TI= <>
##$TILT= no
##$TM1= 0
##$TM2= 0
##$TOPLEV= 0
##$USERP1= <user>
##$USERP2= <user>
##$USERP3= <user>
##$USERP4= <user>
##$USERP5= <user>
##$WDW= 1
##$XDIM= 8192
##$YMAX_p= 0
##$YMIN_p= 0
$$ End of Bruker specific parameters
$$ ---------------------------------
##NTUPLES= NMR FID
##VAR_NAME=  TIME,          FID/REAL,        FID/IMAG
##SYMBOL=    X,             R,               I
##VAR_TYPE=  INDEPENDENT,   DEPENDENT,       DEPENDENT
##VAR_FORM=  AFFN,          ASDF,            ASDF
##VAR_DIM=   8192,          8192,            8192
##UNITS=     SECONDS,       ARBITRARY UNITS, ARBITRARY UNITS
##FACTOR=    0.0002496,     1,               1
##FIRST=     0,             0,               0
##LAST=      2.0444736,     0,               0
##MIN=       0,             -390723,         0
##MAX=       2.0444736,     574812,          0
$$ Real data points
##PAGE= N=1
##DATA TABLE= (X++(R..R)), XYDATA
$$ plain form
0 0 0 0 0 0 0 0 0 0 -8 8 -8 8 -16 16 -24 24 -32 40 -48 56 -72 86 -102 120 -138 162 -191 221 -254 291 -334
31 -334 381 -432 489 -553 624 -702 787 -880 982 -1095 1216 -1349 1493 -1653 1828 -2018
47 -2018 2224 -2451 2701 -2975 3278 -3611 3983 -4400 4867 -5400 6004 -6710 7535 -8519
61 -8519 9713 -11209 13135 -15718 19384 -25036 34965 -57637 222225 -30674 56053 574812
73 574812 -83871 55353 447796 2087 -10129 351107 9853 -24307 204773 24170
83 24170 -44394 114923 -6567 -29998 39738 -34594 -25858 6400 -72214 -4394 -15915 -80152
95 -80152 10468 -24817 -71501 35631 -38416 -41491 62273 -37744 -11976 92685 -23077
106 -23077 15271 118466 12685 28453 142314 63510 31972 157875 119676 30224 164849
$$ packed form
0@%%%%%%%%qJ6j6J6k4L2m0M8n6P2q8J04j28J58j88K22k58L00l53M12m75N45o25
31c34P15q13R21j042J177j326J489j667J862k077K311k565K842l146L481l846
47b018M242m675N152n676O253o889P594q383R267j0267J1404j2714J4245j6054
61h519J8232k0922K4344k8853L5102m4420O0001r2602K79862k52899Q6727N18759
73E74812o58683J39224L92443m45709j2216L61236l41254l4160K29080j80603
83B4170o8564J59317j21490k3431O9736p4332Q736L2258p8614O7820j1521o4237
95h0152R0620l5285m6684J07132p4047l075J03764j00017K5768J04661j15762
106b3077L8348J03195j05781J5768J13861p8804l1538J25903l8199q9452J34625
$$ plain form
117 164849 165134 30093 161070 189838 34006 144512 188863 42638 115929 165013 48987
128 48987 78359 128115 47236 36972 87515 33893 -471 50268 9665 -26601 20728 -18817
140 -18817 -38878 -1916 -41736 -36130 -19239 -51547 -21126 -30284 -46026 -716 -33255 -26762 20084
153 20084 -26440 -2044 37449 -9326 20365 49713 15015 35444 57854 39885 41371 62662
165 62662 58773 41728 64422 65408 40886 63188 59268 41010 57548 44423 42926 45971 26672
178 26672 44328 29739 11600 41179 12044 2890 31157 -4207 -1200 15642 -14432 -3644
190 -3644 -2485 -17585 -7702 -17854 -13919 -14235 -26301 -6550 -21061 -25557 -296 -24065 -16991 3084
204 3084 -19945 -4604 3906 -8287 7438 4358 8185 15107 6381 23980 18637 11111 33392 19379
$$ packed form
117A64849K85j35041J30977K8768j55832J10506M4351j46225P3291M9084j16026
128D8987K9372M9756q0879j0264N0543n3622l4364N0739m0603l6266M7329l9545
140a8817k0061L6962l9820N606J6891l2308L0421r158j5742M5310l2539O493M6846
153B0084m6524K4396L9493m6775K9691K9348l4698K0429K2410j7969J486K1291
165F2662l889j7045K2694R86k4522K2302l920j8258J6538j3125j497L045j9299
178B6672J7656j4589j8139K9579k9135r154K8267l5364L007J6842l0074J0788
190c644J159j5100R883j0152L935l16j2066J9751j4511m496K5261k3769P074K0075
204C084k3029J5341Q510j2193J5725l080L827O922q726J7599n343p526K2281j4013
$$ plain form
218 19379 17421 34482 19655 22251 27517 21380 21534 15983 24080 14621 4636 26158 3302 -2765
232 -2765 25080 -8750 -5580 19757 -16961 -5371 10583 -18708 -4358 1086 -13979 -5689 -5915
245 -5915 -5566 -9124 -7704 2054 -13238 -4127 5817 -15315 2036 4717 -12696 8075 654 -6169
259 -6169 10754 -2973 2694 9185 -3209 10389 4904 1078 13696 1154 8302 11717 384
272 384 15353 5648 3096 19523 -888 7393 18630 -4983 10656 14069 -5051 9819 8079
285 8079 -1881 4053 3860 1922 -4765 2405 3280 -13344 3192 2016 -17912 4352 -2270 -17164
299 -17164 3404 -6491 -10959 -815 -8125 -2254 -7179 -5176 5660 -13348 573 10910 -16307
312 -16307 7223 12816 -13494 11573 13007 -6027 11600 13346 3418 7086 15612 11870 440
$$ packed form
218A9379j958J7061j4827K596N266o137J54n551Q097r459r985K1522k2856o067
232b765K7845l3830L170K5337l6718J1590J5954k9291J4350N444j5065Q290k26
245e915L49l558J420R758j5292R111R944k1132J7351K681j7413K0771p421o823
259f169J6923j3727N667O491j2394J3598n485l826J2618j2542P148L415j1333
272C84J4969r705k552J6427k0411Q281J1237k3613J5639L413j9120J4870j740
285H079r960N934j93j938o687P170Q75j6624J6536j176j9928K2264o622j4894
299a7164K0568r895m468J0144p310N871m925K003J0836j9008J3921J0337k7217
312a6307K3530N593k6310K5067J434j9034J7627J746r928L668Q526l742j1430
$$ plain form
325 440 19426 15984 -5502 22805 15510 -8536 22701 12165 -7950 17767 8661 -5043 8114
338 8114 7476 -1862 -3711 8743 -815 -14011 10870 -1841 -19574 12155 -3807 -19474 10585
351 10585 -4433 -14449 5411 -1692 -7861 -1565 4299 -2046 -7241 11771 984 -9642 18053
364 18053 2347 -7724 20892 3196 -2070 18981 5329 3848 13307 9652 7809 6728 15484
377 15484 8166 1408 19974 5348 -1355 20815 1208 -1434 16927 -1915 -501 9350 -2232
390 -2232 -1416 299 199 -4497 -7044 3828 -9304 -10274 6652 -13654 -9172 7115 -14440 -5226
404 -5226 5142 -10953 -484 2738 -2720 2452 1632 7045 3139 3285 15466 2361 6980 19626
418 19626 1839 11502 19003 3323 13910 14614 6386 12913 9000 9957 7972 4953 12655 945
$$ packed form
325D40J8986l442k1486K8307p295k4046L1237j0536k0115K5717r106j3704J3157
338H114o38r338j849J2454r558j3196K4881j2711j7733L1729j5962j5667L0059
351A0585j5018j0016J9860p103o169O296N864o345n195J9012j0787j0626K7695
364A8053j5706j0071K8616j7696n266K1051j3652j481R459l655j843j081Q756
377A5484p318o758J8566j4626o703K2170j9607k642J8361j8842J414R851j1582
390b232Q16J715j00m696k547J0872j3132r70J6926k0306M482J6287k1555R214
404e226J0368j6095J0469L222n458N172q20N413l906J46J2181j3105M619J2646
418A9626j7787R663P501j5680J0587P04q228O527l913R57j985l019P702j1710
$$ plain form
432 945 3301 12480 -5198 3469 9457 -8230 4033 4419 -7406 2971 216 -3813 156 -1498
446 -1498 685 -4129 74 3516 -7476 3736 3369 -8067 7926 1049 -5366 10215 -1669 88
460 88 9870 -2704 6034 6977 -597 10256 3753 3691 11234 1837 8663 9647 2038 11837 6591 4349
476 4349 11459 4192 6634 7689 4283 7551 2138 6335 5999 -2869 8714 2023 -5096 9947 -1852
491 -1852 -4436 8690 -3733 -1458 4799 -2455 1947 521 2017 3779 -2638 7970 3725 -2615
505 -2615 12864 2440 140 14570 1438 4393 13061 1811 7979 9206 4072 8805 5026 7451
519 7451 7166 2496 10468 3933 2264 11311 1517 3641 9177 1672 5700 5143 5006 6426 729 10486
535 10486 5166 -2365 15218 2877 -2919 16918 841 -1506 14437 -171 793 8877 1133 1897
$$ packed form
432I45K356R179j7678Q667N988j7687J2263L86j1825J0377k755m029L969j654
446a498K183m814M203L442j0992J1212l67j1436J5993o877o415J5581j1884J757
460H8R782j2574Q738R43p574J0853o503o2P543r397O826R84p609R799n246k242
476D349P110p267K442J055l406L268n413M197l36q868J1583o691p119J5043j1799
491a852k584J3126j2423K275O257p254M402j426J496J762o417J0608m245o340
505b615J5479j0424k300J4430j3132K955Q668j1250O168J227n134M733l779K425
519G451k85m670P972o535j669R047r794K124N536p505M028n57j37J420n697R757
535A0486n320p531J7583j2341n796J9837j6077k347J5943j4608R64Q084p744P64
$$ plain form
549 1897 2152 3694 835 -2906 6352 -1849 -5147 7504 -4374 -4557 6929 -5464 -2624 4658 -3768
564 -3768 -1593 2093 1174 -2218 292 7632 -3848 -104 12520 -5397 1181 14379 -5239 2751
578 2751 12679 -1736 3603 8472 4041 3242 3470 10211 1777 -62 14626 -29 -1138 15122 -874
593 -874 88 11830 37 1498 6028 2129 1705 -71 4959 -613 -4594 7163 -4352 -6545 7110
608 7110 -8038 -6441 5437 -9641 -6540 2663 -7931 -7509 302 -3572 -9388 -34 1916 -11090
622 -11090 1661 6400 -11980 4989 7949 -9823 8198 7148 -5327 9890 4464 399 9248
635 9248 1285 5416 6630 -370 7461 3221 -669 6593 71 -677 2823 -1179 -1428 -1460 -691 -4041
651 -4041 -4416 1038 -8141 -5682 2846 -12133 -4608 3141 -14256 -2844 1540 -13295 -1568 -758
$$ packed form
549A897K55J542k859l741R258q201l298J2651j1878j83J1486j2393K840P282q426
564c768K175L686r19l392K510P340j1480L744J2624j7917O578J3198j9618P990
578B751R928j4415N339M869m431p99K28O741q434j839J4688j4655j109J6260j5996
593h74R62J1742j1793J461M530l899m24j776N030n572l981J1757j1515k193J3655
608G110j5148J597J1878j5078L101R203j0594M22P811l874n816R354J950j3006
622a1090J2751M739j8380J6969K960j7772J8021j050j2475J5217n426m065Q849
635I248p963M131J214p000P831m240l890P262o522p48L500m002k49l2P69l350
651d041l75N454r179K459Q528j4979P525P749j7397J1412M384j4835J1727Q10
$$ plain form
665 -758 -9082 -1431 -3125 -3383 -2384 -4159 1295 -3485 -2519 4079 -3386 392 4398 -1385 3464 2671
681 2671 1907 5274 1259 5064 5061 1127 7192 2861 2684 6772 -90 4853 4002 -2477 6274 -166 -3243
698 -3243 5333 -4526 -2794 1852 -7181 -1909 -2482 -7482 -1463 -6330 -5873 -2429 -7693 -2989 -4218 -6212
714 -6212 -663 -5969 -2608 528 -6308 2277 521 -4711 5549 15 -1562 6395 -260 1963 5232
729 5232 540 4199 2601 2202 4460 973 3668 2641 605 3287 -646 1868 1295 -3391 3963 -2381
745 -2381 -4702 5430 -6316 -4529 5480 -9332 -3495 3488 -10045 -2178 712 -8072 -2117 -1409
759 -1409 -4961 -3453 -1866 -1788 -5095 -251 388 -5907 2563 882 -5120 4801 240 -2218 5664 -390
775 -390 1853 4399 -208 5849 1669 1063 7949 -855 2733 7783 -2519 3984 5481 -2401 3826
$$ packed form
665g58q324P651j694k58R99j775N454m780R66O598p465L778M006n783M849p93
681B671p64L367m015L805ll934O065m331j77M088o862M943q51o479Q751o440l077
698c243Q576r859J732M646r033N272n73n000O019m867M57L444n264M704j229j994
714f212N549n306L361L136o836Q585j756n232J0260n534j577P957o655K223L269
729E232m692L659j598l99K258l487K695j027k036K682l933K514n73m686P354o344
745b381k321J0132j1746J787J0009j4812N837O983j3533P867K890q784N955P08
759a409l552J508J587P8l307M844O39o295Q470j681o002R921m561k458P882o054
775c90K243K546m607O057m180o06O886q804L588N050j0302O503J497p882O227
$$ plain form
790 3826 2271 -830 2026 -412 834 -1139 -1499 1967 -4264 -1666 1233 -6124 -1260 -560 -5373 -1494
806 -1494 -2273 -3014 -2817 -3370 594 -5087 -2373 3173 -7328 -209 4342 -8121 2155 4103 -6663
821 -6663 3769 2581 -3593 4028 1356 387 2289 1418 3443 -383 2497 4695 -2235 3821 4032 -3051
837 -3051 4349 1979 -1840 3423 -126 167 804 -990 1842 -2215 -906 2485 -4479 395 1481 -5372
853 -5372 1288 -350 -4210 1104 -2153 -1494 -237 -2912 1212 -2140 -1783 2975 -3913 225 3053 -4546
869 -4546 2305 2050 -2995 3217 702 -316 2684 205 2591 872 1035 4477 -993 2921 4307 -1515
885 -1515 4856 2665 -945 5407 288 857 4170 -1270 2577 1749 -1851 3479 -1407 -1027 2856 -3829
901 -3829 277 773 -4440 1049 -1898 -3242 571 -3840 -1374 -670 -4047 285 -2365 -2885 1259 -3438
$$ packed form
790C826j555l101K856k438J246j973l60L466o231K598K899p357M864P00m813L879
806a494p79p41J97n53L964n681K714N546j0501P119M551j2463J0276J948j0766
821f663J0432j188o174P621k672r69J902q71K025l826K880K198o930O056K11p083
837c051P400k370l819N263l549K93O37j794K832m057J309L391o964M874J086o853
853e372O660j638l860N314l257O59J257k675M124l352L57M758o888M138K828p599
869d546O851k55n045O212k515j018L000k479K386j719J63L442n470L914J386n822
885a515O371k191l610O352n119N69L313n440L847q28l600N330m886L80L883o685
901c829M106M96n213N489k947j344L813m411K466P04l377M332k650n20M144m697
$$ plain form
917 -3438 -821 377 -2748 1009 -1154 -1004 1586 -2161 1659 482 -1957 3565 -1502 -791 4169 -2994
933 -2994 1145 3295 -3517 2736 1229 -2198 3142 -807 -31 2108 -1562 2001 231 -1466 2900
948 2900 -1877 -239 1979 -2650 1098 -257 -1890 1620 -2366 -175 713 -3727 1608 -1109 -3608
963 -3608 2418 -2894 -2243 2134 -3325 50 517 -2490 1597 -1110 -209 1928 -1936 2418 1223 -1561
979 -1561 4133 64 -64 4009 -515 1707 2341 -185 2676 -177 893 1948 -2359 2330 -65 -3014
995 -3014 3202 -2143 -2632 2607 -3854 -1250 954 -4243 -281 -1328 -3104 272 -2794 -980 -713 -3007
1011 -3007 997 -2073 -2032 1531 -2822 -101 710 -2482 1351 -796 -838 1991 -2189 1659 1323 -2769
1027 -2769 3910 -132 -1807 5147 -1706 -241 4553 -1591 1385 3069 -354 2067 957 1855 1512
$$ packed form
917c438K617J198l125L757k163J50K590l747L820j177k439N522n067P11M960p163
933b994M139K150o812O253j507l427N340l949P76K139l670L563j770j697M366
948B900m777J638K218m629L748j355j633L510l986K191Q88m440N335k717k499
963c608O026n312O51M377n459L375M67l007M087k707R01K137l864M354j195k784
979a561N694m069j28M073m524K222O34k526K861k853J070J055m307M689k395k949
995c014O216n345m89N239o461K604K204n197L962j047j776L376l066J814K67k294
1011c007M004l070M1L563m353K721Q11l192L833k147m2K829m180L848l36m092
1027b769O679m042j675O954o853J465M794o144K976J684l423K421j110Q98l43
$$ plain form
1042 1512 -565 3459 -262 -939 4204 -1456 -653 3234 -2549 183 954 -2328 175 -1122 -778 -564
1058 -564 -2667 875 -2239 -2554 2048 -3661 -1144 1865 -4157 693 732 -3084 2045 -785 -657 2096
1074 2096 -2017 1879 1092 -2433 4096 -435 -1535 4890 -1467 -646 3654 -1252 7 2027 20
1089 20 -253 165 1893 -1334 -719 3136 -2915 -471 3147 -4016 655 1734 -3674 1427 -364 -2122
1105 -2122 1507 -2332 -97 378 -3336 1813 -1425 -2956 2607 -2943 -1381 2300 -3452 -208 883
1120 883 -2472 690 -604 -549 215 -1345 1782 -699 -1052 3109 -1449 -1 3166 -1208 1069 2132
1136 2132 206 1461 422 2274 882 -689 4161 -715 -626 4697 -2277 306 4045 -3170 1835
1151 1835 2084 -2694 2380 -70 -1316 2067 -1946 621 915 -2441 2141 -675 -1659 2392 -1901 -616
$$ packed form
1042A512k077M024l721o77N143n660Q03L887n783K732P71l282K503j297L44K14
1058e64k103L542l114l15M602n709K517L009o022M850L9l816N129k830J28K753
1074B096m113L896p87l525O529m531j100O425o357Q21M300m906J259K020k007
1089B0k73M18J728l227O15L855o051K444L618p163M671J079n408N101j791j758
1105b122L629l839K235M75l714N149l238j531N563n550J562L681n752L244J091
1120H83l355L162j294N5P64j560L127k481l53M161m558J448L167m374K277J063
1136B132j926J255j039J852j392j571M850m876Q9N323o974K583L739p215N005
1151A835K49m778N074k450j246L383m013K567K94l356M582k816r84M051m293J285
$$ plain form
1167 -616 1570 -1938 118 423 -521 -185 -725 1419 -1287 -1067 2986 -2293 -473 3345 -2881 613
1183 613 2450 -2248 1649 568 -522 1624 -1219 1670 1051 -2003 3688 -448 -1638 4223 -1381
1198 -1381 -604 3663 -1505 687 1835 -709 1369 45 783 832 -1044 1944 -451 -1018 2470 -1522
1214 -1522 12 2047 -1909 915 683 -932 1164 -850 839 604 -1679 2755 -811 -1249 3613 -2352
1230 -2352 -75 3597 -2687 1255 2196 -2037 2467 473 -297 2484 -970 1892 1387 -1476 3066 239
1246 239 -969 3062 -437 114 2117 -710 930 631 261 666 -440 1317 -264 -839 2202 -1416
1262 -1416 -157 1670 -2171 1072 441 -1826 1746 -1020 -313 1753 -2746 1507 680 -3263 3177 -726
1278 -726 -2752 3608 -2203 -1385 2867 -2365 -12 1269 -1595 784 -257 -225 709 -936 1150 94
$$ packed form
1167f16K186l508K056L05r44L36n40K144k706K20M053n279J820L818o226L494
1183F13J837m698L897j081j090K146k843K889o19l054N691m136j190N861n604
1198a381P77M267n168K192J148k544K078j324P38M9j876K988k395n67L488l992
1214a522J534K035l956K824k32j615K096k014J689k35k283M434l566m38M862n965
1230b352K277L672o284L942R41m233M504j994p70K781l454K862n05k863M542k827
1246B39j208M031l499N51K003k827J640k99l70M05j106J757j581n75L041l618
1262a416J259J827l841L243o31k267L572k766P07K066m499M253q27l943O440l903
1278g26k026O360n811Q18M252n232K353J281k864K379j041L2R34j645K086j056
$$ plain form
1294 94 -887 1779 -764 221 1395 -562 1566 -138 384 2082 -1592 2083 1526 -2145 3104 366
1310 366 -1948 3778 -859 -726 3071 -1435 703 1626 -1038 1716 15 59 1722 -1102 1423 972
1326 972 -1235 2324 -209 -420 2328 -740 780 1356 -539 1348 -267 536 1293 -1178 2011 343
1342 343 -1455 2582 -1182 -605 2537 -2254 596 1314 -2264 1765 -344 -1265 2035 -1714 238 1383
1358 1383 -2297 1583 263 -1396 1955 -732 -569 1303 -982 528 165 -628 887 -838 647 573
1374 573 -1364 1555 -728 -954 1914 -1602 388 1324 -1768 1304 -14 -1117 2045 -798 -79 1701
1390 1701 -1586 1301 701 -1162 2028 -396 -59 1662 -1324 865 421 -1177 1678 -817 -500 1308
1406 1308 -2069 782 365 -1810 1479 -1058 -981 1238 -1979 258 215 -1805 1251 -1004 -794 1418
$$ packed form
1294I4r81K666k543R85J174j957K128j704N22J698l674L675n57l671N249k738
1310C66k314N726m637J33L797m506K138R23k664K754j701M4J663k824K525m51
1326I72k207L559k533k11K748l068J520N76j895J887j615Q03P57k471L189j668
1342C43j798M037l764N77L142m791K850P18l578M029k109r21L300l749J952J145
1358A383l680L880j320j659L351k687J63J872k285J510l63p93J515j725J485p4
1374E73j937K919k283k26K868l516J990R36l092L072j318j103L162k843P19J780
1390A701l287K887o00j863L190k424L37J721k986K189m44j598K855k495L17J808
1406A308l377K851m17k175L289k537P7K219l217K237m3k020L056k255K10K212
$$ plain form
1422 1418 -1866 620 821 -1654 1462 -246 -980 1524 -1022 353 740 -1058 1185 -667 -363 1428
1438 1428 -1547 518 905 -1808 1407 -298 -1219 1467 -1073 57 752 -1370 973 -482 -679 1265
1454 1265 -1687 334 757 -2178 1601 -515 -1896 1521 -1716 -913 978 -1942 149 -453 -1560 687
1470 687 -1824 -672 45 -2486 679 -679 -2112 1329 -1525 -1100 1505 -1733 186 560 -1068 966
1486 966 -367 360 1012 -637 1551 234 -454 2349 -812 198 2266 -1358 1239 1363 -1190 1931
1502 1931 218 -195 1789 -521 884 704 -587 1657 -428 -101 1690 -1331 748 1043 -1612 1302
1518 1302 6 -891 1154 -1185 205 306 -1462 1062 -1082 -944 1182 -1934 -63 605 -2402 830
1534 830 -381 -1648 1067 -1459 -557 457 -1495 884 -562 -833 1213 -1098 461 1028 -1622 1185
$$ packed form
1422A418l284K486K01k475L116j708p34K504k546J375L87j798K243j852L04J791
1438A428k975K065L87k713L215j705r21K686k540J130O95k122K343j455j97J944
1454A265k952K021M23k935L779k116j381L417l237Q03J891k920K091o02j107K247
1470F87k511J152P17k531L165j358j433L441k854M25K605l238J919L74j628K034
1486I66j333P27O52j649K188j317o88K803l161J010K068l624K597J24k553L121
1502A931j713m13J984k310J405j80j291K244k085L27J791l021K079K95k655K914
1518A302j296q97K045k339J390J01j768K524k144J38K126l116J871O68l007L232
1534H30j211j267K715k526R02J014j952K379j446k71K046k311J559N67k650K807
$$ plain form
1550 1185 68 -1165 1640 -471 -234 1231 -737 649 227 -437 1099 -709 539 867 -1347 1199
1566 1199 41 -1054 1507 -972 -136 988 -1462 570 184 -1180 1382 -987 -386 973 -1731 710
1582 710 294 -1530 1184 -609 -920 1420 -1358 255 612 -1385 913 -190 -726 1016 -727 317
1598 317 361 -855 959 -241 -34 1297 -653 765 635 -842 1447 -375 -342 1650 -1118 610 1035
1615 1035 -1189 1286 -35 -708 1541 -1054 -22 700 -1573 1035 -291 -1259 1105 -1310 -582 597
1631 597 -1651 194 -223 -1337 831 -1274 -428 441 -1737 433 -368 -1152 725 -1129 -237 679 -1493
1648 -1493 747 -40 -1044 1188 -579 -137 959 -859 985 -3 -436 1499 -923 662 1315 -1263
1664 -1263 1461 818 -1149 2129 -124 -447 1739 -484 502 709 -670 1079 -2 -112 1160 -1105
$$ packed form
1550A185j117j233K805k111K37J465j968J386m22o64J536j808J248L28k214K546
1566A199j158j095K561k479Q36J124k450K032l86j364K562k369O01J359k704K441
1582G10m16j824K714j793l11K340k778J613L57j997K298j103n36J742j743J044
1598C17M4j216J814j200K07J331j950J418j30j477K289j822L3J992k768J728M25
1615A035k224K475j321o73K249k595J032P22k273K608j326r68K364k415P28J179
1631E97k248J845m17j114K168k105Q46Q69k178K170q01p84J877j854Q92R16k172
1648a493K240p87j004K232j767M42J096j818J844r88m33J935k422J585O53k578
1664a263K724o43j967L278k253l23K186k223R86K07j379J749j081j10J272k265
$$ plain form
1680 -1105 853 618 -1006 1228 -164 -1084 1146 -747 -243 385 -753 216 -520 186 267 -1238 1124
1697 1124 -160 -1562 1696 -850 -902 1641 -1396 -96 1112 -1292 777 -8 -660 1201 -1047 96
1713 96 931 -1463 1184 121 -1338 1453 -459 -828 1115 -621 -110 178 -674 -51 -801 195 -162 -1263
1731 -1263 726 -1020 -1197 1189 -1546 -329 724 -1782 497 -217 -1233 712 -1004 -241 742 -1761
1747 -1761 713 -34 -1392 1285 -755 -702 1385 -1311 -79 771 -1371 621 221 -753 445 -301 292
1764 292 169 -456 789 -502 65 728 -918 711 177 -902 1161 -634 -213 1077 -1441 368 367
1781 367 -1714 1076 -272 -1246 1133 -1169 -469 465 -1480 408 -594 -1122 553 -1451 -389 212
1797 212 -1691 503 -209 -1076 830 -655 -357 371 -919 402 -136 -592 848 -882 135 721 -1126
$$ packed form
1680a105J958k35j624K234j392r20K230j893N04O28j138R69p36P06Q1j505K362
1697A124j284j402L258k546n2K543l037J300J208k404K069p85o52J861k248J143
1713I6Q35k394K647j063j459K791j912l69J943j736N11K88q52O23p50R96l57j101
1731a263J989j746j77K386k735J217J053k506K279p14j016J945j716P63R83k503
1747a761K474p47j358K677k040N3K087k696J232Q50k142J992m00r74J198p46N93
1764B92j23o25J245j291N67O63j646J629n34j079K063j795M21J290k518J809j
1781C67k081K790j348r74K379k302P00R34j945J888j002n28J675k004J062O01
1797B12j903K194p12q67J906j485K98P28j290J321n38m56J440j730J017N86j847
$$ plain form
1814 -1126 833 -196 -815 984 -603 -241 717 -953 610 -281 -726 913 -1221 -185 856 -1820
1830 -1820 515 302 -1480 773 -306 -874 654 -896 -187 -176 -640 255 -966 -275 604 -1358 548
1847 548 115 -1416 1053 -494 -890 802 -765 -7 381 -775 736 -380 -233 741 -944 782 569
1864 569 -1093 1369 -33 -406 1422 -648 152 1068 -955 1050 148 -644 1040 -675 -185 907 -1058
1881 -1058 278 23 -862 456 -484 -203 12 -893 269 -821 -563 479 -1427 -117 259 -1727 418
1898 418 -337 -1221 777 -1117 -364 520 -1601 458 -290 -1346 1069 -900 -628 885 -1360 47 353
1915 353 -1074 345 -261 -421 257 -623 361 19 -562 919 -473 46 1178 -876 601 742 -716
1932 -716 958 -96 -144 716 -469 496 111 -801 1140 -722 -455 1249 -1138 74 596 -1579 372
$$ packed form
1814a126J959j029o19J799j587L62R58j670J563q91m45J639k134J036J041k676
1830a820K335k13j782K253j079n68J528j550P09J1m64Q95j221O91Q79j962J906
1847E48m33j531K469j547l96J692j567P58L88j156J511j116J47R74j685J726k13
1864E69j662K462j402l73J828k070Q00R16k023K005r02p92J684j715M90J092j965
1881a058J336k55q85J318r40K81K15r05J162j090K58J042j906J310L76j986K145
1898D18p55q84J998j894P53Q84k121K059p48j056K415j969K72J513k245J407L06
1915C53j427J419o06j60O78q80R84l42n81J481j392N19J132k054J477J41j458
1932g16J674j054m8Q60j185R65l85r12J941j862K67J704k387J212N22k175J951
$$ plain form
1949 372 141 -880 657 -571 -39 107 -667 553 -420 -129 892 -771 321 870 -1096 765 356
1966 356 -191 978 -140 262 442 -421 985 -87 -158 1162 -834 441 879 -1002 985 518 -865
1983 -865 1079 -330 -64 904 -864 570 221 -695 992 -484 -332 786 -1016 189 388 -1108 401
2000 401 -113 -453 368 -667 -81 -74 -686 305 -739 -128 434 -765 596 -100 -777 993 -541 -126 986
2019 986 -882 797 848 -722 1409 495 -532 1304 -210 179 966 -472 1006 135 43 980 -264
2036 -264 404 580 -534 830 -142 -216 876 -815 95 480 -773 615 -231 -536 813 -919 13 547
2054 547 -1210 596 288 -1033 672 -445 -362 554 -638 7 154 -442 384 -816 81 459 -885 764
2072 764 -101 -917 752 -609 -317 795 -893 74 182 -629 587 -246 -60 524 -837 488 61 -1011
$$ packed form
1949C72k31j021J537j228N32J46p74J220r73K91J021j663J092N49j966J861m09
1966C56n47J169j118M02J80q63J406j072p1J320j996J275M38j881J987m67j383
1983h65J944j409K66R68j768J434l49r16J687j476J52J118j802J205J99j496J509
2000D01n14l40Q21j035N86Po12R91j044O11N62j199J361o96o77J770j534M15J112
2019I86j868J679N1j570K131r14j027J836j514L89P87j438J478q71r2R37j244
2036b64O68J76j114J364r72p4J092j691R10L85j253J388q46l05J349j732R32N34
2054E47j757J806l08j321J705j117Q3R16j192O45J47n96Q26j200Q97L78j344J649
2072G64q65q16J669j361K92J112j688R67J08q11J216q33J86N84j361J325m27j072
$$ plain form
2090 -1011 804 -753 -365 652 -927 -36 139 -799 366 -497 -314 593 -1009 352 -56 -1148 813
2107 813 -428 -856 1086 -590 -139 716 -779 294 48 -236 537 -472 300 302 -377 853 -241 -290
2125 -290 813 -640 227 451 -612 827 -290 -367 893 -634 502 733 -884 938 -117 -540 1090
2142 1090 -626 -109 713 -739 490 196 -443 685 -333 220 542 -798 702 93 -772 740 -487
2159 -487 -191 759 -495 150 230 -721 552 -345 -60 472 -1041 256 -6 -690 680 -513 -202 425
2177 425 -858 160 166 -635 625 -481 -176 620 -1041 415 294 -933 1049 -194 -719 861 -464
2194 -464 -159 773 -605 382 50 -311 580 -375 561 419 -476 772 -129 -396 782 -600 210 493 -585
2213 -585 413 -223 -438 641 -796 381 506 -833 1000 -47 -611 1106 -749 -231 768 -904 335
$$ packed form
2090a011J815j557L88J017j579Q91J75r38J165q63J83R07j602J361m08j092J961
2107H13j241m28J942j676M51Q55j495J073k46k84P73j009P72Ko79J230j094m9
2125b90J103j453Q67K24j063J439j117p7J260j527J136K31j617J822j055m23J630
2142A090j716N17Q22j452J229k94o39J128j018N53L22j340J500o09q65J512j227
2159d87K96R50j254O45Q0r51J273q97K85N32j513J297k62o84J370j193L11O27
2177D25j283J018Oq01J260j106L05P96j661J456j21j227J982j243n25J580j325
2194d64L05R32j378R87l32l61Q91r55R36j42q95J248r01k67J178j382Q10K83j078
2213e85R98o36k15J079j437J177J25j339J833j047n64J717j855N18R99j672J239
$$ plain form
2230 335 181 -772 428 -419 -163 68 -724 424 -123 -711 656 -625 -208 717 -828 51 463 -577
2248 -577 219 -200 63 430 -458 494 -130 -311 860 -676 -74 862 -755 236 295 -836 711 -235 -420
2267 -420 559 -780 159 140 -685 466 -396 -304 655 -797 147 275 -794 482 -85 -400 468 -495 504
2286 504 32 -504 611 -254 -206 810 -718 239 597 -739 501 -64 -365 671 -332 178 440 -461
2304 -461 582 111 -262 881 -337 349 721 -533 826 42 -184 924 -378 173 598 -485 760
2321 760 203 -509 890 -454 -157 774 -591 318 255 -673 571 -274 -139 418 -365 343 65 -567 620
2340 620 -337 -137 613 -629 149 -1 -328 593 -530 -46 454 -787 524 102 -726 631 -384 -589
2358 -589 802 -742 -25 360 -808 535 -48 -334 568 -353 52 235 -580 507 -120 -101 656 -297 531
$$ packed form
2230C35j54r53J200q47K56K31p92J148n47n88J367j281M17R25j545Q79M12j040
2248e77P96m19K63L67q88R52o24j81J171j536O02R36j617R91N9j131J547r46j85
2267d20R79j339R39j9q25J151q62R2R59j452R44J28j069J276n67l15Q68r63R99
2286E04m72n36J115q65M8J016j528R57L58j336J240n65l01J036j003N10K62r01
2304d61J043m71l73J143j218O86L72j254J359p84k26J108j302N51M25j083J245
2321G60n57p12J399j344K97R31j365R09o3r28J244q45J35N57p83P08k78o32J187
2340F20r57K00P50j242P78j50l27R21j123M84N00j241J311m22q28J357j015k05
2358e89J391j544P17L85j168J343n83k86R02r21M05J83q15J087o27J9P57r53Q28
$$ plain form
2377 531 301 -434 706 -105 -198 867 -487 377 545 -768 572 -7 -486 593 -509 5 574 -451
2395 -451 407 -32 -392 475 -390 85 485 -572 597 13 -400 818 -314 23 498 -542 417 225
2413 225 -470 732 -22 -315 476 -304 275 168 -386 434 -213 -18 307 -583 585 71 -500 726 -519
2432 -519 -78 593 -813 406 375 -861 513 -67 -407 550 -517 73 166 -516 379 -333 -305 404 -537
2451 -537 50 318 -570 563 -205 -307 522 -403 198 438 -433 672 -74 -140 704 -396 256 623 -433
2470 -433 654 239 -134 695 -146 302 389 -284 697 -271 -190 835 -399 70 575 -627 680 236 -494
2489 -494 711 -249 -34 669 -469 473 227 -149 580 -219 28 508 -323 371 342 -358 625 -156 -24 431
2509 431 -293 426 169 -350 385 -235 27 371 -453 339 149 -504 591 -296 -120 565 -636 108 249
$$ packed form
2377E31k30p35J140q11r3J065j354Q64J68j313J340n79m79J079j102N14N69j025
2395d51Q58m39l60Q67q65M75M00j057J169n84m13J218j132L37M75j040R59j92
2413B25o95J202p54k93P91p80N79j07n54Q20o47J95L25q90J168n14n71J226j245
2432e19M41O71j406J219l1j236J374n80l40R57j067N90R3o82Q95p12K8P09r41
2451e37N87K68q88J133p68j02Q29r25O01K40q71J105p46o6Q44j100O52L67j056
2470d33J087m15l73Q29q41M48Q7o73R81r68Q1J025j234M69N05j202J307m44p30
2489d94J205r60K15P03j138R42k46l76P29p99K47M80q31O94k9p00R83p81J32M55
2509D31p24P19k57n19P35o20K62L44q24P92j90o53J095q87J76O85j201P44J41
$$ plain form
2528 249 -496 225 -177 -287 251 -486 -23 195 -493 502 -325 -577 423 -638 -7 179 -607 479 -109
2547 -109 -344 307 -456 37 181 -418 642 -58 -351 557 -641 -50 374 -529 451 114 -365 584 -251
2566 -251 -220 332 -216 290 -38 -269 394 -403 -16 403 -535 253 -21 -382 597 -142 24 415 -481 407
2586 407 255 -117 684 -323 161 575 -512 269 303 -420 612 -120 -240 380 -222 184 9 -121 349
2605 349 -313 58 252 -683 294 -82 -680 630 -603 -384 587 -694 102 304 -803 395 -233 -364
2623 -364 442 -529 -56 406 -455 405 -1 -338 402 -319 161 111 -252 459 -97 -38 594 -402 173 160 -462
2644 -462 537 -71 -310 635 -260 -74 320 -488 429 -10 -321 477 -323 11 349 -492 352 123 -422 558
2664 558 -203 138 345 -397 288 0 -299 617 -346 -174 398 -331 369 188 -617 608 -90 -153 297 -240
$$ packed form
2528B49p45P21m02j10N38p37M63K18o88R95q27k52J000j061O31J86p86J086n88
2547a09k35O51p63M93J44n99J060p00k93R08j198N91M24r03R80l37m79R49q35
2566b51L1N52n48N06l28k31O63p97L87M19r38P88k74l61R79p39J66L91q96Q88
2586D07j52l72Q01j007M84M14j087P81L4p23J032p32j20O20o02M06j75j30M70
2605C49o62L71J94r35R77l76n98J310j233K19R71j281P96K02j107J198o28j31
2623c64Q06r71M73M62q61Q60m06l37P40p21M80n0l63P11n56N9O32r96N75j3o22
2644d62R99o08k39R45q95J86L94q08R17m39l11P98q00L34L38q41Q44k29n45R80
2664E58p61L41K07p42O85k88k99R16r63J72N72p29P00j81q05J225o98o3M50n37
$$ plain form
2684 -240 128 277 -214 390 -196 -9 208 -711 263 -49 -393 632 -297 -373 348 -511 10 171 -502 317
2704 317 -51 -277 207 -465 -42 112 -382 162 -157 -374 319 -361 -168 198 -368 209 -138 -237 127 -452
2724 -452 305 328 -597 442 -70 -390 467 -372 -46 332 -484 388 62 -421 213 -234 -61 135 -568 230
2744 230 -165 -528 475 -381 -119 352 -464 119 338 -430 265 -187 -40 546 -195 183 183 -139 454 -240
2764 -240 164 484 -241 312 412 -242 483 10 -73 689 -319 335 133 -402 468 -299 -82 560 -283 76
2784 76 325 -475 187 -63 -253 354 -256 -95 261 -430 242 -231 -175 269 -586 -70 193 -501 86 -97 -458
2805 -458 254 -267 -35 95 -354 353 105 -191 573 -263 264 487 -336 423 128 -88 444 -87 223 761
2825 761 -324 463 230 -373 602 -98 -78 393 -235 150 -47 -342 359 -340 -153 239 -311 99 178 -479
$$ packed form
2684b40L68J49m91O04n86J87K17r19R74l12l44J025r29p6P21q59N21J61o73Q19
2704C17l68k26M84o72M23J54m94N44l19k17O93o80J93L66n66N77l47r9L64n79
2724d52P57K3r25J039n12l20Q57q39L26L78q16Q72l26m83O34m47J73J96p03P98
2744B30l95l63J003q56K62M71q16N83K19p68O95m52J47N86p41L78%l22N93o94
2764b40M04L20p25N53J00o54P25m73q3P62j008O54k02n35Q70p67K17O42q43L59
2784G6K49q00O62k50j90O07o10J61L56o91O72m73N6M44q55N16K63o94N87j83l61
2805d58P12n21K32J30m49P07k48k96P64q36N27K23q23P59k95k16N32n31L10N38
2825G61j085P87k33o03R75p00K0M71o28L85j97k95P01o99J87L92n50M10P9o57
$$ plain form
2845 -479 375 -248 -94 293 -447 105 140 -270 392 -278 57 383 -253 185 137 -338 424 -7 -57 270 -415
2866 -415 164 76 -176 321 77 -26 494 -251 155 458 -306 372 85 -315 367 -62 -109 283 -320 248 35
2887 35 -121 170 -515 57 23 -383 310 -190 -479 125 -366 -320 199 -485 -107 -190 -457 261 -405 -23 61 -367
2909 -367 113 -165 -412 247 -218 -206 313 -166 125 22 -323 491 -192 51 559 -125 176 214 -408 387 73
2930 73 -38 448 -87 48 203 -103 289 -27 137 145 -301 167 -78 -382 369 -130 -216 298 -270 -83 100
2951 100 -390 179 -276 -240 367 -411 -91 123 -417 62 -31 -252 281 -304 51 54 -170 375 33 11 346 -173
2973 -173 166 189 -267 371 73 -193 297 -203 97 319 -360 439 -9 -196 468 -201 -162 206 -505 156 -51
2994 -51 -433 170 -215 -158 88 -325 160 0 -144 79 -429 -193 -12 -282 34 -102 -339 220 -282 -248 296
$$ packed form
2845d79Q54o23J54L87p40N52L5m10O62o70L35L26o36M38m8m75P62m31n0L27o85
2866d15N79q8k52M97k44j03N20p45M06L03p64O78k87m00O82m29m7L92o03N68k13
2887C5j56K91o85N72l4m06O93n00k89O04m91M6N19o84L78q3k67P18o66L82Q4m28
2909c67M80k78k47O59m65J2N19m79K91j03l45Q14o83K43N08o84L01L8o22P95l14
2930G3j11M86n35J35J55l06L92l16J64Qm46M68k45l04P51m99q6N14n68J87J83
2951A00m90N69m55L6O07p78L20K14n40M79r3k21N33n85L55Lk24N45l42k2L35n19
2973a73L39K3m56O38k98k66M90n00L00K22o79P99m48j87O64o69L9L68p11O61k07
2994e1l82O03l85N7K46m13M85j60j44K23n08K36J81k70L16j36k37N59n02L4N44
$$ plain form
3015 296 -313 154 119 -341 359 -143 -225 515 -82 159 275 -175 445 66 -81 406 11 89 286 -90 346
3036 346 124 -104 294 -267 221 268 -187 121 -54 -354 232 -318 -69 -24 -306 -33 -223 -224 166 -391 -59
3057 -59 165 -437 221 -191 -322 306 -155 -243 163 -360 44 21 -295 285 -206 19 97 -194 174 -60 -238
3078 -238 354 12 -101 446 -240 346 -17 -223 334 -70 -176 598 -207 79 107 -144 263 -40 -299 410
3098 410 -217 50 8 -360 189 -214 -124 345 -282 57 -22 -375 326 -67 -215 138 -146 165 239 -184 368
3119 368 -140 -116 458 -505 148 60 -183 205 -75 -68 365 -16 101 241 -340 335 127 -93 339 -72 46
3140 46 156 -279 327 -6 -19 354 -237 59 223 -123 126 89 -457 170 -240 49 208 -480 -13 137 -255
3161 -255 104 -282 -70 36 -300 224 -25 -354 106 -243 -124 287 -508 178 186 -283 315 -104 -2 394 -285
$$ packed form
3015B96o09M67l5m60P00n02q2P40n97K41J16m50O20l79j47M87l95P8J97l76M36
3036C46k22k28L98n61M88M7m55L08j75l00N86n50K49M5k82K73j90jL90n57L32
3057e9K24o02O58m12j31O28m61q8M06n23M04k3l16N80m91K25P8k91L68k34j78
3078b38N92l42j13N47o86N86l63k06N57m04j06P74q05K86K8k51M07l03k59P09
3098D10o27K67m2l68N49m03R0M69o27L39p9l53P01l93j48L53k84L11P4m23N52
3119C68n08K4N74r63O53q8k43L88k80PM33l81J17J40n81O75k08k20M32m11J18
3140D6J10m35O06l33j3L73n91K96J64l46K49l7n46O27m10K89J59o88M67J50l92
3161b55L59l86K12J06l36N24k49l29M60l49J19M11p95O86Qm69N98m19J02L96o79
$$ plain form
3182 -285 25 268 -282 304 19 -115 262 -84 132 46 -205 407 174 63 301 -41 110 104 -18 259 -27
3203 -27 -199 236 -318 213 81 -269 219 -95 -271 199 -197 -78 249 -307 333 -104 -318 307 -238 -134
3223 -134 39 -217 232 135 -10 353 98 67 -71 -188 323 0 -77 411 -131 -17 195 -240 122 36 -338
3244 -338 319 -219 -56 176 -196 98 -144 -332 90 -142 -177 225 -401 9 59 -359 168 -108 -42 -6 -546
3265 -546 210 -76 -457 92 -204 -256 149 -215 -195 242 -205 217 -1 -12 318 -142 318 296 -79 346 225
3286 225 17 348 58 240 138 -117 374 94 -80 493 -79 190 262 -253 328 168 -208 278 -12 127
3306 127 252 -289 113 51 -271 82 -266 -60 195 -399 123 95 -292 127 -178 -221 225 -390 229 132 -19
3327 -19 359 43 88 319 31 162 1 -312 87 -127 -2 213 -307 167 183 -228 29 -32 -80 66 -310 82
$$ packed form
3182b85L10K43n50N86k85j34L77l46K16q6k51O12k33j11K38l42J51oj22K77k86
3203b7j72M35n54N31j32l50M88l14j76M70l96J19L27n56O40m37k14O25n45J04
3223a34J73k56M49r7j45L63k55l1j38j17N11l23p7M88n42J14K12m35L62q6l74
3244c38O57n38J63K32l72K94k42j88M22k32l5M02o26M10N0m18N27k76O6L6n40
3265e46P56k86l81N49k96n2M05l64K0M37m47M22k18j1L30m60M60k2l75M25j21
3286B25k08L31k90J82j02k55M91k80j74N73n72K69P2n15N81j60l76M86k90J39
3306A27J25n41M02o2l22L53l48K06K55n94N22k8l87M19l05m3M46o15O19r7j51
3327a9L78l16M5K31k88J31j61l13L99k14J25K15n20M74J6m11K57o1m8J46l76L92
$$ plain form
3349 82 103 -291 107 -178 -85 69 -173 -36 20 -351 184 -152 -196 19 -231 39 210 -248 82 -82 -215 158
3371 158 -268 12 34 -188 123 6 -51 179 -153 135 248 -91 319 -56 -174 280 -102 75 83 -64 235
3392 235 279 -15 248 -103 76 387 -156 282 -33 -205 262 -50 38 116 -332 126 44 -267 271 -230 -190 258
3414 258 -393 -12 -80 -259 -39 -197 -161 217 -263 -132 -10 -290 90 21 -123 273 -238 -147 175 -280 163
3435 163 99 -203 132 -249 71 29 -304 245 -136 -68 322 -117 69 164 -9 71 42 -152 112 -226 132 38
3457 38 -216 29 139 -175 198 -313 127 58 -451 183 49 -318 201 -68 -37 306 -273 277 -51 -124 212
3478 212 -71 46 203 -165 165 152 -231 275 -199 49 72 -108 52 147 -93 33 -116 9 242 -235 199
3499 199 -91 -373 232 -76 -108 56 -252 87 110 -96 149 -47 -227 256 -288 67 132 -359 52 -75 -264
$$ packed form
3349H2K1l94L98k85R3J54k42J37N6l71N35l36m4K15k50K70J71m58L30j64j33L73
3371A58m26K80K2k22L11j17n7K30l32K88J13l39M10l75j18M54l82J77Qj47K99
3392B35M4k94K63l51J79L11n43M38l15j72M67l12Q8P8m48M58q2l11N38n01M0M48
3414B58o51L81o8j79K20j58L6L78m80J31J22k80L80o9j44L96n11R1L22m55M43
3435A63o4l02L35l81L20m2l33N49l81O8L90m39J86R5j73Q0k9j94K64l38L58r4
3457C8k54K45J10l14L73n11M40o9n09O34j34l67N19k69L1L43n79N50l28p3L36
3478B12k83J17J57l68L30j3l83N06m74K48K3j80J60R5k40J26j49J25K33m77M34
3499A99k90k82O05l08l2J64l08L39K3k06K45j96j80M83n44L55O5m91M11j27j89
$$ plain form
3520 -264 244 -200 12 97 -33 173 -64 -189 132 -234 8 119 -417 266 -149 -50 -29 -242 167 12 -129
3541 -129 38 65 -93 403 -217 123 157 -214 128 39 -220 255 -9 -48 -7 -21 349 -131 -225 78 62 -22 111
3564 111 -171 145 185 -143 405 -32 73 137 -310 206 -20 -176 390 -90 69 168 -193 86 133 -188 170
3585 170 15 -254 176 -120 161 9 -95 225 -147 -73 216 -173 -6 206 -129 199 56 -51 94 -24
3605 -24 75 146 -181 408 -84 -129 266 -258 -59 83 -110 85 -137 -223 278 -235 -12 -23 -292 -57 -104 -120 70
3628 70 -344 -100 150 -66 172 2 -8 322 -87 196 218 -183 191 -54 -102 238 -56 -59 184 -90 248 -104
3650 -104 -83 278 -96 -26 233 -221 77 120 -169 335 -21 -36 138 23 40 34 -101 250 -149 -110 312 -232 79
3673 79 288 -201 110 -54 -274 32 -329 6 57 -319 -24 -81 -92 -48 -226 -19 -84 -30 131 9 -9 283 -54
$$ packed form
3520b64N08m44K12Q5j30K06k37j25L21l66K42J11n36O83m15R9K1k13M09j55j41
3541a29J67K7j58M96o20L40L4l71L42q9k59M75k64l9M1j4L70m80r4L03j6q4J33
3564A11k82L16M0l28N48m37J05O4m47N16k26j56N66m80J59R9l61K79M7l21L58
3585A70j55k69M30k96K81j52j04L20l72P4K89l89J67K12l35L28j43j07J45j18
3605b4R9P1l27N89m92m5L95n24J99J42j93J95k22q6N01n13K23j1k69K35m7j6J90
3628G0m14K44K50k16K38j70j0L30m09K83K2m01L74k45m8L40k94lK43k74L38l52
3650a04K1L61l74P0K59m54K98M3k89N04l56j5J74j15J7oj35L51l99L9M22n44L11
3673G9K09m89L11j64k20L06l61L35N1l76K95n7j1M4j78K07o5N4J61j22j8K92l37
$$ plain form
3696 -54 53 44 -132 288 96 25 163 -172 128 132 -163 210 -205 -259 141 -26 -192 205 -223 10 17 -209 105
3719 105 -211 34 138 -278 -83 58 -226 87 -240 -151 198 -119 20 -21 -170 101 -48 104 97 -192 -32
3740 -32 84 -313 -119 13 -43 387 -219 -48 98 -161 81 96 -14 207 60 120 -126 -145 175 17 -19 277
3762 277 -47 61 217 -227 173 74 10 77 -83 82 77 -98 212 -66 -134 241 -262 -52 196 -174 -7 50
3784 50 -255 49 -89 151 145 -100 202 -4 -133 190 -111 -167 78 -22 260 81 -160 158 -51 -13 97 -56
3806 -56 105 240 -58 232 -146 -132 26 -269 8 138 -140 224 -120 -129 302 -181 23 165 -48 -16 -118 -109
3828 -109 35 -160 124 -33 -228 155 -72 -142 -63 -78 14 215 -204 191 -8 -121 203 -303 123 -8 59 227
3850 227 -62 -209 194 -182 113 101 -77 132 -87 -42 83 14 -5 -48 -65 47 76 -116 152 -221 -107 168
$$ packed form
3696e4J07rj76M20j92p1J38l35L00Mk95L73m15n4M00j67j66L97m28K33Pk26L14
3719A05l16K45J04m16J95J41k84L13l27Q9L49l17J39m1j49K71j49J52pk89J60
3740c2J16l97J94J32n6M30o06J71J46k59K42J5j10K21j47O0k46j9L20j58l6K96
3762B77l24J08J56m44M00r9o4O7j60J65nj75L10k78o8L75n03K10K48l70J67N7
3784E0l05L04j38K40ok45L02k06j29L23l01n6K45j00K82j79k41L18k09L8J10j53
3806e6J61J35k98K90l78J4J58k95K77J30k78L64l44rM31m83K04J42k13L2j02R
3828a09J44j95K84j57j95L83k27p0P9j5R2K01m19L95j99j13L24n06M26j31O7J68
3850B27k89j47M03l76K95j2j78K09k19M5J25o9j9m3j7J12K9j92K68l73J14K75
$$ plain form
3872 168 -87 110 71 -133 143 -182 -79 109 -252 115 99 -160 109 -70 -101 103 -157 13 -108 -165 83
3893 83 -30 -171 149 -176 46 -167 45 210 -145 -88 -67 -105 51 42 -13 148 -28 -93 64 -69 37 103 -145
3916 -145 326 -115 -110 74 -329 -83 -4 -172 147 -123 -97 142 79 -44 129 -253 164 125 12 86 -177 124
3938 124 58 -18 188 126 -82 267 22 133 161 -28 153 282 147 114 -160 28 250 -4 -5 -65 -62 125 -138
3961 -138 -68 149 -118 9 77 -14 131 4 -106 -65 -177 232 -56 -120 171 -192 -67 -91 -155 108 -13 -125
3983 -125 113 -133 -249 95 -271 52 -42 -71 175 -72 -108 234 -97 -118 -45 -244 227 -63 -91 -77 -78 63 145
4006 145 -40 78 19 -116 234 -103 34 42 43 -95 6 11 128 51 67 73 20 -47 58 -112 276 57 71 181 -93
4031 -93 174 11 -229 64 -350 -78 63 -224 191 102 -132 250 -45 -228 109 -127 71 -76 -128 232 -28
$$ packed form
3872A68k55J97l9k04K76l25J03J88l61L67j6k59K69j79l1K04k60J70j21n7K48
3893H3j13j41L20l25K22k13K12J65l55N7K1l8J56rn5J61j76o5J57j33J06O6k48
3916a45M71m41NJ84m03K46P9j68L19k70K6K39o3j23J73l82M17l9j13P4k63L01
3938A24o6p6K06o2k08L49k45J11K8j89J81J29j35l3k74J88K22k54jo0LJ87k63
3961a38P0K17k67J27O8r1J45j27j10M1j12M09k88o4K91l63J25k4o4K63j21j12
3983a25K38k46j16L44l66L23r4k9K46k47l6L42l31k1P3j99M71k90k8J4jJ41Q2
4006A45j85J18n9j35L50l37J37QJj38J01NJ17p7J6On3o7J05j70L88k19J4J10k74
4031i3K67j63k40K93m14K72J41k87M15q9k34L82k95j83L37k36J98j47n2L60k60
$$ plain form
4052 -28 -139 144 -9 71 136 -28 265 92 -5 283 -61 -79 -54 -34 101 -168 -42 102 -169 -125 149 -168 196
4075 196 -61 -90 55 -124 62 -5 -53 209 -74 -334 89 -52 141 136 -101 22 -111 -82 200 -75 6 39 -170
4098 -170 140 67 -143 154 64 90 208 -239 427 143 -55 148 -28 118 296 -30 -8 33 -161 325 -29 -34
4120 -34 153 -124 116 225 53 323 -105 266 125 -140 16 161 -271 165 -187 43 119 -285 135 -58 -249
4141 -249 99 112 -116 71 23 57 129 -116 156 -103 20 65 2 -85 12 -52 239 136 -24 39 -238 109 285
4164 285 -176 -47 66 -277 290 -94 -2 245 -15 -78 -117 -149 109 -141 -38 95 -96 164 -130 26 131
4185 131 -61 -28 74 -38 -67 -36 -265 -28 -285 97 213 11 212 -30 -271 135 -102 -28 46 -229 211 92
4207 92 99 171 -10 72 76 -90 -18 30 -26 28 133 -113 121 -98 177 -70 -230 144 -66 2 255 -192 16 170
$$ packed form
4052b8j11K83j53Q0O5j64K93j73r7K88l44j8K5K0J35k69J26J44k71M4K74l17L64
4075A96k57k9J45j79J86o7m8K62k83k60M23j41J93nk37J23j33K9K82k75Q1L3k09
4098a70L10p3k10K97r0K6J18m47O66k84j98K03j76J46J78l26K2M1j94M86l54n
4120c4J87k77K40J09j72K70m28L71j41k65J56J45m32M36l52K30P6m04M20j93j91
4141b49L48J3k28J87m8L4P2k45K72k59J23M5o3q7R7o4K91j03j60O3k77L47J76
4164B85m61J29J13l43N67l84R2K47k60o3l9l2K58k50J03J33j91K60k94J56J05
4185A31j92L3J02j12k9L1k29K37k57L82J16k02K01k42k41M06k37P4P4k75M40j19
4207I2PP2j81Q2Mj66P2M8n6N4J05k46K34k19K75k47j60L74k10O8K53m47K08J54
$$ plain form
4231 170 -175 170 -65 67 65 -179 -96 148 -207 160 -93 -91 58 -96 -25 -28 -191 46 -51 -41 -121 31 95 -7
4255 -7 -140 59 115 -173 136 -154 -16 172 -15 80 89 -11 179 -87 -35 0 -39 145 13 -104 96 78 2 208
4279 208 -69 85 154 -178 17 -85 105 192 -185 68 1 43 -9 -126 -52 -5 -160 27 33 -42 12 6 -15 -83 -85 29
4305 29 117 -58 290 -27 55 200 39 17 -104 -166 72 59 78 171 -86 -97 73 -64 15 52 -134 260 -147 -41
4329 -41 191 -175 219 -70 -177 142 -136 53 321 -220 117 -20 -178 53 -115 -33 55 -215 -118 79 -166
4350 -166 16 -83 52 121 -98 99 93 12 -3 -168 -30 39 -139 19 -81 -141 194 -48 -7 -44 54 -56 -97 -143
4374 -143 119 -11 -58 -35 -306 274 82 -52 81 -42 6 88 -62 8 157 -118 -90 -83 -117 25 -98 27 144
4397 144 -43 151 -60 38 92 -302 57 -68 -177 94 185 -8 230 -18 134 92 -46 116 121 -54 182 76
$$ packed form
4231A70l45L45k35J32kk44Q3K44l55L67k53KJ49j54P1lj63K37r7J0q0J52O4j02
4255gj33J99N6k88L09k90J38J88j87R5Rj00J90k66N2L5l9J84j32j17K00j8p6K06
4279B08k77J54O9l32J95j02J90Q7l77K53o7M2n2j17P4M7j55J87Op5N4ok1o8kJ14
4305B9Q8j75L48l17Q2J45j61k2j21o2K38j3J9R3k57j1J70j37P9L7j86L94m07J06
4329d1K32l66L94k89j07L19k78J89K68n41L37j37j58K31j68Q2Q8k70R7J97k45
4350a66J82r9J35O9k19J97oq1j5j65J38O9j78J58j00o0L35k42M1l7R8j10m1m6
4374a43K62j30m7K3k71N80j92j34J33j23M8Q2j50P0J49k75K8Pl4J42j23J25J17
4397A44j87J94k11R8N4l94L59j25j09K71R1j93K38k48J52m2j38J62Nj75K36j06
$$ plain form
4419 76 -2 163 -47 -60 13 -158 229 -61 -136 333 79 -38 218 -11 150 74 -67 141 -153 41 -140 -84
4441 -84 169 47 -99 -63 -216 -71 7 56 113 -66 -10 31 -64 -46 97 -30 241 19 77 115 -32 -28 20 -374 49
4466 49 -142 89 161 -99 23 -21 90 68 174 10 51 -26 -121 124 22 84 -64 -165 116 -164 -128 111 15
4489 15 70 70 -61 -13 -45 -104 -38 -141 40 -28 -213 207 102 127 -13 -133 -7 63 -76 20 -228 -236 96 -209 -40
4514 -40 -27 -117 88 -81 24 -29 -246 -30 167 -20 12 17 -38 173 -113 -27 42 -61 63 -130 -21 278 -56
4537 -56 55 -126 -75 166 31 -74 91 -23 -57 15 -141 -12 8 -65 197 -69 -61 13 -41 77 -79 -146 -82 -98
4561 -98 43 38 -175 -89 -127 -74 70 -106 65 68 -179 85 -51 7 116 42 -128 88 44 154 -165 38 271 11
4585 11 28 239 -174 234 24 -144 126 -158 36 -52 10 22 -37 -26 253 -197 -64 -75 -186 17 -35 -148 -5
$$ packed form
4419G6p8J65k10j3P3j71L87k90p5M69k54j17K56k29J61p6j41K08k94J94j81N6
4441h4K53j22j46L6j53J45P8M9N7j79N6M1r5J8J43j27K71k22N8L8j47MM8l94M23
4466D9j91K31P2k60J22m4J11k2J06j64M1p7r5K45j02O2j48j01K81k80L6K39r6
4489A5N5%j31M8l2n9O6j03J81o8j85M20j05K5j40j20J26P0j39R6k48qL32l05J69
4514d0J3r0K05j69J05n3k17K16J97j87L2Nn5K11k86Q6O9j03J24j93J09K99l34
4537e6J11j81N1K41j35j05J65j14l4P2j56J29K0p3K62k66QP4n4J18j56o7O4j6
4561i8J41nk13Q6l8N3J44j76J71Lk47K64j36N8J09p4j70K16m4J10l19K03K33k60
4585A1J7K11m13M08k10j68K70k84J94q8O2J2n9J1K79m50J33j1j11K03n2j13J43
$$ plain form
4608 -5 -67 -202 -53 -231 69 134 -68 9 -69 -252 199 -251 127 40 -98 249 -91 -47 73 -65 8 134 -97
4631 -97 241 -19 44 -70 -35 4 64 -237 105 -35 -96 87 -129 -39 27 -101 3 55 -69 197 -165 -13 13
4654 13 -170 45 25 78 147 26 40 -17 -145 -38 19 63 75 -141 5 225 -115 105 48 -28 127 -164 8 27
4678 27 -209 -28 155 -46 107 -44 -76 -88 25 -27 45 -135 156 -79 -142 1 -223 108 -102 -77 40 -68
4700 -68 -20 -48 -188 -43 -72 -65 -81 -131 -187 -28 -188 -111 92 -48 151 -64 74 144 -141 269 46 -111 98 -1
4724 -1 -245 147 -79 11 7 -303 23 -48 144 6 -22 41 164 -106 56 76 -12 -10 -46 -54 106 -178 169 78 -2 78
4750 78 -114 15 156 10 -2 18 -108 122 21 57 77 -73 -50 114 -139 150 -76 -30 33 -162 333 93 -63
4773 -63 50 -60 53 34 -207 62 -24 -168 46 -69 -334 91 -120 -5 28 -17 260 -33 -133 85 -2 64
$$ packed form
4608eo2j35J49j78L00O5k02P7p8j83M51m50L78q7j38L47l40M4J20j38P3J26k31
4631i7L38k60O3j14L5L9O0l01L42j40o1J83k16R0O6j28J04N2j24K66l62J52K6
4654A3j83K15k0N3O9j21J4n7j28J07N7M4J2k16J46K20l40K20n7p6J55k91J72J9
4678B7k36J81J83k01J53j51l2j2J13n2P2j80K91k35o3J43k24L31k10K5J17j08
4700f8M8k8j40J45k9Pj6n0n6J59j60P7K03j40J99k15J38P0k85M10k23j57K09r9
4724ak44L92k26R0ml10L26p1J92j38k8O3J23k70J62K0q8Kl6qJ60k84L47r1q0Q0
4750G8j92J29J41j46j2K0j26K30j01L6K0j50K3J64k53K89k26M6O3j95M95k40j56
4773f3J13j10J13j9k41K69q6j44K14j15k65M25k11J15L3m5K77k93j00K18q7O6
$$ plain form
4795 64 -11 -163 -53 -49 -105 30 -154 -27 132 -19 -70 -56 -6 15 35 -2 71 -69 195 135 -2 115 44 -72 -16
4820 -16 -295 107 83 76 214 -94 55 62 -47 -3 37 -48 362 19 -1 255 -154 -68 -76 3 6 -88 -63 82 -181 91
4846 91 32 -39 43 -19 -5 106 -179 28 -303 5 175 -28 -2 416 29 -24 85 -139 23 -84 -78 21 -38 -42 127
4871 127 -141 -109 85 -248 74 -40 -10 -61 -162 66 -147 -119 24 -260 111 -96 -9 -50 8 24 -82 -184 5
4894 5 202 -20 42 -41 -210 89 56 75 152 -264 -101 163 -148 3 20 -182 -44 -269 115 127 -68 189 -234
4917 -234 -13 195 13 -80 59 48 55 58 15 104 -6 57 315 -129 213 -254 -122 193 -19 -101 62 -5 49 -38
4941 -38 -16 293 -211 61 34 -154 52 85 80 68 -70 22 30 -44 59 -54 -27 54 -153 -88 105 -27 -13 -82 -174 -6
4967 -6 -58 -4 -26 -119 63 -55 -11 49 -186 -45 51 -153 123 -222 -297 57 -24 -113 117 88 126 62 -269 68 -252
$$ packed form
4795F4p5j52J10Mn6J35j84J27J59j51n1J4N0K1K0l7P3j40K64o0j37J17p1j16N6
4820a6k79M02k4pJ38l08J49Pj09M4M0q5M10l43k0K56m09Q6qP9Lr4K5J45k63K72
4846I1n9p1Q2o2J4J11k85K07l31L08J70k03K6M18l87n3J09k24J62j07OR9n9mJ69
4871A27k68L2J94l33L22j14L0n1j01K28k13K8J43k84L71k07Q7m1N8J6j06j02J89
4894EJ97k22O2q3j69K99l3J9P7m16J63K64l11J51J7k02J38k25L84J2j95K57m23
4917b34K21K08j82r3J39j1PLm3Q9j10O3K58m44L42m67J32L15k12q2J63o7N4q7
4941c8K2L09n04K72k7j88K06L3nj2j38R2Qp4J03j13K7Q1k07O5J93j32J4o9r2J68
4967fn2N4k2r3J82j18M4O0k35J41R6k04K76l45p5L54q1q9K30k9L8o4l31L37l20
$$ plain form
4992 -252 -103 -45 -118 29 -10 -25 67 -206 -10 140 -119 150 -52 119 118 -19 -120 192 -184 65 -85 -163 -10
5015 -10 -68 -109 254 -46 56 -46 -89 103 2 102 206 -109 -140 -85 -33 30 -213 23 43 -254 -109 0 -46
5038 -46 -21 -168 -68 63 -121 209 56 -39 119 -138 -80 183 106 20 32 -15 42 86 -155 197 -58 135 46 -189
5062 -189 60 107 -130 173 -21 -229 8 -79 -53 -167 -146 56 -136 94 70 -258 110 -128 -41 139 -106 -9
5084 -9 132 -131 162 58 -88 113 -53 -19 189 -124 180 35 -146 233 56 -6 -31 -103 40 108 -52 -151 -42
5107 -42 12 297 -108 60 184 79 125 -182 -127 -56 -95 -236 -188 -167 73 31 -42 -17 -94 -174 96 26 161 -19 84
5132 84 189 -139 86 -2 -69 38 -21 127 91 -225 -4 99 57 189 104 33 248 -59 -58 92 34 123 87 24 127
5157 127 -100 -16 160 -92 25 48 -19 83 -27 -143 174 20 -7 21 -95 9 -41 -63 51 -215 91 67 -216
$$ packed form
4992b52J49N8p3J47l9j5R2k73J96J50k59K69k02J71jj37j01L12l76K49j50p8J53
5015a0n8m1L63l00J02j02m3J92j01J00J04l15l1N5N2O3k43K36K0k97J45J09m6
5038d6K5j47J00J31j84L30j53r5J58k57N8K63p7q6J2m7N7M4k41L52k55J93q9k35
5062a89K49M7k37L03j94k08K37q7K6j14K1K02j92K30k4l28L68k38Q7J80k45R7
5084iJ41k63K93j04j46K01j66L4K08l13L04j45j81L79j77o2k5p2J43O8j60r9J09
5107d2N4K85m05J68J24j05M6l07N5P1l9j41M8K1K40m2p3K5p7q0K70p0J35j80J03
5132H4J05l28K25q8o7J07n9J48l6l16K21J03m2J32q5p1K15l07JJ50n8Q9l6o3J03
5157A27k27Q4J76k52J17K3o7J02j10j16L17j54k7K8j16J04n0k2J14k66L06k4k83
$$ plain form
5180 -216 55 36 -268 112 -88 -58 159 -145 194 -139 41 52 -45 -21 117 -46 94 -60 -56 131 5 -67 -74
5203 -74 -210 -66 147 -306 122 21 46 154 -177 136 91 61 39 -211 110 296 -151 28 174 -192 114 -177
5225 -177 -10 109 -18 -66 30 -108 47 -20 93 96 -23 66 -161 -247 102 89 -105 -104 -203 75 66 2 70 52 -26 115
5251 115 -159 69 110 -84 70 12 93 -98 -153 110 -7 -40 62 86 -60 97 -207 -65 54 -99 65 115
5273 115 28 102 -59 50 122 -143 155 3 149 26 44 -97 71 -172 189 50 -164 127 -151 -112 79 26
5295 26 -95 22 35 114 -242 118 97 -293 70 -59 -73 143 -110 -84 114 -206 -126 44 -205 55 -85 52
5317 52 141 -40 184 -14 -203 -28 -152 7 75 -40 97 32 -175 -25 -12 15 119 -211 -10 148 -183 179
5339 179 -26 31 85 -15 -46 136 -77 -65 -134 -54 -33 -286 79 100 -171 154 -74 -121 81 -221 -64 -56 -92 75
$$ packed form
5180b16K71j9l04L80k00L0K17l04L39l33J80J1r7K4J38j63J40j54MJ87j26p2p
5203g4j36J44K13m53M28j01K5J08l31L13m5l0k2k50L21J86m47J79J46l66L06k91
5225a77J67J19j27m8R6j38J55o7J13Lj19Q9k27q6L49j3j94Jr9K78ro4O8j8p8J41
5251A15k74K28M1j94J54n8Q1j91n5K63j17l3J02K4j46J57l04J42J19j53J64N0
5273A15q7P4j61J09P2k65K98j52J46j23J8j41J68k43L61j39k14K91k78L9J91n3
5295B6j21J17J3P9l56L60k1l90L63j29j4K16k53K6J98l20Q0J70k49K60j40J37
5317E2Q9j81K24j98j89J75j24J59O8j15J37o5k07J50J3K7J04l30K01J58l31L62
5339A79k05N7N4j00l1J82k13J2o9Q0K1k53L65K1k71L25k28m7K02l02J57Ql6J67
$$ plain form
5363 75 -27 80 107 -185 -81 47 -118 -102 40 56 89 59 25 94 -1 72 -73 12 157 -111 -66 -30 -109 24 139
5388 139 -21 192 23 86 202 -161 89 11 -169 31 71 40 182 -36 -37 -20 41 -78 -82 15 -46 -230 -10 121
5412 121 74 -53 36 -156 24 -43 46 104 -119 78 -155 6 6 -149 82 50 39 71 -36 -21 -48 45 79 180 -192
5437 -192 181 127 -230 96 -89 2 94 -97 129 -98 14 27 33 -58 -62 -60 58 132 -15 149 -121 -107 18 -14 -16
5462 -16 32 -39 259 -53 -33 73 -80 34 166 -64 29 -176 53 -112 -206 180 62 -196 112 -45 -121 117
5484 117 -127 34 4 -76 113 -245 35 -103 -176 12 39 -118 53 -71 -182 217 -46 -77 138 139 35 -129
5506 -129 -65 45 -48 24 182 -129 114 151 -64 34 104 -25 66 -199 52 -83 -38 22 -19 55 19 -6 99 -30
5530 -30 21 105 -172 -197 -2 -158 -7 101 10 131 154 92 164 -110 -26 130 -108 42 -147 -127 42 -168 86
$$ packed form
5363G5j02J07K7k92J04J28j65J6J42J6L3l0l4O9r5P3j45Q5J45k68M5L6p9J33J15
5388A39j60K13j69O3J16l63K50p8j80K00M0l1J42k18jJ7O1j19mR7o1j84K20J31
5412A21m7j27Q9j92J80o7Q9N8k23J97k33J61%j55K31l2j1L2j07J5k7R3L4J01l72
5437a92L73n4l57L26j85R1R2j91K26k27J12J3Or1mKJ18P4j47J64k70J4J25l2k
5462a6M8p1K98l12K0J06j53J14J32k30R3k05K29j65r4L86j18k58L08j57p6K38
5484A17k44J61l0q0J89l58K80j38p3J88K7j57J71j24j11L99k63l1K15Jj04j64
5506a29O4J10r3P2J58l11K43L7k15R8P0j29R1k65K51j35M5O0m1P4l6k5J05j29
5530c0N1Q4k77k5J95j56J51J08r1J21K3o2P2k74Q4J56k38J50j89K0J69k10K54
$$ plain form
5553 86 106 -13 107 25 147 207 1 -23 -32 -154 129 53 180 8 -47 7 -48 58 -32 -94 -89 246 -60 -75 46
5578 46 -21 -21 -102 -37 28 -10 77 203 30 106 -74 -159 -62 -88 5 -68 -91 100 -91 -10 105 -77 118 32 72 69 -2
5605 -2 8 182 -109 240 125 -130 108 -16 -169 143 -19 -35 -82 -102 76 60 -222 -64 89 44 174 -41 135
5628 135 31 -151 -127 -173 -64 0 44 86 110 0 128 12 25 163 -89 36 106 41 163 -208 100 7 -98
5651 -98 50 127 -19 178 78 -112 75 -83 220 76 -120 67 -97 150 51 -44 -46 215 -102 160 -134 -36
5673 -36 50 -157 134 81 -59 62 16 -76 46 -113 -164 142 -112 -39 67 77 102 -149 -42 -15 -71 252 39 58
5697 58 89 -88 108 65 -102 216 12 62 72 -91 36 112 -217 113 -12 -102 -55 -91 142 -77 -224 98 74
5720 74 -188 -44 14 -8 -101 -79 -265 60 -96 47 12 56 107 -161 88 -22 -288 239 -58 30 -67 -197 67
$$ packed form
5553H6K0j19J20q2J22O0k06k4rj22K83p6J27j72n5N4n5J06r0o2NL35l06j5J21
5578D6o7%q1O5O5l8Q7J26j73P6j80q5R7k6R3p3k3J91j91Q1J15j82J95q6M0lp1
5605bJ0J74k91L49j15k55K38j24j53L12j62j6m7k0J78j6k82J58J53m5J30k15J76
5628A35j04j82K4m6J09O4M4M2K4j10J28j16J3J38k52J25P0o5J22l71L08r3j05
5651i8J48P7j46J97j00j90J87j58L03j44j96J87j64K47r9r5kK61l17K62k94R8
5673c6Q6k07K91n3j40J21m6r2J22j59n1L06k54P3J06J0K5k51J07K7n6L23k13J9
5697E8L1j77J96m3j67L18k04N0J0j63J27P6l29L30j25r0M7l6K33k19j47L22k4
5720G4k62J44N8k2r3K2j86L25j56J43l5M4N1k68K49j10k66N27k97Q8r7j30K64
$$ plain form
5743 67 138 -42 -47 48 -4 39 -190 87 10 -38 75 10 55 -25 -87 188 -29 52 79 -146 32 27 -92 -111 -149 31
5769 31 -17 28 -128 -51 54 -20 -28 -145 36 -174 -9 141 -133 210 -68 -33 167 -59 -40 27 -164 137 196 -197
5793 -197 -51 -18 -8 149 -129 -38 56 -56 98 -152 -113 82 61 -127 71 3 75 34 -348 121 -32 70 402
5816 402 69 -27 67 -158 15 112 2 -102 58 -110 203 -194 48 12 -62 69 73 -12 -72 18 107 -4 177 111
5840 111 54 142 -10 -76 136 5 -53 58 -190 31 -53 -239 -68 -77 -175 -107 -43 115 -28 -104 14 224 -43 76
5864 76 -4 -44 31 175 115 -69 -44 -100 -160 -20 99 -154 9 2 -138 124 -127 16 158 42 85 -149 -168 78
5888 78 91 58 63 5 -79 -45 -102 11 -15 48 -26 -270 194 -78 -45 118 -108 50 20 -17 110 43 -11 -46 -144 -139 207
5915 207 55 24 157 -22 24 -3 53 105 -148 -113 50 -26 175 56 112 97 72 -46 -47 -82 166 -41 -167 115
$$ packed form
5743F7P1j80nR5n2M3k29K77p7m8J13o5M5q0o2K75k17Q1K7k25J78nj19j9l8J80
5769C1m8M5j56P7J05p4qj17J81k10J65J50k74L43k78L5K00k26J9O7j91L01N9l93
5793a97J46L3J0J57k78R1R4j12J54k50L9J95k1j88J98o8P2m1l82M69j53J02L32
5816D02l33r6R4k25J73R7j10j04J60j68L13l97K42l6p4J31Mq5o0R0Q9j11J81o6
5840A11n7Q8j52o6K12j31n8J11k48K21q4j86J71rr8O8O4J58j43p6J18K10k67J19
5864G6q0m0P5J44o0j84K5n6o0J40J19k53J63pj40K62k51J43J42j16M3k34j9K46
5888G8J3l3Nn8q4L4n7J13k6O3p4k44M64k72L3J63k26J58l0l7J27o7n4l5r8NL46
5915B07j52l1J33j79M6k7N6N2k53L5J63p6K01j19N6j5k5j18jl5K48k07j26K82
$$ plain form
5939 115 -51 -54 25 4 263 -42 -79 161 -234 -109 89 -55 -101 -127 58 1 -80 79 60 -112 95 -179 -64
5962 -64 -15 -84 -52 -150 -37 150 -117 54 110 -177 32 44 -81 187 -57 -153 93 45 80 71 30 -22 168 -139 37
5987 37 -16 205 64 -18 28 111 8 -79 67 -6 -51 -1 -30 -45 -18 8 -153 -1 -32 119 193 36 -88 10 -11 -63
6013 -63 -43 -218 106 220 -195 61 66 -104 14 -17 -50 190 -128 87 139 69 103 -109 64 35 -96 -138 49 5
6037 5 187 -125 7 33 35 50 -46 -24 91 -19 117 -63 13 -96 -118 -99 107 -116 91 -84 -66 115 -120 -24
6061 -24 94 -143 -85 125 110 -67 -7 -46 82 -141 -137 -22 -2 -102 -118 -193 -16 45 45 78 -64 74 -56 -25 52
6086 52 -6 -25 138 128 199 95 -150 36 -63 -29 -46 -24 37 27 -74 12 37 -169 19 -189 24 -88 -61 207 108
6111 108 -84 43 -10 -80 30 -225 19 114 61 20 -259 -96 -64 -174 56 -122 -64 62 15 45 20 -8 -51 15
$$ packed form
5939A15j66lP9k1K59l05l7K40l95J25J98j44m6k6J85n7q1J59j9j72K07k74J15
5962f4M9o9L2r8J13J87k67J71N6k87K09J2j25K68k44r6K46m8L5rm1n2J90l07J76
5987C7n3K21j41q2M6Q3j03q7J46p3m5N0k9j5K7K6j61J52l1J51P4j57j24R8k1n2
6013f3K0j75L24J14m15K56Nj70J18l1l3K40l18K15N2p0L4k12J73k9j31m2J87m4
6037EJ82l12J32K6KJ5r6K2J15j10J36j80P6j09k2J9K06k23K07j75J8J81k35R6
6061b4J18k37N8K10j5j77O0l9J28k23MJ15K0j00j6p5J77O1%L3j42J38j30L1P7
6086E2n8j9J63j0P1j04k45J86r9L4j7K2O1j0j01Q6K5k06J88k08K13j12K7K68r9
6111A08j92J27n3p0J10k55K44R5n3m1k79J63L2j10K30j78N8J26m7L0k5k8m3O6
$$ plain form
6135 15 48 -9 -103 24 -63 -157 0 -84 -9 90 91 -10 -2 -100 32 62 14 28 -42 -156 199 -158 93 11 -187 -17
6161 -17 -34 37 65 -4 36 -84 35 17 -105 68 -10 -71 87 82 15 181 53 -57 5 -183 148 -39 -134 204 -136
6186 -136 -29 76 -125 11 169 -52 130 -227 -122 118 41 188 -27 32 37 44 -119 66 -116 102 36 -191
6208 -191 -71 -157 -94 243 95 209 -64 -233 70 -31 97 18 -98 117 88 -137 -116 70 -123 84 3 168
6230 168 76 -76 73 272 57 92 -158 87 82 -284 145 -28 -197 187 -120 -179 124 -102 76 214 -29 -15
6252 -15 110 15 -21 -296 82 -36 39 224 68 -22 -83 -124 6 173 -167 -11 -64 -140 1 4 16 27 -216 150
6276 150 -110 -27 64 37 -107 -116 16 165 -104 -226 23 86 -17 34 -20 -145 30 -74 -20 -133 190 -20 4
6299 4 105 197 -28 128 -122 -66 12 -17 342 17 110 100 -82 106 14 -162 -2 1 -3 -7 -9 115 17 2 26 7 51
$$ packed form
6135A5L3n7r4J27q7r4J57q4P5R9Jj01Qr8J32L0m8J4p0j14L55l57K51q2j98J70
6161a7j7P1K8o9M0j20J19j8j22J73p8o1J58no7J66j28j10O2j88L31j87r5L38l40
6186a36J07J05k01J36J58k21J82l57J05K40p7J47k15N9NPj63J85j82K18o6k27
6208a91J20q6O3L37j48J14k73j69L03j01J28p9j16K15k9k25K1J86j93K07q1J65
6230A68r2j52J49J99k15L5k50K45nl66M29j73j69L84l07n9L03k26J78J38k43J4
6252a5J25r5l6k75L78j18P5J85j56r0o1m1J30J67l40J56n3p6J41LJ2J1k43L66
6276A50k60Q3R1k7j44rJ32J49k69j22K49O3j03N1n4j25J75j04N4j13L23k10K4
6299DJ01R2k25J56k50N6P8k9L59l25R3j0j82J88r2j76J60LmmkJ24r8j5K4j9M4
$$ plain form
6326 51 226 -291 -79 66 -150 164 42 32 -10 -110 -110 61 -113 36 -38 -5 -26 -22 32 104 -72 -140 131 110 33
6351 33 71 27 128 -60 110 126 39 148 -74 -69 -187 -113 -213 -56 -138 142 -74 145 -137 42 93 89 -7 92 -16
6376 -16 89 136 -247 -68 -87 -176 218 -121 -114 -150 -28 -132 -18 55 56 -12 51 -29 -4 -78 -123 -129 -11 -94 136 207 -127
6403 -127 -184 -21 -121 -96 -54 -43 60 6 51 12 -222 -69 -24 -186 1 -113 -1 -83 69 36 -8 51 57 72 -189
6428 -189 94 -54 154 96 -246 156 -12 62 126 -34 -123 -111 86 231 19 -3 86 -62 37 -268 31 123 164
6451 164 -91 141 -22 -123 -6 -79 -17 -33 57 139 -127 -45 62 -130 -34 39 -94 57 -171 -7 -56 -100 138
6474 138 -36 -15 -33 40 63 102 -56 117 -87 -53 165 -58 -4 -126 -14 184 -146 -98 -9 137 -81 197 -136
6497 -136 74 -120 -117 98 -45 -32 -67 -5 20 -183 -44 278 6 -94 -90 -68 -42 -41 62 104 58 14 160 -121 -236
$$ packed form
6326E1J75n17K12J45k16L14j22j0m2j00%J71j74J49p4L3k1MN4P2j76o8K71k1p7
6351C3L8m4J01j88J70J6q7J09k22Nj18P4j00J57q2K80k16K19k82J79N1mr6R9j08
6376a6J05M7l83J79j9q9L94l39Pl6J22j04J14P3Jo8O3q0K5p4m5oJ18q3K30P1l34
6403a27n7J63j00K5M2J1J03n4M5l9k34J53M5j62J87j14J12q2J52l3m4N9OJ5k61
6428a89K83j48K08n8l42M02j68P4O4j60q9J2J97J45k12k2Q9j48R9l05K99R2M1
6451A64k55K32j63j01J17p3O2j6R0Q2k66Q2J07j92R6P3j33J51k28J64m9m4K38
6474A38j74K1j8P3K3L9j58J73k04L4K18k23N4j22J12J98l30M8Q9J46k18K78l33
6497a36K10j94LK15j43J3l5O2K5k03J39L22k72j00MK2K6JJ03M2m6m4J46k81j15
$$ plain form
6522 -236 80 -116 -25 -10 -48 113 46 30 29 -88 65 -92 -28 -119 -92 -4 162 -6 -29 -140 -66 43 0 -60 -7
6547 -7 -120 -214 -12 -44 24 -183 -30 -9 -20 39 -50 -46 36 -72 12 152 -71 58 -49 -59 69 51 -151 -133 -309
6572 -309 11 -57 -75 -36 -37 230 -38 -217 100 -40 -115 164 21 81 -44 -67 -74 -34 122 53 -3 -95 -26 31 91 38
6598 38 -348 -67 -105 -57 70 -151 19 66 -78 -53 -163 27 -395 36 74 -18 100 -210 -127 114 -67 -63 -63 113
6622 113 30 123 36 -5 -73 -147 96 43 77 62 4 119 30 10 61 31 -129 -57 -7 -123 12 71 -10 -99 -86 57 -27
6649 -27 50 -249 -68 58 64 -118 173 -6 134 168 -83 257 26 8 76 48 -122 -1 -164 176 151 45 -158
6672 -158 -89 45 153 -65 164 93 -70 -4 42 -9 -49 17 48 -44 -73 31 30 -210 -3 -47 92 73 -80 -119 129
6697 129 -134 2 -76 47 -69 -40 136 -132 36 113 -63 -245 -16 -30 37 106 95 -63 220 -26 86 80 125
$$ packed form
6522b36L16j96R1J5l8J61o7j6jj17J53j57O4r1K7Q8J66j68k3j11P4J09m3o0N3
6547gj13r4K02l2O8k07J53K1j1N9q9MQ2j08Q4J40k23J29j07j0J28j8k02J8j76
6572c09L20o8j8L9jK67k68j79L17j40p5K79j43O0j25k3pM0J56o9n6r2O9N7O0n3
6598C8l86K81l8M8J27k21J70M7j44K5j10J90m22M31L8r2J18l10Q3K41j81M%J76
6622A13q3R3q7m1o8p4K43n3L4j5n8J15q9k0N1l0j60P2N0j16J35N9q1q9J3J43q4
6649b7P7k99J81J26Oj82K91j79J40L4k51L40k31j8O8k8j70J21j63L40k5j06k03
6672a58O9J34J08k18K29p1j63O6M6n1m0O6L1r2k9J04jk40K07m4J39j9j53l9K48
6697A29k63J36p8J23j16K9J76k68J68P7j76j82K29j4O7O9j1j58K83k46J12oM5
$$ plain form
6720 125 136 -5 -80 -99 -32 8 -173 22 248 -24 151 21 58 203 -116 -68 -32 -162 17 -102 13 -68 -11
6743 -11 -327 103 -16 -62 -88 -176 86 -165 -19 77 -132 -99 -19 -73 136 -51 47 27 118 63 132 116 42 38 174 -64
6769 -64 126 -121 -37 -275 70 117 -70 109 -59 -47 -63 -83 -5 -40 130 38 -18 -134 65 107 -52 -45 43 102 183
6794 183 -58 109 -17 45 -19 30 -81 -16 -22 53 39 78 69 56 80 -116 -95 -23 19 178 -5 30 19 -112 -14 -25 -85
6821 -85 133 -16 96 84 -91 -169 55 38 70 -58 31 24 -248 102 -20 20 24 36 50 -74 -18 -141 -76 -155 -157 87
6847 87 -10 -6 61 94 -36 35 98 -2 140 -21 -9 -98 117 -47 -36 -13 30 121 79 95 -33 -40 21 50 -24 -142 -45
6874 -45 36 55 -5 -53 34 -224 125 -64 -83 73 5 20 -26 -22 97 55 109 120 186 -124 88 -57 -34 91 -41 175
6900 175 -29 -24 170 39 88 -183 67 162 43 21 2 15 21 12 -42 132 103 -194 29 -162 -66 -179 -67 -44 19
$$ packed form
6720A25J1j41p5j9O7M0j81J95K26k72J75j30L7J45l19M8L6j30J79j19J15q1N7
6743a1l16M30j19m6k6q8K62k51J46R6k09L3Q0n4K09j87R8k0R1n5O9j6p4mJ36k38
6769f4J90k47Q4k38L45M7j87J79j68J2j6k0P8l5J70r2n6j16J99M2j59PQ8N9Q1
6794A83k41J67j26O2o4M9j11O5oP5j4L9rj3K4j96K1P2M2J59j83L5j1j31R8j1o0
6821h5K18j49J12j2j75p8K24j7L2j28Q9pk72L50j22M0MJ2J4j24N6j23O5p9kK44
6847H7r7MO7L3j30P1O3j00J42j61J2q9K15j64J1K3M3R1m2J6j28pO1K9p4j18R7
6874d5Q1J9o0m8Q7k58L49j89j9J56o8J5m6MJ19m2N4J1O6l10K12j45K3J25j32K16
6900A75k04NJ94j31M9k71K50R5j19k2j9J3Orn4J74k9k97K23j91R6j13J12K3O3
$$ plain form
6925 19 -47 6 85 -121 1 -151 129 204 246 -57 47 -65 43 89 126 31 169 304 21 -57 -18 -13 13 99 -41
6950 -41 -15 -33 1 -83 180 75 -106 28 -60 13 -34 -51 -80 -71 -74 -60 -38 -39 -20 -66 -13 75 -167 55 56 -152 -18 185
6978 185 76 -9 -52 56 -61 -19 9 35 180 102 -114 -53 -114 -77 40 -3 -41 -34 236 158 -50 -77 -51 -164 -151 116
7004 116 82 0 74 -24 25 46 -235 7 -20 113 -102 182 155 -48 -144 64 50 78 -73 -45 8 45 -55 44 -20
7029 -20 -31 9 -165 104 -164 -45 95 175 -152 -127 5 40 -8 60 -105 78 -65 20 54 -23 38 75 -110 -89 148
7054 148 53 -60 -25 156 23 229 -45 61 114 -58 -162 -55 19 124 99 -162 -35 -81 -46 74 68 -49 9
7077 9 5 -215 48 -44 -6 -60 48 25 16 -48 -96 137 101 11 -62 -141 -5 49 88 -123 78 26 -56 67 -5 50 8 -7
7105 -7 -125 1 -10 84 -6 -25 2 -65 88 116 -8 3 -33 -35 -81 29 44 74 -9 -128 -54 12 122 70 46 -66 -11
$$ packed form
6925A9o6N3P9k06J22j52K80P5M2l03J04j12J08M6L7r5J38J35k83p8L9NK6Q6j40
6950d1K6j8L4q4K63j05j81J34q8P3m7j7k9RlJ4K2jJ9m6N3Q8k42K22Jk08J34K03
6978A85j09q5m3J08j17M2K8K6J45p8k16O1o1L7J17m3l8PK70p8k08k7K6j13J3K67
7004A16l4q2P4r8M9K1k81K42k7J33k15K84k7k03r6K08j4K8j51K8N3L7j00R9o4
7029b0j1M0j74K69k68J19J40Q0l27K5J32L5m8O8j65J83j43Q5L4p7O1L7j85K1K37
7054A48r5j13L5J81j33K06k74J06N3j72j04J07P4J05k5k61J27m6L5J20oj17N8
7077Imk20K63r2L8n4J08k3ro4m8K33l6r0p3p9J36N4L9k11K01n2q2J23p2N5m2j5
7105gj18J26j1R4r0j9K7o7J53K8j24J1l6km6J10J5L0q3j19P4O6J10n2k4j12N5
$$ plain form
7132 -11 -70 -15 -6 -117 -1 -171 18 -102 -66 178 34 15 74 -52 -71 29 103 -77 -15 160 -34 -12 167 104
7156 104 -67 -22 -13 -46 -65 165 -132 137 83 -38 -71 100 -20 -41 121 -37 29 37 -36 54 76 -71 -58 -9 -118
7181 -118 -33 106 202 85 54 -61 -22 -10 61 61 -9 58 108 -13 -9 -25 -85 50 -56 -164 115 30 75 -150 -129 -113
7207 -113 -80 -73 -165 -223 5 -103 -98 107 1 -149 58 96 -170 84 -62 14 90 -190 -17 155 153 229 -54 -28 113
7232 113 170 121 32 -106 135 56 55 9 29 -30 -55 163 210 -118 -7 -46 -59 118 106 60 26 99 -76 30 85 -4
7258 -4 6 -63 24 -39 101 63 -104 19 201 -76 110 -70 115 -84 -86 4 -87 33 39 6 75 243 -19 36 -37 -28
7284 -28 -40 -19 -39 -83 -40 -121 123 -88 -113 122 -127 -32 -11 -43 32 -61 74 14 -165 -177 102 -90 68 -26 118
7309 118 -46 -13 -24 -3 -123 -13 -85 34 -4 -45 20 38 53 -14 12 -56 -81 1 30 86 21 -17 77 -15 5 2 38 -21
$$ packed form
7132a1n9N5Rj11J16j70J89j20L6K44j44j9N9j26j9J00P4j80O2J75j94K2J79o3
7156A04j71M5Rl3j9K30k97K69n4j21l3J71j20k1J62j58O6Qp3R0K2j47J3M9j09
7181a18Q5J39R6j17l1j15L9J2P1%p0O7N0j21Mj6o0J35j06j08K79q5M5k25K1J6
7207a13L3Pr2n8K28j08NK05j06j50K07L8k66K54j46P6P6k80J73J72kP6k83K6J41
7232A13N7m9q9j38K41p9jm6K0n9k5K18M7l28J11l9j3J77j2m6l4P3j75J06N5q9
7258dJ0o9Q7o3J40l8j67J23J82k77J86j80J85j99kR0r1J20Ol3O9J68k62N5p3R
7284b8j2K1k0m4M3q1K44k11k5K35k49R5K1l2P5r3J35o0j79j2K79j92J58r4J44
7309A18j64L3j1K1j20J10p2J19l8m1O5J8J5o7K6o8k5Q2K9N6o5l8R4r2K0lL6n9
$$ plain form
7337 -21 7 19 62 -186 44 -60 20 93 75 -146 -2 5 -62 -61 -135 9 -52 24 -127 47 32 56 72 90 -71 88
7363 88 -75 -40 -41 75 41 -73 -144 -156 -161 63 129 -25 -6 -48 -110 -100 75 190 28 42 -51 51 124 -6 -111 12
7389 12 -18 -91 57 84 116 2 124 7 42 74 3 46 215 -25 142 46 52 9 -108 -27 15 -102 167 -57 131
7414 131 75 64 52 -82 -94 -96 -104 -18 -191 -4 -92 23 34 35 59 177 -60 50 80 128 248 -93 -82 -68 -97 -107 11
7441 11 119 3 138 24 -95 29 92 -69 -96 114 277 34 -53 -92 -36 121 21 -53 4 35 81 58 75 9
7465 9 -110 -102 -96 5 48 168 28 -66 -96 2 -60 104 59 -15 -123 -36 -50 -129 -9 68 7 -7 144 -30 -48 -70 -11
7492 -11 112 -29 -195 -61 28 -9 108 -77 -48 49 119 28 -84 -162 128 -39 -61 1 -223 -27 53 76 -157 -159 37
7517 37 -118 65 -86 -114 -8 15 -46 -63 60 -16 68 -66 -148 -25 -3 -60 60 22 -24 -73 -122 46 -75 40 -42
$$ packed form
7337b1K8J2M3k48K30j04Q0P3j8k21J44Po7Jp4J44o1P6j51J74j5K4J6J8j61J59
7363H8j63L5jJ16l4j14p1j2nK24O6j54J9m2o2J0J75J15j62J4r3J02P3j30j05J23
7389A2l0p3J48K7L2j14J22j17L5L2p1M3J69k40J67r6Om3j17Q1M2j17K69k24J88
7414A31n6j1j2j34j2kqQ6j73J87q8J15J1JK4J18k37J10L0M8J20l41J1J4k9j0J18
7441A1J08j16J35j14j19J24O3j61k7K10J63k43q7l9N6J57j00p4N7L1M6k3J7o6
7465Ij19QOJ01M3J20j40r4l0R8o2J64m5p4j08Q7j4p9J20P7o1j4J51j74j8k2N9
7492a1J23j41j66J34Q9l7J17j85K9R7P0r1j12p8K90j67k2O2k24J96Q0K3k33kJ96
7517C7j55J83j51k8J06K3o1j7J23p6Q4j34q2J23K2n7J20l8m6m9m9J68j21J15q2
$$ plain form
7542 -42 -55 64 -49 -20 70 -62 89 -14 -199 -135 -36 -6 -59 -7 8 25 241 27 -136 -95 41 7 -55 71 -3
7567 -3 139 -47 20 40 -17 -71 -94 -139 -67 -92 94 -97 59 -53 -156 -11 61 -12 2 44 123 121 191 95 22 117 128
7594 128 69 73 -6 -58 -27 130 -63 -17 162 154 77 -49 69 65 -59 -197 -50 -30 84 21 -44 -6 76 -96 -50 -50 38
7621 38 -68 -88 -20 4 -36 -58 126 63 63 0 -6 147 152 -41 109 -41 -43 5 2 -39 29 106 -79 58 56 -75 -144 -147 7
7650 7 123 111 126 -50 156 -90 32 133 -40 -46 -28 -18 -33 38 11 61 39 19 107 -5 44 112 -40 111 121 18
7676 18 61 179 0 42 26 -69 18 38 -109 -41 -40 -93 158 -142 -24 -14 6 84 -4 84 -57 -98 40 76 -29 -23 -12
7703 -12 28 141 -16 140 -154 134 96 135 -21 -74 -43 -27 46 -69 55 -177 0 -116 -22 -101 -103 -95 42 -57 -21
7728 -21 -37 -50 116 19 15 24 21 92 28 -123 -15 -64 -24 15 -161 78 -127 24 28 -59 -66 35 -38 -70 91 -63 -49 32
$$ packed form
7542d2j3J19j13K9R0j32J51j03j85O4R9L0n3N2J5J7K16k14j63M1J36l4o2J26p4
7567cJ42j86O7K0n7n4k3m5P2k5J86j91J56j12j03J45P2p3J4M2P9kP0r6p3R5J1
7594A28n9Mp9n2L1J57j93M6J79qp7j26J18mj24j38J47K0J14o3o5L8Q2j72M6%Q8
7621C8j06k0O8K4m0k2J84o3%o3oJ53Nj93J50j50kM8lm1O8P7j85J37kj31o9lJ54
7650GJ16j2J5j76K06k46J22J01j73oJ8J0j5P1k7N0k2k0Q8j12M9O8j52J51J0j03
7676A8M3J18j79M2j6r5Q7K0j47O8Jn3K51l00J18J0K0P8q8Q8j41m1J38L6j05OJ1
7703a2M0J13j57J56k94K88l8L9j56n3L1J6P3j15J24k32J77j16R4p9kQJ37r9L6
7728b1j6j3J66r7mRlP1o4j51J08m9M0L9j76K39k05J51Mq7pJ01p3l2J61j54J4Q1
$$ plain form
7756 32 -90 -75 36 -172 -35 -66 -126 57 -219 102 -90 31 -214 -127 -4 -56 -29 -66 112 59 63 -127 -134 30
7780 30 -2 7 121 125 -134 -2 2 -79 91 19 -7 3 -129 108 -187 67 -44 154 34 -63 -10 -84 -61 -82 -67 63
7806 63 -85 -148 -86 30 -199 -139 -2 48 -272 -116 -8 46 93 -181 67 -2 170 31 120 -38 137 50 66 71
7830 71 -131 -84 -6 -70 -26 8 -9 -8 -130 62 -130 42 -2 -178 50 68 32 -24 -217 -90 109 -1 -40 26 91
7855 91 -34 42 -224 -110 2 -9 -84 65 -20 -72 13 -132 0 73 61 -16 61 112 158 -132 -21 49 -2 -76 -3 87
7881 87 -28 -35 -62 66 -35 25 -68 93 -31 -101 69 -84 -2 85 -83 -115 3 33 -30 -65 -4 -56 -33 5 -77 12
7907 12 23 -5 -23 -17 103 134 -104 51 -104 -44 0 -163 -77 -16 -19 -65 68 23 102 220 -144 -15 -128 6 -97
7932 -97 -32 -24 45 22 35 -10 157 -14 -87 -7 -207 -84 -163 -32 -192 -82 -56 -1 46 -187 161 -105 7 25 64
$$ packed form
7756C2j22J5J11k08J37l1o0J83k76L21j92J21k45Q7J23n2K7l7J78n3Mj90pJ64
7780C0l2RJ14Mk59J32Mq1J70p2k6J0j32K37k95K54j11J98j20r7N3p4K3k1J5J30
7806F3j48o3O2J16k29O0J37N0l20J56J08N4M7k74K48o9J72j39Q9j58J75q7J6N
7830G1k02M7P8o4M4L4j7Jj22J92j92J72m4j76K28J8l6n6j93J27J99j10l9O6O5
7855I1j25P6k66J14J12j1p5J49q5n2Q5j45J32P3j2p7P7N1M6k90J11P0n1p4P3R0
7881H7j15pk7J28j01O0r3J61j24p0J70j53Q2Q7j68l2J18L0o3l5O1n2K3L8q2Q9
7907A2J1k8j8OJ20L1k38J55j55O0M4j63Q6O1lm6J33m5P9J18l64J29j13J34j03
7932i7O5QO9k3J3m5J67j71p3Q0k00J23p9J31j60J10K6N5M7k33L48k66J12J8L9
$$ plain form
7957 64 22 51 75 127 25 88 56 -33 54 -55 -9 30 36 -29 -97 195 73 142 140 -1 45 119 -1 143 -38 -35 -61 -77
7985 -77 33 -85 117 33 -83 22 155 -86 15 24 -14 -90 -150 56 -145 -59 -38 96 104 -31 -63 -29 -142 -79 -86
8010 -86 120 214 62 115 -169 54 59 101 -88 -53 144 -34 72 161 177 -85 -29 153 -52 -47 -77 58 -118 -150 78
8035 78 141 -197 -83 19 -152 -41 21 16 45 -117 15 -130 58 3 100 -68 172 -106 15 -10 -21 -119 15 40
8059 40 13 -12 -46 12 74 -86 163 35 -34 155 -125 -107 -60 -99 -40 -169 -27 93 -50 70 89 64 176 -55
8083 -55 -31 -136 98 9 48 72 -63 47 104 -8 -38 75 -21 -45 -75 46 -122 62 -22 116 -134 60 -20 -114
8107 -114 -45 -79 150 79 88 -91 -45 -8 -89 129 65 -174 114 40 69 74 92 9 -72 40 -60 -46 -183 -197 59 75
8133 75 -168 132 118 58 -71 -113 -236 47 -52 68 8 -174 84 46 71 80 21 240 53 -45 57 -214 99 54
$$ packed form
7957F4m2K9K4N2j02O3l2q9Q7j09M6L9Oo5o8K92j22O9kj41M6P4j20J44j81Lk6j6
7985g7J10j18K02q4j16J05J33k41J01Rl8p6o0K06k01Q6K1J34Qj35l2L4j13O3p
8010h6K06R4j52N3k84K23NM2j89L5J97j78J06Q9J6k62N6J82k05Nl0J35j76l2K28
8035G8O3l38J14J02j71J11O2nK9j62J32j45J88n5R7j68K40k78J21k5j1r8J34K5
8059D0k7k5l4N8O2j60K49j28o9J89k80J8M7l9N9j29J42J20j43J20J9k5J12k31
8083e5K4j05K34q9L9K4j35J10N7j12l0J13r6k4l0J21j68J84q4J38k50J94q0r4
8107a14O9l4K29p1Rj79M6L7q1K18o4k39K88p4K9NJ8q3q1J12j00J4j37j4K56J6
8133G5k43L00j4o0j29m2j23K83r9J20o0j82K58l8K5Rn9K19j87r8J02k71L13m5
$$ plain form
8157 54 -5 -19 68 -200 -26 149 -97 60 178 -52 163 -92 -46 27 -35 21 -44 54 -75 72 37 -23 -77 35
8181 35 13 30 138 -20 -14 120 81 155 -93 -204
$$ packed form
8157E4n9j4Q7k68J74J75k46J57J18k30K15k55M6P3o2N6o5R8j29J47l5o0n4J12
8181C5k2J7J08j58OJ34l9P4k48j11
8191b04
$$ Imaginary data points
##PAGE= N=2
##DATA TABLE= (X++(I..I)), XYDATA
$$ plain form
0 0 0 0 0 0 0 0 0 0 0 0 8 -8 8 -8 16 -16 16 -24 29 -32 40 -48 56 -64 77 -88 104 -118 136 -156 176 -199 228
33 228 -255 286 -324 362 -404 451 -502 558 -618 685 -756 835 -923 1017 -1121 1233 -1358
50 -1358 1497 -1649 1818 -2008 2222 -2467 2746 -3069 3450 -3907 4462 -5157 6053 -7252 8941
65 8941 -11488 15728 -23984 45579 -208855 -390723 275671 -206670 -369462 204559 -121844
76 -121844 -336519 133964 -75228 -261313 59952 -26455 -177413 30988 -10933 -96132 20779
87 20779 -11377 -42958 32257 -27441 -2808 41006 -41839 16040 35830 -56197 29877 9267
99 9267 -65147 39246 -21997 -76926 42049 -46317 -87832 34170 -52687 -101237 17652 -37663
111 -37663 -114322 -7419 -8642 -124302 -33810 20987 -126876 -55867 40311 -120207 -71577
$$ packed form
0@%%%%%%%%%%Qj6J6j6K4l2L2m0N3o1P2q8J04j20J41j65J92k22K54k92L32l75M27
33B28m83N41o10O86p66Q55r53J060j176J303j441J591j758J940k138K354k591
50a358K855l146L467l826M230m689N213n815O519p357Q369r619J1210j3305J6193
65H941k0429K7216l9712O9563k54434j81868O66394m82341j62792N74021l26403
76a21844k14675M70483k09192j86085L21265q6407j50958K08401m1921q5199J16911
87B0779l2156l1581P5215n9698K4633M3814q2845N7879J9790r2027Q6074k0610
99I267p4414J04393o1243n4929J18975q8366m1515J22002q6857m8550J18889n5315
111c7663p6659J06903j223j15660R0492N4797j47863P1009R6178j60518M8630
$$ plain form
122 -71577 41999 -103097 -79692 28093 -79386 -82224 6865 -54369 -81499 -11218 -33570
133 -33570 -78119 -19809 -21616 -70714 -17520 -19065 -58281 -9104 -23061 -40714 -2139 -29215
145 -29215 -19168 -1673 -34386 910 -8291 -35475 14029 -18641 -34067 17653 -27216 -32120
157 -32120 10582 -29631 -32119 -2530 -25662 -34649 -16181 -18613 -38311 -25221 -12979 -39828 -26644
170 -26644 -13645 -37830 -22237 -19855 -31005 -16436 -29229 -20245 -13459 -37570 -10376 -15541 -40519
183 -40519 -4140 -21191 -36619 -3762 -26608 -28231 -9320 -27933 -18834 -17341 -21850 -11974 -23916
196 -23916 -10741 -8907 -24627 1742 -8281 -18511 10766 -7412 -7569 13159 -4296 3835 9407
209 9407 1275 11053 1820 7685 11832 -5759 10816 6126 -10111 8327 -2599 -11652 -816 -10025
$$ packed form
122g1577J13576j45096K3405J07785j07479k838Q9089o1234k7130P0281k2352
133c3570m4549N8310j807m9098N3194j545l9216M9177j3957j7653L8575k7076
145b9215J0047J7495l2713L5296r201k7184M9504l2670j5426N1720m4869m904
157c2120M2702m0213k488K9589k3132q987J8468k432j9698J3090J2242k6849J3184
170b6644J2999k4185J5593K382j1150J4569j2793Q984O786k4111K7194n165k4978
183d0519L6379j7051j5428L2857k2846j623J8911j8613R099J493m509R876j1942
196b3916J3175J834j5720K6369j0023j0230K9277j8178j57K0728j7455Q131N572
209I407q132R778r233N865M147j7591J6575m690j6237J8438j0926r053J0836r209
$$ plain form
223 -10025 -11872 -14083 -12825 -13066 -27535 -10830 -16771 -36333 -5650 -21713 -37868 -1233 -25406
236 -25406 -32431 432 -24960 -22446 -1285 -18669 -12239 -4238 -7411 -5062 -5652 5100 -1997 -3001
250 -3001 15465 -1502 3476 20188 -1378 11728 18684 985 18108 12445 5562 19441 5510
263 5510 10664 14704 912 12951 5569 -51 10177 -4800 1518 1769 -12839 3023 -9526 -17072
277 -17072 2046 -19800 -17851 -2256 -25121 -17235 -8548 -23702 -17159 -13743 -16649 -18485 -14946 -7021
291 -7021 -19822 -11045 1447 -19097 -3247 6772 -14492 5334 8561 -4632 11286 8383 8313
304 8313 12776 8406 21067 9896 9709 29680 5245 12077 32038 1363 13393 27832 708
317 708 11134 19571 3126 4551 10627 6737 -5261 3937 9066 -16300 -210 8521 -24109 -2516
$$ packed form
223a0025j847k211J258k41j4469J6705n941j9562L0683j6063j6155L6635k4173
236b5406p025L2863k5392K514K1161j7384O430Q001l173K349n90J0752p097j004
250c001J8466j6967M978J6712k1566J3106O956j7699J7123n663o883J3879j3931
263E510N154M040j3792J2039p382n620J0228j4977O318K51j4608J5862j2549p546
277a7072J9118k1846J949J5595k2865P886Q687j5154O543L416k906j836L539P925
291g021j2801Q777J2492k0544J5850J0019k1264J9826L227j3193J5918k903p0
304H313M463m370J2661j1171j87J9971k4435O832J9961l0675J2030J4439k7124
317G08J0426Q437j6445J425O076l890j1998R198N129k5366J6090Q731l2630K1593
$$ plain form
331 -2516 4585 -26591 -4541 -633 -22767 -8609 -4546 -14696 -14371 -4666 -5514 -20422 -1413 1991
345 1991 -23324 3528 6173 -21151 7435 7420 -14166 8111 7944 -3936 4975 9625 5786 -435
359 -435 12956 12989 -5303 17084 15678 -7351 19433 14205 -5125 18613 11457 -108 13607 9442
373 9442 5163 5341 9468 8039 -3388 10789 6958 -10034 11217 2637 -13263 9212 -2645 -12567
387 -12567 3712 -6414 -10157 -3920 -6649 -7973 -11528 -2918 -7416 -16591 2192 -8414 -16417 6681
401 6681 -8893 -11739 8373 -7214 -4490 7259 -2520 2285 4492 4898 6262 1789 12894 6833
415 6833 1629 18226 5371 3800 19405 3717 7091 16338 3695 9300 10305 6107 8732 3531
429 3531 9569 4798 -1008 12004 -820 -2908 11105 -6268 -2768 7035 -9206 -2695 684 -9353
$$ packed form
331b516P101l1176K2050L908k2134J4158M063j0150L25R705q48j4908J9009L404
345A991k5315K6852K645k7324K8586j5k1586K2277j67j1880Q911M650l839o221
359d35J3391L3j8292K2387j406k3029K6784n228j9330K3738p156j1565J3715m165
373I442m279J78M127j429j1427J4177l831j6992K1251q580j5900K2475j1857r922
387a2567J6279j0126l743O237k729j324l555Q610m498r175J8783j0606q003K3098
401F681j5574k846K0112j5587K724J1749r779M805K207M06J364m473J1105o061
415F833n204J6597j2855j571J5605j5688L374R247j2643N605J005m198K625n201
429C531O038m771n806J3012j2824k088J4013j7373L500R803j6241O511L379j0037
$$ plain form
443 -9353 -4465 -5723 -6632 -8313 -9392 -3614 -12978 -9251 -1809 -16218 -5923 -2081 -16049 -789
457 -789 -3770 -11676 3953 -5041 -4043 6313 -4111 4367 6020 -344 10562 4849 5365 13273 3836
472 3836 10588 12085 4243 12753 8548 5921 10719 5302 7688 5147 3605 7544 -1983 4279 5746
487 5746 -7649 5086 1909 -9947 5066 -2377 -8577 2842 -5091 -4828 -1435 -4638 -914 -6382
501 -6382 -1825 1028 -9931 2414 724 -10278 5516 -1313 -7540 6460 -3021 -3093 4800 -2700
515 -2700 1066 1464 -16 3801 -1667 3891 3897 -2830 7319 2224 -1789 8086 969 1147 4777 1092
531 1092 3807 -686 2933 5050 -6870 5877 3936 -11359 7695 1171 -12166 6973 -1871 -9760
545 -9760 3700 -3088 -5512 -1319 -1967 -1769 -5584 1326 580 -7851 5170 865 -7065 7922 367
$$ packed form
443i353M888j258r09j681j079N778r364L727P442j4409J0295L842j3968J5260
457g89k981p906J5629q994R98J0356j0424Q478J653o364J0906n713N16P908r437
472C836O752J497p842Q510m205k627M798n417K386k541j542L939r527O262J467
487E746j3395J2735l177j1856J5013p443o200J1419p933K63L393l203L724n468
501f382M557K853j0959J2345j690j1002J5794o829o227J4000r481p2P893p500
515b700L766L98j480L817n468N558Oo727J0149n095m013R875p117J78L630l685
531A092K715m493L619K117j1920J2747j941j5295J9054o524j3337J9139q844p889
545i760J3460o788k424M193o48J98l815O910p46q431J3021m305p930J4987p555
$$ plain form
560 367 -3950 8063 682 -750 5620 2908 718 1022 6817 324 -3451 10699 -1776 -6292 12090
575 12090 -3906 -6816 10379 -3939 -5110 5167 -1553 -2380 -981 2798 22 -6062 7741 1558
589 1558 -8014 10675 2278 -6329 10716 2456 -2061 7777 3396 2470 2936 5514 5065 -1593 8391
604 8391 4872 -4560 10525 2593 -5085 10701 257 -4514 8958 -145 -3872 5316 2045 -4542
618 -4542 1164 5699 -6489 -1704 9301 -8978 -2558 10493 -10683 -1391 8460 -10280 1016
631 1016 4147 -7261 3136 -443 -2869 4079 -3444 1762 3890 -3066 5379 3401 -204 6832 4248
646 4248 3695 6265 6622 6439 4700 10270 6412 3116 14026 4229 2241 16188 911 2439 15187
661 15187 -1772 2798 10859 -2326 2665 4846 -776 1774 -947 1496 81 -4080 3427 -1871
$$ packed form
560C67m317J2013p381j432O370k712k190L04N795o493l775J4150j2475m516J8382
575A2090j5996k910J7195j4318j171J0277o720q27J399L779k776o084J3803o183
589A558r572J8689q397q607J7045q260m517R838m381r26M66K578m49o658R984
604H391l519r432J5085p932p678J5786j0444m771J3472r103l727R188l271o587
618d542N706M535j2188M785J1005j8279O420J3051k1176R292R851j8740J1296
631A016L131j1408J0397l579k426O948p523N206K128o956Q445j978l605P036k584
646D248n53K570L57j83j739N570l858l296J0910r797j988J3947j5277J528J2748
661A5187j6959M570Q061j3185M991K181n622K550k721K443j415m161P507n298
$$ plain form
675 -1871 -4166 3344 -2953 -1692 1730 -2422 1556 -454 -108 3549 -1469 3067 3174 -831 5787 1484
691 1484 2086 6862 -698 5408 6199 -1517 8392 4410 -72 9459 2031 2687 8014 1175 5698 5436
707 5436 1409 7104 2169 3151 5842 362 5182 2551 167 5954 -1443 1405 4667 -4685 2644
722 2644 2337 -5547 3223 -996 -4554 1903 -3140 -1951 -93 -3223 -169 -2295 -1815 388 -2950 328
738 328 -638 -1126 2419 -2502 2712 2895 -3997 7011 1739 -3850 10145 92 -2306 10986 -974
753 -974 130 9546 -795 2015 6645 906 2466 4160 3388 1114 2721 5496 -1205 2811 6164
768 6164 -3354 3816 4520 -3556 4307 1667 -1856 3788 -1562 926 1818 -3725 3652 -1311 -4187 4843
784 4843 -4185 -3098 3986 -5313 -1505 1632 -4065 -668 -1070 -1782 -1004 -2863 1022 -1908 -2967 3110
$$ packed form
675a871k295P510o297J261L422m152L978k010L46L657n018M536J07m005O618m303
691A484O02M776p560O106P91p716R909l982m482R531p428O56N327o839M523k62
707E436m027N695m935R82K691n480M820k631k384N787p397K848L262r352P329
722B644l07p884Q770m219l558O457n043J189J858l130L054k126M80K203l338L278
738C28r66m88L545m921N214J83o892J1008n272n589J3995j0053k398J3292j1960
753i74J104R416j0341K810M630n739J560J694p72k274J607K775o701M016L353
768F164r518P170P04q076P863k640l523N644n350K488Q92n543P377m963k876R030
784D843r028J087P084r299L808L137n697L397m02p12P78j859L885k930j059O077
$$ plain form
800 3110 -2797 -1740 3396 -2608 76 2254 -492 1083 347 2751 463 -1105 6360 -1037 -1039 8714
816 8714 -3097 380 8973 -4121 1984 7076 -3378 2845 3961 -1246 2305 832 1341 191 -757
831 -757 3547 -2843 -982 3659 -4596 -108 2285 -4808 373 -93 -3250 239 -2430 -489 -1086 -3340
847 -3340 2071 -2916 -2448 3481 -4107 -485 2894 -3542 1365 964 -1711 2414 -396 1574 1494 -1161
863 -1161 4242 -119 -505 5838 -1500 855 5521 -2005 2595 3574 -994 3024 1390 858 1875 -279
879 -279 3028 -341 -576 3648 -2784 -6 2608 -4231 1321 76 -4045 1577 -2796 -2628 713 -4799
895 -4799 -226 -1341 -4904 1077 -3392 -3298 1557 -4650 -991 490 -4094 1021 -1193 -1944 1957 -2156
911 -2156 477 1486 -1757 2784 167 -608 3228 -841 1221 2088 -482 2649 85 577 2794 -1772
$$ packed form
800C110n907J057N136o004K684K178k746J575p36K404k288j568P465p397kR753
816H714j1811L477Q593j3094O105N092j0454O223J116n207L551j473N09j150r48
831g57M304o390J861M641q255M488K393p093N181m66l157L489k669J941n97k254
847c340N411m987M68N929p588L622L379o436M907m01k675M125k810J970q0k655
863a161N403m361l86O343p338K355M666p526M600R79m568M018j634n32J017k154
879b79L307l369k35M224o432K778K614o839N552j245m121N622m373J68L341n512
895d799M573j115l563N981m469R4M855o207L659J481m584N115k214p51L901m113
911b156K633J009l243M541k617p75L836m069K062Q67k570L131k564M92K217m566
$$ plain form
927 -1772 2764 1512 -2399 4359 -736 -1408 4751 -2401 324 3455 -2778 2342 1508 -1548 2823 -699
943 -699 586 1873 -1863 2447 398 -1643 2880 -1321 -155 1880 -2034 1469 -285 -1210 2311 -2444
959 -2444 641 2111 -3415 2580 757 -2802 3660 -494 -839 3360 -1185 1533 1621 -447 3081 -328
975 -328 979 3187 -1670 2885 1784 -1964 3535 50 -830 2662 -1117 823 434 -1144 1850 -1849
991 -1849 114 1942 -3386 2053 995 -3331 3365 -640 -2013 3810 -1628 185 2696 -1304 1975
1006 1975 748 -136 2622 -588 1936 1929 -1055 3139 393 -195 3505 -827 1685 2369 -810 3157
1022 3157 370 740 3688 -1614 2954 3186 -2497 4769 1641 -1708 5402 325 -244 4319 -75 1226
1038 1226 2016 710 1957 -463 2027 1474 -2086 3115 193 -2418 3643 -1121 -1594 2736 -1748 -117
$$ packed form
927a772M536j252l911O758n095o72O159p152K725L131o233N120q34l056M371l522
943f99J285J287l736M310k049k041M523m201J166K035l914L503j754r25L521m755
959b444L085J470n526N995j823l559O462m154l45M199m545K718Q8k068L528l409
975c28J307K208m857M555j101l748N499l485q80L492l779J940l89j578K994l699
991a849J963J828n328N439j058m326O696m005j373N823n438J813K511m000L279
1006A975j227q84K758l210K524pk984M194k746n88L700m332K512O84l179L967
1022C157k787L70K948n302M568K32n683P266l128l349P110n077n69M563m394J301
1038A226P90j306J247k420K490n53l560N201k922k611O061m764m73M330m484J631
$$ plain form
1054 -117 599 -803 1057 -1180 1000 990 -1801 3231 176 -1485 4171 -1387 28 3969 -1764 1822
1070 1822 2453 -1140 3146 60 721 3282 -2095 2865 2235 -2751 4271 966 -2366 4233 135 -1305
1086 -1305 2730 358 -36 673 1932 -19 -1104 3461 -378 -1571 4669 -1525 -862 4274 -2265 637
1102 637 2861 -2056 2190 516 -695 2709 -1410 1301 1923 -2445 3297 783 -1715 4226 -363
1117 -363 -195 4042 -530 1308 2329 461 2205 815 2276 2170 -287 3973 1497 -510 4418 565
1133 565 290 3449 286 1304 1360 1232 1636 -897 2763 1086 -2255 4137 -274 -2325 4524 -2002
1149 -2002 -919 3716 -2690 841 1981 -2212 2200 -146 -823 2320 -1591 985 1440 -2228 2523
1164 2523 196 -1417 2833 -386 -223 1933 -131 511 191 1384 836 -1114 3189 209 -1383 4251
$$ packed form
1054a17P16j402J860k237K180j0k791N032l055j661N656n558J415L941n733L586
1070A822O31l593M286l086O61K561n377M960o30m986P022l305l332O599m098j440
1086a305M035k372l94P09J259j951j085M565l839j193O240o194O63N136o539K902
1102F37K224m917M246j674j211L404m119K711O22m368N742k514k498N941m589
1117c63J68M237m572J838J021j868J744j390J461j06k457M260k476k007M928l853
1133E65k75L159l163J018N6j28M04k533L660j677l341O392m411k051O849o526
1149b002J083M635o406L531J140m193M412k346o77L143l911K576M55l668M751
1164B523k327j613M250l219J63K156k064O42l20J193n48j950M303k980j592N634
$$ plain form
1180 4251 -852 -773 4342 -1350 483 2582 -826 2111 473 599 2553 -1780 2398 1995 -2631 3706
1196 3706 954 -2478 4061 -231 -1072 2817 -766 465 810 -236 1169 -842 1160 977 -1765 2280
1212 2280 180 -1561 2492 -928 -337 1871 -1236 1097 384 3 1788 -1296 1586 1345 -2229 3513
1228 3513 59 -1968 4261 -1157 -788 3759 -1813 873 1960 -1484 1969 -137 59 2058 -1808
1243 -1808 1281 1448 -2315 2099 176 -1729 1818 -723 -663 678 -633 238 -661 127 523 -1832 1006
1260 1006 -453 -1856 2002 -1592 -709 1543 -1988 887 154 -1714 2068 -1638 -405 2483 -3086
1275 -3086 1467 1841 -3462 3050 744 -2681 3714 -585 -1161 3102 -635 608 1451 -148 1429 97
1291 97 1129 1817 -458 2024 908 -334 1898 -50 807 1139 -207 1801 -720 105 2410 -2421
$$ packed form
1180D251n103P9N115n692J833K099l408K937j638J26J954m333M178m03m626O337
1196C706k752l432O539m292q41L889l583J231L45j046J405k011K002j83k742M045
1212B280k100j741M053l420N91K208l107K333p13l81J785l084K882k41l574N742
1228C513l454k027O229n418L69M547n572K686J087l444L453k106J96J999l866
1243a808L089J67l763M414j923j905L547k541O0J341j311Q71q99P88L96k355K838
1260A006j459j403L858l594Q83K252l531K875p33j868L782l706J233K888n569
1275c086M553L74n303O512k306l425O395m299n76M263l737J243Q43j599J577j332
1291I7J032O88k275K482j116j242K232j948Q57L32j346K008k521Q25K305m831
$$ plain form
1307 -2421 1116 1702 -3064 2223 649 -2760 2361 -636 -1484 1874 -1557 -21 622 -1124 1387 -911
1323 -911 -409 1423 -2014 939 863 -1813 1544 -466 -984 1227 -748 145 218 -837 949 -1258 166
1340 166 983 -2164 1498 113 -2370 2174 -1371 -1312 2192 -2061 214 1115 -2153 1273 -479 -1289
1356 -1289 2109 -1648 34 1339 -2169 1056 603 -1759 1313 -760 -502 803 -1024 461 -356 -539
1372 -539 1010 -1607 616 591 -1695 1557 -593 -1139 2079 -1455 307 1609 -1717 1515 484 -1321
1388 -1321 2008 -796 -34 1512 -1803 1152 551 -1439 1623 -1159 -499 860 -1723 670 -95 -1584
1404 -1584 1364 -1399 -596 1292 -2221 454 292 -1794 1350 -595 -744 1395 -1411 619 370 -1212
1420 -1212 1633 -808 -705 1778 -1432 588 1177 -1571 1394 -148 -813 1449 -1081 310 598 -1221
$$ packed form
1307b421L537N86m766N287j574l409N121k997q48L358l431J536O43j746K511k298
1323i11N02J832l437K953p6k676L357k010n18K211j975Q93P3j055J786k207J424
1340A66Q17l147L662j385k483M544l545N9L504m253K275R01l268L426j752q10
1356a289L398l757J682J305l508L225m53k362L072k073K58J305j827J485q17j83
1372e39J549k617K223k5k286L252k150n46L218l534J762J302l326L232j031j805
1388a321L329k804P62J546l315K955o01j990L062k782O60J359k583K393p65j489
1404a584K948k763Q03J888l513K675j62k086L144j945j49K139k806K030k49j582
1420a212K845k441J03K483l210K020N89k748K965j542o65K262k530J391K88j819
$$ plain form
1436 -1221 1219 -748 -524 1698 -1644 339 949 -1741 1185 -34 -1154 1259 -908 -14 305 -1108
1452 -1108 1043 -537 -733 1479 -1864 279 946 -2142 1182 -30 -1746 1522 -990 -515 1198 -1337
1468 -1337 804 -7 -607 1810 -699 838 1680 -1354 1983 1130 -902 2597 130 235 2218 -148
1484 -148 1218 1176 77 1893 -165 1016 1408 -816 1921 234 -1001 2369 -777 -379 1958 -1470
1500 -1470 624 842 -1274 1033 -436 -588 794 -1139 494 26 -1356 1217 -983 -856 1049 -1613
1516 -1613 66 572 -1729 763 -624 -945 804 -1397 427 180 -1427 1455 -759 -759 1805 -1238
1532 -1238 258 1488 -1474 1172 358 -720 1482 -521 664 1204 -870 1556 334 -328 1858 -881
1548 -881 604 1557 -1266 1089 629 -1105 1259 -213 -360 1013 -935 611 -7 -757 1207 -1032
$$ packed form
1436a221K440j967K24K222l342J983O10k690K926j219j120K413k167Q94L19j413
1452a108K151j580j96K212l343K143O67l088L324j212j716L268k512M75J713k535
1468a337K141q11o00K417k509J537Q42l034L337q53k032L499k467J05J983k366
1484a48J366m2j099J816k058J181L92k224K737j687j235L370l146L98K337l428
1500a470K094K18k116K307j469j52J382j933J633m68j382K573k200J27J905k662
1516a613J679N06k301K492j387l21J749k201J824k47j607K882k214%K564l043
1532a238J496J230k962K646q14j078K202k003J185N40k074K426j222o62K186k739
1548h81J485R53k823K355m60j734K364j472j47J373j948J546o18p50J964k239
$$ plain form
1564 -1032 190 956 -1228 1044 205 -1090 1623 -639 45 1251 -1243 1041 265 -1002 1668 -632
1580 -632 -43 1574 -1397 1044 730 -1293 1866 -212 -466 1607 -782 514 1044 -967 1100 164
1596 164 -296 1249 -722 620 497 -878 1335 -428 -344 1361 -952 693 536 -1236 1188 -604
1612 -604 -714 1340 -1285 58 752 -1535 916 -206 -924 1177 -1145 190 677 -1598 1103 -79
1628 -79 -1177 1343 -787 -48 990 -1010 744 221 -660 1269 -533 344 983 -739 1257 506 -354
1645 -354 1607 -410 324 1374 -900 1211 936 -529 1435 0 338 940 -567 1453 93 -396
1661 -396 1842 -809 218 1837 -1385 957 871 -1388 1505 -63 -690 1225 -738 62 303 -843
1677 -843 982 -658 -309 1282 -1420 195 617 -1661 858 -22 -985 740 -441 -98 -47 -322 601
$$ packed form
1564a032J222P66k184K272q39j295K713k262O84J206k494K284p76j267K670k300
1580f32N89J617k971K441l14k023L159k078k54K073k389J296N30k011K067r36
1596A64m60J545j971J342j23j375K213j763Q4J705k313J645j57j772K424j792
1612f04j10K054k625J343O94k287K451j122p18K101k322J335M87k275K701j182
1628g9j098K520k130P39J038k000J754n23q81J929j802Q77O39j722J996p51q60
1645c54J961k017P34J050k274K111k75j465J964j435L38O02j507K020j360m89
1661c96K238k651J027J619l222K342q6k259K893j568o27J915j963Q00K41j146
1677h43J825j640L49J591k702J615M22k278K519q80r63J725j181L43N1k75R23
$$ plain form
1694 601 -991 225 746 -1387 1065 358 -1656 1879 -178 -1037 1681 -830 -96 915 -1232 884
1710 884 -85 -668 1185 -1212 95 1056 -1564 923 359 -1562 883 -335 -759 425 -573 123 -295
1727 -295 -437 325 -923 335 304 -1381 1366 -300 -807 1483 -797 20 1379 -1035 729 442 -598
1744 -598 1527 -270 216 1395 -1183 1153 523 -1178 1721 -65 -818 1563 -833 204 1155 -741
1760 -741 590 133 -185 444 -386 460 95 -630 930 -627 -196 681 -1225 497 80 -1038 1122 -975
1778 -975 -541 952 -1742 131 553 -1848 760 -94 -1070 918 -687 -148 553 -958 993 -133 -559
1795 -559 1104 -796 186 1028 -1062 883 396 -605 1102 -345 26 728 -639 728 54 -410 1202
1812 1202 -1010 45 766 -1109 463 -16 -975 742 -663 -167 596 -969 736 -84 -780 1304 -999
$$ packed form
1694F01j592J216N21k133K452p07k014L535k057q59K718k511P34J011k147K116
1710H84r69n83J853k397J307R61k620K487n64j921K445j218m24J184r98O96m18
1727b95j42P62j248J258l1j685K747j666n07K290k280Q17J359k414J764k87j040
1744e98K125j797M86J179k578K336o30j701K899j786p53K381k396J037R51j896
1760g41J331m57l18O29q30Q46l65p25J560j557M31Q77j906J722m17j118K160k097
1778i75M34J493k694J873M22k401K608q54r76J988j605N39P01j511J951j126m26
1795e59J663j900R82Q42k090J945m87j001J707j447L71P02j367J367o74m64J612
1812A202k212J055P21j875J572m79r59J717j405M96P63j565J705q20o96K084k303
$$ plain form
1829 -999 -433 1511 -1327 241 732 -1159 581 29 -448 569 -322 284 -96 -312 959 -848 -119
1846 -119 1207 -1161 565 737 -1081 940 38 -384 1021 -432 450 271 -394 1092 -377 -131 1173
1863 1173 -960 675 638 -1215 877 -110 -723 915 -973 -194 379 -1485 393 -431 -1189 649 -1021
1880 -1021 -758 450 -1222 -384 -46 -943 121 -854 -136 -14 -1032 572 -721 -646 947 -1183 -28
1897 -28 759 -1319 783 -15 -904 1045 -756 14 841 -1119 853 370 -1098 1248 -316 -329 1212
1914 1212 -608 351 758 -696 713 -64 13 660 -600 939 97 -715 1186 -550 -378 1145 -913
1931 -913 91 448 -917 656 -259 -175 459 -924 437 124 -1111 1149 -532 -796 1137 -876 -250
1948 -250 754 -845 254 168 -593 385 -414 411 22 -634 1022 -344 -393 1185 -1032 -129 579 -1098
$$ packed form
1829i99N66J944k838J568M91j891J740n52m77J017q91O06l80k16J271j807P29
1846a19J326k368J726J72j818K021r02m22J405j453Q82j79o65J486j469K46J304
1863A173k133J635l7j853K092r87o13J638j888P79N73j864J878q24p58J838j670
1880a021K63J208j672Q38L38q97J064r75P18J22j018J604j293P5J593k130J155
1897b8P87k078K102p98q89J949j801P70Q27j960J972m83j468K346j564j3J541
1914A212j820R59M07j454J409p77P7O47j260J539q42q12J901j736J72J523k058
1931i13J004L57j365J573r15Q4O34j383J361l13j235K260j681k64J933k013O26
1948b50J004j599J099q6p61R78p99Q25l89o56J656j366m9J578k217R03P08j677
$$ plain form
1966 -1098 295 -49 -822 470 -684 32 120 -1106 634 -597 -766 903 -1165 -329 661 -1243 348
1983 348 69 -1008 634 -490 -264 692 -969 440 31 -928 690 -550 -623 588 -1026 -166 184
2000 184 -904 355 -391 -260 249 -662 190 -8 -457 628 -781 50 419 -1087 694 4 -867 1038
2018 1038 -461 -417 1073 -1171 201 527 -1249 673 -100 -892 606 -687 -195 329 -738 276 -351
2035 -351 -603 282 -934 -51 -137 -950 425 -507 -835 488 -925 -96 185 -1162 364 -655 -975 710
2053 710 -1177 -270 198 -1613 156 -132 -1143 355 -581 -623 249 -796 107 -376 -592 454 -1122 4
2071 4 435 -1240 246 -59 -1124 590 -369 -517 547 -641 144 -81 -493 617 -707 -21 400 -976
2089 -976 520 -77 -940 632 -299 -447 520 -835 205 -36 -706 501 -524 -77 921 -1043 498
$$ packed form
1966a098J393l44p73J292j154P16Q8j226J740j231j69J669k068Q36R90j904J591
1983C48k79j077J642j124K26R56j661J409m09r59J618j240p3J211j614Q60L50
2000A84j088J259p46J31N09r11Q52j98m49J085j409Q31L69j506J781o90q71J905
2018A038j499M4J490k244J372L26j776J922p73p92J498j293M92N24j067J014o27
2035c51k52Q85j216Q83q6q13J375r32l28J323j413Q29K81j347J526j019l20J685
2053G10j887R07M68j811J769k88j011J498r36m2Q72j045R03m83k16J046j576J126
2071DM31j675J486l05j065J714r59j48J064j188P85k25m12J110j324O86M21j376
2089i76J496n97q63J572r31j48R67j355J040k41o70J207j025M47R98j964J541
$$ plain form
2106 498 450 -1123 914 -66 -712 971 -390 -158 409 -576 443 -59 -453 570 -540 257 289 -796
2124 -796 622 -268 -584 658 -757 149 265 -1112 617 -303 -509 680 -1059 301 359 -1163 567
2141 567 -96 -942 478 -718 -528 316 -849 15 -246 -603 454 -875 -213 292 -1189 350 33 -1090
2159 -1090 500 -570 -437 411 -664 175 -92 -629 384 -610 -115 283 -835 435 -8 -724 674
2176 674 -471 -285 404 -871 271 -202 -703 673 -645 -164 787 -1088 215 337 -1177 626 -95
2193 -95 -742 646 -510 -411 361 -612 127 -22 -366 282 -670 384 108 -670 629 -163 -493 564 -535
2212 -535 -16 105 -776 364 -332 -413 544 -818 127 225 -1065 500 -226 -930 678 -909 -456 365 -807
2231 -807 36 -199 -654 214 -711 -197 324 -970 388 -247 -1046 585 -428 -552 522 -748 21 48
$$ packed form
2106D98m8j573K037r80o46J683j361K32N67r85J019n02l94J023j110P97L2j085
2124g96J418q90l16J242j415R06J16j377J729r20k06J189j739J360N8j522J730
2141E67o63q46J420j196J90Q44j165Q64k61l57J057j329O62N05j481J539l17j123
2159a090J590j070J33Q48j075Q39k67n37J013r94M95L98j118J270m43p16J398
2176F74j145J86O89j275J142m73n01J376j318M81R51j875J303J22j514J803p21
2193i5o47J388j156R9P72r73P39j49l44O48r52J054k76p78J299p92l30J057j099
2212e35N19J21q81J140o96q1R57j362R45R8j290J565p26p04J608j587M53Q21j172
2231h07Q43k35m55Q68r25N14N21j294J358o35p99J631j013j24J074j270P69K7
$$ plain form
2249 48 -406 221 -518 23 110 -861 466 -155 -687 807 -392 -358 603 -945 107 445 -747 524 -242
2268 -242 -211 525 -709 186 144 -673 577 -238 -251 766 -618 21 149 -575 392 -187 -381 503 -568
2287 -568 149 100 -886 630 -129 -553 675 -580 128 482 -711 490 2 -453 538 -420 322 520 -591
2306 -591 547 -85 -310 879 -631 34 222 -576 447 -28 -581 653 -439 -123 403 -1022 471
2323 471 -126 -922 498 -371 -406 535 -874 278 156 -492 384 -281 -162 467 -597 166 -79 -500 374
2342 374 -442 -187 424 -583 356 -203 -649 620 -459 -335 479 -784 406 394 -924 837 -156 -306
2360 -306 751 -468 203 386 -601 657 59 -230 632 -373 344 380 -444 591 6 87 764 -545 404
2379 404 348 -482 624 -31 -242 723 -394 98 529 -548 535 105 -427 907 -217 -35 486 -200
$$ packed form
2249D8m54O27p39N41Q7r71J327o21n32J494j199L4R61j548J052L38j192J271p66
2268b42L1P36j234Q95m2q17J250q15j3J017j384O39J28p24R67n79j94Q84j071
2287e68P17m9r86J516p59m24J228j255P08L54j193J201m88m55R91r58P42J98j111
2306e91J138o32k25J189j510O65J88p98J023m75n53J234j092L16N26j425J493
2323D71n97p96J420q69l5R41j409J152j22o48Q76o65J19O29j064P63k45m21Q74
2342C74q16K55O11j007R39n59m46J269j079J24Q14j263J190j2j318J761r93j50
2360c06J057j219O71J83r87J258n98k89Q62j005P17L6q24J035n85Q1O77j309R49
2379D04n6q30J106o55k11R65j117M92M31j077J083m30n32J334j124J82N21o86
$$ plain form
2397 -200 458 62 -189 580 -433 83 382 -587 447 -111 -500 790 -465 -309 461 -667 85 191
2415 191 -512 551 -302 -365 363 -546 204 250 -484 477 -472 158 311 -641 611 -133 -577 876 -373
2434 -373 -72 843 -686 360 620 -640 828 -23 -391 500 -343 248 157 -304 681 -194 -6 759 -379
2453 -379 466 395 -360 746 151 -109 689 -252 127 374 -401 689 -51 -173 695 -492 123 487 -616
2472 -616 262 -108 -326 338 -499 95 259 -678 343 -208 -351 719 -559 114 472 -688 371 76
2490 76 -436 585 -455 -110 468 -370 479 106 -461 603 -299 -81 586 -625 422 103 -571 556
2508 556 -180 -162 579 -560 162 89 -559 505 -480 -232 369 -646 168 102 -468 370 -483 -244 331 -715
2528 -715 7 151 -706 462 -322 -379 396 -731 106 66 -674 520 -72 -241 663 -386 25 420 -341
$$ packed form
2397b00O58l96k51P69j013N16K99r69J034n58l89J290j255J56P70j128P52J06
2415A91p03J063q53o3P28r09P50M6p34R61r49O30J53r52J252p44m44J453j249
2434c73L01R15j529J046K60j260J468q51l68Q91q43N91r1m61R85q75J88P65j138
2453c79Q45p1p55J106n95k60P98r41L79K47p75J090p40j22Q68j187O15L64j103
2472f16Q78l70k18O64q37N94J64r37J021n51j43J070j278O73L58j160J059k95
2490G6n12J021j040L45N78q38Q49l73n67J064r02K18O67j211J047l19o74J127
2508E56p36J8P41j139P22p3o48J064r85K48O01j015Q14o6n70Q38q53K39N75j046
2528g15P22J44q57J168p84n7P75j127Q37m0p40J194n92j69R04j049M11L95p61
$$ plain form
2547 -341 577 229 -40 657 -220 327 445 -492 664 294 -73 752 -195 233 773 -469 548 215 -279
2566 -279 567 -107 -3 262 -491 306 57 -204 433 -494 -73 216 -667 321 20 -547 584 -261 -175 213
2586 213 -486 196 -12 -332 458 -325 -250 573 -492 283 258 -364 417 -74 -19 498 -117 446 125 -87 701
2607 701 -391 66 546 -411 409 278 -456 693 -40 -346 706 -511 272 222 -538 346 -256 -439 618
2626 618 -395 -56 306 -589 187 -100 -314 333 -284 85 -56 -310 433 -324 -102 555 -464 150 441
2645 441 -342 538 -101 -206 503 27 35 544 -354 380 541 -99 648 -121 168 435 -315 300 34 -192 528
2666 528 -265 18 475 -656 222 43 -568 390 -599 -389 189 -730 -91 -6 -543 251 -219 -335 194 -378
2686 -378 48 -42 -297 356 -496 -91 372 -574 260 173 -564 541 -117 -288 583 -489 9 287 -428 527
$$ packed form
2547c41R18l48k69O97q77N47J18r37J156l70l67Q25r47M28N40j242J017l33m94
2566b79Q46o74J04K65p53P97k49k61O37r27M21K89q83R88l01n67J131q45Q6L88
2586B13o99O82k08l20P90p83P5Q23j065P75k5o22P81m91N5N17o15N63l21k12P88
2607G01j092M57M80r57Q20j31p34J149p33l06J052j217P83n0p60Q84o02j83J057
2626F18j013L39L62q95P76k87k14O47o17L69j41k54P43p57K22O57j019O14K91
2645D41p83Q80o39j05P09m76QN09q98P34J61o40P47p69K89K67p50O15k66k26P20
2666E28p93K83M57j131Q78j79o11R58r89K10N78r19O39Q5n37P94m70j16N29n72
2686c78M26r0k55O53q52M05M63r46Q34q7p37J105o58j71Q71j072M98K78p15R55
$$ plain form
2706 527 53 -373 452 -389 121 346 -349 297 120 -351 452 -270 -112 220 -270 366 -211 -284 369 -351
2726 -351 -81 323 -598 228 29 -408 553 -390 -175 128 -482 251 -135 -270 313 -175 79 468 -363 483
2746 483 -45 -304 522 -48 -66 641 -326 345 295 -205 430 -186 211 346 -123 372 365 -361 498 50 -228
2767 -228 385 -243 240 128 -394 210 -155 -89 290 -474 -60 197 -684 293 -211 -330 235 -503 -115 219
2787 219 -554 265 -250 -294 265 -407 46 70 -397 498 -20 -296 282 -389 105 165 -355 632 -2 -41 470
2808 470 -56 126 299 -233 386 -22 -34 673 89 143 293 -231 322 21 -249 419 -298 -12 342 -579 126
2829 126 -75 -463 281 -368 -131 324 -381 176 183 -427 337 -55 -116 307 -237 191 133 -351 372 -52 -79 368
2851 368 -152 195 76 -170 248 -96 11 448 -169 347 331 -469 483 -9 -93 341 -294 40 95 -468 384
$$ packed form
2706E27m74m26Q25q41N10K25o95O46j77m71Q03p22J58L32m90O36n77p3O53p20
2726c51K70M04r21Q26j99m37R61r43K15L03o10P33l86j35N83m88K54L89q31Q46
2746D83n28k59Q26n70j8P07r67O71n0n00O35o16L97J35m69M95pp26Q59m48k78
2767b28O13o28M83j12n22O04l65O6L79p64M14K57q81R77n04j19N65p38L88L34
2787B19p73Q19n15m4N59o72M53K4m67Q95n18k76N78o71M94O0n20R87o34l9N11
2808D70n26J82J73n32O19m08j2P07n84N4J50n24N53l01k70O68p17K86L54r21P05
2829A26k01l88P44o49K37M55p05N57Po10P64l92o1M23n44M28n8m84P23m24k7M47
2851C68n20L47j19k46M18l44J07M37o17N16j6q00R52m92q4M34o35L34N5n63Q52
$$ plain form
2872 384 -266 -93 336 -537 48 226 -497 108 -95 -524 139 -296 -226 147 -406 -115 -419 -369 71 -446 69
2893 69 250 -506 252 -32 -431 345 -161 124 353 -156 462 158 -94 577 -100 209 591 -102 540 208
$$ packed form
2872C84o50J73M29q73N85J78p23O05k03m29O63m35P0L73n53K91l04N0M40n17N15
2893F9J81p56P58k84l99P76n06K85K29n09O18l04k52O71o77L09L82o93O42l32
$$ [...]
8191D5
##END NTUPLES=NMR FID
##END=
