##TITLE=1H_55-2021
 CDCl3, 8 sc, 
 9.07.2021
##JCAMPDX= 6.0         $$ Bruker NMR JCAMP-DX V2.0
##DATA TYPE= NMR FID
##DATA CLASS= NTUPLES
##ORIGIN= UXNMR, Bruker Analytische Messtechnik GmbH
##OWNER= root
$$ XWIN-NMR		Version 3.5
$$ Fri Jul  9 10:52:19 2021 Russian Standard Time (UT+4h)  she@DPX200
##.OBSERVE FREQUENCY= 200.131506
##.OBSERVE NUCLEUS= ^1H
##.DELAY= (6, 6)
##.ACQUISITION MODE= SIMULTANEOUS
##.ACQUISITION SCHEME= undefined
##.AVERAGES= 8
##.DIGITISER RES= 18
##SPECTROMETER/DATA SYSTEM= spect
##.PULSE SEQUENCE= zg30
##.SOLVENT NAME= CDCl3
##.SHIFT REFERENCE= (INTERNAL, CDCl3, 0, 15.7039)
##AUDIT TRAIL= $$ (NUMBER, WHEN, WHO, WHERE, WHAT)
$$ ##TITLE= Audit trail, XWIN-NMR		Version 3.5
$$ ##JCAMPDX= 5.01
$$ ##ORIGIN= Bruker BioSpin GmbH
$$ ##OWNER= she
$$ F:/spectra/data/she/nmr/H-F/1/audita.txt
$$ ##AUDIT TRAIL=  $$ (NUMBER, WHEN, WHO, WHERE, WHAT)
(   1,<2021-07-09 10:51:12.06 +0400>,<she>,<DPX200>,
      <created by zg, POWCHK disabled, PULCHK disabled
       configuration hash MD5:
       00 E9 B6 7A A2 85 ED C7 34 08 36 98 17 FE 4E 26
       data hash MD5: 16K
       50 48 B7 23 CE C2 32 1E 8F E9 FC 84 AF 64 4C 83>)
$$ ##END=
$$ 
$$ hash MD5
$$ 8A 6D CF 39 AC 1D E6 2F 52 13 5E A0 0A 27 9B CA
##$RELAX= 
##$RELAX= 
##$RELAX= 
##$RELAX= 
##$RELAX= 
##$RELAX= 
$$ Bruker specific parameters
$$ --------------------------
##$DU= <F:/spectra>
##$EXPNO= 1
##$NAME= <H-F>
##$PROCNO= 1
##$TYPE= <nmr>
##$USER= <she>
##$AMP= (0..31)
100 100 100 100 100 100 100 100 100 100 100 100 100 100 100 100 100 100 
100 100 100 100 100 100 100 100 100 100 100 100 100 100 
##$AQSEQ= 0
##$AQ_mod= 1
##$AUNM= <au_zg>
##$AUTOPOS= <>
##$BF1= 200.13
##$BF2= 200.13
##$BF3= 200.13
##$BF4= 200.13
##$BF5= 200.13
##$BF6= 200.13
##$BF7= 200.13
##$BF8= 200.13
##$BYTORDA= 1
##$CFDGTYP= 0
##$CFRGTYP= 5
##$CHEMSTR= <none>
##$CNST= (0..31)
1 1 145 1 1 1 1 1 1 1 1 1 1 1 1 1 1 1 1 1 1 1 1 1 1 1 1 1 1 1 1 1 
##$CPDPRG= <>
##$CPDPRG1= <>
##$CPDPRG2= <>
##$CPDPRG3= <>
##$CPDPRG4= <mlev>
##$CPDPRG5= <mlev>
##$CPDPRG6= <mlev>
##$CPDPRG7= <mlev>
##$CPDPRG8= <mlev>
##$CPDPRGB= <>
##$CPDPRGT= <>
##$D= (0..31)
0 1.2 0 0 0 0 0 0 0 0.06 0 0.03 0 0 0 0 0.0002 0 0 0 0 0 0 0 0 0 0 0 0 
0 0 0 
##$DATE= 1625813471
##$DBL= (0..7)
120 120 120 120 120 120 120 120 
##$DBP= (0..7)
150 150 150 150 150 150 150 150 
##$DBP07= 0
##$DBPNAM0= <>
##$DBPNAM1= <>
##$DBPNAM2= <>
##$DBPNAM3= <>
##$DBPNAM4= <>
##$DBPNAM5= <>
##$DBPNAM6= <>
##$DBPNAM7= <>
##$DBPOAL= (0..7)
0.5 0.5 0.5 0.5 0.5 0.5 0.5 0.5 
##$DBPOFFS= (0..7)
0 0 0 0 0 0 0 0 
##$DE= 6
##$DECBNUC= <off>
##$DECIM= 32
##$DECNUC= <off>
##$DECSTAT= 4
##$DIGMOD= 1
##$DIGTYP= 9
##$DL= (0..7)
0 120 120 120 120 120 120 120 
##$DP= (0..7)
150 150 150 150 150 150 150 150 
##$DP07= 0
##$DPNAME0= <>
##$DPNAME1= <>
##$DPNAME2= <>
##$DPNAME3= <>
##$DPNAME4= <>
##$DPNAME5= <>
##$DPNAME6= <>
##$DPNAME7= <>
##$DPOAL= (0..7)
0.5 0.5 0.5 0.5 0.5 0.5 0.5 0.5 
##$DPOFFS= (0..7)
0 0 0 0 0 0 0 0 
##$DQDMODE= 0
##$DR= 18
##$DS= 0
##$DSLIST= <SSSSSSSSSSSSSSS>
$$ [...]
##$SUBNAM2= <"">
##$SUBNAM3= <"">
##$SUBNAM4= <"">
##$SUBNAM5= <"">
##$SUBNAM6= <"">
##$SUBNAM7= <"">
##$SUBNAM8= <"">
##$SUBNAM9= <"">
##$SW= 20.0188882624521
##$SWIBOX= (0..15)
0 0 2 0 0 0 0 0 0 0 0 0 0 0 0 0 
##$SW_h= 4006.41025641026
##$TD= 16384
##$TD0= 1
##$TE= 0
##$TE2= 300
##$TE3= 300
##$TEG= 300
##$TL= (0..7)
0 120 120 120 120 120 120 120 
##$TP= (0..7)
150 150 150 150 150 150 150 150 
##$TP07= 0
##$TPNAME0= <>
##$TPNAME1= <>
##$TPNAME2= <>
##$TPNAME3= <>
##$TPNAME4= <>
##$TPNAME5= <>
##$TPNAME6= <>
##$TPNAME7= <>
##$TPOAL= (0..7)
0.5 0.5 0.5 0.5 0.5 0.5 0.5 0.5 
##$TPOFFS= (0..7)
0 0 0 0 0 0 0 0 
##$TUNHIN= 0
##$TUNHOUT= 0
##$TUNXOUT= 0
##$USERA1= <user>
##$USERA2= <user>
##$USERA3= <user>
##$USERA4= <user>
##$USERA5= <user>
##$V9= 5
##$VALIST= <valist>
##$VCLIST= <CCCCCCCCCCCCCCC>
##$VD= 0
##$VDLIST= <DDDDDDDDDDDDDDD>
##$VPLIST= <PPPPPPPPPPPPPPP>
##$VTLIST= <TTTTTTTTTTTTTTT>
##$WBST= 1024
##$WBSW= 4
##$XGAIN= (0..3)
0 0 0 0 
##$XL= 0
##$YL= 0
##$YMAX_a= 374895
##$YMIN_a= -463247
##$ZGOPTNS= <>
##$ZL1= 120
##$ZL2= 120
##$ZL3= 120
##$ZL4= 120
##$ABSF1= 10
##$ABSF2= 0
##$ABSG= 5
##$ABSL= 3
##$ALPHA= 0
##$AQORDER= 0
##$ASSFAC= 0
##$ASSFACI= 0
##$ASSFACX= 0
##$ASSWID= 0
##$AUNMP= <proc_1d>
##$AZFE= 0.1
##$AZFW= 0.1
##$BCFW= 1
##$BC_mod= 2
##$BYTORDP= 1
##$COROFFS= 0
##$CY= 11.3945322036743
##$DATMOD= 1
##$DC= 2
##$DFILT= <>
##$DTYPP= 0
##$F1P= 17.5019972093344
##$F2P= -2.517084195857
##$FCOR= 0.5
##$FTSIZE= 0
##$FT_mod= 4
##$GAMMA= 1
##$GB= 0.15
##$INTBC= 1
##$INTSCL= 1
##$ISEN= 128
##$LB= 0.24
##$LEV0= 0
##$LPBIN= 0
##$MAXI= 10000
##$MC2= 0
##$MEAN= 0
##$ME_mod= 0
##$MI= 1.114404
##$NCOEF= 0
##$NC_proc= 0
##$NLEV= 6
##$NOISF1= 3.799351
##$NOISF2= 2.8
##$NSP= 1
##$NTH_PI= 0
##$NZP= 0
##$OFFSET= 15.70392
##$PC= 1
##$PHC0= -12273.93
##$PHC1= 10.00101
##$PH_mod= 1
##$PKNL= yes
##$PPARMOD= 0
##$PSCAL= 0
##$PSIGN= 0
##$REVERSE= no
##$SF= 200.130013532006
##$SI= 16384
##$SIGF1= 3
##$SIGF2= 2
##$SINO= 400
##$SIOLD= 16384
##$SREGLST= <1H.CDCl3>
##$SSB= 0
##$STSI= 0
##$STSR= 0
##$SW_p= 3612.71676300578
##$SYMM= 0
##$S_DEV= 0
##$TDeff= 0
##$TDoff= 0
##$TI= <>
##$TILT= no
##$TM1= 0
##$TM2= 0
##$TOPLEV= 0
##$USERP1= <user>
##$USERP2= <user>
##$USERP3= <user>
##$USERP4= <user>
##$USERP5= <user>
##$WDW= 1
##$XDIM= 8192
##$YMAX_p= 0
##$YMIN_p= 0
$$ End of Bruker specific parameters
$$ ---------------------------------
##NTUPLES= NMR FID
##VAR_NAME=  TIME,          FID/REAL,        FID/IMAG
##SYMBOL=    X,             R,               I
##VAR_TYPE=  INDEPENDENT,   DEPENDENT,       DEPENDENT
##VAR_FORM=  AFFN,          ASDF,            ASDF
##VAR_DIM=   8192,          8192,            8192
##UNITS=     SECONDS,       ARBITRARY UNITS, ARBITRARY UNITS
##FACTOR=    0.0002496,     1,               1
##FIRST=     0,             0,               0
##LAST=      2.0444736,     0,               0
##MIN=       0,             -463247,         0
##MAX=       2.0444736,     374895,          0
$$ Real data points
##PAGE= N=1
##DATA TABLE= (X++(R..R)), XYDATA
0 0 0 0 0 0 0 0 0 0 0 0 -8 8 -8 16 -16 16 -24 32 -38 42 -50 64 -73 89 -105 121 -138 162 -187 215 -244 280
32 280 -316 362 -408 459 -515 580 -645 723 -802 893 -990 1096 -1215 1341 -1479 1631 -1798
49 -1798 1982 -2182 2404 -2649 2924 -3229 3575 -3964 4413 -4933 5545 -6278 7171 -8291
63 -8291 9742 -11706 14525 -18944 26907 -45859 190223 70798 -87802 231136 17559
74 17559 71619 374895 150710 -223661 26677 134954 -57415 133714 226653 -249156 -224631
85 -224631 130137 -30593 -80219 144433 -139536 -371345 -33707 86001 -153110 -50552
95 -50552 -13050 -356913 -237296 140537 -73294 -202478 -10771 -216419 -329134 51680
105 51680 86737 -205280 -129032 -51751 -261694 -95064 203194 -68668 -226661 12826 -91819
116 -91819 -150799 183105 118174 -193523 -59163 72285 -70994 60581 237072 -55102
126 -55102 -167232 121110 66593 -28726 207134 86957 -184765 22544 162521 -2386
136 -2386 62599 151015 -95938 -125187 161182 93016 -57294 107010 12704 -180594 59845
147 59845 162653 -49644 -13589 61564 -109843 -74420 156132 48220 -115019 29276 -3491
158 -3491 -134759 77945 126988 -107767 -56372 46372 -75798 -23474 132112 -4572 -129092
169 -129092 25736 34730 -71293 80859 95011 -116904 -31354 95769 -20529 12859 115853
180 115853 -19488 -83481 74917 79104 -28341 67475 75257 -87310 9930 128162 -6772
191 -6772 502 86466 -28188 -49436 88858 60296 -42681 26374 42783 -68767 11882 100633
203 100633 -36407 -38221 53971 -36089 -42330 67760 12808 -67724 -36 18527 -56587 -3096
215 -3096 53622 -59926 -59202 35574 -36493 -49460 37702 -23953 -78195 -4562 3493 -52748 -17199
228 -17199 16443 -61007 -53812 29143 -28581 -51374 23461 -25979 -62725 12501 6606 -40713
240 -40713 -7680 12081 -35162 -24599 34389 -9630 -35301 29212 -3122 -35417 31222 17107
252 17107 -25527 11663 21087 -10725 1875 34675 5237 -14874 33561 16907 -14983 36426
264 36426 25162 -13361 25001 27991 710 16297 29738 11196 1223 28739 22072 -5816 26784
277 26784 23880 -10546 20839 22391 -5432 12314 15767 462 604 10386 8009 -9888 5160
290 5160 9937 -17275 2261 7829 -18530 -1713 1289 -14624 -6498 -5481 -7899 -12735 -10390 -2426
304 -2426 -18162 -11638 -642 -21077 -10248 -2917 -19601 -8423 -7899 -13953 -8174 -11966 -6616 -9510
318 -9510 -12893 -601 -11377 -9584 1676 -11832 -4267 537 -8983 957 -2450 -3056 3658 -4216
332 -4216 3840 3612 -2769 9232 1975 2061 11230 1068 8370 9851 2738 13301 6720 6911 14471
347 14471 4664 11790 12171 4931 14895 7814 7810 14599 4340 11377 10955 3196 12900 5607 4875 10918
363 10918 955 7220 5873 -1229 8061 -336 -1021 5832 -4956 158 373 -6697 95 -6503 -5508
378 -5508 -2510 -12176 -3381 -7154 -15198 -2849 -11506 -14551 -5355 -14208 -12047 -10369 -12786 -9076 -15941
393 -15941 -9294 -7602 -18920 -3807 -6305 -17735 -1210 -5864 -11865 -207 -2462 -3998 -3870 1442
407 1442 4575 -5293 8462 10282 -7557 11695 14112 -2329 14725 15580 2391 9842 17013 14045
421 14045 7106 17938 18984 -1001 18418 27383 683 17063 24356 -690 12177 26003 10640
434 10640 5124 16317 12944 -4556 15219 24606 -10779 2060 17961 -15013 -532 20817 -10907
447 -10907 -17177 2537 -6444 -19986 969 3817 -35133 -21084 4988 -30004 -18781 8971 -34579
460 -34579 -38942 -1857 -16230 -29802 -6068 -11985 -47059 -23737 8830 -28743 -25397 6571 -39412
473 -39412 -39729 15267 -7896 -31244 -1069 -11728 -39033 -1733 26631 -19341 -20997 16916 -21263
486 -21263 -17288 47011 9941 -26605 18692 11716 -11449 35856 48276 -10478 -5690 41918 11254
499 11254 11707 68985 17340 -26606 40162 38758 4781 50470 44172 -22579 2166 57547 21393
512 21393 9728 52667 -1530 -37344 47794 45098 -12126 27436 17371 -44437 4565 57555
524 57555 1287 -20867 17928 -23716 -43264 45134 29181 -51593 -9483 -3197 -55455 6325
536 6325 45086 -37559 -54797 -1468 -26581 -34930 39641 4186 -82026 -21073 10768 -39963
548 -39963 14833 36345 -61860 -54227 25044 608 -14249 38715 -9233 -77574 8783 50508
560 50508 -18640 14823 29748 -63391 -26093 67141 16980 -16837 26684 -16732 -55387 42236
572 42236 65984 -28759 -8216 20153 -52814 -1362 82567 -2562 -46771 11556 -15710 -34860
584 -34860 52595 42814 -62896 -32794 19134 -36444 4436 63708 -41848 -75192 13888 -2440
596 -2440 -24927 40163 4930 -85949 -26692 39905 -16473 -782 39192 -57458 -62994 50670
608 50670 25522 -19991 31404 -4923 -65452 19973 74655 -2285 -4749 34921 -34207 -18852
620 -18852 91134 39909 -28372 29967 10771 -29384 59305 81262 -16687 -13397 40172 -6959
632 -6959 8869 91415 17921 -51281 27735 25920 -15457 56100 48358 -51709 -22790 42068
644 42068 -1930 -521 51327 -23568 -71162 24478 26052 -32001 19039 3853 -77932 -22279
656 -22279 40402 -17507 -29171 9669 -45723 -65170 29672 19150 -53690 -9311 -9024 -68285
668 -68285 -2352 43909 -32294 -40904 5188 -30598 -34562 41742 14391 -57829 -6376 12288
680 12288 -37730 17721 45873 -37757 -31471 27175 -4605 -9473 44032 7114 -48379 11888
692 11888 35675 -16749 19638 38746 -36769 -15535 47496 6453 -6611 34720 -921 -34791
704 -34791 26382 40182 -16467 6990 27198 -31048 -4901 50831 -1435 -18717 23280 -5062
716 -5062 -24131 28917 27062 -26307 -3973 20903 -22416 -2210 40538 -13291 -27030 21086
728 21086 -2424 -18854 24594 11798 -30775 -2771 20365 -15542 -3943 27864 -17774 -25632
740 -25632 24136 351 -19490 18761 2791 -28962 3710 18487 -14924 -6692 18018 -16221
752 -16221 -19719 23947 -118 -22354 14254 1064 -24446 8788 14258 -16857 -5938 13567
764 13567 -11404 -12897 19903 -919 -21181 13065 4313 -19318 10529 11518 -16232 -1082 13100
777 13100 -7236 -6942 15508 64 -15110 12955 7499 -15121 10087 11205 -13458 3539 13114
790 13114 -6109 -2591 12643 722 -8911 10944 7486 -11934 7960 10856 -11493 3780 11348
803 11348 -7550 -1226 9844 -1520 -6182 6400 3914 -9821 3998 8165 -11345 314 8112
816 8112 -9570 -1914 6949 -5342 -5488 3083 -71 -7339 632 4261 -9551 -2362 6263 -8407
830 -8407 -2884 5710 -6715 -4401 2962 -1769 -3996 189 1920 -5352 -2176 5666 -4596 -2735 5881
845 5881 -4499 -2274 4995 -1493 -1225 1611 842 -670 -274 4613 -569 -2027 5553 -989 -1269 5957
861 5957 -621 -268 3362 168 1495 1366 2007 1364 -1417 3507 1142 -1907 4315 -288 -1846 3398
877 3398 -1108 64 1228 -1326 879 -1525 -230 1165 -3186 874 -177 -3437 1609 -1607 -2110
892 -2110 1125 -2713 -217 -372 -2591 977 -2085 -1450 1040 -3034 228 -165 -2598 1271 -1657 -1107
908 -1107 1418 -2266 700 404 -2002 1929 -1049 -586 2106 -1515 1426 929 -1042 2555 -368 357
924 357 2590 -1046 1887 1435 -794 2864 -155 450 2384 -1280 1759 996 -1486 2328 -712 -467
940 -467 1500 -1636 985 -147 -1566 1609 -2034 -485 1622 -2872 578 447 -2571 1273 -679 -618
956 -618 326 -1619 1170 -889 -970 2866 -2370 -457 2652 -2580 907 2059 -1540 684 264 1046 665
973 665 -197 3300 -1293 -1024 5000 -960 439 4836 -1633 19 3541 1310 1348 1360 2449 -719 -504
990 -504 6108 -192 -1734 5071 -2254 -1978 5706 119 -2043 694 -144 -2167 -351 4513 -2092 -5629
1006 -5629 3269 -2830 -4459 5990 -1855 -7468 374 -994 -3814 348 1644 -5655 -7403 2907
1020 2907 -1460 -5956 4430 -3984 -11677 1912 990 -5512 274 -1103 -8732 -5438 4771 -109
1034 -109 -7045 2137 -3710 -10777 6331 5362 -7427 232 140 -7295 1438 9565 267 -6666 2719
1049 2719 858 -4794 11562 8516 -9632 1374 5988 -3005 7600 12408 -2905 -5871 6934
1062 6934 6354 564 12315 6781 -11936 3799 13632 -516 7683 10349 -8364 -4225 12792 7862
1076 7862 -617 6749 946 -12690 6513 16417 -4696 -564 4684 -12600 -2468 15543 1841
1089 1841 -9348 -1024 -3836 -10703 7652 12090 -13743 -10222 2714 -11056 -976 14515 -7788
1102 -7788 -17524 -1327 -1453 -6043 7387 4719 -19728 -11027 8698 -4509 -682 11221 -13550
1115 -13550 -17718 7915 5430 -3580 5966 -759 -18232 -2183 17466 -408 -3702 7789 -12276
1128 -12276 -10668 19361 9059 -7649 3049 -1427 -11553 8616 20248 -4002 -9061 6291
1140 6291 -6112 -3156 22861 4292 -16240 1918 2322 -5674 12375 13271 -13079 -12016 8516
1153 8516 132 -1129 16413 -4148 -21623 5493 8415 -4875 8629 4355 -18299 -7124 14103
1166 14103 2741 -4124 7941 -7769 -17790 12380 12660 -8596 2986 1280 -15896 2101 18025
1179 18025 -641 -8381 4004 -4800 -9405 16449 11100 -14693 -580 4461 -9852 7538 16464
1192 16464 -8283 -10690 5875 -2 -3688 13908 4356 -18406 371 9951 -7079 5623 10639
1205 10639 -14386 -9329 10342 1293 -4471 7330 -2029 -16859 3508 12038 -8329 -355 6228
1218 6228 -14626 -5061 13836 -1083 -7569 4067 -2810 -10902 6881 10727 -10043 -3142 6931
1231 6931 -9636 -1108 14912 -4129 -9011 6284 -253 -5630 8555 7031 -10279 -1773 9529
1244 9529 -5149 -347 12927 -5671 -8173 10028 1504 -4796 7762 3518 -8846 1461 9850
1257 9850 -4097 -1994 9925 -5125 -6496 11249 653 -6819 6609 1699 -7763 3003 7057
1270 7057 -5279 -2946 7531 -4012 -6163 9038 -858 -8639 5954 1148 -7975 3006 4079
1283 4079 -6385 -2197 5691 -3610 -5994 6286 -1019 -8425 5439 1069 -8770 2510 2900 -6440
1297 -6440 -680 3915 -4234 -5146 4522 -573 -7188 4057 576 -8900 2815 3228 -6641 51 2728
1312 2728 -4858 -2766 4552 -223 -5553 2738 1264 -6451 3702 4623 -6028 826 3815 -3797 532
1327 532 5267 -226 -3075 3003 2855 -2784 4381 5277 -4642 1576 5753 -1566 2474 5486 -821 -941
1343 -941 4145 3552 -200 3207 4131 -3182 1787 6513 -1053 1421 4491 -2027 -78 4197 1759 -621
1359 -621 866 1567 -2453 377 4415 -2659 -1940 2260 -3377 -1433 2612 -1794 -2983 -1233 -1176 -2503
1375 -2503 -1280 1030 -3973 -3914 853 -3201 -2592 1242 -3437 -3649 -669 -1688 -1688 -1276 -838 -2543 -2874
1392 -2874 1147 -1134 -2312 1356 -2197 -2347 1652 -552 -616 409 -428 -155 -297 1730 773 -1115 1943
1409 1943 470 -669 3076 903 -59 2056 611 1216 1603 1287 1596 -107 1469 1687 -238 2181
1425 2181 854 -817 1729 336 122 1197 -370 496 -147 -267 1105 -975 236 567 -1617 767
1441 767 97 -1086 663 -921 -483 358 -961 503 -416 -892 670 -1133 -26 521 -1338 562 -184
1458 -184 -827 832 -774 -28 629 -1012 607 126 -385 1104 -541 168 926 -646 1009 227 -285
1475 -285 1173 -571 418 738 -753 953 -6 -376 973 -792 8 500 -1219 528 -355 -1003 666
1492 666 -1298 -335 90 -1305 320 -641 -933 553 -1180 -18 267 -1181 430 -202 -559 765 -689
1509 -689 196 354 -727 929 -296 -188 1187 -631 474 1002 -555 927 167 164 1155 -215 933
1526 933 770 -475 1418 75 171 1777 -281 441 1049 -132 976 266 174 682 -733 1149 482 -854
1544 -854 1140 -780 -1049 1172 -513 -321 6 -1110 -275 -679 76 295 -1798 -31 -586 -1705 1313
1561 1313 -263 -1729 63 -1117 -645 326 -152 -314 -1804 -326 382 -1294 1099 -149 -2663 319
1577 319 -20 -806 1038 -436 -1493 -1225 74 1042 -695 323 -106 -2723 1059 1763 -888 874 -358
1594 -358 -1643 554 1491 1069 -588 -404 183 -1405 1888 2700 -1701 -80 461 -1208 1921 2575 36
1611 36 -857 -270 1018 757 2296 2298 -2269 -433 2479 157 2454 2688 -1694 -955 1473 2112 1662 1550
1629 1550 653 -2521 -123 3888 226 401 1066 -3259 -978 2984 1039 -433 -881 -1696 -2224 493
1645 493 3184 -1450 -2719 -368 -3085 -738 3394 -1070 -3203 -1595 -1914 -955 1155 1250 -3253 -3944
1661 -3944 260 -1061 -246 2654 -2724 -4321 207 233 221 1439 -697 -3383 -1766 2533 1284 -262
1677 -262 1597 -2373 -2959 3598 2464 215 1324 -686 -1650 1593 4252 1635 -949 1025 -419 -719
1693 -719 5168 2412 -1836 836 -42 -483 3221 2976 -560 -1983 676 725 27 3548 545 -3813 479
1710 479 1156 -753 2278 773 -2853 -1545 1074 890 -376 967 -1052 -3905 955 2103 -1690 594
1726 594 -283 -3534 -371 1793 -175 -1451 -412 -1019 -2396 1397 1791 -2723 -537 290 -2779 585
1742 585 1927 -1431 -1332 -82 -495 -922 1061 1101 -2768 -716 1404 -1886 411 1549 -2141 -1037 1092
1759 1092 -438 -617 635 323 -1721 -122 1838 -1418 -140 1907 -1610 -341 2050 -456 -244 1166
1775 1166 439 -212 545 1755 -565 281 2710 -461 -73 2394 -332 228 2346 635 -55 914 1020
1792 1020 171 788 2432 -193 -787 1936 205 204 2411 -122 -967 752 603 482 439 674 -946 -1391
1810 -1391 1609 428 -602 1271 -1532 -1949 939 341 -408 -341 -1057 -1496 -1056 1054 192 -1928 -529
1827 -529 -1529 -1896 1424 50 -1579 -957 -1715 -1008 271 514 -569 -2455 -957 -60 -553 1572 -165
1844 -165 -2430 -628 -303 221 1250 -177 -1304 -1720 -313 1483 143 229 -755 -2409 309 1019 404
1861 404 715 -1114 -1610 -189 777 1626 -59 -1051 -433 -1000 1224 2114 -230 -212 -778 -756 1509 1483 600
1880 600 -207 -1110 550 939 1456 1602 -877 -495 702 645 2313 1340 -343 -99 -61 1509 2186 739
1898 739 653 -516 86 2081 1372 1318 400 -1029 571 1179 1186 1557 -527 -298 -73 124 1608 505 -668
1917 -668 -528 -1124 288 919 -314 -208 -1267 -1120 287 -111 63 -571 -2090 -739 -618 -263 255 -1362
1935 -1362 -1117 -953 -995 506 -417 -1262 -770 -1562 -388 196 -545 -323 -1277 -1060 11 -457 310 -367 -1467
1954 -1467 11 -262 -51 853 -515 -446 -104 -308 915 154 -114 208 -644 675 851 -142 619 -152 -308
1973 -308 583 122 618 275 -481 367 -153 298 874 -466 101 276 -210 887 228 -70 368 -372 427
1992 427 274 145 583 -210 5 698 -206 569 407 -299 503 194 197 504 -250 331 191 -252 645 -38 66
2013 66 547 -312 428 355 -281 643 -242 95 562 -198 352 227 -341 510 -323 -90 371 -578 222 -148 -517
2034 -517 266 -359 -250 105 -761 116 -98 -549 252 -417 -285 76 -621 143 5 -491 343 -313 -83 207
2054 207 -627 438 -87 -325 492 -340 -13 412 -349 263 -7 -350 362 -317 128 445 -361 466 -48 -359
2074 -359 687 -143 162 542 -323 323 73 -132 501 -254 133 223 -482 583 -105 -414 330 -488 -152 246
2094 246 -560 150 -234 -346 74 -593 14 -28 -776 86 -276 -606 300 -298 -379 -81 -576 100 -254 -126 87
2115 87 -864 67 352 -690 527 -80 -746 433 -78 180 185 -17 204 -259 328 983 -496 527 539 -638
2135 -638 872 794 71 432 84 334 302 527 820 -376 176 1061 -376 771 1117 -621 174 266 -183
2154 -183 459 383 342 -582 -219 943 -519 141 756 -1216 -302 914 -502 109 253 -709 -714 39 743 -557
2174 -557 -650 468 -1412 -484 1372 -861 -777 211 -1088 -691 542 308 -983 -892 522 -837 -364 1419
2192 1419 -1127 -1344 795 -631 -462 1105 -191 -1200 -360 686 -350 -321 1240 -982 -1501 1632
2208 1632 -149 -779 1401 -278 -1337 719 1027 -271 -302 909 -783 -1107 2192 332 -1434 1572
2224 1572 37 -1335 1486 1073 -888 -80 1191 -408 -340 2114 273 -1738 1507 522 -1613 1733
2240 1733 991 -1654 305 1173 -790 -552 1377 -271 -2050 1490 675 -2357 1110 891 -2547 397
2256 397 1328 -1561 -668 1248 -659 -1767 1356 478 -2687 1075 1257 -2740 563 1543 -2369 -543
2272 -543 1982 -1027 -1288 1554 286 -2274 1527 1767 -2675 387 2099 -1946 159 2634 -1291 -1089
2288 -1089 2058 397 -1294 1775 1549 -2575 388 2687 -1710 190 2769 -2009 -1392 2759 330
2303 330 -1456 1381 575 -2856 488 2880 -1929 -1014 2114 -2684 -1563 3340 -509 -2283 820 -235
2319 -235 -2692 1115 2235 -2731 -1628 1948 -1977 -1085 3628 -1288 -3280 1471 217 -1668 1941
2334 1941 1628 -3115 -1195 2919 -657 -643 3299 -1691 -3290 2980 1542 -1364 2050 715 -3109 284
2350 284 3928 84 -876 2369 -1368 -2585 4264 1860 -2451 1387 539 -2414 1588 3665 -1454 -2098
2366 -2098 1644 -737 -1613 4093 847 -4409 558 907 -2238 1955 2083 -3348 -2483 1759 -217 -1093
2382 -1093 2678 -794 -4920 1161 1943 -2097 1266 799 -4254 -1147 2874 -78 -1518 1152 -1416
2397 -1416 -3601 2387 2791 -2681 -34 785 -3512 612 3748 -831 -2040 762 -579 -1467 3127 2384
2413 2384 -3432 -315 2012 -1893 1529 3700 -2027 -2059 1890 519 -256 2436 934 -3455 122 2959
2429 2959 -1004 765 2481 -3031 -1720 2972 480 -720 1225 -490 -2821 910 2971 -1242 -813
2444 -813 1583 -2446 -771 3600 -288 -2005 758 -700 -1643 1524 1900 -2156 -1411 1452 -1498 -437
2460 -437 2873 -1308 -2721 1093 -63 -952 1504 690 -2270 -951 1771 -375 -607 2050 -1188 -2233
2476 -2233 2290 641 -1086 1311 163 -1634 303 2052 -237 -761 1278 -503 -1367 2499 769
2491 769 -1606 943 287 -1134 1228 1411 -706 -756 739 105 -725 1733 437 -1827 837 607 -932
2508 -932 1027 618 -1283 -420 792 88 -693 656 -79 -1882 656 750 -1328 420 50 -1642 -4
2525 -4 469 -403 -626 -143 -264 -1173 248 701 -1349 -53 362 -1456 312 521 -823 -398 -138 -157 -323
2544 -323 138 352 -961 -286 852 -722 257 709 -814 11 296 -68 242 199 337 -188 -10 1000 -238
2563 -238 54 1015 -382 276 956 -88 389 314 221 502 206 895 264 -26 856 -71 91 884 -79 126
2583 126 644 -177 392 79 172 472 -173 430 97 -411 497 -222 -361 430 -413 -31 110 -497 51 -405
2603 -405 -232 7 -660 70 -248 -694 103 -491 -535 19 -737 -219 -395 -630 -15 -609 -361 12 -739 -18
2623 -18 59 -613 245 -459 -267 164 -336 115 -108 -281 310 -355 178 460 -470 463 203 -424 578 95
2643 95 -113 483 -1 456 167 199 597 -210 437 868 -393 592 576 -235 715 302 5 403 4 309 -2
2664 -2 85 729 -510 277 665 -802 355 508 -730 54 66 -250 -257 -99 211 -731 -77 848 -1049 28
2684 28 611 -1204 -168 513 -659 -315 227 -242 -728 -38 603 -1075 -312 1023 -1133 -271 1394 -802
2702 -802 -456 725 -254 -384 652 750 -817 -33 1543 -819 -421 2023 -670 -839 1719 -90 -549
2719 -549 1358 619 -973 266 1550 -726 -493 1970 -625 -1030 2158 -179 -1468 1487 319 -1382
2735 -1382 589 1284 -1130 -627 1753 -933 -1695 2122 -403 -2297 1710 162 -2205 633 851 -2012
2751 -2012 -777 1464 -1161 -1952 1931 -501 -2892 1709 370 -3035 1077 1013 -2391 -176 1914 -1513
2767 -1513 -1595 2253 -249 -2548 2343 778 -3212 1685 2010 -2500 562 2585 -1694 -857 3001 106
2783 106 -2075 2825 1188 -3000 2391 2908 -2995 891 3157 -2051 -436 3650 -507 -2372 2669
2798 2669 1215 -3131 2190 2647 -3988 223 3149 -2951 -876 3425 -1825 -2940 2613 531 -3454
2813 -3454 1696 1841 -4592 -27 3456 -3546 -1287 3345 -2698 -2901 3305 122 -3720 1626 1483 -4580
2829 -4580 610 3811 -3624 -1665 3888 -2703 -2408 4564 -184 -3771 2421 1714 -3505 1699 4257
2844 4257 -3432 -1196 4906 -1945 -1914 5317 -378 -3962 3521 2321 -3160 1873 3590 -3904 -1008
2859 -1008 5286 -1483 -2393 4855 -929 -4521 4334 2122 -3964 1552 2758 -4173 -590 4934 -2238
2874 -2238 -3159 4208 -1337 -4464 4324 1340 -5294 1329 2103 -4494 -15 4253 -3429 -3576 3946 -1143
2890 -1143 -4333 4170 528 -6134 2008 2597 -4320 446 3644 -4030 -2639 4456 -640 -3847 3742
2905 3742 561 -5701 2810 3609 -4473 677 3608 -3869 -1405 5349 -565 -3664 3777 799 -4584
2920 -4584 3638 3947 -4768 600 4088 -3370 -440 5409 -1545 -3575 3758 1358 -3717 3239 3292 -5051
2936 -5051 641 4653 -3209 -471 4795 -2503 -3236 4036 752 -3765 2537 1973 -5134 794 4578
2951 4578 -3708 -1320 3975 -3112 -2788 4400 -95 -4098 1877 1179 -4464 1029 3896 -4134 -1910
2966 -1910 3846 -2719 -2248 4306 -980 -4228 2165 1241 -3580 1115 3088 -4105 -1635 4087 -1933
2981 -1933 -2135 4234 -1248 -3805 3342 1514 -3079 1475 2350 -3388 -618 4317 -1478 -2287 3885 -935
2997 -935 -3115 3928 1416 -3235 1349 1909 -2744 284 3746 -1629 -2352 3197 -245 -2458 3537 1052
3013 1052 -3606 1458 1882 -2488 695 2568 -2114 -2034 2818 -156 -2409 2613 335 -3658 1607 2002
3029 2002 -2524 495 1861 -2317 -993 2708 -86 -2132 1797 360 -2850 1717 1973 -2617 179
3044 179 1753 -1864 -482 2289 -682 -2008 1207 491 -2169 1489 1537 -2792 -33 1773 -1702 -240
3060 -240 1874 -1059 -1476 1309 444 -1495 735 1011 -2325 131 2094 -1321 -146 1586 -1163 -675
3076 -675 1580 345 -861 755 700 -1386 409 1989 -1027 -257 1591 -879 -377 1703 -24 -747
3092 -747 684 620 -686 193 1314 -751 -518 1295 -630 -507 1329 -511 -783 501 -115 -599 -90
3109 -90 65 -809 -822 723 -487 -1013 609 -808 -992 431 -233 -712 -120 -307 -533 -533 290 -120 -857 510
3129 510 -148 -650 626 9 -432 370 128 -112 246 515 323 -206 637 608 -249 1017 516 -158 842
3148 842 390 209 634 386 525 342 440 767 48 482 589 -257 645 338 -231 396 -36 -18 30 -269 47
3169 47 -293 -323 40 -829 -393 -86 -934 -169 -303 -785 -263 -674 -481 -556 -785 -209 -711 -645 -90 -706 -318
3190 -318 46 -777 -126 -82 -383 139 -80 63 89 -13 508 -192 -75 664 -208 435 723 -35 359 432 312
3211 312 488 461 623 385 199 1154 166 266 1101 -82 292 995 -136 245 580 208 73 110 567 -228
3231 -228 -409 713 -473 -697 680 -534 -700 392 -478 -625 -82 -151 -718 -611 464 -800 -1087 706
3249 706 -518 -1210 558 -465 -1122 209 44 -1010 -428 503 -616 -1094 981 -302 -1266 1007 -164
3266 -164 -1114 996 487 -1048 332 790 -462 -418 1351 168 -993 1445 651 -1211 1655 933 -1240
3283 -1240 899 1425 -619 48 1782 8 -1143 1656 704 -1524 1420 1044 -1898 704 1528 -1386
3299 -1386 -92 1494 -828 -1346 1549 284 -1973 1152 1036 -2617 477 1656 -2150 -416 1551
3314 1551 -1578 -1387 1662 -168 -2431 916 848 -2827 617 1963 -2764 -586 2188 -1904 -1158 2284
3330 2284 -570 -2240 1503 1123 -2386 1001 2329 -2674 -235 3097 -1582 -1026 3187 -801 -2060
3345 -2060 2552 1139 -2360 1297 2422 -2865 -33 3589 -1857 -1252 3396 -1032 -2387 2963 959
3360 959 -2806 1233 1969 -2928 -49 3466 -2215 -1876 3467 -1357 -2730 3308 208 -3822 1458 1556
3376 1556 -3198 57 3055 -2859 -2307 3611 -1179 -3143 3616 3 -4097 2165 1967 -3453 694
3391 694 3000 -3043 -1647 3867 -1082 -3008 3740 51 -4164 2974 2175 -3779 1052 3062 -3041
3406 -3041 -908 4158 -1088 -2925 3759 277 -4177 3370 2208 -4333 1103 3262 -3318 -549 4162
3421 4162 -1727 -2914 3734 258 -4042 3143 2105 -4786 1281 3406 -3781 -394 3889 -2327 -2727
3436 -2727 3800 -48 -3951 3023 1885 -4638 1367 3513 -3960 -176 4250 -2665 -2327 3877 -352
3451 -352 -3452 2940 1677 -4416 1483 3421 -4019 -106 4418 -2955 -2032 4118 -895 -3349 3127
3466 3127 1287 -4046 1665 3221 -3990 -230 4304 -3134 -2123 4383 -1150 -3275 3423 718 -4014
3481 -4014 1809 3001 -3905 -418 4034 -3114 -2090 4565 -1340 -3385 3633 320 -3941 2256 2569
3496 2569 -3669 10 3659 -2830 -1863 4551 -1370 -3437 3585 330 -3669 2660 2059 -3654 153
3511 153 3331 -2295 -1375 4180 -1517 -3219 3608 406 -3556 2755 1770 -3699 724 3227 -2539 -957
3527 -957 3496 -1450 -2716 3595 499 -3446 2631 1390 -3689 1158 2972 -2614 -747 2961 -1488
3542 -1488 -2146 3304 494 -3364 2272 1509 -3434 1537 2907 -2947 -637 2707 -1371 -1624 2963 130
3558 130 -3271 1890 1478 -3049 1184 2361 -3125 -513 2618 -1600 -1282 2281 -558 -2823 1733 1357
3574 1357 -2818 727 1867 -3104 -158 2667 -1670 -1212 2140 -902 -1959 1735 994 -2426 528
3589 528 1660 -2408 87 2562 -1611 -1061 2193 -661 -1208 1894 716 -1909 571 1756 -1632 -6
3605 -6 2380 -1532 -979 2254 -531 -1147 1777 37 -1600 741 1224 -1389 -88 1605 -1318 -1085 1963
3622 1963 -646 -1363 1510 -279 -1424 707 750 -1300 -217 963 -1015 -844 1574 -578 -1478 1308
3638 1308 -197 -1328 982 386 -1005 93 813 -587 -390 1338 -73 -866 1459 283 -961 1216
3654 1216 554 -731 493 816 -203 -14 909 59 -478 1000 510 -711 872 521 -730 642 649 -451
3672 -451 252 458 -140 -512 519 261 -755 335 379 -1029 210 286 -847 -255 7 -444 -462 -193 -157
3691 -157 -699 -249 184 -912 -306 134 -937 -222 144 -680 -47 -100 -71 -105 -232 291 -305 -159 527 -353
3711 -353 143 484 -340 320 186 -57 174 -36 291 219 -8 577 -37 -127 591 -199 107 496 -78 141 309
3732 309 -56 184 -47 258 235 -276 386 101 -143 423 -200 -140 229 -340 75 -149 -162 27 -257 212 231
3753 231 -467 259 -41 -158 290 -173 -160 267 -123 163 21 162 261 -139 434 154 -306 468 99 -150 533
3774 533 -35 109 230 253 240 -74 230 285 -257 319 272 -511 392 181 -373 453 84 -87 -32 171 -23 -296
3796 -296 253 90 -738 258 136 -770 209 -104 -637 -80 41 -276 -371 -71 -36 -847 73 298 -959 140
3816 140 306 -1103 178 388 -543 -195 285 -72 -413 338 438 -806 198 746 -743 201 1025 -567
3834 -567 -18 786 -217 -128 727 575 -601 379 836 -831 300 1242 -789 -207 1093 -491 -358 954
3852 954 26 -826 307 747 -862 63 1027 -1294 -587 1249 -740 -631 1140 -519 -1212 428 559
3869 559 -1192 -273 789 -1495 -778 1640 -824 -1238 1270 -617 -1102 1025 691 -1343 163 1008 -1045
3886 -1045 -235 1979 -586 -1194 1778 -270 -1114 1796 629 -1460 703 1181 -843 161 1985 -768
3902 -768 -1220 2036 47 -1405 1866 458 -1999 980 1538 -1239 175 1525 -1140 -1398 2119 144
3918 144 -1838 1563 219 -2652 1081 1365 -1902 -221 1188 -1765 -1047 2055 -236 -2203 1304 183
3934 183 -2499 1261 1482 -2459 -148 1453 -1740 -629 2123 -609 -2269 1432 571 -2121 1625 1739
3950 1739 -2713 178 2151 -1546 -209 2458 -881 -1969 1908 894 -1852 1517 1595 -2742 527
3965 527 2863 -1463 -214 2434 -1397 -1441 2544 673 -1864 1377 1237 -2668 640 2836 -2061 -696
3981 -696 2264 -1670 -1463 2700 118 -2300 1099 719 -2621 785 2550 -2404 -1184 2383 -1618 -1491
3997 -1491 2854 -432 -2629 1231 756 -2246 850 2004 -2569 -1217 2603 -1364 -1355 2754 -987 -2841
4013 -2841 2013 1024 -2023 1020 1396 -2486 -528 2796 -914 -1283 2574 -887 -2498 2713 1001 -2184
4029 -2184 1109 1111 -2389 206 2869 -963 -1422 2156 -611 -2012 2859 976 -2761 926 1163 -2103
4045 -2103 632 2351 -1516 -1502 2025 -292 -1745 2597 481 -2964 1045 1457 -1993 639 2123 -2079
4061 -2079 -1276 2194 -424 -1615 2002 159 -3069 1398 1712 -2045 467 1619 -2123 -794 2332
4076 2332 -509 -1543 1672 -4 -2332 1639 1696 -2300 281 1666 -2110 -185 2395 -809 -1300 1452
4092 1452 103 -1737 1584 1662 -2072 210 1767 -1559 -7 2434 -1192 -1193 1711 163 -1343 1540
4108 1540 910 -1932 295 1839 -1467 -122 1971 -1408 -1097 1848 -90 -1354 983 330 -2072 207
4124 207 1454 -1509 -544 1558 -1545 -1372 1707 -382 -1606 938 -16 -1848 412 944 -1505 -655
4140 -655 1153 -1142 -1149 1515 -626 -1585 1009 -32 -1475 596 738 -1385 -288 1115 -681 -785 1590
4157 1590 -286 -1268 1269 256 -1145 896 724 -1042 141 1141 -442 -414 1387 -22 -796 1381
4173 1381 590 -927 974 704 -772 337 954 -402 -154 986 14 -688 1029 376 -1029 705 517
4190 517 -872 265 778 -781 -68 541 -111 -512 572 245 -886 423 594 -974 136 530 -810
4207 -810 -26 350 -406 -505 322 123 -721 90 391 -811 -8 474 -680 -11 492 -461 -261 359 63 -374
4227 -374 104 288 -398 -5 516 -612 -8 514 -413 30 426 -179 -142 29 251 -328 -87 364 -412 -178
4247 -178 422 -293 -216 469 -121 -217 55 5 -104 -146 161 -123 -204 379 -42 -254 497 -223 -193 232 -6 -163
4269 -163 110 -33 52 -220 162 -11 -335 251 82 -187 301 28 44 179 -84 79 -188 64 60 -199 139
4290 139 94 -236 379 147 -225 207 -81 -94 51 -182 91 -126 80 301 -217 5 103 -211 241 27 -107
4311 -107 105 -203 22 77 -36 178 15 -17 171 -186 47 182 -293 -25 90 -65 62 0 58 -57 -193
4332 -193 169 -176 -66 207 -222 55 89 -259 132 124 64 136 -32 64 -50 -49 105 -191 -116 346 -254 -56 174
4355 174 -158 27 121 -99 14 -11 52 -269 -157 235 -219 -75 428 -366 -191 224 -254 -74 115 -92 -219
4376 -219 -151 323 -248 -139 372 -306 -285 463 -188 -402 322 -149 -189 198 217 -129 -172 313 -289 -307 726 -199
4398 -199 -408 355 -178 -307 426 186 -272 -173 368 -102 -223 632 -211 -650 626 21 -314 576 82 -703
4418 -703 68 237 -185 -217 478 -356 -726 495 174 -554 481 26 -823 197 444 -379 -229 415 -539
4437 -539 -533 795 237 -906 356 23 -1050 546 766 -664 -109 466 -381 -288 932 264 -943 299
4455 299 345 -713 814 907 -851 -21 629 -186 101 1012 -42 -940 507 684 -572 722 594 -1296
4473 -1296 -69 1062 -485 -97 880 -421 -881 776 536 -839 231 329 -1361 126 1208 -686
4489 -686 -483 581 -840 -740 1047 258 -1062 -18 358 -1146 136 1277 -1000 -761 938 -662
4505 -662 -421 1285 0 -1281 167 539 -703 401 1235 -1151 -778 1191 -295 -297 1265 -303 -1347
4522 -1347 593 863 -542 315 929 -1169 -443 1735 -122 -407 1209 -546 -1224 1147 638 -751 202
4539 202 608 -995 -237 1597 -206 -941 843 -265 -1151 1404 637 -1150 243 572 -850 217 1295
4556 1295 -605 -1279 873 -139 -997 1193 334 -1644 149 634 -889 233 878 -1109 -1128 936 304
4573 304 -1065 949 142 -1860 497 1004 -1064 99 620 -1254 -698 1080 99 -913 658 17 -1483
4590 -1483 870 1144 -1248 80 825 -1023 -262 1274 -324 -1073 736 212 -1089 853 1020 -1297
4606 -1297 113 1078 -757 -25 1362 -340 -873 884 383 -716 805 796 -1267 159 1265 -741 89
4623 89 1295 -700 -669 1094 272 -650 572 500 -1306 347 1342 -742 -228 1207 -724 -669 1264 240
4641 240 -835 532 437 -854 156 1021 -858 -570 990 -810 -583 1321 -249 -923 626 152 -880
4658 -880 193 551 -894 -530 920 -471 -653 940 -256 -1001 672 -12 -730 308 511 -726 -377
4675 -377 684 -547 -682 899 -270 -1071 713 265 -863 367 362 -715 -97 673 -378 -551 742
4692 742 -104 -842 655 240 -827 335 428 -765 -2 342 -324 -328 605 -107 -761 533 257 -810 439
4711 439 502 -733 129 536 -277 -66 546 -55 -427 542 247 -651 420 392 -606 140 588 -473 120 442
4731 442 -213 -223 442 153 -309 297 371 -436 202 464 -416 185 495 -159 -41 614 141 -287 210 326 -292
4752 -292 56 497 -493 26 441 -290 -100 304 -102 -328 87 54 -322 -44 264 -421 -297 444 -373 -391 234
4773 234 -312 -290 190 -21 -188 -149 72 -156 -217 368 -354 -256 254 -330 -225 234 -244 -222 -57 -52 -127 -249 145
4796 145 -102 -237 192 -89 -85 275 -168 -220 52 -92 35 -11 258 102 -233 251 185 -228 252 -6 -34 308
4818 308 -65 11 223 78 115 35 188 238 -56 303 231 -139 275 86 -273 270 79 56 102 16 211 -54 -54
4841 -54 161 -106 95 159 -257 -55 -92 -205 -29 116 -165 -75 -168 70 -173 -166 29 -285 -120 -41 -331 0 45
4864 45 -122 -51 -63 -37 14 -104 109 -191 -47 195 -126 -85 -82 -226 190 89 -12 30 -129 116 195 44 218
4887 218 -86 -34 224 -69 32 106 -26 183 -22 -25 148 -98 257 101 -1 170 -24 23 289 -226 131 23
4909 23 -233 125 -62 36 48 -128 120 25 99 176 -88 -168 125 -55 13 90 -33 32 98 75 72 -127 175 -26 -377
4934 -377 242 48 -206 217 -47 -166 -37 -5 99 -24 -55 -195 -354 136 94 -297 183 -160 -221 57 8 -12
4956 -12 -63 -96 74 -139 116 202 -320 108 80 -276 274 93 -29 36 13 -18 -7 366 100 -280 200 370 -203
4979 -203 222 114 -294 93 328 32 128 108 -88 -270 215 95 -261 216 88 -411 12 448 -206 27 -14
5000 -14 -202 -173 328 124 -433 -55 162 -339 90 389 -298 -173 145 -250 -57 289 60 -220 -65 167 -161
5021 -161 88 464 -430 -262 344 -142 31 422 -97 -437 165 397 -34 35 367 -521 -199 729 -175 -9
5041 -9 424 -159 -229 371 225 -12 -132 194 -295 -241 550 37 -320 302 -303 -162 397 155 -439 -105 164
5062 164 -172 -10 597 -167 -469 379 -70 -101 667 78 -602 82 246 -68 114 315 -232 -426 365 282 -267
5083 -267 485 -177 -773 265 396 -228 73 51 -336 -309 505 192 -397 287 -56 -599 533 514 -424 -54
5103 -54 130 -356 -48 480 -24 -514 89 75 -463 532 410 -642 121 318 -313 -6 431 -147 -405 271
5123 271 138 -285 257 328 -698 22 465 -433 40 341 -358 -256 287 214 -291 36 295 -629 160 701
5143 701 -393 -75 153 -457 -169 556 110 -295 9 160 -305 81 396 -495 -262 387 -231 -131 418 -127
5163 -127 -365 278 221 -377 108 475 -402 -149 595 -120 -113 602 -218 -168 454 39 -151 202 335 -421 -89
5184 -89 524 -91 -300 534 -233 -373 450 42 -176 80 134 -419 -55 289 -135 -368 381 -77 -335 262 -142
5205 -142 -369 139 75 -512 -26 77 -177 -315 379 -138 -491 164 6 -471 194 -56 -526 -19 185 -83
5225 -83 -62 176 -145 -244 272 97 -410 238 192 -396 203 216 -198 4 93 -19 -110 372 304 -247 4 181 -338
5248 -338 276 416 -225 -13 138 61 -67 337 137 -236 -11 375 -205 189 331 -382 -22 201 -142 127
5268 127 151 -181 -170 68 310 -65 -1 182 -187 -90 261 -79 36 83 -221 -145 124 128 15 -78 -77 -170 57 313
5292 313 -68 -115 52 -298 -30 139 5 -65 -38 -29 -92 -44 147 -90 -309 223 -117 42 140 -105 -117 -2 -14
5315 -14 -43 -115 42 -71 -243 295 -25 -177 196 -125 -84 -6 -39 -10 33 -16 -153 -145 214 92 -130 134 32 -134
5339 -134 167 77 -71 61 -113 118 18 128 77 -138 129 146 -120 356 116 73 133 30 106 38 172 -5
5361 -5 -172 -120 95 37 31 106 -183 171 137 -64 48 -82 -23 51 -220 -29 -65 -126 9 -104 42 105 -1 -23 55
5386 55 78 -119 -9 117 -45 -71 175 -23 -147 12 -169 83 31 -198 85 -11 16 28 -191 -70 -30 -37 140
5409 140 -41 -48 10 -91 -45 139 -107 -26 -61 -76 56 -144 62 39 -20 152 -134 -84 89 -76 35 18 -99 71
5433 71 -156 -138 80 -110 1 60 -111 127 5 -39 53 -177 -18 34 -67 163 -48 52 149 -119 76 3 -250
5456 -250 78 93 -1 130 -128 89 159 -128 89 139 177 66 -137 120 1 35 91 -63 60 124 -82 87 -19
5479 -19 3 45 -34 9 113 -132 124 55 -157 108 -22 -87 86 38 -102 137 -80 146 -123 -79 3 -155 6
5502 6 9 -156 103 -37 -6 117 -135 30 130 26 178 -86 -53 104 -40 102 -86 -15 -22 -48 14 -136 36 100
5526 100 2 -128 39 11 -9 51 -289 -79 65 185 125 4 -4 -97 -92 112 66 33 51 -95 42 295 56 36 34
5551 34 -100 147 -32 61 130 -154 -10 -18 -154 29 -175 -123 -141 -151 -25 119 -35 52 -271 16 18 -85 178 -30
5575 -30 -192 87 233 123 205 -89 -63 -50 60 112 67 131 -45 25 106 87 -23 134 -170 44 79 -24 -10 16
5599 16 -79 -73 -36 240 162 -68 54 -49 -59 150 -78 17 -85 -57 31 -31 -27 61 -217 -30 -102 -27 113 -94 -140 55
5625 55 -179 186 114 -153 68 -98 -2 82 192 79 65 -127 155 -110 93 94 -46 5 -1 90 164 -4 28 -25 -127
5650 -127 38 31 3 -36 -66 -122 16 -96 20 -6 -160 -23 -11 -68 56 35 84 64 -41 -68 -50 -6 -17 -177 -186 -39
5676 -39 -121 85 -29 -64 42 -2 12 -3 -56 265 -29 -47 97 -51 145 102 -27 60 -21 249 130 -60 150 60
5700 60 -164 107 58 -59 221 -194 -147 -64 32 120 23 -21 81 -150 179 33 -144 42 -110 -133 119 33 -15 2
5724 2 -125 72 -74 102 115 -195 -26 -119 -43 133 95 -119 -41 -85 -40 79 85 141 -174 -20 168 -32 132 101
5748 101 -240 -83 -54 13 88 -185 -161 -235 -66 221 35 91 -50 -354 142 97 -165 121 -25 -250 -8 19 125
5771 125 -73 -64 0 -182 223 308 -69 -108 -153 -128 275 218 63 -52 -59 29 84 274 136 -118 -50 -23 60 222 337
5796 337 -85 -24 22 126 122 73 70 -177 -87 259 15 -56 204 -207 -62 210 61 61 -149 -143 -205 55 100 -3 48
5821 48 15 -257 -27 148 -35 -2 -228 16 9 147 213 23 -330 -47 14 21 229 -111 -290 -167 -61 76 73 -93
5845 -93 -188 -236 154 91 -7 65 -101 -278 -9 1 -62 -70 -33 -68 -259 98 16 -99 -52 -47 -126 235 177 -139 -38 -94
5871 -94 -49 76 134 -19 -143 -41 125 19 148 255 -157 87 26 -34 171 195 -84 58 72 88 6 1 67 -113
5895 -113 145 234 37 138 47 36 149 79 100 82 77 116 93 91 317 -64 96 114 -51 135 65 28 0 71 202 91
5921 91 -49 101 -141 -106 42 -119 109 55 -171 -26 -132 36 42 -88 42 -120 -160 -5 -53 -48 -40 -264 -39 54
5945 54 19 69 53 41 24 -180 -97 -80 -50 -59 115 -17 -15 -3 54 -56 -13 15 -15 -91 114 -185 84 -15 -128 142 -37
5972 -37 71 27 36 11 13 21 87 -27 131 140 -44 97 50 -32 126 29 54 48 -59 171 -37 121 58 -94 24 167
5998 167 -170 103 76 162 40 78 -22 94 43 170 -77 56 125 -137 98 8 84 107 155 -92 28 -11 72 156
6022 156 58 30 -27 -97 168 -65 -43 -29 -157 187 123 -89 120 -69 -61 -90 -17 27 -3 -84 -34 -64 16 53 -150 -78
6048 -78 2 -84 -41 62 -43 7 -184 8 -7 14 120 -81 -109 30 -42 108 73 3 -63 -13 -9 68 -99 25 -31 -69
6074 -69 92 -206 88 130 -112 -2 86 -23 17 -75 240 -48 -165 189 158 -81 160 -23 -5 151 64 25 -46
6097 -46 15 29 -70 56 -68 -77 82 35 -106 188 -30 -18 96 34 55 42 70 -57 -49 141 213 -308 128 -43 -190
6122 -190 76 -106 -108 -13 2 -232 -124 84 32 -188 58 -95 -230 90 4 -205 -67 134 -98 -67 55 79 -168
6145 -168 50 111 -185 106 224 -226 -92 145 -64 22 85 84 -181 162 123 -209 198 199 -247 155 201 -274 75
6168 75 136 -13 -35 177 -63 -234 101 168 -174 -53 333 -206 -35 134 -214 -46 147 -39 -77 166 242 -148
6190 -148 -134 303 -147 84 292 -81 14 43 -131 40 239 95 -215 69 224 -182 20 397 -70 10 310
6211 310 -83 -204 338 161 -104 0 125 -204 150 294 -274 -224 311 55 -210 98 -11 -434 85 171 -271
6232 -271 -91 11 -193 -333 263 77 -451 243 -137 -239 296 190 -298 -100 129 -181 56 371 64 -483
6252 -483 289 183 -224 379 167 -328 32 329 -25 99 208 -168 -348 331 294 -87 362 117 -370 65
6272 65 498 -5 32 215 -334 -254 298 271 -424 210 37 -417 154 400 -242 -193 70 -239 -111 464 23 -455
6294 -455 -166 63 -356 343 414 -526 -293 204 -104 -25 389 -127 -558 112 357 -138 210 264 -461 -147 587
6315 587 -118 -67 226 -316 -239 201 399 -104 127 153 -374 -7 461 -144 -33 291 -147 -172 531 234 -152
6336 -152 -13 9 -252 147 711 -312 -259 248 -139 -107 419 2 -465 14 154 61 146 455 -278 -362 195 234
6358 234 -32 292 -264 -537 17 309 -18 2 -33 -392 -240 341 -16 -159 199 -267 -279 386 400 -177 -135 24
6380 24 -166 -9 459 129 -350 102 -53 -129 430 241 -265 -60 71 44 235 386 -188 -260 165 236 -75 348
6402 348 106 -401 157 445 -3 167 158 -339 -273 304 252 -171 123 1 -243 31 308 -170 -68 80 -136
6423 -136 -20 419 136 -193 -15 201 -46 116 329 -213 -86 11 -141 -52 146 66 -206 32 129 -80 160
6444 160 194 -141 -98 288 -92 19 208 -194 -137 166 125 -78 176 214 -141 22 219 -105 -85 156 -235 -147
6466 -147 242 43 -311 -193 36 -102 -89 218 -118 -116 47 -190 -179 225 -86 -84 -38 -71 7 50 131 -96 -148 94
6490 94 -82 -11 96 12 -143 196 56 35 34 -78 29 -130 29 27 -8 124 -42 -149 129 128 27 103 4 -8 -78
6515 -78 130 109 -93 133 65 -116 -3 111 -90 133 100 72 52 32 -19 -103 34 154 -32 38 48 45 179 163 -61
6540 -61 156 -43 39 64 -37 37 -150 -16 56 -88 -39 91 -83 66 64 -99 19 53 41 -59 -45 105 -37 -24
6564 -24 44 -70 -30 82 -156 -30 66 61 -50 13 44 -20 -153 7 -61 -178 141 -152 -76 85 4 -33 59 -49 15
6589 15 -110 -24 -14 -61 38 63 -96 93 -57 -62 10 -193 -19 -88 -101 -83 -30 -35 -142 23 29 -124 -133 134 -82 47
6615 47 46 -37 45 45 149 21 -74 136 34 -30 19 67 17 158 -72 -87 99 184 -36 -90 106 -27 64 33 152 -235
6641 -235 97 53 -134 49 93 -189 93 -12 39 -49 -45 35 -162 258 34 -207 29 51 7 -38 -114 -82 -58 149
6665 149 1 -168 -44 129 -122 -18 -2 -172 -1 143 -93 -23 -108 -65 -39 81 20 -261 102 192 -27 27 205
6688 205 -140 111 124 81 -91 125 75 -127 3 218 -115 -141 308 -176 -143 212 -30 -81 91 75 -245 228
6710 228 103 -220 -84 245 -74 -25 248 -147 -166 25 -61 -193 299 57 -128 -27 294 -48 -87 324 -261
6731 -261 -260 242 -36 -368 80 91 -333 31 85 -203 -115 176 -194 -307 298 -16 -252 208 79 -246 115 383
6753 383 -18 -156 269 -59 -115 348 50 -299 344 149 -182 281 218 -177 -66 320 23 16 370 4 -400
6774 -400 263 189 -196 246 146 -452 -4 396 -168 -259 103 -70 -494 347 181 -549 109 154 -421 123 492
6795 492 -273 -274 167 -201 -306 310 159 -473 65 176 -351 172 393 -281 -232 242 -78 -85 436 44 -634 71
6817 71 323 -223 137 388 -557 -290 455 60 -82 437 -41 -502 288 353 -233 201 350 -413 10 600 168
6838 168 -180 197 -250 -177 360 295 -340 82 259 -424 -5 499 -170 -466 252 58 -319 398 156 -559 43
6859 43 420 -163 -3 526 -320 -474 394 66 -229 427 -121 -562 45 417 -163 -36 435 -450 -328 641
6879 641 204 -220 381 -159 -232 326 452 -206 -51 365 -353 -248 723 38 -523 225 17 -402 420 356 -495
6900 -495 -169 253 -157 142 511 -127 -540 261 73 -172 234 160 -667 -194 247 -152 -17 368 -187 -429
6920 -429 420 373 -294 137 99 -512 84 473 -246 -100 163 -174 -151 314 227 -400 43 -47 -388 245 467 -486
6942 -486 -166 219 -217 -73 412 -18 -439 111 129 -163 187 405 -501 -116 394 -141 -87 434 -36 -163 227
6963 227 391 -206 -69 247 -231 20 544 -77 -172 352 131 -278 226 272 -339 48 245 -159 40 476 -165
6984 -165 -209 113 -16 -146 263 81 -293 -48 91 -68 54 320 -225 -205 162 -31 -174 157 -151 -296 -1
7005 -1 101 -267 -18 165 -102 -218 267 -43 -181 256 -137 -302 197 93 -130 -100 124 31 30 260 -100 -150
7027 -150 -32 -70 -4 227 24 -131 -51 95 -94 -124 183 -24 -210 137 68 -12 218 163 -218 92 199 -29
7049 -29 -19 175 -16 -74 155 86 -217 249 180 -134 93 128 61 -40 227 -131 -137 180 146 -183 99 107 -159 -62
7073 -62 -64 -181 -113 121 81 -61 105 105 -166 -90 162 -90 118 -44 -168 -14 -14 20 -57 114 3 33 -25 -43 -47 56
7099 56 60 -16 -151 48 -142 20 71 -81 -6 -10 42 29 -22 10 -42 -147 165 -42 -59 71 -104 -26 -101 15 56 -23
7125 -23 174 43 -29 17 -64 29 119 30 -51 -37 1 -83 -116 -51 -65 -31 76 63 -26 -76 -100 -74 -9 -44 -161 53 -57
7152 -57 -151 -81 15 87 -116 13 -34 -157 -46 13 -56 67 -11 -246 -79 115 -38 -182 -38 53 -119 67 136 -45
7176 -45 22 19 -44 148 39 -13 35 61 -18 -10 146 79 -116 23 195 -50 -26 192 -39 26 58 -15 -66 114 55 -186
7202 -186 143 -12 -156 -50 106 -126 56 98 -95 30 26 20 -132 -154 -3 -232 -44 157 -193 -108 135 -169
7224 -169 -4 43 -27 -151 77 34 -121 118 88 -140 -54 251 -177 -60 241 -57 -204 70 10 132 -14 -12 -70
7247 -70 19 307 -18 -100 242 -128 -55 156 39 -162 101 113 -54 -107 165 6 -59 63 -90 -263 157 3
7269 3 -150 91 2 -182 130 127 -82 -73 201 14 -191 303 -78 -326 156 34 -242 -40 78 -339 -154 240
7291 240 -36 -141 186 23 -324 286 124 -164 -16 71 -447 -86 310 -13 -130 187 63 -361 243 204 -356
7312 -356 -68 196 -208 43 324 -47 -274 190 102 -239 367 239 -400 66 339 -126 73 394 -148 -257
7332 -257 218 201 -212 210 -51 -564 152 402 -195 95 382 -375 -209 374 136 -311 101 -37 -367 9
7352 9 403 -327 -168 240 -344 -223 524 -63 -400 249 11 -357 395 321 -397 -147 414 -254 -126 369 -85
7373 -85 -341 200 2 -237 64 140 -421 -24 555 -63 8 360 -197 -324 456 12 -281 183 93 -367 41
7394 41 368 -93 -174 347 -219 -314 630 37 -318 107 126 -375 190 441 -344 -153 232 -82 -115 473 98 -512
7416 -512 134 149 -300 203 316 -428 -210 351 -89 -206 344 44 -488 407 244 -369 50 190 -382 -165
7436 -165 509 -38 -177 346 -130 -425 417 334 -315 -112 265 -512 74 493 -232 -296 124 -33 -301 430 203
7457 203 -492 -13 227 -324 154 264 -369 -253 266 66 -259 343 -88 -450 122 307 -254 -112 244 -500
7477 -500 -226 234 194 -205 192 150 -330 76 277 -305 2 340 -260 -139 593 17 -275 168 -15 -322 213
7498 213 232 -238 -224 317 -231 -63 368 -172 -348 135 5 -296 180 91 -374 -16 396 -96 37 361 4
7519 4 -289 287 149 -96 94 157 -134 -2 179 -135 -152 268 -167 -231 310 124 -207 198 110 -295 188 247
7541 247 -104 -164 90 -76 -165 364 -2 -292 73 124 -305 45 130 -57 -128 93 -100 -215 171 -17 -344 95
7563 95 73 -282 134 108 -159 -45 106 -99 -96 84 34 -287 95 26 -309 83 26 -214 -41 138 -207 -113 -11
7586 -11 102 -180 64 60 -109 24 103 -212 29 49 -326 -14 55 -8 -164 -75 26 -54 -44 230 -43 -40 39 -67
7610 -67 -51 214 73 -79 150 60 -26 105 280 -121 -6 134 -27 40 136 10 -153 34 41 79 -30 53 -29 -93
7634 -93 257 -117 -59 26 -4 -125 -98 -88 -142 -17 55 -17 11 128 -136 -230 13 121 40 -100 26 -205 128 -70
7658 -70 -16 -8 52 31 -65 111 25 111 -163 38 -25 -41 133 152 174 28 111 -61 79 -21 -129 107 80 -67 79
7683 79 -23 32 23 -19 -98 -55 -97 63 -113 84 -80 -8 -5 97 -86 -155 6 -38 38 19 -50 -23 -28 56 -36 -60 339
7710 339 -102 -67 29 -49 90 155 19 128 -73 -44 16 -54 -26 -162 -8 -11 77 5 77 -34 28 -18 -99 41 -29 145
7736 145 -57 -138 31 -124 92 67 -77 -115 56 -76 -96 54 -76 -194 36 -16 69 36 101 -87 65 166 -3
7759 -3 -16 -34 -2 -119 143 279 87 -14 196 -135 -95 203 63 -4 115 -125 -88 -12 53 -117 115 126 166 -17
7783 -17 171 -53 -126 -86 -3 -130 65 105 -181 47 55 51 -135 111 -101 -84 176 97 48 49 -45 -173 88 34 -65 -45
7809 -45 19 24 -158 166 158 -145 41 69 -132 118 281 -231 -6 198 -143 -125 8 153 -86 81 80 -173 140
7832 140 96 -148 -26 66 -53 -107 151 -62 -192 115 210 -167 79 153 -220 -14 245 2 73 263 -91 -68
7854 -68 132 152 -112 53 164 -306 -15 263 84 53 153 -45 -155 135 124 -270 40 104 -206 -38 192 -101
7876 -101 -175 103 -140 -51 193 -2 -182 -126 118 -69 10 182 -201 -342 267 -84 -92 195 -53 -206 129 233
7898 233 -120 65 296 -100 -235 248 59 -177 289 40 -176 135 269 -160 32 89 -120 -133 363 53 -337
7919 -337 209 48 -43 262 199 -193 91 234 -139 -51 204 -50 -290 7 -7 -361 246 -76 -364 62 120 -212
7941 -212 -135 191 -160 -224 133 152 -202 126 -22 -432 102 344 -147 -152 154 -150 -196 181 188 -377 146 -34 -156
7964 -156 260 369 -149 -47 312 -31 56 361 -13 -168 194 175 -275 114 369 -367 -108 288 -51 -78 217
7985 217 -154 -205 176 83 -196 -68 135 -194 -16 346 -77 -164 134 -99 -361 277 36 -229 -166 -2 -138
8006 -138 -21 320 -217 -234 214 -136 -142 193 169 -189 10 17 -161 78 230 -240 -99 210 -4 -103 163 162 -260
8029 -260 87 79 -176 42 23 -124 -97 131 -114 -141 267 -57 -159 279 136 -69 67 127 -148 -51 339 -31
8051 -31 -322 220 107 -114 242 109 -84 -29 228 -156 -174 148 -69 -222 211 238 -228 69 118 -196 -70 164
8073 164 -119 -54 32 -51 -231 176 -108 -186 -51 -51 -18 103 95 -200 -37 195 -28 -163 163 161 -152 41 210 -214
8097 -214 -13 156 -139 -86 206 33 -140 97 63 -114 72 39 -189 -97 224 -218 -30 78 -168 -68 30 102
8119 102 -144 103 46 -96 -11 154 61 -111 337 -112 -108 215 -87 -19 27 85 -27 69 154 116 -67 189 -85 -97
8143 -97 232 13 -158 66 54 -124 -5 54 -37 -121 72 -94 -231 118 -33 -95 127 39 -86 105 49 -119 -16
8166 -16 96 62 18 91 35 -196 79 41 64 -56 16 -202 -56 117 -26 -88 49 -99 -21 104 -5 -153 25
8189 25 -13 -56
8191e6
$$ Imaginary data points
##PAGE= N=2
##DATA TABLE= (X++(I..I)), XYDATA
0 0 0 0 0 0 0 0 0 0 0 0 0 -3 8 -8 8 -8 16 -16 19 -24 26 -32 40 -45 53 -59 72 -82 93 -107 122 -139 159 -177
34 -177 199 -224 251 -282 314 -349 387 -431 476 -528 582 -644 708 -782 860 -949 1044 -1151
52 -1151 1267 -1402 1551 -1721 1914 -2140 2403 -2720 3102 -3577 4192 -5013 6170 -7913 10825
67 10825 -16547 31893 -156327 -395305 17712 -57662 -173559 75541 -82524 -463247 -205561
78 -205561 51688 -170678 -140629 11169 -356881 -388408 70784 -18630 -234513 -25195 -160228
89 -160228 -390533 -43331 157256 -141116 -152355 -4898 -230282 -174955 232310 60520
99 60520 -211998 10679 -25196 -171853 162082 243516 -111932 -90169 110801 -24574 33828
110 33828 311907 78218 -173822 106230 142191 -11127 231167 218071 -134696 -27252
120 -27252 208359 67843 66482 226018 -7618 -171760 140017 174924 -37342 113201 87080
131 87080 -194394 -14177 204081 3792 -40143 81556 -87976 -150436 136309 119703 -121745
142 -121745 -2753 25137 -168532 19878 179303 -68138 -103752 43728 -64507 -77274
152 -77274 137464 62538 -152493 -20933 55076 -90414 46631 144811 -101565 -97265 84950
163 84950 -5112 -23501 122495 19504 -129503 25119 103846 -33278 41705 106649 -94066
174 -94066 -53870 132070 21777 -25805 86667 -9632 -96238 58752 96213 -46232 -4757
185 -4757 55317 -86213 -39464 114143 -15987 -77438 38616 -32675 -86115 48698 41436
196 41436 -86922 -40209 23402 -71248 -38474 71505 -48195 -99377 26279 -23551 -73201
207 -73201 36229 5614 -94199 -29355 23351 -48185 -31268 40492 -48064 -80321 36098 -2536
219 -2536 -59387 29913 667 -72559 3542 35867 -28334 -13474 33943 -22609 -37211 52206
231 52206 19971 -37945 37235 22064 -37083 34327 48864 -14498 7914 41146 1700 -3305
243 -3305 53222 26268 -21797 37707 34786 -19201 36832 44494 -15410 14623 38869 2861 5577
256 5577 36927 16205 -14121 26033 29718 -16832 20310 30892 -20895 7889 27295 -9714
268 -9714 -1192 16400 -2031 -14642 6429 9816 -22310 -3105 11348 -28135 -8912 9863 -25007
281 -25007 -14020 493 -18579 -18066 -7749 -7899 -22226 -15155 -562 -24623 -16861 3244 -23813
294 -23813 -15766 778 -18549 -12422 -4223 -9838 -9892 -9121 -423 -8983 -10733 6935 -8653 -7906 9706
309 9706 -6913 -2421 7796 -2538 3542 3717 3759 7071 661 10896 7700 506 15340 6005 4144
324 4144 16199 4743 9563 13333 5453 13745 8436 8573 14700 4380 12154 11681 3430 14297 6573
339 6573 5287 12764 1953 8176 7977 -132 9385 1579 518 7156 -3533 2383 1845 -5926 3205
354 3205 -4896 -5308 977 -9934 -3465 -3990 -11568 -2588 -9671 -9879 -4068 -14043 -6710 -7735 -15002 -4576
370 -4576 -11829 -12772 -5097 -13955 -8547 -8342 -12684 -4700 -12082 -8425 -3124 -13919 -2962 -2699 -11684
385 -11684 822 -3091 -5727 2354 -1613 2213 541 1644 9559 -818 7547 14507 -1259 11556
399 11556 15986 3108 14482 15262 8826 11697 13347 16960 8377 12602 20966 1760 11152 23107
413 23107 1175 10141 18388 274 5161 13388 7744 431 4540 9754 -7971 -370 16322 -11196
427 -11196 -8099 10209 -14940 -11379 8181 -9189 -18942 -7667 -6774 -21828 -12168 2982 -28047
440 -28047 -28271 910 -25652 -26187 3647 -23325 -36750 -9393 -11037 -26528 -11714 -2225 -32914
453 -32914 -27758 10302 -15320 -23378 12770 -17147 -32511 13230 8034 -16408 4102 8437 -19909
466 -19909 -4142 34505 3915 -13001 26753 1245 -14885 42528 29611 -11278 18427 24703
478 24703 -2636 23920 53931 11146 -7044 39406 21924 2826 59555 36282 -19624 25649
490 25649 40661 4843 33673 49497 -7616 -14048 41929 24382 -4057 41218 11336 -46407
502 -46407 17553 39410 -16608 7364 17456 -43762 -27046 36445 4530 -34563 4476 -18325
514 -18325 -62459 13261 31161 -48223 -26677 -3307 -57832 -23627 36563 -20069 -61876 -13227
526 -13227 -20875 -51125 19253 22259 -71116 -39382 9407 -39800 -6518 41873 -36246 -64818
538 -64818 8680 8754 -21272 31331 18196 -68783 -15373 52636 -6324 7352 45542 -38371 -42786
551 -42786 53999 38585 -10585 27305 9304 -54768 17611 79768 -5107 -12581 31693 -37659
563 -37659 -23309 78042 29152 -40227 6288 593 -40949 34279 68228 -37560 -43199 23737
575 23737 -25764 -12241 72574 -4428 -74707 1920 11603 -26402 34411 37339 -67000 -47312
587 -47312 40476 -2572 -8724 53090 -27836 -77221 31015 41790 -15132 27937 18595 -62752
599 -62752 -10374 77165 18256 -11030 40125 -19747 -42983 74051 64173 -22064 17530 20312
611 20312 -37296 30353 91618 4501 -30230 30671 -3557 -16893 80456 42547 -57658 43
623 43 25081 -26754 31894 61335 -41305 -54061 25468 567 -20870 46546 -3802 -89202
635 -89202 -7064 29851 -35302 3938 17913 -76444 -55972 32510 -4549 -39412 8908 -32136
647 -32136 -85733 7713 36452 -46826 -20326 1728 -69335 -27034 51745 -8225 -47366 2941
659 2941 -18084 -46408 36122 43509 -47389 -18027 23109 -30750 8358 65716 -11654 -40035
671 -40035 25062 12851 -10772 48605 36268 -44183 -2529 48762 -4961 15337 56785 -20410
683 -20410 -31198 45509 25291 -7264 36028 17469 -40995 10330 54525 -6480 -1545 36283
695 36283 -25909 -24293 51147 16008 -24689 17342 3427 -35503 15841 41457 -22278 -19439
707 -19439 21919 -22176 -19100 43349 -660 -40209 10188 3065 -27747 15851 23887 -32595 -21021
720 -21021 21471 -12498 -15564 31421 -9212 -40346 15685 9993 -23676 12812 12965 -32381 -10545
733 -10545 24679 -8033 -15130 21327 -9435 -31533 21155 12481 -25124 8902 9600 -27078 -156
746 -156 24067 -10334 -14404 16183 -5417 -21158 21355 10877 -25515 8293 12509 -20900 5490
759 5490 21124 -13033 -9647 16398 -1377 -12938 17890 8443 -21173 9091 15481 -16226 5924
772 5924 18226 -13216 -4318 16955 -1536 -8538 13469 5720 -14900 8204 14182 -14011 2746
785 2746 15411 -12243 -2619 14866 -4997 -7242 9840 2028 -11187 4687 8850 -12968 -750
798 -750 11996 -11836 -4782 11341 -8139 -7599 7584 -2289 -9638 2089 3576 -10138 -2215 8252
812 8252 -10183 -6093 9262 -7462 -6617 7752 -3939 -7557 3268 1492 -5934 -768 5604 -5822
826 -5822 -4470 8892 -3398 -5018 8209 -2409 -4698 6086 1471 -2532 1714 3721 -1264 -1509
840 -1509 7200 367 -3779 7295 186 -3327 6979 1310 -1813 3292 1899 328 453 3729 1414
855 1414 -3089 4347 1596 -3441 4917 661 -3283 3052 -110 -903 903 -375 268 -2457 405 1225
871 1225 -4060 1207 105 -4699 1575 -829 -3084 646 -2311 -1131 -841 -2262 867 -2679 -1161
886 -1161 1285 -3394 520 427 -2872 1397 -835 -1140 1665 -1675 995 535 -1566 2467 -789 -85
902 -85 2514 -1462 1609 1399 -1119 2696 -202 336 2661 -1142 2002 1547 -898 2970 -152 384 2529
919 2529 -1083 1855 1054 -1188 2653 -512 -46 2017 -1905 1124 404 -1755 1834 -1587 -784 1239
935 1239 -2671 391 -97 -2424 1035 -1581 -781 698 -2283 843 -422 -1873 2132 -1742 -787 2063
951 2063 -2117 784 1209 -1075 1237 -577 817 1172 -1291 2910 -221 -1746 3686 -751 -553 3322
967 3322 -1205 -14 1480 480 1401 -508 1889 258 -2421 4135 454 -2469 3661 -1260 -2540
982 -2540 2957 18 -1187 -676 -307 -1319 -2807 2868 -562 -5960 1701 -1749 -5596 3181 -837 -5999
998 -5999 -1212 -1324 -2939 -1850 1665 -2523 -7627 1162 205 -6053 3566 -187 -9042 222 1869 -3091
1014 -3091 98 1401 -3829 -5862 3572 3288 -5196 2981 1062 -9212 3673 7267 -3546 668
1028 668 2797 -3847 -687 8512 5089 -4528 2641 4214 -4879 8250 11675 -5086 26 6672 -1163
1043 -1163 4432 12061 2590 -5720 3802 7491 -975 8637 10356 -9216 -1500 11206 -3 3437
1057 3437 10109 -4418 -8256 6265 8223 -1916 3501 3865 -13261 -1781 14239 -2873 -3680 4541
1071 4541 -10790 -9215 9796 4680 -9129 -3943 -2396 -13286 -191 13215 -9361 -13183 1387
1084 1387 -10442 -6894 12244 -1541 -16918 -5487 -659 -7472 3254 9575 -14319 -15420 6702
1097 6702 -2179 -3241 12715 -5781 -18534 2640 8030 -1733 4948 5527 -14301 -8521 16569 5321
1111 5321 -3664 10106 -6141 -14201 13931 14772 -3563 2238 2620 -10731 1409 21833 3892
1124 3892 -9677 6028 -2886 -7999 19709 12653 -13075 -1912 3837 -6251 7294 18110 -5708
1137 -5708 -15890 5454 2304 -4694 16226 3776 -22203 -1844 9415 -4092 5555 9090 -14679
1150 -14679 -14804 10483 6826 -5445 7818 -2564 -21886 4831 16153 -5537 273 4079 -15181
1163 -15181 -5980 17359 6014 -9567 2218 -1764 -13782 11430 17478 -11260 -5164 5131 -10208
1176 -10208 1496 18758 -961 -14105 1915 2340 -6495 11706 11387 -17279 -6661 10288 -5266
1189 -5266 2327 14268 -9503 -15219 6748 5657 -4908 6667 3632 -18518 -3226 15007 -4404
1202 -4404 -2978 8605 -12430 -11389 12746 5162 -8081 2083 374 -13475 2367 15866 -6276
1215 -6276 -7226 7815 -8049 -5793 16133 2222 -10772 3018 2645 -6922 6122 12628 -7993
1228 -7993 -7183 10114 -2569 -3293 14743 -998 -12007 6675 5291 -5146 5640 7454 -9238
1241 -9238 -4499 11292 -875 -4897 10353 -2730 -11382 8953 5172 -7654 3472 3851 -9125
1254 -9125 -1427 9666 -2907 -6986 6924 -2398 -9897 8315 3087 -10602 2492 3191 -8572
1267 -8572 49 6753 -5279 -6462 5627 -1219 -8654 6242 1998 -10740 3034 4129 -8408
1280 -8408 514 5432 -5651 -3806 5497 -1145 -6816 4743 2433 -8685 3276 4839 -8191 915
1294 915 5936 -5095 -1680 5339 -1781 -4569 4570 3115 -5940 2754 4813 -6619 1906 7259 -4520
1309 -4520 -634 5753 -1821 -1623 5891 2828 -3964 2432 5109 -3594 2655 7800 -3971 -554 6743
1324 6743 -1058 190 6193 1009 -2822 2844 4498 -1678 1795 5608 -4043 -1196 6857 -1247 -1004
1339 -1004 4531 -1632 -2889 2580 2340 -2104 -618 1981 -3959 -2178 4691 -2610 -3873 1993 -3475
1354 -3475 -3762 1981 -717 -4056 -2567 -873 -3525 -2777 2014 -3650 -5652 938 -2862 -3869 1628
1369 1628 -2326 -4449 -1086 -739 -1678 -1314 790 -2092 -3653 2097 -44 -2448 2593 -622 -2797 2136
1385 2136 1089 -14 697 935 330 -406 2927 2108 -1163 2601 1305 -1087 3759 2195 61 2191
1401 2191 1191 1268 1446 2177 2366 -513 1746 2259 -693 2587 1787 -1193 1620 748 -17 1164 64
1418 64 328 -755 -369 1190 -1347 -119 512 -2346 114 96 -1546 251 -970 -1075 -259 -1170 231
1435 231 -897 -1245 646 -1586 -327 728 -1656 261 -152 -1007 840 -632 -147 376 -939 716
1451 716 -171 -661 1185 -891 -35 828 -911 922 217 -448 1073 -478 327 783 -691 1040 18
1468 18 -446 1114 -735 267 651 -918 763 -222 -779 695 -1004 -195 334 -1303 315 -489 -869
1485 -869 590 -1198 -242 179 -1220 430 -385 -812 745 -873 171 433 -753 977 40 -331 1161
1502 1161 -581 544 980 -549 1136 238 -100 1156 -321 829 802 -580 1194 138 -104 1387
1518 1387 -304 418 792 -404 945 -36 57 779 -972 736 456 -976 955 -419 -1138 875 -708
1535 -708 -288 -161 -1229 -99 -1076 -285 282 -1780 -222 -416 -2145 455 -421 -1576 23 -1407 -586
1552 -586 -83 -256 275 -1464 -582 643 -1412 1040 768 -1925 282 49 -334 988 93 -155 -662 -201
1570 -201 1427 -406 661 950 -2002 546 1617 -490 1113 411 -1093 176 1121 1617 -34 -125 882
1587 882 -1283 1138 3195 -758 -51 726 -1126 1319 2297 946 -492 -835 953 131 1299 2852
1603 2852 -1527 -1312 1694 -373 1323 2510 -743 -1479 126 1242 1053 726 1248 -2382 -1688 2879
1619 2879 314 -52 1317 -2539 -2110 1522 1148 -117 -1116 -1097 -2610 -1221 2924 -550 -2980 -320
1635 -320 -2974 -1955 2516 -53 -2708 -2012 -1930 -1432 224 2093 -1821 -4277 -51 -849 -827 3287 -879
1652 -879 -4060 -539 306 496 1635 1026 -2240 -2818 2144 2108 154 2634 -816 -3433 2456 3149 841
1669 841 1845 253 -1584 179 4162 2945 -649 1239 -138 -1699 4212 3763 -1156 466 -28 -918
1685 -918 2050 3528 695 -2455 -135 548 -709 3070 1639 -4180 -1163 609 -942 1763 1478 -2543
1701 -2543 -3158 -47 962 -798 847 -330 -4749 -589 2134 -1378 322 205 -3623 -1852 1440
1716 1440 936 -1169 -712 -713 -3165 576 2998 -1897 -1269 425 -2614 -97 2725 -112 -1678 -414
1732 -414 105 -1065 1309 2629 -2235 -1333 1894 -1117 432 2773 -1198 -1488 742 567 6 1124
1748 1124 1332 -1743 -867 2768 -383 -255 2359 -1262 -921 2141 506 -142 908 769 -639 130 2579
1765 2579 -4 -590 2371 -340 -551 2713 315 -502 1633 822 -120 525 1469 -121 -512 2102 140
1782 140 -1267 1772 23 -1039 1746 160 -1194 -22 273 -296 -470 712 -709 -2149 809 65
1798 65 -1669 984 -873 -2585 -111 -39 -669 -639 -879 -1508 -2098 386 349 -2097 -426 -1093 -2543 732
1816 732 471 -1305 -878 -1280 -1058 -374 815 256 -2058 -914 -110 -952 1514 923 -1871 -696 16 243
1834 243 1241 797 -188 -1438 -291 1712 591 1269 463 -1945 112 1513 826 1531 54 -1018 -387
1851 -387 796 2186 782 -190 -29 -1187 915 2529 191 247 -256 -943 1164 1820 1411 164 -915
1868 -915 283 625 1441 2410 -420 -887 215 87 1846 1709 -123 -533 -785 747 1663 847 681 -1167
1886 -1167 -985 1235 926 1199 499 -1427 -595 362 781 1377 -524 -980 -837 -799 1332 438 -705 -913
1904 -913 -2036 -394 645 -230 -400 -1725 -1891 -395 -318 134 -532 -2260 -1249 -1020 -348 480 -1181 -1494
1922 -1494 -1370 -1339 491 97 -762 -773 -1679 -573 420 -92 242 -1025 -1090 185 -145 877 444 -1135 -100
1941 -100 -114 282 1466 -4 -50 -65 -129 1147 938 475 653 -605 692 1035 405 1425 -56 -125 731
1960 731 373 1025 708 -322 465 24 455 1122 -138 194 88 -393 904 396 -47 306 -617 289 321
1979 321 -64 741 -346 -303 460 -245 549 557 -520 337 -160 118 531 -322 236 39 -489 650 -122 -141
1999 -141 330 -566 56 280 -397 320 -275 -323 275 -625 397 -33 -598 352 -430 -277 397 -531 33 -15
2019 -15 -610 309 -446 -257 23 -862 146 -276 -740 351 -533 -425 114 -740 -59 -26 -524 339 -500 7
2039 7 301 -634 235 -39 -344 431 -217 78 445 -492 375 123 -306 569 -374 92 412 -537 417 225 -221
2060 -221 516 -162 164 491 -426 415 39 -209 510 -310 72 422 -519 330 39 -334 448 -345 -113 367
2080 367 -421 128 -197 -401 340 -666 19 254 -802 34 -164 -560 199 -432 -149 -4 -654 315 -51
2099 -51 -256 531 -522 94 335 -394 530 242 -216 395 24 339 307 -125 597 -163 154 874 -207 351
2119 351 535 -463 488 618 211 397 114 303 255 208 1101 -295 -165 723 -495 431 910 -367 150 89
2139 89 -88 227 45 279 -664 -685 722 -355 -266 786 -949 -692 465 -479 -159 -25 -546 -657 -647 644
2159 644 -327 -742 405 -1109 -1004 925 -363 -681 39 -679 -487 -45 585 -313 -1092 198 -569 -755
2177 -755 1401 -391 -1285 580 -448 -282 898 451 -671 -627 777 146 -439 1414 -339 -1492 1331
2194 1331 584 -448 1205 312 -996 141 1176 370 -387 1106 -135 -1453 1777 970 -1281 1079
2210 1079 434 -1409 983 1375 -269 -325 835 -64 -800 1610 843 -1861 761 921 -1589 986 1208
2227 1208 -1338 -566 863 -261 -901 1188 367 -2283 505 1205 -2012 393 1082 -2149 -521 1316
2243 1316 -853 -1024 779 -67 -2159 646 1279 -2419 90 1584 -2218 -244 2034 -1137 -1074 1424
2259 1424 -68 -1664 977 1248 -2021 354 2387 -2068 -173 2589 -1427 -825 2361 -302 -1471
2274 -1471 1419 1184 -1653 692 2447 -1958 -680 2952 -1330 -846 2742 -819 -1942 1939 898
2289 898 -1616 617 1428 -2248 -705 2991 -1221 -1625 2370 -1516 -2381 2334 497 -2368 259 672
2305 672 -2371 -308 2931 -1532 -2469 1873 -1152 -2188 3211 247 -3266 558 958 -1823 789 2579
2321 2579 -1915 -2257 2609 96 -1654 3316 52 -3737 1698 2144 -1161 1333 2022 -2324 -1178 3484
2337 3484 664 -1640 2407 -239 -3411 2898 2831 -2158 687 1211 -2578 -103 3784 -112 -2655 1264
2353 1264 -250 -2660 3107 2253 -3906 -534 1200 -2395 507 2867 -2027 -3604 977 279 -1926
2368 -1926 2254 755 -4978 -490 2512 -1863 356 2024 -3260 -2633 2365 1108 -1623 1261 109
2383 109 -4207 976 3875 -1880 -464 1672 -3093 -885 4033 813 -2103 651 230 -2294 2312
2398 2312 3851 -2551 -1411 2109 -1620 318 4286 -411 -2737 1006 1094 -662 2288 2429 -3286 -1307
2414 -1307 3284 -529 48 3193 -1942 -2974 2004 1459 -910 1073 535 -3263 -650 3516 -734 -1474
2430 -1474 1814 -2156 -2355 3149 1069 -2173 111 -163 -2208 575 2895 -1427 -2529 1297 -1184
2445 -1184 -1504 3270 7 -3075 403 372 -1184 1172 1688 -2002 -2131 1776 197 -1193 2539 -428
2461 -428 -3092 1405 1579 -994 1060 976 -1851 -715 2402 639 -1140 1517 -238 -2344 2110 1669
2477 1669 -1589 558 625 -1537 339 1984 0 -1402 556 94 -1271 1676 1189 -2382 252 915
2493 915 -1194 584 1138 -1072 -1185 613 454 -904 732 620 -2256 25 1384 -1169 57 738
2509 738 -1609 -767 791 96 -837 63 270 -1693 91 1438 -1286 -251 689 -1306 -160 1080 -368
2526 -368 -530 80 320 -546 177 1108 -882 -352 1057 -567 45 1194 -415 -255 460 296 230 243 814
2545 814 -243 -282 1438 -193 -137 1131 -358 16 953 194 237 299 426 242 -5 923 232 -459 1089
2564 1089 30 -217 1016 -178 -63 259 -202 82 -175 112 79 -796 185 -206 -657 446 -456 -581 213
2583 213 -542 -309 22 -632 30 -571 -274 15 -946 -75 -177 -899 21 -475 -575 37 -625 -156 -177 -493
2603 -493 180 -504 -219 209 -575 47 -10 -571 362 -150 -249 245 -271 268 280 -13 588 -201 121 515 -274
2624 -274 456 327 -232 677 193 202 526 -110 544 255 209 794 -174 227 661 -241 606 458 -185 588 253
2645 253 150 303 -120 447 -157 39 631 -412 -90 576 -673 83 227 -532 70 -143 -190 -170 -337 151
2665 151 -671 -530 707 -728 -335 499 -860 -240 270 -362 -196 -79 -14 -448 -397 616 -601 -509 944
2684 944 -617 -563 1012 -436 -303 469 141 -305 -53 914 -432 -580 1275 -262 -552 1581 -95 -661
2702 -661 1161 241 -453 586 889 -481 -388 1469 -249 -841 1648 -92 -1386 1514 256 -1261 795
2719 795 641 -967 -152 1283 -519 -1226 1394 -227 -1988 1405 301 -2260 715 464 -1895 -171
2735 -171 1020 -1100 -1380 1277 -311 -2319 1453 423 -2650 879 1066 -2328 124 1455 -1438 -893
2751 -893 1727 -194 -2012 1813 870 -2659 1322 1849 -2428 563 2520 -1511 -288 2388 -380 -1489
2767 -1489 2210 1185 -2321 1576 2141 -2773 824 3130 -2153 -308 3164 -887 -1511 2749 717
2782 717 -2619 1457 2150 -3070 540 3369 -2820 -1109 3195 -1811 -1911 2788 -349 -3376 1270 1429
2798 1429 -3273 77 2639 -3701 -1795 3383 -2153 -2488 2987 -1128 -3665 1862 1503 -3522 292
2813 292 2695 -3443 -1310 4362 -2078 -2818 3561 -1050 -3330 3462 1705 -3531 872 2960 -2881
2828 -2881 -321 4966 -1888 -2659 4478 -170 -2886 4322 1580 -3910 1830 3311 -2573 305 4539
2843 4539 -2376 -2804 4909 124 -3353 4138 743 -4963 2246 3394 -3569 -161 3454 -3195 -2675
2858 -2675 4572 -420 -4567 3120 496 -5273 2517 3134 -4708 -610 3176 -3480 -1940 4516 -1203
2873 -1203 -5060 2942 830 -4934 2640 2890 -5726 -318 3796 -3369 -1310 4361 -2074 -4349 3667
2888 3667 1463 -4394 2886 2837 -5505 844 4978 -3078 -822 4496 -2225 -3110 4847 1580 -4057 2654
2904 2654 2785 -4804 1618 5567 -3706 -1213 4596 -2218 -2250 5267 738 -4513 2537 2890 -4109 1682
2920 1682 4684 -4414 -1636 5038 -1940 -2289 4700 -672 -4705 2655 2478 -4052 854 3585 -4770
2935 -4770 -1668 5061 -2364 -2991 4015 -1418 -4509 3282 1767 -4524 479 2608 -4428 -968 4972
2950 4972 -2639 -3531 3732 -1409 -3719 3826 1187 -4960 823 2648 -3377 -342 4334 -2842 -3158
2965 -3158 4259 -476 -3308 4032 737 -4607 1899 3088 -2656 236 3660 -2549 -2277 4647 252
2980 252 -3099 3557 661 -4096 2792 3118 -3131 164 2883 -2190 -1387 4322 -274 -3578 2765 911
2996 911 -3602 2732 2482 -3781 81 2875 -2152 -702 3308 -1140 -3320 2594 1032 -3290 2134
3011 2134 1679 -4019 178 2877 -2159 -696 2493 -1647 -2414 2632 867 -2809 1451 1471 -3517 629
3027 629 3042 -2287 -791 2168 -1534 -1433 2503 458 -2489 1019 1322 -2522 905 2534 -2528 -1063
3043 -1063 2252 -1307 -942 2390 -195 -2169 950 1279 -1916 474 2045 -2328 -783 2458 -951
3058 -951 -927 2008 -639 -1631 1396 1100 -1396 147 1522 -1603 -461 2514 -796 -1010 1698 -503
3074 -503 -1030 1532 649 -1195 212 1148 -839 -169 1964 -716 -1212 1602 -411 -1069 1475 150 -1362
3091 -1362 289 487 -798 -380 838 -773 -1336 1048 -321 -1335 915 -378 -1490 302 74 -802
3107 -802 -316 129 -551 -824 741 57 -1142 642 75 -1045 630 376 -650 191 389 70 73 760 467
3126 467 -383 710 829 -351 916 862 -286 739 603 160 573 412 477 29 324 695 -227 340 772
3145 772 -451 304 483 -461 214 51 -223 46 -299 6 -404 -541 155 -776 -422 -14 -850 -446 -270 -743
3165 -743 -365 -665 -376 -504 -830 -169 -529 -644 36 -623 -234 62 -609 -63 42 -220 336 -72 199 296
3185 296 -161 582 -5 56 915 123 313 870 116 513 594 354 670 180 567 512 115 882 334 174 926
3206 926 50 143 785 16 255 280 193 301 -323 384 11 -586 460 -354 -644 459 -507 -765 -99 -432
3226 -432 -454 -443 -357 -468 -948 128 -345 -1275 297 -293 -1170 215 -235 -730 -77 -70 -374 -533 334 -38 -1022
3247 -1022 706 299 -1025 633 349 -1105 576 586 -386 -1 894 175 -591 952 698 -964 1120
3264 1120 1111 -880 1041 1272 -689 379 1193 -183 -260 1148 490 -1126 1070 1163 -1318 706 1382 -1465
3282 -1465 39 1421 -845 -719 1067 -151 -1446 745 821 -2042 113 1358 -2133 -333 1728 -1480
3298 -1480 -1125 1330 -589 -1635 1074 663 -2200 104 1413 -2278 -465 2244 -1813 -1233 1965 -787
3314 -787 -1648 1622 517 -2204 635 1813 -1802 -85 2789 -1670 -1294 2882 -569 -1537 2579 633
3330 633 -2241 1346 1935 -1796 193 2848 -1827 -1344 3426 -639 -2190 2851 177 -2735 1758 1741
3346 1741 -2296 -23 2425 -2017 -1486 3404 -951 -2787 2723 -18 -3084 2066 1603 -3284 107
3361 107 2389 -2412 -1358 3424 -1211 -3288 2959 194 -3573 2499 1577 -3969 547 2584 -2473
3376 -2473 -897 3280 -1509 -2911 3426 635 -3442 2781 1752 -4047 1459 3379 -2818 -507 3476
3391 3476 -1844 -2213 3898 482 -3707 2513 2000 -4217 1743 3474 -3395 -372 3621 -2243 -1964 3783
3407 3783 -17 -3866 2530 1819 -4220 1555 3341 -4099 -544 3937 -2567 -1992 3885 -680 -3699
3422 -3699 2636 1652 -4211 1381 3245 -4395 -481 4312 -2777 -2033 4184 -1153 -3489 3294 1506
3437 1506 -4110 1395 3220 -4112 -358 4525 -2890 -2096 4406 -1369 -3317 3688 1130 -3996 1814
3452 1814 2856 -3893 -98 4308 -3056 -1984 4692 -1491 -3384 3945 568 -3940 2205 2439 -3942
3467 -3942 31 4025 -2935 -2107 4555 -1578 -3635 4092 333 -4232 2536 2043 -4091 552 3720
3482 3720 -3003 -1944 4207 -1496 -3325 4009 402 -4163 2918 2012 -3945 1029 3422 -3029 -1360
3497 -1360 4011 -1334 -2990 4087 314 -4203 2876 1912 -3868 1584 2976 -3356 -891 3570 -1262
3512 -1262 -2530 3573 187 -3940 2826 2091 -3766 1307 2893 -3361 -400 3825 -1538 -1995 3018
3527 3018 -193 -3394 2756 1833 -4008 1136 2575 -3438 100 3678 -2164 -1929 2845 -229 -2696
3542 -2696 2451 1515 -3673 886 2651 -3217 59 3266 -2573 -1733 2934 -587 -2218 2213 886
3557 886 -3320 702 2519 -2733 -307 2855 -2571 -1560 3103 -660 -2023 1899 201 -2793 1141
3572 1141 2150 -2343 -345 2526 -2138 -1163 3217 -732 -1878 2211 248 -1890 1493 1781 -1976
3587 -1976 -153 2266 -1265 -918 2923 -904 -1805 2256 163 -1730 1487 956 -1984 -118 1872 -1005
3603 -1005 -900 2229 -771 -1839 2046 221 -1862 1350 576 -1849 178 1460 -993 -1074 1487 -734
3619 -734 -1557 1801 115 -1952 937 490 -1767 630 1143 -1155 -552 1077 -343 -922 1507 388
3635 388 -1528 1082 919 -1259 813 1153 -888 147 1184 35 -366 1142 432 -1020 760 887
3651 887 -1002 626 907 -1004 70 830 -313 -342 599 68 -892 311 535 -1089 90 599 -1294
3668 -1294 -317 560 -841 -505 158 -486 -700 -69 105 -944 -316 371 -1016 -392 357 -857 -518 259
3686 259 -402 -446 -23 -18 -378 -164 468 -344 -87 857 -337 -93 778 -119 12 511 236 260 152 328 301
3707 301 147 699 31 -98 651 -46 -67 636 9 110 67 101 236 -141 366 85 -376 416 0 -315 470
3728 470 -126 -135 249 -263 54 -189 -142 174 -234 140 -56 -481 312 -57 -330 214 -246 -108 -40 -142 203
3749 203 -47 78 288 -392 247 183 -247 472 122 -64 503 37 152 270 -33 319 -66 181 442 -306
3769 -306 400 197 -494 355 -16 -261 161 8 -155 -146 -105 261 -496 -165 241 -627 58 169 -485 157 113
3790 113 -433 -28 -120 4 -272 -194 136 -591 -68 435 -703 -13 288 -636 -257 356 -338 -135 179 158 -258
3811 -258 -26 799 -425 -93 844 -513 63 907 -160 -36 407 256 -206 474 831 -468 77 1105
3829 1105 -456 -124 1169 -335 -352 887 -28 -367 611 354 -606 -132 752 -549 -435 1194 -631 -872
3847 -872 1019 -288 -905 586 -5 -1063 91 665 -883 -607 943 -844 -1176 1269 -191 -1236
3863 -1236 747 -23 -1277 517 917 -960 -336 1099 -559 -790 1728 240 -1503 1337 395 -1293
3879 -1293 1275 1208 -1099 15 1398 -238 -662 1815 98 -1595 1331 737 -1383 1160 1056 -1680
3895 -1680 47 1395 -637 -581 1377 -695 -1820 1518 942 -1862 904 786 -2404 156 1571 -1324
3911 -1324 -787 1045 -725 -1773 1576 588 -2312 557 842 -2488 389 1843 -1892 -956 1437 -924
3927 -924 -1232 1827 543 -2165 717 1381 -2145 675 2245 -2015 -868 2207 -632 -920 2286 257
3943 257 -2218 1178 1677 -1662 754 2411 -2203 -802 2895 -667 -824 2438 -195 -2074 1636 1689
3959 1689 -1935 242 1937 -2252 -647 2977 -1129 -1600 2080 -702 -2156 2036 1239 -2280 144
3974 144 1494 -2257 -409 2849 -1539 -2171 2103 -722 -2139 2335 603 -2813 334 1410 -1995
3989 -1995 -164 2427 -1729 -2241 2451 -484 -2017 2504 400 -3022 944 1862 -1889 150 2177
4004 2177 -1863 -1818 2944 119 -2025 2357 364 -2962 1752 2068 -1941 231 1838 -1725 -925 3114
4020 3114 70 -2207 2065 286 -2669 2016 1986 -2536 201 1927 -1793 -410 2874 -725 -2256
4035 -2256 1762 374 -2144 1858 1530 -2966 30 1912 -1766 -327 2342 -1121 -2130 1918 577
4050 577 -2126 1519 1106 -3229 179 2283 -1741 -450 2103 -1662 -1843 2135 451 -1999 1169 972
4066 972 -2692 644 2627 -1862 -569 2043 -1462 -1155 2466 200 -1956 1205 973 -2080 922 2389
4082 2389 -1927 -850 2176 -1168 -750 2612 -393 -2052 1253 706 -1599 776 1772 -2008 -812 2070
4098 2070 -1038 -1007 2217 -764 -2043 1393 577 -1638 491 963 -2003 -659 1971 -1030 -1288 1598
4114 1598 -913 -1971 1540 269 -1927 563 516 -1801 -250 1650 -1108 -1432 1408 -557 -1762 1656
4130 1656 258 -1842 790 714 -1442 202 1405 -870 -1025 1627 -17 -993 1667 410 -1563 1058
4146 1058 991 -1111 721 1228 -723 -318 1518 184 -786 1483 579 -1224 1142 1197 -1107 750 1228
4163 1228 -763 -24 1305 -122 -605 1041 270 -1003 849 817 -1248 237 925 -1096 -131 915 -588
4180 -588 -718 600 -7 -1115 406 568 -1325 28 717 -1108 -175 635 -724 -547 520 -222 -819
4197 -819 72 296 -1028 -63 685 -869 -190 738 -663 -248 583 -210 -438 241 124 -537 66 575 -412
4216 -412 -229 793 -295 -200 598 -223 -348 409 234 -253 72 321 -237 -231 664 -164 -353 554 -152 -270
4236 -270 370 89 -136 139 249 -178 -201 272 -112 -437 502 -149 -295 254 -174 -194 113 -1 -155 30 186
4257 186 156 -165 213 149 -338 311 202 -430 323 101 -146 182 -120 87 -165 130 139 -142 112 313 -212
4278 -212 251 257 -208 184 23 29 115 -51 257 -22 92 378 -357 49 95 -143 249 -56 -205 143 -12 104
4300 104 -42 -158 197 -147 -138 255 -249 21 98 -165 105 -4 -153 88 -119 53 -165 -160 140 -178 -54 271
4322 271 -186 -77 75 -216 93 -110 -82 123 -186 176 32 -198 286 -164 -122 332 -199 -33 331 -110 196
4343 196 84 30 100 -168 223 -45 -184 143 -212 -97 240 -130 -8 104 -83 -105 -64 -129 -125 -212 310 -17 -225
4366 -225 329 -173 -343 456 -128 -151 -6 -15 -44 85 288 31 -262 403 -36 -389 516 68 -363 250 -13
4387 -13 -342 275 212 -109 -233 212 34 -415 430 225 -503 256 131 -446 310 332 -321 5 332 -12 -205
4408 -205 411 -86 -727 383 371 -495 337 150 -693 28 585 -154 -354 248 -143 -751 447 640 -772
4427 -772 280 324 -730 113 730 -414 -313 402 79 -438 581 567 -769 126 585 -704 259 916 -574
4446 -574 -322 668 -188 -100 780 379 -910 89 823 -510 299 989 -903 -338 935 -102 -299 585 -169
4465 -169 -959 273 827 -636 -110 600 -1097 -523 1163 -300 -704 394 -430 -959 637 708 -899 -301
4483 -301 647 -884 -387 1383 -385 -987 615 -336 -809 907 367 -1120 -254 749 -460 -117 1490
4500 1490 -511 -1204 1057 51 -561 1233 337 -1260 118 1036 -456 90 1297 -709 -945 1474
4516 1474 442 -649 1134 70 -1335 577 1198 -631 -164 708 -689 -686 1532 250 -1192 828
4532 828 81 -1348 943 1096 -1051 -370 589 -722 -392 1395 -7 -1430 501 220 -1304 851 875
4549 875 -1657 -391 937 -619 -248 1121 -540 -1556 686 490 -1099 729 631 -1869 -130 1265
4565 1265 -564 -91 710 -794 -1203 1009 674 -1143 408 517 -1502 363 1601 -708 -570 977
4581 977 -652 -567 1319 559 -1142 341 690 -1039 565 1606 -1066 -487 1273 -496 -378 1578 118
4598 118 -1160 595 815 -681 466 1268 -1021 -487 1409 -245 -249 1309 -276 -990 791 785 -809 159
4616 159 919 -1008 -413 1574 -291 -667 1118 -485 -1211 943 557 -958 64 597 -1108 -358 1389
4633 1389 -626 -997 810 -354 -1065 1081 56 -1222 151 438 -798 -288 1021 -627 -885 916
4649 916 -17 -896 902 27 -1335 352 478 -782 52 692 -632 -521 805 27 -927 748 195 -1084
4667 -1084 611 675 -803 127 707 -707 -272 928 139 -727 723 270 -856 685 696 -856 319
4684 319 689 -627 3 770 -145 -462 598 237 -668 440 614 -802 212 673 -620 -77 667 -174
4702 -174 -323 503 227 -581 261 625 -667 139 704 -700 -74 744 -341 -335 566 -38 -333 333 346 -613
4722 -613 110 647 -619 -194 735 -360 -236 507 6 -262 362 310 -390 -47 493 -525 -111 630 -382
4741 -382 -331 485 -273 -363 264 -38 -442 -7 367 -258 -220 492 -436 -453 207 -214 -361 270 -136 -279 39
4762 39 141 -185 -254 284 -389 -371 417 -179 -467 214 -113 -361 245 -55 -283 -26 108 -94 -206 382 25
4783 25 -312 271 -8 -107 249 232 -208 -7 95 98 -28 341 182 -239 341 219 -207 353 216 -221 123 186
4805 186 -22 144 116 81 -37 219 234 -166 188 189 -245 113 153 -179 152 66 -22 -80 -77 127 -183 -81 89 -121
4829 -121 60 157 -97 -61 -70 -124 -16 -2 -63 -157 -196 73 -297 -92 130 -239 -84 -15 -346 -14 -74 -283 -55 -183
4853 -183 107 -57 -91 203 -42 -131 167 -112 5 177 -147 113 95 163 122 -96 89 57 -93 151 -19 -120
4875 -120 197 -84 70 131 2 248 -114 43 114 120 193 52 -106 249 -106 -70 268 -91 14 182 -207 131
4897 131 -55 -58 193 -172 95 68 -54 98 38 -80 65 -127 172 199 -158 79 -167 -52 96 -133 270 17
4919 17 -266 201 32 -141 65 -29 -179 33 -32 54 -149 93 -19 -260 -47 -15 -249 59 -35 -129 10 -135
4941 -135 -100 20 67 170 -161 1 369 -173 66 182 -197 -13 72 21 22 2 114 36 158 263 -247 80 444
4964 444 -100 260 355 -210 28 272 161 -47 168 140 -218 -10 474 -196 61 82 -299 -38 285 -49 -79
4985 -79 94 -102 -187 -6 327 -155 -190 105 -322 -152 474 -66 -128 173 -117 -159 67 154 -316 -235 187 -137
5007 -137 29 474 -261 -354 362 -47 -55 311 12 -466 -157 229 -62 -6 383 -93 -300 428 129 -228 314
5028 314 -60 -349 262 374 74 -191 108 -237 -482 516 56 -380 246 -135 -359 211 430 -257 -287 30
5048 30 -173 -275 427 65 -591 231 88 -196 441 187 -457 -119 317 -40 -173 431 0 -543 287 310 -329
5069 -329 377 93 -630 -9 503 -54 66 112 -288 -497 377 238 -430 190 97 -689 82 456 -198 -207 37
5090 37 -115 -208 426 166 -623 8 254 -480 298 563 -505 -208 162 -83 -75 481 163 -570 -21 418 -263
5111 -263 178 406 -584 -223 555 -166 -94 428 -60 -397 140 360 -192 -2 240 -539 53 703 -302 -359
5131 -359 333 -252 -385 314 108 -444 -40 253 -305 -26 654 -167 -370 578 -71 -220 497 120 -431 -38
5151 -38 262 -148 33 517 -273 -392 631 -8 -393 427 60 -397 203 247 -198 155 314 -160 -286 412
5171 412 -19 -327 430 -172 -440 187 196 -241 -67 153 -193 -173 280 -63 -556 327 15 -585 142 41 -376
5192 -376 19 276 -363 -148 161 -186 -340 298 27 -478 197 140 -532 -8 181 -342 -182 269 -183 -200 240
5213 240 98 -301 177 189 -433 150 455 -274 81 306 20 -100 103 114 -200 290 430 -126 20 310 -362
5234 -362 172 503 -44 9 139 -78 -38 313 222 -438 38 387 -136 49 413 -207 -128 114 -183 -36 104
5255 104 20 -352 -78 143 -59 41 344 -327 -197 79 38 -52 137 -113 -308 96 147 -27 -164 160 -216
5276 -216 -195 278 -75 -273 -71 -68 9 114 70 -101 -239 -34 -73 -1 291 -30 -261 139 -97 -88 216 -26 -81
5299 -81 -157 86 -51 -58 108 -26 -151 143 63 -59 118 -7 -156 85 82 139 -32 -119 -59 -32 256 208 -183 59
5323 59 -20 -55 196 99 -9 40 12 3 180 193 170 -137 132 123 73 134 42 -77 85 22 -53 84 -80 203 -64 -100
5349 -100 251 -151 58 47 -287 1 74 -9 66 -85 -197 -95 -126 131 -171 -65 -96 -200 46 105 -16 121
5371 121 -29 -38 6 -153 42 -123 -109 164 -155 36 22 -194 -3 -42 -149 46 3 40 -3 -114 105 25 -191
5394 -191 -5 21 -43 87 -169 -107 112 -75 -34 -76 -98 13 -93 -69 -37 -180 35 70 46 138 -49 126 48 -45
5418 -45 -19 -44 31 110 -60 105 100 -74 16 -7 0 162 -21 71 23 5 80 146 21 127 -137 85 37 -94 121 -124
5444 -124 -47 162 0 69 112 -68 88 -31 -7 208 23 19 122 -42 -4 -85 -85 30 -91 -99 -44 -120 69 -36 0
5469 0 138 -81 -13 -72 -101 9 -93 -64 57 -47 120 201 -77 13 -121 -147 123 17 60 -68 -112 115 -89 -27
5493 -27 59 -167 35 -190 49 257 -34 -162 76 -142 48 -12 -58 -21 -109 163 -23 52 66 -85 -67 154 4
5516 4 -22 27 -129 31 119 -88 140 -4 53 -18 -45 175 23 25 42 -173 49 140 1 119 41 -178 104 -11
5540 -11 152 161 -138 -9 -55 -121 94 -94 -118 -9 -191 -2 48 88 91 -238 -114 24 -99 150 -52 -184 82
5563 82 5 111 151 -3 237 -6 4 89 47 -66 33 -183 47 154 -3 233 42 -77 14 80 108 137 -105 60
5587 60 -185 92 169 -252 116 -69 -234 169 -13 91 -31 -134 -11 -29 40 140 -108 3 -95 -37 156 -43
5609 -43 -109 -30 -141 20 70 -63 99 -70 -23 -29 86 70 60 -168 100 36 81 182 29 -1 -89 -98 63 -65 -2
5634 -2 99 -114 100 3 -50 78 -159 -38 125 -189 71 -98 -259 35 -47 11 203 -110 31 -73 -70 128 -33
5657 -33 -80 -3 30 2 -14 41 104 -72 -39 137 -59 81 66 -193 60 -21 -24 135 129 68 107 50 248 -23 21 220
5683 220 109 196 -120 -39 198 41 201 227 -22 -38 -112 34 163 -187 -26 31 -171 48 26 -161 46 -110
5705 -110 -76 82 -11 122 71 -38 -91 -38 -115 118 -10 -106 29 -198 219 129 -192 2 -42 -16 139 54 35 -245
5729 -245 17 140 -37 128 63 -162 -27 1 25 31 21 -19 -258 27 158 -47 110 46 -326 -47 157 52 79
5752 79 -147 -124 -68 82 144 102 -218 78 -99 54 274 -72 -5 -175 -148 27 211 97 -307 -137 -8 88 140
5775 140 295 -114 -66 152 -84 217 121 -12 -111 -118 -19 117 -26 94 -96 -222 237 -8 100 212 -253 -83
5797 -83 73 142 108 15 -271 -180 -3 327 -55 -131 1 -292 -183 178 114 -22 -164 -60 -49 -153 248 -127 -348
5820 -348 -69 -233 -48 378 35 -131 28 18 -27 218 20 -96 -466 44 111 -120 213 -64 -326 13 116
5841 116 41 -6 -169 -60 -169 189 117 -91 74 136 -223 29 180 91 175 -76 -39 24 253 127 -24 32 90
5864 90 -135 158 87 -86 157 51 54 169 71 -7 -137 47 145 -18 74 66 -235 118 153 -2 180 11 -100 7
5888 7 48 141 35 -56 73 -231 -18 213 -39 64 9 -54 22 150 13 60 -32 108 -172 -17 124 -45 -102 141
5912 141 -152 -17 33 -66 -132 -78 -152 -56 -152 9 43 -154 42 -72 -49 -27 -51 -210 -53 -58 90 -20 25 -7 -34
5937 -34 165 -12 -62 213 -124 -193 -48 -54 -7 17 -99 70 -22 78 111 -60 87 1 -20 111 73 -167 44 -89
5961 -89 115 49 14 96 -21 163 7 -122 163 12 36 129 158 -13 32 128 -49 200 21 120 -116 2 29 -76
5985 -76 19 40 9 53 9 -29 139 11 -2 -68 -155 122 -97 -115 -28 -128 4 -42 -91 35 -33 7 -95 5 -50 -71
6011 -71 -159 -66 -42 -65 110 -48 -48 57 -152 119 -70 54 24 -20 129 -35 -139 16 -222 -56 32 21 55 68
6035 68 -117 -46 51 8 -54 -101 11 -69 -176 108 -10 56 131 -120 -6 -37 102 -31 66 90 -114 -123 125 -13 -93
6060 -93 202 -3 -24 2 -27 8 -4 144 227 -11 -23 -35 -172 186 -90 -53 3 -59 80 11 -20 78 27 43 -1 -35
6086 -35 161 82 -157 109 20 -146 129 -31 -126 69 -63 107 -93 44 -23 -197 153 29 -221 139 -36 -129
6108 -129 -7 104 -67 -80 -56 6 -143 41 170 -237 -97 43 -284 34 128 -103 123 -80 -83 -153 23 68 -183
6131 -183 59 80 -158 -15 146 -87 -51 57 -125 -23 205 91 18 -79 45 -264 35 257 -53 71 196
6152 196 -80 -80 46 -92 -185 13 159 -197 -7 265 -231 -186 371 -158 -160 187 -106 -141 -51 185 -258 -7 207
6175 207 -212 -144 239 -139 -159 310 -122 -214 167 31 -144 112 233 -177 -53 225 -84 -96 286 -235 -271 272
6197 272 -45 -162 104 17 -231 -96 165 -131 -176 284 15 -255 173 12 -284 118 58 -338 -142 145 -30
6218 -30 -179 180 -196 -372 346 90 -246 97 15 -283 114 105 -67 -244 169 -250 -67 418 143 -457 70
6239 70 179 -250 179 240 -156 -131 170 15 -42 368 124 -359 31 285 -33 210 420 -323 -142 230 -17
6260 -17 -25 239 -97 -450 283 236 -215 74 216 -500 -114 261 -34 -231 76 -160 -310 296 255 -364 -113 88
6282 88 -244 67 403 -425 -307 163 -240 -203 390 111 -410 -37 314 -57 144 325 -413 -228 463 249 -89
6303 -89 206 -255 -465 -129 503 -69 53 208 -384 -3 443 83 -180 132 -13 -207 389 409 -113 -121 341
6324 341 -371 85 578 -61 -509 83 -43 -31 424 344 -285 -188 235 -120 -66 362 -210 -542 186 169 -101 284
6346 284 0 -620 -109 186 74 -229 103 -386 -534 327 169 -301 180 -12 -393 150 424 -102 76 65
6366 65 -231 -160 383 252 -451 -51 39 -172 292 380 -311 -272 116 -123 -54 325 3 -493 48 208 -44 321
6388 321 230 -433 -347 313 84 66 233 -112 -379 208 329 -182 148 119 -390 10 338 -51 -148 -49 -224 -142
6410 -142 252 109 -215 -66 158 -294 -3 390 -238 -200 78 -91 -144 313 105 -241 -77 69 -75 145 223
6431 223 -229 -189 157 -28 -46 152 -114 -23 34 108 -27 -76 290 -214 -156 282 -175 -84 158 -344 -204 112 107
6454 107 -33 47 179 -155 -2 271 15 -347 82 13 -92 29 68 -74 -79 -68 -12 -57 128 -93 -224 136 -50
6477 -50 -112 233 0 -230 133 175 82 13 121 -67 5 190 91 -147 137 -54 -40 76 106 0 21 132 -41
6500 -41 -29 31 102 -153 -58 43 -35 36 39 -116 -109 39 -17 68 108 -13 -26 98 77 -3 40 179 -50 65 120 -18
6526 -18 26 -71 25 -48 -48 80 -50 38 105 -82 137 82 -25 -125 33 -98 -128 22 -143 -78 23 67 36 -67 124
6551 124 -91 -57 -102 51 -141 -6 -64 -131 -63 -20 48 -102 41 -44 -90 -75 -107 -242 -15 11 -9 -51 81 18 -74
6576 -74 -45 -45 -185 11 -37 -68 88 21 -19 127 127 60 -83 41 7 -37 117 53 53 25 -17 -6 -17 49 43 131 -36 90
6604 90 -99 8 181 90 121 178 1 169 65 21 89 62 -70 -11 -1 72 -31 112 26 -61 -20 175 -33 93
6628 93 107 -18 -11 123 2 41 -29 112 -89 -25 -44 -208 -84 58 -53 50 3 -100 42 23 -77 -165 -66 55
6652 55 -299 28 5 -277 20 58 -92 2 46 -77 -18 48 68 -120 -95 154 -15 29 168 -232 53 252 1
6675 1 72 70 200 -2 146 91 -40 -8 242 -53 5 228 -67 -51 105 18 -50 27 -15 -102 47 174 -167 -93 230
6700 230 -138 -167 346 -37 -163 212 36 -173 28 199 -164 -62 265 -268 -168 229 -147 -360 99 -19
6720 -19 -229 136 144 -173 -61 199 22 -45 209 -194 -350 170 37 -150 130 98 -193 96 245 -32 -132 270
6742 270 111 -282 248 119 -305 233 121 -182 278 346 -194 -215 348 54 -185 396 79 -403 94 233 -260
6763 -260 89 133 -325 -25 280 19 -293 182 78 -521 143 322 -364 30 121 -531 -199 421 -150 -365 36
6784 36 -183 -456 191 274 -409 -39 220 -288 -106 573 -222 -351 92 1 -222 318 375 -444 8 404 -231
6805 -231 17 540 -306 -408 457 145 -70 289 174 -534 39 478 -165 -56 409 -446 -353 511 101 -317
6825 -317 188 39 -328 142 359 -271 -166 134 -241 -234 503 -84 -388 130 83 -258 170 460 -383 -201 319
6846 319 -222 -151 587 -139 -632 242 149 -161 293 211 -534 -286 437 25 -162 199 -277 -508 545 345 -342
6867 -342 236 -69 -530 -138 552 -109 -253 299 -163 -152 618 302 -463 119 -32 -395 326 542 -268 -233 310
6888 310 -136 -203 608 220 -568 189 257 -161 204 323 -515 -227 432 10 -259 385 -6 -513 120 361 -318
6909 -318 -64 361 -561 -216 517 -23 -123 325 -160 -464 428 268 -395 13 118 -382 -3 576 -243 -281
6929 -281 200 -180 -43 395 322 -389 -98 404 -247 69 474 -235 -294 305 92 -112 264 282 -395 11 406
6950 406 -129 91 347 -373 -377 451 75 -270 122 7 -379 209 220 -155 -126 131 -265 -171 492 -42 -234 139
6972 139 16 -321 212 181 -370 -94 286 -98 -90 345 -116 -365 123 -109 -248 148 149 -380 -91 217 -175 -41
6994 -41 200 -31 -377 223 163 -239 224 -54 -310 9 162 -113 -47 153 -85 -99 237 53 -233 104 165 -217
7016 -217 216 138 -53 -195 -29 -132 -76 166 74 -262 166 137 -108 76 140 -154 11 55 -12 88 222 107
7038 107 -92 106 236 -36 1 161 -213 -154 91 -13 -132 34 21 -180 112 313 -68 -60 246 -96 102 237
7060 237 -10 4 67 -102 -27 -33 11 -131 -103 66 -46 -4 138 -252 -131 76 -46 2 -95 18 -65 -101 127 -5
7084 -5 -151 147 -191 -174 78 48 -122 96 -50 -98 16 67 62 -58 0 67 -133 164 5 -82 133 -17 -94 77
7108 77 115 162 -63 59 77 -153 56 -5 -145 75 51 8 -18 36 43 50 -32 13 -8 -16 -70 -242 14 35 -64 -51 73
7135 73 -118 44 -10 85 -52 -74 29 -64 -22 19 -106 4 37 -83 106 15 86 3 147 -12 -92 17 105 -6
7159 -6 -22 174 -20 -22 169 63 2 115 44 7 -20 -59 -24 -7 137 -107 115 185 -55 10 15 -138 48 17 8 22 -15
7186 -15 23 -121 6 -33 -78 -30 9 7 -7 81 9 -38 33 46 -135 -28 -55 -151 -44 105 -116 -85 -43 -99 -189 26 111
7213 111 -106 -143 43 32 -4 -12 -214 -192 152 -95 -77 106 -40 -126 51 14 -18 -98 30 2 -115 222 47 -81
7237 -81 363 49 -124 148 64 45 25 105 -180 -31 93 24 -136 110 -72 -259 192 174 -180 38 51 -30 -56
7260 -56 157 -99 -242 95 -106 -329 122 10 -207 -138 229 -184 8 177 -109 -303 157 37 -197 157 146
7281 146 -461 100 258 -103 -13 130 -135 -169 321 200 -193 43 93 -286 132 283 -148 -105 277 -223 -16
7302 -16 239 102 -110 114 172 -235 191 307 -178 -78 272 -68 -47 341 -249 -281 191 91 -340 107 336
7323 336 -391 58 480 -154 -143 300 -251 -364 290 197 -271 151 111 -328 -30 429 -184 -211 207 -287 -391
7344 -391 396 174 -362 62 71 -314 -21 273 -332 -270 357 -237 -254 386 -50 -456 76 187 -246 214 406
7365 406 -387 -276 473 68 -155 316 -80 -630 199 268 -217 132 181 -285 -196 498 81 -232 182 -120 -473
7386 -473 491 276 -329 -18 223 -362 73 441 -122 -290 194 -46 -354 404 157 -368 24 241 -292 46
7406 46 461 -312 -521 221 43 -295 298 6 -621 -41 284 -215 -42 227 -428 -222 414 158 -352 157
7426 157 53 -657 208 435 -290 -143 215 -425 -52 463 -10 -466 101 -92 -376 192 464 -415 -170 194
7446 194 -262 1 421 -162 -391 162 122 -304 45 250 -369 -164 337 -196 -23 449 -266 -399 335 95
7466 95 -229 121 269 -397 -47 548 -208 -222 292 -175 -202 449 151 -236 140 172 -306 17 341 -278 -202 310
7488 310 -88 -239 317 83 -378 -18 184 -264 112 253 -253 -132 320 -65 -223 307 -24 -362 235 261
7508 261 -221 156 131 -313 -56 325 -35 -227 207 -87 -301 181 232 -212 111 117 -69 81 281 -88 -287
7529 -287 223 120 -174 265 287 -299 -16 126 -227 -33 271 -162 -261 61 -3 -250 208 103 -266 -89 273
7550 273 -253 28 261 -121 -92 14 76 -132 124 103 -106 158 269 -252 -125 191 -160 -183 108 -54 -178
7571 -178 34 -12 -122 99 189 -232 -37 286 -96 -31 179 -60 -104 54 168 -205 -62 283 -299 -33 240
7592 240 -10 -83 312 -42 7 105 112 -55 95 80 17 -32 119 160 4 224 98 -99 85 -64 -93 35 -76
7615 -76 -38 48 78 -68 -36 200 -31 -175 91 198 -212 37 103 -104 -87 64 8 -106 -45 23 -238 85 59 -294
7639 -294 -9 22 -110 64 18 -94 38 132 15 -39 18 -6 -132 7 -23 -96 14 23 11 8 132 2 14 68 83
7664 83 -33 98 22 -130 127 47 -132 -7 -67 15 -118 -23 -16 -172 7 -79 -97 -48 -2 -180 -21 55 -32 -67 -40
7689 -40 39 -89 -31 89 9 -117 34 -54 19 108 -89 28 0 -107 -18 -176 66 -49 5 133 -80 -110 81 -119
7713 -119 -34 -36 -54 52 -69 67 -5 144 25 -50 -104 -36 23 -132 -53 9 -27 108 -1 -17 118 49 51 5 75 44
7739 44 33 122 73 -46 65 13 48 3 114 8 -31 127 -29 -47 59 95 -104 118 -109 -148 1 -49 -15 11 -67
7764 -67 -68 -200 41 88 32 101 31 -226 141 -10 -28 -146 10 -41 -82 -52 28 -137 92 104 -199 26 104 40 170
7789 170 97 -184 36 162 18 48 22 -1 -170 -27 106 -117 -6 127 -92 -6 215 -121 37 29 60 -106 143
7812 143 157 -8 -28 141 -65 -120 177 -9 -133 83 -17 -71 -20 100 -51 86 110 -156 53 215 -111 -89
7834 -89 198 -51 -25 125 -119 -153 31 190 -62 88 168 -279 -129 161 -6 -209 87 -185 -261 85 145 -108
7856 -108 1 191 -232 -92 285 -65 -289 49 -87 -163 48 141 -189 -96 137 24 -91 241 60 -258 192
7877 192 49 -133 221 78 -170 -6 194 -59 19 177 -110 -179 370 79 -240 166 -81 -107 220 254 57
7898 57 -98 111 -171 -223 274 118 -249 -56 -29 -148 71 195 -119 -46 45 -229 -92 312 74 -360 23 151
7920 151 -137 56 143 -289 -105 212 -27 -106 96 -30 -255 146 119 -320 71 219 -282 21 242 -148 -41
7941 -41 169 22 -157 238 201 -313 94 143 -221 3 356 -212 -85 160 -42 -79 337 145 -218 45 289
7962 289 -244 187 308 -208 -164 263 -14 41 252 23 -312 -18 235 -122 -18 249 -201 -112 339 -18 -99
7983 -99 297 -66 -392 146 264 -177 -100 189 -263 -219 430 -36 -203 120 54 -229 19 252 -173 -52 92
8004 92 -97 -9 298 -24 -336 177 -68 -203 174 134 -222 49 235 -60 -3 181 -40 -303 394 -3 -305
8025 -305 20 59 -241 88 160 -135 -7 290 -104 -217 248 52 -250 265 200 -83 134 205 -205 -155 141 -155
8047 -155 -60 203 -12 -217 64 33 -344 81 165 -303 -43 177 12 -204 140 -48 -127 -8 149 -229 15
8068 15 127 -215 -15 250 -155 -101 208 -2 -275 159 140 -237 186 199 -218 -69 245 -116 -22 288 18 -35
8090 -35 170 2 -213 -64 224 -131 -44 263 -173 43 163 -64 -166 189 53 -47 70 95 -97 24 127
8111 127 -100 15 58 -52 -143 119 92 -38 79 157 -131 -157 134 -124 -93 208 -6 -132 36 63 -249 188
8133 188 125 -214 -11 198 -34 -115 15 -46 -133 80 64 -288 81 33 -64 24 -22 -158 -154 174 136 -162 35 44 -77
8158 -77 66 42 -63 -36 106 -32 -8 55 -56 -28 14 51 -169 0 42 -158 157 27 -53 70 14 36 -106 -32
8182 -32 53 -135 83 130 -115 -84 8 55 -62
8191f2
##END NTUPLES=NMR FID
##END=
