##TITLE=1H_54-2024
 CDCl3
 8 sc, 
 12.8.2024
##JCAMPDX= 6.0         $$ Bruker NMR JCAMP-DX V2.0
##DATA TYPE= NMR FID
##DATA CLASS= NTUPLES
##ORIGIN= UXNMR, Bruker Analytische Messtechnik GmbH
##OWNER= root
$$ XWIN-NMR		Version 3.5
$$ Mon Aug 12 13:44:54 2024 Russian Standard Time (UT+4h)  she@DPX200
##.OBSERVE FREQUENCY= 200.1317
##.OBSERVE NUCLEUS= ^1H
##.DELAY= (6, 6)
##.ACQUISITION MODE= SIMULTANEOUS
##.ACQUISITION SCHEME= undefined
##.AVERAGES= 8
##.DIGITISER RES= 18
##SPECTROMETER/DATA SYSTEM= spect
##.PULSE SEQUENCE= zg30
##.SOLVENT NAME= CDCl3
##.SHIFT REFERENCE= (INTERNAL, CDCl3, 0, 15.7039)
##AUDIT TRAIL= $$ (NUMBER, WHEN, WHO, WHERE, WHAT)
$$ ##TITLE= Audit trail, XWIN-NMR		Version 3.5
$$ ##JCAMPDX= 5.01
$$ ##ORIGIN= Bruker BioSpin GmbH
$$ ##OWNER= she
$$ F:/spectra/data/she/nmr/H-F/1/audita.txt
$$ ##AUDIT TRAIL=  $$ (NUMBER, WHEN, WHO, WHERE, WHAT)
(   1,<2024-08-12 13:43:48.79 +0400>,<she>,<DPX200>,
      <created by zg, POWCHK disabled, PULCHK disabled
       configuration hash MD5:
       00 E9 B6 7A A2 85 ED C7 34 08 36 98 17 FE 4E 26
       data hash MD5: 16K
       61 5B CA 52 32 68 AA 62 13 EB 0F 5C FF B8 3D 58>)
$$ ##END=
$$ 
$$ hash MD5
$$ BD 59 6A AE CC A4 91 AC 51 0C 6D 0D 49 21 CD F8
##$RELAX= 
##$RELAX= 
##$RELAX= 
##$RELAX= 
##$RELAX= 
##$RELAX= 
$$ Bruker specific parameters
$$ --------------------------
##$DU= <F:/spectra>
##$EXPNO= 1
##$NAME= <H-F>
##$PROCNO= 1
##$TYPE= <nmr>
##$USER= <she>
##$AMP= (0..31)
100 100 100 100 100 100 100 100 100 100 100 100 100 100 100 100 100 100 
100 100 100 100 100 100 100 100 100 100 100 100 100 100 
##$AQSEQ= 0
##$AQ_mod= 1
##$AUNM= <au_zg>
##$AUTOPOS= <>
##$BF1= 200.13
##$BF2= 200.13
##$BF3= 200.13
##$BF4= 200.13
##$BF5= 200.13
##$BF6= 200.13
##$BF7= 200.13
##$BF8= 200.13
##$BYTORDA= 1
##$CFDGTYP= 0
##$CFRGTYP= 5
##$CHEMSTR= <none>
##$CNST= (0..31)
1 1 145 1 1 1 1 1 1 1 1 1 1 1 1 1 1 1 1 1 1 1 1 1 1 1 1 1 1 1 1 1 
##$CPDPRG= <>
##$CPDPRG1= <>
##$CPDPRG2= <>
##$CPDPRG3= <>
##$CPDPRG4= <mlev>
##$CPDPRG5= <mlev>
##$CPDPRG6= <mlev>
##$CPDPRG7= <mlev>
##$CPDPRG8= <mlev>
##$CPDPRGB= <>
##$CPDPRGT= <>
##$D= (0..31)
0 1.2 0 0 0 0 0 0 0 0.06 0 0.03 0 0 0 0 0.0002 0 0 0 0 0 0 0 0 0 0 0 0 
0 0 0 
##$DATE= 1723455828
##$DBL= (0..7)
120 120 120 120 120 120 120 120 
##$DBP= (0..7)
150 150 150 150 150 150 150 150 
##$DBP07= 0
##$DBPNAM0= <>
##$DBPNAM1= <>
##$DBPNAM2= <>
##$DBPNAM3= <>
##$DBPNAM4= <>
##$DBPNAM5= <>
##$DBPNAM6= <>
##$DBPNAM7= <>
##$DBPOAL= (0..7)
0.5 0.5 0.5 0.5 0.5 0.5 0.5 0.5 
##$DBPOFFS= (0..7)
0 0 0 0 0 0 0 0 
##$DE= 6
##$DECBNUC= <off>
##$DECIM= 24
##$DECNUC= <off>
##$DECSTAT= 4
##$DIGMOD= 1
##$DIGTYP= 9
##$DL= (0..7)
0 120 120 120 120 120 120 120 
##$DP= (0..7)
150 150 150 150 150 150 150 150 
##$DP07= 0
##$DPNAME0= <>
##$DPNAME1= <>
##$DPNAME2= <>
##$DPNAME3= <>
##$DPNAME4= <>
##$DPNAME5= <>
##$DPNAME6= <>
##$DPNAME7= <>
##$DPOAL= (0..7)
0.5 0.5 0.5 0.5 0.5 0.5 0.5 0.5 
##$DPOFFS= (0..7)
0 0 0 0 0 0 0 0 
##$DQDMODE= 0
##$DR= 18
##$DS= 0
##$DSLIST= <SSSSSSSSSSSSSSS>
$$ [...]
##$SUBNAM2= <"">
##$SUBNAM3= <"">
##$SUBNAM4= <"">
##$SUBNAM5= <"">
##$SUBNAM6= <"">
##$SUBNAM7= <"">
##$SUBNAM8= <"">
##$SUBNAM9= <"">
##$SW= 24.0689290302721
##$SWIBOX= (0..15)
0 0 2 0 0 0 0 0 0 0 0 0 0 0 0 0 
##$SW_h= 4816.95568400771
##$TD= 16384
##$TD0= 1
##$TE= 0
##$TE2= 300
##$TE3= 300
##$TEG= 300
##$TL= (0..7)
0 120 120 120 120 120 120 120 
##$TP= (0..7)
150 150 150 150 150 150 150 150 
##$TP07= 0
##$TPNAME0= <>
##$TPNAME1= <>
##$TPNAME2= <>
##$TPNAME3= <>
##$TPNAME4= <>
##$TPNAME5= <>
##$TPNAME6= <>
##$TPNAME7= <>
##$TPOAL= (0..7)
0.5 0.5 0.5 0.5 0.5 0.5 0.5 0.5 
##$TPOFFS= (0..7)
0 0 0 0 0 0 0 0 
##$TUNHIN= 0
##$TUNHOUT= 0
##$TUNXOUT= 0
##$USERA1= <user>
##$USERA2= <user>
##$USERA3= <user>
##$USERA4= <user>
##$USERA5= <user>
##$V9= 5
##$VALIST= <valist>
##$VCLIST= <CCCCCCCCCCCCCCC>
##$VD= 0
##$VDLIST= <DDDDDDDDDDDDDDD>
##$VPLIST= <PPPPPPPPPPPPPPP>
##$VTLIST= <TTTTTTTTTTTTTTT>
##$WBST= 1024
##$WBSW= 4
##$XGAIN= (0..3)
0 0 0 0 
##$XL= 0
##$YL= 0
##$YMAX_a= 294212
##$YMIN_a= -269667
##$ZGOPTNS= <>
##$ZL1= 120
##$ZL2= 120
##$ZL3= 120
##$ZL4= 120
##$ABSF1= 10
##$ABSF2= 0
##$ABSG= 5
##$ABSL= 3
##$ALPHA= 0
##$AQORDER= 0
##$ASSFAC= 0
##$ASSFACI= 0
##$ASSFACX= 0
##$ASSWID= 0
##$AUNMP= <proc_1d>
##$AZFE= 0.1
##$AZFW= 0.1
##$BCFW= 1
##$BC_mod= 2
##$BYTORDP= 1
##$COROFFS= 0
##$CY= 11.3945322036743
##$DATMOD= 1
##$DC= 2
##$DFILT= <>
##$DTYPP= 0
##$F1P= 15.6554695791079
##$F2P= 12.8336369535428
##$FCOR= 0.5
##$FTSIZE= 0
##$FT_mod= 4
##$GAMMA= 1
##$GB= 0.15
##$INTBC= 1
##$INTSCL= 1
##$ISEN= 128
##$LB= 0.24
##$LEV0= 0
##$LPBIN= 0
##$MAXI= 10000
##$MC2= 0
##$MEAN= 0
##$ME_mod= 0
##$MI= 1.114404
##$NCOEF= 0
##$NC_proc= 0
##$NLEV= 6
##$NOISF1= 3.799351
##$NOISF2= 2.8
##$NSP= 1
##$NTH_PI= 0
##$NZP= 0
##$OFFSET= 15.70392
##$PC= 1
##$PHC0= -25995.75
##$PHC1= 13.98749
##$PH_mod= 1
##$PKNL= yes
##$PPARMOD= 0
##$PSCAL= 0
##$PSIGN= 0
##$REVERSE= no
##$SF= 200.130013532006
##$SI= 16384
##$SIGF1= 3
##$SIGF2= 2
##$SINO= 400
##$SIOLD= 16384
##$SREGLST= <1H.CDCl3>
##$SSB= 0
##$STSI= 0
##$STSR= 0
##$SW_p= 3612.71676300578
##$SYMM= 0
##$S_DEV= 0
##$TDeff= 0
##$TDoff= 0
##$TI= <>
##$TILT= no
##$TM1= 0
##$TM2= 0
##$TOPLEV= 0
##$USERP1= <user>
##$USERP2= <user>
##$USERP3= <user>
##$USERP4= <user>
##$USERP5= <user>
##$WDW= 1
##$XDIM= 8192
##$YMAX_p= 0
##$YMIN_p= 0
$$ End of Bruker specific parameters
$$ ---------------------------------
##NTUPLES= NMR FID
##VAR_NAME=  TIME,          FID/REAL,        FID/IMAG
##SYMBOL=    X,             R,               I
##VAR_TYPE=  INDEPENDENT,   DEPENDENT,       DEPENDENT
##VAR_FORM=  AFFN,          ASDF,            ASDF
##VAR_DIM=   8192,          8192,            8192
##UNITS=     SECONDS,       ARBITRARY UNITS, ARBITRARY UNITS
##FACTOR=    0.0002076,     1,               1
##FIRST=     0,             0,               0
##LAST=      1.7004516,     0,               0
##MIN=       0,             -269667,         0
##MAX=       1.7004516,     294212,          0
$$ Real data points
##PAGE= N=1
##DATA TABLE= (X++(R..R)), XYDATA
$$ plain form
0 0 0 0 0 0 0 0 -5 0 -6 8 -8 16 -16 16 -24 32 -34 40 -48 58 -71 81 -94 109 -125 146 -166 190 -215 246 -277
31 -277 312 -351 392 -438 491 -546 607 -675 749 -829 918 -1018 1126 -1246 1380 -1530 1702
48 1702 -1893 2114 -2369 2672 -3031 3473 -4021 4730 -5682 7028 -9074 12527 -30426 251529
62 251529 5371 -254790 198054 116498 -220602 72656 252047 -136263 -133887 143259 -11688
73 -11688 -149303 103757 70025 -177889 -36970 120432 -27010 -5199 87256 -23767 -42466
84 -42466 52009 48520 36379 -12532 -47938 29053 12384 -34902 58755 2413 -120837 28087
96 28087 118397 -22158 9480 95211 -64185 -91890 128742 77665 -113422 33825 88311
107 88311 -144347 -12856 198700 -75902 -128020 165402 14669 -136622 146916 95322
$$ packed form
0@%%%%%%nNoJ4j6K4l2L2m0N6o6P4q8J06j29J52j75K03k34K71l12L56m05M61n23
31b77N89o63P43q30R29j037J153j282J424j578J747j936K144k372K626k910L232
48A702l595M007m483N041n703O504p494Q751j0412J2710j6102K1601m2953K81955
62B51529k46158k60161M52844q1556l37100K93258J79391l88310K376K77146j54947
73a1688j37615K53060l3732k47914J40919J57402j47442K1811R2455j11023j8699
84d2466R4475l489j2141m8911l5406P6991j6669m7286R3657n6342j23250J48924
96B8087R0310j40555L1638Q5731j59396k7705K20632n1077j91087J47247N4486
107H8311k32658J31491K11556k74602n2118K93422j50733j51291K83538n1594
$$ plain form
117 95322 -173746 21905 157187 -75031 -55112 109331 -52133 -133409 88854 83587 -97357
128 -97357 2468 70761 -81926 -18297 105924 -29244 -56641 49637 -3908 -10578 53822
139 53822 -15224 -41734 7120 -8368 22162 53290 -18368 -30873 15947 3728 16291 58488
151 58488 10797 -52332 -6648 31533 -14969 11772 53377 -46928 -48484 68529 -5550 -58125
163 -58125 58954 -1119 -79883 69356 65475 -69215 7721 45845 -63751 -12298 78148
174 78148 -17230 -64995 27429 13236 -58928 18292 48672 -63712 -26233 68028 -19737 -30293
186 -30293 58334 -12209 -39040 60789 24677 -35089 8483 -11550 -38352 17039 29956 -6983
198 -6983 -17881 -17269 -20606 -12759 14766 14501 -18918 -9897 6007 -5870 16023 14956 -20565 -2685
$$ packed form
117I5322k69068J95651J35282k32218J9919J64443j61464q1276K22263n267j80944
128i7357R9825O8293j52687O3629J24221j35168k7397J06278n3545o670O4400
139E3822o9046k6510M8854j5488L0530L1128p1658j2505M6820j2219J2563M2197
151E8488m7691o3129M5684L8181m6502K6741M1605j00305j556J17013p4079n2575
163e8125J17079o0073p8764J49239l881j34690P6936L8124j09596N1453R0446
174G8148r5378m7765R2424j4193p2164P7220L0380j12384L7479R4261q7765j0556
186c0293Q8627p0543k6831R9829l6112n9766M3572k0033k6802N5391J2917l6939
198f983j0898O12l337P847K7525k65l3419R021J5904j1877K1893j067l5521J7880
$$ plain form
212 -2685 1218 -10851 26501 3273 -40371 8004 4792 -28525 28282 19196 -50289 -11146 22850
225 22850 -15443 651 38417 3036 -32508 8272 25179 -30857 -16620 36089 -19912 -33665
237 -33665 39892 -5949 -58098 8890 9026 -30356 13567 19046 -25330 -19359 4956 10586 893
250 893 -3742 2933 -20840 -27858 13961 8904 -17311 843 -1057 -10984 7833 8718 -633 -10807
264 -10807 -15148 16278 19341 -2363 16659 -1828 -38133 6193 24216 -8112 10924 12123 -21488
277 -21488 -3617 17934 6465 510 1290 2910 -3933 -3205 16935 1543 -13030 20367 13782 -7685
291 -7685 16743 1986 -21843 12573 17632 2265 13044 -903 -13171 -1223 -1109 5740 3387
304 3387 -12318 4112 9502 -3176 12760 3417 -20559 -236 10799 2959 5394 -6946 -16506
$$ packed form
212b685L903j2069L7352k3228m3644M8375l212l3317N6807r086o9485L9143L3996
225B2850l8293J6094L7766l5381l5544M0780J6907n6036J4237N2709n6001j3753
237c3665P3557m5841n2149O6988J36l9382M3923N479m4376N971K4315N630r693
250H93m635O675k3773p018M1819n057k6215J8154j900r927J8817Q85r351j0174
264a0807m341L1426L063k1704J9022j8487l6305M4326J8023l2328J9036J199l3611
277b1488J7871K1551j1469n955P80J620o843P28K0140j5392j4573L3397o585k1467
291g685K4428j4757k3829L4416N059j5367J0779j3947j2268J1948J14O849k353
304C387j5705J6430N390j2678J5936r343k3976K0323J1035p840K435j2340r560
$$ plain form
317 -16506 -12181 -6537 15553 6336 -24465 -8621 -8843 -24276 16246 22418 -17625 -3671 6825
330 6825 -15340 -1923 9527 -6880 -10816 -1497 9412 666 -12264 1017 -7324 -19871 13289
343 13289 13040 -15871 1788 4456 -11217 10087 12417 -3518 1602 -1954 1340 9950 -3907 -422
357 -422 6623 -5409 8580 13758 -10932 -9936 -2920 -3443 14091 16924 5832 630 -11343 -457
371 -457 15657 3710 9429 9509 -15159 593 15351 -6220 1037 4871 -15576 -1757 9897 -3233
385 -3233 -736 -303 -2460 6140 6330 9170 2668 -13219 633 5506 -7157 10462 8455 -16822
399 -16822 -2017 1659 -17266 -3967 1474 -6004 4961 5086 363 -942 -10006 1853 11036 -2025
413 -2025 5715 3053 -19164 -5209 6997 -4205 811 -1409 -12210 -6986 -4071 4122 9432 -3903
$$ packed form
317a6506M325N644K2090r217l0801J5844k22j5433M0522O172m0043J3954J0496
330F825k2165J3417J1450j6407l936R319J0909q746j2930J3281q341j2547L3160
343A3289k49k8911J7659K668j5673K1304K330j5935N120l556L294Q610j3857L485
357d22P045j2032J3989N178k4690R96P016n23J7534K833j1092n202j1973J0886
371d57J6114j1947N719Q0k4668J5752J4758k1571P257L834k0447J3819J1654j3130
385c233K497M33k157Q600J90K840o502j5887J3852M873j2663J7619k007k5277
399a6822J4805L676j8925J3299N441p478J0965J25m723j305r064J1859R183j3061
413b025P740k662k2217J3955J2206j1202N016k220j0801N224K915Q193N310j3335
$$ plain form
427 -3903 5290 13091 -4502 6268 13438 -11701 -3392 11209 -1383 3751 8147 -5317 -5769 -3413
441 -3413 1701 9797 2760 7781 11685 -4098 4530 14125 -1321 6146 11445 -5109 -1030 481
455 481 -6296 5852 5867 3161 10294 -2891 -5507 8056 -665 3660 15758 -281 -1678 5661 -5589
470 -5589 -2942 1781 -4656 523 1569 2052 7732 -1442 -388 5441 -7712 258 9466 -11070 -6617
485 -6617 1316 -18856 -9120 5489 -9431 -5862 1214 -11503 -9326 -489 2425 4672 232 819
499 819 -4995 -18564 -7765 -1809 -14173 -1956 80 -16690 -3820 1693 -8393 4916 4173 -4203
513 -4203 7736 3418 -2791 7534 -2105 -8694 2638 -3183 -7744 -1707 -4862 -6531 -3441 4688
527 4688 11387 2297 5859 13148 -7140 -2767 17209 -3295 -2513 18488 -5219 -13579 5829 -7296
$$ packed form
427c903R193P801j7593J0770P170k5139Q309J4601j2592N134M396j3464m52K356
441c413N114Q096p037N021L904j5783Q628R595j5446P467N299j6554M079J511
455D81o777J2148J5k706P133j3185k616J3563q721M325J2098j6039j397P339j1250
470e589K647M723o437N179J046M83N680r174J054N829j3153P970R208k0536M453
485f617P933k0172R736J4609j4920L569P076j2717K177Q837K914K247m440N87
499H19n814j3569J0799N956j2364J2217K036j6770J2870N513j0086J3309p43q376
513d203J1939m318o209J0325r639o589J1332n821m561O037l155j669L090Q129
527D688O699r090L562P289k0288M373J9976k0504P82K1001k3707q360J9408j3125
$$ plain form
541 -7296 -10816 9816 6474 -847 4278 4725 3105 4550 12325 10880 -3379 1555 3547 -10272 1983
556 1983 6806 -13441 -2945 2272 -16263 -1394 4641 -15365 -2368 7175 -6276 4033 8416
569 8416 -9383 -10427 -4480 -5675 -4576 206 1044 -10704 -12418 1790 -6026 -8318 11011 -2788
583 -2788 -12717 9197 -1852 -12151 11379 2565 -9917 9504 1244 -12718 3587 5125 -1206
596 -1206 9670 11838 1379 -2503 4366 4440 -4100 6170 9252 -9559 2182 14605 -8056 -443
610 -443 14292 -8868 1170 23946 3495 2314 15385 -2423 -1884 16645 9460 344 2318 -1055
624 -1055 -5608 1343 14959 7641 -3616 7645 890 -10290 11138 8457 -11482 7436 7514 -11888
638 -11888 4131 3062 -16729 -2464 3566 -6803 1463 1394 -9862 -5780 -442 -1591 -4004 -3307
$$ packed form
541g296l520K0632l342p321N125M47j620J445P775j445j4259M934J992j3819J2255
556A983M823k0247J0496N217j8535J4869O035k0006J2997R543j3451J0309M383
569H416j7799j044N947j195J099M782Q38j1748j714J4208p816k292J9329j3799
583b788r929K1914j1049j0299K3530q814j2482J9421q260j3962J6305J538o331
596a206J0876K168j0459l882O869P4q540J0270L082j8811J1741J2423k2661P613
610d43J4735k3160J0038K2776k0451j181J3071j7808N39J8529p185r116J974l373
624a055m553O951J3616p318j1257J1261o755j1180K1428k681j9939J8918P8j9402
638a1888J6019j069j9791J4265O030j0369Q266o9j1256M082N338j149k413O97
$$ plain form
652 -3307 -3091 -9951 -3171 6217 -8801 -6020 8347 -8235 -4483 13585 -11611 -17258 8260 -2796
666 -2796 -5133 16751 418 -16847 -1363 4116 574 8506 12069 -650 -9443 4804 8805 -6173
680 -6173 1076 3019 -16306 -3256 11512 -6601 -2199 7192 -5549 5872 16608 2773 3640
693 3640 4137 -2922 7905 11472 784 -124 -3638 -7799 -3238 -131 907 -4151 -1527 10736 2782
708 2782 -1971 9116 -5625 -10656 15823 6715 -10196 3216 -6879 -18403 4367 8161 -6492
721 -6492 -6649 -7338 -9366 -3416 5278 6408 -7221 -9128 1585 -3986 -3025 5301 -9661 -10751 6278
736 6278 1848 3075 6910 -10234 -9355 3834 -43 5534 7229 -7410 -5600 1611 46 2981 722
751 722 -3630 -648 -719 3968 3868 -5663 528 5480 178 7571 2412 -12490 -1602 4187 906 12446
$$ packed form
652c307K16o860O780R388j5018K781J4367j6582L752J8068k5196n647K5518j1056
666b796k337K1884j6333j7265J5484N479l542P932L563j2719q793J4247M001j4978
680f173P249J943j9325J3050J4768j8113M402R391j2741J1421J0736j3835Q67
693C640M97p059J0827L567j0688r08l514m161M561L107J038n058K624J2263p954
708B782m753J1087j4741n031K6479r108j6911J3412j0095j1524K2770L794j4653
721f492j57o89k028N950Q694J130j3629j907J0713n571R61Q326j4962j090J7029
736F278m430J227L835j7144Q79J3189l877N577J695j4639J810P211j565K935k259
751G22m352K982p1M687j00r531O191M952n302P393n159j4902J0888N789l281J1540
$$ plain form
767 12446 4878 -11071 -2233 1628 24 8438 3148 -4613 -1043 2932 8520 5069 -3969 -1046 -3100
782 -3100 -1958 12354 4381 -9303 -2351 -4063 -2563 10581 3345 -5479 -3639 -7144 1391 10122
796 10122 1290 864 82 -7239 -439 1416 -6630 -3697 -3784 -2151 5193 -1142 -4515 -1686 -6085 2760
812 2760 11980 1860 426 1234 -5079 4049 7172 -1942 -1297 -5638 -8019 3926 1801 -3519 65
827 65 -4095 -808 9209 3562 -54 -2453 -7827 2904 9853 3818 4018 -3976 -11860 -1171 2122
842 2122 1258 4214 -4392 -5173 2749 -1315 2036 4692 -5649 -1166 5924 -565 2340 2167 -4456 2271
858 2271 4262 1591 3209 -5106 -7327 1175 -1005 764 4434 -4527 -3377 1088 -2201 2010 272
873 272 -4848 4732 4635 153 6555 -2245 -10047 719 1651 177 4661 -3421 -7081 -2412 -1085 6223
$$ packed form
767A2446p568j5949Q838L861j604Q414n290p761L570L975N588l451r038K923k054
782c100J142J4312p973j3684O952j712J500J3144p236q824J840l505Q535Q731
796A0122q832m26p82p321O800J855q046K933q7J633P344o335l373K829m399Q845
812B760R220j0120j434Q08o313R128L123r114O45m341k381J1945k125n320L584
827F5m160L287J0017n647l616k399n374J0731O949o035K00p994p884J0689L293
842B122q64K956q606p81P922m064L351K656j0341M483P090o489K905j73o623O727
858B271J991k671J618q315k221Q502k180J769L670q961J150M465l289M211j738
873B72n120R580r7m482O402q800p802J0766R32j474M484q082l660M669J327P308
$$ plain form
889 6223 6215 -2975 -407 -1541 -2982 7248 5130 -613 2637 -2546 -2176 4020 -4080 -3866 1194 -4792
905 -4792 1410 7769 -2220 -2406 188 -3864 1866 4133 1102 2790 -2663 -2481 3600 -2251 -1533 3256
921 3256 -4083 -1843 2937 -3768 -1021 931 -2524 5338 3699 -3974 197 -3778 -6018 6385 5585
936 5585 -2 1860 -4247 -5161 892 734 3149 948 -5367 1347 1512 -2478 4154 -1355 -7462 1856
952 1856 1291 -295 4657 -2319 -4481 2773 687 3974 5804 -4341 -3830 -368 -2188 4689 4155 -2494
968 -2494 -258 -3494 -3734 2857 -1510 -714 5466 143 2409 5660 -3251 -1472 2828 -639 4401 3128
984 3128 -5441 -2019 -1919 -2586 4929 914 -4226 -180 -2077 1083 6903 1470 1289 2507 -1092 4813
1000 4813 3756 -4465 -2115 -3739 -4278 6264 3211 -3838 -1759 -6537 -4534 6565 3897 2434 2796
$$ packed form
889F223qr190K568j134j441J0230k118n743L250n183L70O196q100K14N060n986
905d792O202O359r989j86K594m052N730K267l031J688n453J82O081n851P18M789
921C256p339K240M780o705K747J952l455P862j639p673M171l975k240J2403q00
936E585n587J862o107r14O053j58K415k201o315O714J65l990O632n509o107R318
952A856n65j586M952o976k162P254k086L287J830j0145N11L462j820O877n34o649
968b494K236l236k40O591m367P96O180n323K266L251q911J779M300l467N040j273
984C128q569L422J00o67P515m015n140M046j897L160N820n433j81J218l599N905
1000D813j057q221K350j624n39J0542l053p049K079m778K003J1099k668j463L62
$$ plain form
1015 2796 -3104 487 4603 600 2477 -848 -5599 868 -835 -4061 805 -3549 -3444 4870 422
1030 422 -1255 1035 -4414 697 6396 2008 3399 798 -5646 132 300 -3600 372 -3085 -4307
1045 -4307 3565 1207 -820 515 -4947 -924 5728 2780 4186 946 -6732 189 3391 1400 5145
1060 5145 -1680 -7873 -1088 -440 1405 6590 -64 -1916 2500 -903 1834 2612 -3257 496 2217
1075 2217 -45 4493 -347 -5845 159 -1302 -1005 5498 -733 -3054 1616 -1692 415 2604 -3318
1090 -3318 -1634 -544 -3652 1287 -1399 -5575 1109 977 -218 4717 -2162 -6548 -724 -1104 2546
1105 2546 5485 -2094 -3913 -4165 -6413 724 1368 -4063 -337 -2358 -3488 4178 1102 -2110 1612
1120 1612 -1827 -262 3995 -1737 -1823 -1108 -5157 565 2119 -3665 -511 -2714 -5113 2669 3005 1016
$$ packed form
1015B796n900L591M116m003J877l325m751O467j703l226M866m354J05Q314m448
1030D22j677K290n449N111N699m388J391k601o444N778J68l900L972l457j222
1045d307P872k358k027J335n462M023O652k948J406l240p678O921L202j991L745
1060E145o825o193O785O48J845N185o654j852M416l403K737P78n869L753J721
1075B217k262M538m840n498O004j461K97O503o231k321M670l308K107K189n922
1090c318J684J090l108M939k686m176O684j32j195M935o879m386N824l80L650
1105B546K939p579j819k52k248P137O44n431L726k021j130P666l076l212L722
1120A612l439J565M257n732q6P15m049N722J554n784L154k203k399P782L36j989
$$ plain form
1136 1016 5410 1722 579 3414 -1279 -359 1889 -1155 3196 2938 -3845 -910 -1860 -4446 4465 4024
1152 4024 -1039 2839 -31 -1294 5628 3961 2214 2234 -2495 -832 584 -2008 1247 -785 -4507
1167 -4507 2259 755 -3099 2290 -1958 -3791 4531 2864 2558 5048 -1268 -2282 809 -2742 666
1182 666 1886 -3282 -600 -1314 -4367 168 -627 -1063 2815 -500 -161 2129 -2550 1563 5340 -1137
1198 -1137 1613 1419 -7184 -1887 1406 -3392 1333 2346 -2512 714 1595 422 2155 104 1421
1213 1421 3170 121 3700 2249 -4033 843 883 -2991 4722 2859 -2943 2975 908 -1393 6101
1228 6101 3061 -716 2425 -1942 -3399 1126 206 1161 2191 -611 452 -1403 -1323 3683 996 1266
1244 1266 6554 -1154 -1784 3688 -3373 -3309 2620 -3740 -3231 1951 -2452 -1197 2360 -1123 1073 2595
$$ packed form
1136A016M394l688j143K835m693R20K248l044M351k58o783K935r50k586Q911m41
1152D024n063L878k870j263O922j667j747K0m729J663J416k592L255k032l722
1167d507O766j504l854N389m248j833Q322j667l06K490o316j014L091l551L408
1182F66J220n168K682p14l053M535p95m36L878l315L39K290m679M113L777o477
1198a137K750j94q603N297L293m798M725J013m858L226Q81j173J733k051J317
1213A421J749l049L579j451o282M876M0l874P713j863n802N918k067k301P494
1228F101l040l777L141m367j457M525r20R55J030k802J063j855Q0N006k687K70
1244A266N288p708o30N472p061O4N929o360N09N182m403J255L557l483K196J522
$$ plain form
1260 2595 601 2115 -463 -990 -428 -2875 344 1461 -4881 -2273 -2118 -8402 -460 3132 -2567 3874
1276 3874 3989 -4747 86 2486 -2567 1609 1997 -1765 -1937 -2540 -1655 -1564 -2834 1238 -883 -4082 2700
1293 2700 1077 -2501 5078 2457 -1926 4372 916 -3173 2038 -2261 -3481 2257 -702 -854 2417
1308 2417 -2310 -2665 -408 -1095 2028 3056 2872 2588 -2341 -420 2692 -3032 1139 5004 -4797 -2246
1324 -2246 4193 -4371 -668 6719 -1490 -1801 2918 -1307 -1862 1366 1821 930 -870 1756 948 -4458
1340 -4458 683 2474 -4342 1330 4553 -2808 1150 2461 -4727 -1228 80 -3009 1616 696 -3064
1355 -3064 396 -2084 -2354 3527 1532 244 1323 -1752 -1386 -414 869 3051 -1987 -3352 862 -5983
1371 -5983 -4636 5003 -1861 -3285 6516 -46 -3529 4760 914 -3750 1975 1855 -982 -1016 -92 -244
$$ packed form
1260B595j994J514k578n27N62k447L219J117o342K608J55o284P942L592n699O441
1276C874J15q736M833K400n053M176L88l762j72o03Q85R1j270M072k121l199O782
1293B700j623l578P579k621m383O298l456m089N211m299j220N738k959j52L271
1308B417m727l55K257o87L123J028j84k84m929J921L112n724M171L865r801K551
1324b246O439q564L703P387q209l11M719m225n55L228M55q91j800K626q08n406
1340d458N141J791o816N672L223p361L958J311p188L499J308l089M625r20l760
1355c064L460k480k70N881j995j288J079l075L66R72J283K182n038j365M214o845
1371e983J347R639o864j424R801o562l483Q289l846m664N725j20k837l4R24j52
$$ plain form
1387 -244 -4386 -1204 2862 -2821 -838 5022 -1862 -1269 5186 -818 357 4817 -1160 -589 441 -4171
1403 -4171 -239 2304 -532 2958 1426 -3318 -1104 232 463 2442 1461 1632 -394 -2874 2982 582
1419 582 -3519 3109 586 -5296 3999 3445 -4324 1739 2158 -3237 1095 2092 -2488 -2405 -1534 -212 -481
1436 -481 -347 2725 -898 -4025 1519 -631 -2593 4322 1107 -1596 2585 -2646 -4103 709 -3195
1451 -3195 -1581 3005 -2705 -2585 763 -2346 -287 3314 904 -34 -750 398 1268 -929 2370 2761
1467 2761 -4564 -582 3296 -4883 -1066 3670 -4077 -284 5766 679 1043 2729 -1095 380 2500
1482 2500 3551 3855 165 546 788 -2769 1074 2939 -2070 1252 1598 -2549 2137 2929 -138 5188
1498 5188 3307 -507 3556 124 -2324 3749 1184 -630 2005 -1041 -2688 -1038 -558 749 -295
$$ packed form
1387b44m142L182M066n683J983N860o884N93O455o004J175M460n977N71J030m612
1403d171L932K543k836L490j532m744K214J336K31J979r81J71k026k480N856k400
1419E82m101O628k523n882R295n54p769O063M19n395M332R97m580Q3Q71J322k69
1436d81J34L072l623l127N544k150j962O915l215k703M181n231j457M812l904
1451c195J614M586n710J20L348l109K059L601k410r38p16J148Q70k197L299L91
1467B761p325L982L878q179L817M736p747L793O050n087L64J686l824J475K120
1482B500J051L04l690L81K42l557L843J865n009L322L46m147M686P92l067N326
1498E188j881l814M063l432k448O073k565j814K635l046j647J650M80J307j044
$$ plain form
1513 -295 149 3198 -459 -46 5031 -1813 -2944 3817 -1246 -2024 4100 -1856 -4729 369 -1271 -1077
1529 -1077 1625 -531 -1327 -2449 -1570 2549 731 725 2595 -2861 -3211 1073 -2501 -593 2200 -2445
1545 -2445 77 1249 -3049 -3 964 -2871 1713 1789 -1912 1170 443 -2081 673 252 -293 225 -1274
1562 -1274 903 358 -1346 3014 1439 -2140 3864 1415 -3688 1442 -284 -3771 2890 2361 -1569
1577 -1569 342 -2216 -2853 679 827 2840 1684 -1455 989 -526 -1803 2469 -567 -3470 -31
1592 -31 -2916 -3061 1416 -2517 -2364 807 -2612 -365 2091 -2955 -1031 1009 -1874 1195 1376 -2488
1608 -2488 -2192 -3617 -3602 -1738 -3077 -1270 292 -3427 -252 611 -3777 310 2301 -1917 2296 2473
1624 2473 -3477 -976 74 -1895 1201 24 -3030 -2094 -3105 -485 2385 563 1912 1181 -1791
$$ packed form
1513b95M44L049l657M13N077o844j131O761n063p78O124n956k873N098j640J94
1529a077K702k156p96j122Q79M119j818oJ870n456l50M284l574J908K793m645
1545b445K522J172m298L046R67l835M584P6l701L082p27k524K754m21n45N18j499
1562a274K177n45j704M360j575l579O004k449n103N130j726l487O661n29l930
1577a569J911k558o37L532J48K013j156l139K444j515j277M272l036k903L439
1592c1k885j45M477l933J53L171l419K247K456n046J924K040k883L069J81l864
1608b488K96j425J5J864j339J807J562l719L175Q63m388M087J991m218M213J77
1624B473n950K501J050j969L096j177l054R36j011K620K870j822J349p31k972
$$ plain form
1639 -1791 2652 2471 -541 2807 990 -1261 3347 1349 -1455 661 -2515 -2016 2283 730 1721 2594
1655 2594 -1298 576 3055 1191 3130 2367 -768 1259 -54 -20 2254 -803 -186 2176 -1818 -799
1671 -799 1435 -2436 1342 4540 217 2140 1648 -2790 108 1609 -334 1375 -510 -1646 392
1686 392 -396 425 928 -2727 -127 1780 -717 2371 1392 -3432 223 1047 -628 2480 -174 -3684
1702 -3684 -607 -643 495 4151 746 -449 585 -1553 547 2423 -204 1309 581 -1067 970 -802
1718 -802 -1888 1195 -767 894 4086 -24 246 3135 -258 1680 3800 -1177 -851 350 -2437 198
1734 198 603 -1292 -319 -314 126 2118 -450 161 1559 -221 3113 4741 -569 -509 -891 -4240 165 1625
1752 1625 -1751 -395 -1583 -3118 1077 1077 678 1927 -380 -433 1685 -441 262 457 -2670 -370 -824
$$ packed form
1639a791M443j81l012L348j817k251M608j998k804K116l176M99M299j553R91Q73
1655B594l892J874K479j864J939p63l135K027j313L4K274l057O17K362l994J019
1671g99K234l871L778L198m323J923m92m438K898J501j943J709j885j136K038
1686C92p88Q21N03l655K600J907k497L088r79m824L655Q24j675L108k654l510
1702c684L077l6J138L656l405j195J034k138K100J876k627J513p28j648K037j772
1718h02j086L083j962J661L192m110K70K889l393J938K120m977L26J201k787K635
1734A98M05j895R73NM40J992k568O11J398j780L334J628n310O0l82l349M405J460
1752A625l376J356j188j535M195%l99J249k307n3K118k126P03J95l127K300m54
$$ plain form
1769 -824 -3116 -945 -3027 -3585 1207 -338 -983 2026 -1302 -2055 1498 -1049 -839 1122 -1104 -702
1785 -702 465 -2009 -1286 -1771 -2264 898 281 -360 996 -2512 -1654 1987 -281 699 1846 -3400 -1993
1802 -1993 1113 -985 1583 2397 -1590 -215 520 -957 839 230 -687 698 -551 785 1349 -2282
1818 -2282 -531 388 -1546 1968 3178 -884 1391 1692 -871 2059 1608 -657 1063 -529 -1223 414
1834 414 -1277 -179 1506 -792 941 956 -2013 550 1061 82 3168 846 -1598 75 -2463 -1914
1850 -1914 1759 -1089 -1929 1019 -2376 -938 1857 -481 -548 393 -735 816 346 -242 546 -2214 -1176
1867 -1176 2002 -1483 -703 1123 -3754 -2043 2313 -385 498 2275 -1735 -1425 -68 -1129 606 286
1883 286 27 1109 -1076 -532 982 -1541 66 2348 -646 581 1013 -2313 947 1566 -693 1601
$$ packed form
1769h24k292K171k082n58M792j545o45L009l328p53L553k547K10J961k226M02
1785g02J167k474P23m85m93L162o17o41J356l508Q58L641k268R80J147n246J407
1802a993L106k098K568Q14l987J375P35j477J796o09r17J385j249J336N64l631
1818b282J751R19j934L514J210m062K275L01k563K930m51k265J720j592o94J637
1834D14j691J098J685k298J733J5k969K563N11r79L086k322k444J673k538N49
1850a914L673k848q40K948l395J438K795k338o7R41j128J551m70n88P88k760J038
1867a176L178l485P80J826m877J711M356k698Q83J777m010L10J357j061J735l20
1883B86k59J082k185N44J514k523J607K282k994J227M32l326L260O19k259K294
$$ plain form
1899 1601 61 -2153 1516 1256 -36 2730 1480 257 2003 1100 645 309 -953 482 308 139
1915 139 2408 -737 -3051 509 -1112 -1281 3838 1064 -1542 1860 -150 -920 2238 220 -1240 -752
1931 -752 -1741 -1110 -1257 -1361 23 -1388 -1173 1014 -1871 -1285 1572 -1148 380 3123 -1113 -359 1366
1948 1366 -2832 -1310 910 -2260 -1097 649 -1123 -468 -232 -875 -460 -492 1136 1815 -766 934 435
1965 435 -2242 2086 2270 -1579 1119 221 -3354 1239 2379 -307 2336 1152 -1348 849 1293 922
1981 922 1477 1344 1400 1174 1005 2091 46 -839 2040 -226 -355 3111 -502 -1758 2908 -364 -1167
1998 -1167 3016 133 -1368 1677 338 -744 833 686 904 137 -183 -381 -2439 -1110 1347 -715
2014 -715 250 1950 -2675 -1503 1031 -1790 700 2479 -1904 -526 1223 -1795 92 1078 -2010 -1107
$$ packed form
1899A601j540k214L669k60j292K766j250j223J746r03m55l36j262J435j74j69
1915A39K269l145k314L560j621j69N119k774k606L402k010p70L158k018j460M88
1931g52r89O31j47j04J384j411K15K187k885N86K857k720J528K743m236P54J725
1948A366m198J522K220l170J163J746j772O55K36o43M15l2J628O79k581J700m99
1965D35k677M328J84l849K698q98l575M593J140k686K643j184k500K197M44l71
1981I22N55j33N6k26j69J086k045q85K879k266j29L466l613j256M666l272q03
1998a167M183k883j501L045j339j082J577j47K18p67l20j98k058J329K457k062
2014g15R65J700m625J172K534k821K490J779m383J378J749l018J887R86l088R03
$$ plain form
2030 -1107 35 -786 -508 -462 -158 -770 -1168 1324 303 -2263 1233 -446 -3197 2336 1607 -1883 1895
2047 1895 833 -3136 678 1362 -836 1388 1694 -444 -427 -461 43 -484 -348 1908 -677 -1323 1749
2064 1749 -499 -436 3276 222 -661 1884 -1210 -1162 2326 -921 -1198 1315 -1637 -1253 627 -1508 -1683
2081 -1683 -63 98 467 529 1423 624 -1941 265 1043 -1982 957 1516 -4150 -944 419 -3872 -431
2098 -431 1517 -2242 -957 556 -1573 -260 1348 844 624 -459 -447 -1249 -2208 335 -674 -2101 504
2115 504 -1074 -2899 473 -479 -2011 1713 524 -1032 2641 922 -983 1117 -174 -1049 646 136
2131 136 -639 -562 -740 -244 -561 655 1961 -408 -304 1709 -1291 222 3274 -40 360 2583 -1521
2148 -1521 -1232 1509 -644 345 1986 -286 22 768 195 711 590 761 853 -383 1011 1367 -1082 1246
$$ packed form
2030a107J142q21K78M6L04o12l98K492j021k566L496j679k751N533p29l490L778
2047A895j062l969L814O84k198K224L06k138J7l4N04n27J36K256k585o46L072
2064A749k248O3L712l054q83K545l094M8L488l247k77K513k952L84J880k135j75
2081a683J620J61L69O2Q94p99k565K206P78l025K939N59n666L206J363m291L441
2098d31J948l759J285J513k129J313J608n04k20j083J2q02r59K543j009j427K605
2115E04j578j825L372r52j532L724j189j556L673j719j905K100j291q75J695n10
2131A36p75P7j78M96l17J216J306k369J04K013l000J513L052l314M00K223m104
2148a521K89K741k153R89J641k272L08P46n73N16j21J71R2j236J394L56k449K328
$$ plain form
2166 1246 834 -1416 1297 1528 -1516 1068 900 -1338 1778 1778 -335 767 -42 -1782 -356 39 196
2183 196 991 -198 300 -766 -1620 964 118 -491 1856 391 -1436 1364 -705 -1575 1055 -646 -1387
2200 -1387 538 -1291 -867 908 -420 411 1095 -299 717 250 -254 804 -642 -517 1148 -489
2216 -489 -339 197 -2627 -872 821 -261 1458 2386 -854 535 1440 -271 1853 1885 45 342 -429
2233 -429 -600 547 -202 1 458 -1199 74 455 -1287 1164 1780 45 2097 1225 -846 785 -296
2250 -296 -1085 947 -548 -957 204 -1192 -1090 40 -1439 -294 302 -661 866 466 -1364 83 -460
2267 -460 -493 1493 -564 -1469 -660 -2030 -909 1156 -738 -535 -718 -2628 -717 479 -1137 303 36
2284 36 -1567 555 -134 -1154 -7 -1139 -725 851 -498 -65 528 -1509 52 626 -718 874 630
$$ packed form
2166A246m12k250K713K31l044K584j68k238L116%k113J102q09j740J426L95J57
2183A96P95j189M98j066q54K584q46o09K347j465j827K800k069q70K630j701p41
2200a387J925j829M24J775j328Q31O84j394J016m67n04J058j446J25J665j637
2216d89J50N36k824J755J693j082J719R28l240J389R05j711K124L2j840K97p71
2233d29j71J147p49K03M57j657J273L81j742K451O16j735K052q72k071J631j081
2250b96p89K032j495m09J161j396J02J130j479J145N96r63J527m00j830J447n43
2267d60l3J986k057r05Q09j370J121K065j894K03j83j910J911J196j616J440k67
2284C6j603K122o89j020J147j132M14J576j349M33N93k037J561N74j344J592k44
$$ plain form
2301 630 -1124 767 734 -159 1746 350 23 1557 -178 -227 993 -822 874 1895 122 364 -280
2318 -280 -1494 436 916 532 1848 -97 -718 1103 -370 464 1479 -1069 -509 989 -589 617
2334 617 624 -1751 -209 125 -950 654 -374 -1578 24 -275 228 1397 -172 -503 -215 -1402 253
2351 253 1170 -970 551 177 -1504 238 -515 -1807 434 -361 -658 612 -976 -1242 204 -324 631
2368 631 1276 -836 47 219 -571 1087 1162 -467 478 -923 -753 918 -516 -433 1000 -238 833 2032
2386 2032 -235 303 575 -583 1388 2062 287 589 -230 -1592 302 57 -332 363 -1450 -1123 531
2403 531 -303 1056 1169 -422 1022 717 -1105 527 -238 -1048 1086 81 -981 242 -1342 -1495 412
2420 412 -211 44 933 -437 -40 833 -42 511 0 -1068 700 -55 -460 654 -1692 -1243 558 -437
$$ packed form
2301F30j754J891l3q93J905j396l27J534j735m9J220j815J696J021j773K42o44
2318b80j214J930M80l84J316j945o21J821j473Q34J015k548N60J498j578J206
2334F17Pk375J542L34j075J604j028j204J602k99N03J169j569l31K88j187J655
2351B53R17k140J521l74j681J742p53j292K241p95k97J270j588k66J446n28R55
2368F31O45k112Q83J72p90J658P5j629R45j401J70J671j434Q3J433j238J071J199
2386B032k267N38K72j158J971O74j775L02q19j362J894k45l89O95j813L27J654
2403E31q34J359J13j591J444l05j822J632p65q10K134j005j062J223j584j53J907
2420D12o23K55Q89j370L97Q73q75N53n11j068J768p55m05J114k346M49J801r95
$$ plain form
2438 -437 108 1072 -1770 -1135 665 -425 1163 1536 -1122 -711 -183 -819 1187 507 -99 743 -193 258
2456 258 896 -862 -33 245 -816 905 670 -1346 123 300 -984 1647 640 -903 709 32 -453
2473 -453 924 83 -433 -14 -669 -260 -438 -1321 -420 -577 -444 2015 -38 -899 674 -970 -302 2542
2491 2542 731 -323 781 -1584 -866 1234 -375 -155 204 -1066 -19 991 321 725 140 236 1188
2508 1188 84 355 406 -1794 -83 1333 -1065 538 539 -2311 -499 917 -850 1042 931 -980 134
2525 134 463 -628 95 -523 -2 455 84 902 -201 -1233 800 668 -181 1402 -829 -2160 416
2542 416 51 -644 1538 -655 -2281 383 -462 -410 1088 50 -410 431 468 588 -199 -1396 -342 -1410
2560 -1410 -122 1442 -1040 -1022 352 -1461 -62 2463 -144 197 1433 -474 792 2011 114 157
$$ packed form
2438d37N45R64k842O35J800j090J588L73k658M11N28o36K006o80o06Q42r36M51
2456B58O38j758Q29K78j061J721k35k016J469J77j284K631j007j543J612o77m85
2473d53J377q41n16M19o55M09j78q83R01j57J33K459k053q61J573j644O68K844
2491B542j811j054J104k365P18K100j609K20L59j270J047J010o70M04n85R6R52
2508A188j104K71N1k200J711J416k398J603Jk850J812J416j767J892j11j911J114
2525A34L29j091P23o18N21M57l71Q18j103j032K033j32q49J583k231j331K576
2542D16l65o95K182k193j626K664q45N2J498j038m60Q41L7J20p87j197J054j068
2560a410J288J564k482J8J374j813J399K525k607L41J236j907J266J219j897M3
$$ plain form
2576 157 429 -439 -140 -647 -912 -243 -416 980 1292 -523 451 557 -691 1731 1978 -782 664 276
2594 276 -1690 694 398 -1955 -363 -373 -1352 759 284 -664 -155 39 1105 931 349 761 -1120 -1346
2612 -1346 1324 293 -779 1000 -1501 -2144 723 -548 -760 1358 -394 -664 1351 -177 -452 -43
2628 -43 -481 76 2 -14 -7 -1106 -504 704 -651 337 990 -1627 -16 1593 -641 622 1371 -1299 -211
2647 -211 1068 -899 -120 426 -504 445 1329 821 615 -491 -368 271 -132 1590 689 -1487 -17 -467
2665 -467 -1286 1274 470 -1522 855 72 -661 1386 498 -410 835 67 -272 134 -682 -618 -454 -364 717
2684 717 -353 -878 531 -886 -328 1475 -195 -205 1914 -99 -458 1240 -784 -1041 687 -771 -316
2701 -316 128 -1250 -819 -454 -194 932 241 249 222 -751 599 1708 281 813 744 -1792 -215 427 -1600
$$ packed form
2576A57K72q68K99n07k65O69j73J396L12j815R74J06j248K422K47k760J446l88
2594B76j966K384k96k353J592j0r79K111m75r48N09J94J066j74n82M12j881k26
2612a346K670j031j072J779k501o43K867j271k12K118j752k70K015j528k75M09
2628d3m38N57p4j6Pj099O02J208j355R88O53k617J611J609k234J263P49k670J088
2647b11J279j967P79N46r30R49Q84n08k06j106J23O39m03J722r01k176J470m50
2665d67q19K560q04j992K377p83p33K047q88r08J245p68l39M06q16O4J64R0J081
2684G17j070n25J409j417N58J803j670j0K119k013l59J698k024k57J728j458M55
2701c16M44j378M31L65K60J126o91Qk7r73J350J109j427N32o9k536J577O42k027
$$ plain form
2720 -1600 256 148 -1237 512 868 -889 410 234 26 1038 572 872 490 -643 237 -73 -1303
2737 -1303 427 -113 -1420 147 -73 -1048 1074 373 -88 1362 151 -341 586 -384 -99 1193 118
2754 118 123 -50 -1403 -170 -114 -277 867 -305 -695 918 -329 233 1273 -637 -208 975 -584 305
2772 305 1038 -679 -6 813 -50 698 355 -365 140 -467 172 1280 -302 -131 176 -1481 -217 710
2790 710 -217 493 839 -600 349 451 -613 625 18 -233 921 -308 -521 82 -708 -187 454 -962
2808 -962 -186 -83 -737 390 227 -488 1205 -189 -835 736 -530 -917 571 -533 -275 935 -272
2825 -272 -302 -140 -879 167 507 295 1034 -121 -993 588 46 -147 1191 -337 -898 514 -673 -316
2843 -316 728 -590 356 285 -557 673 -165 -288 1379 636 187 1434 -262 -555 522 -455 -98 384
$$ packed form
2720a600J856j08j385J749L56j757J299j76k08J012m66L00l82j133Q80l10j230
2737a303J730n40j307J567k20r75K122p01m61J450j211m92R27r70K85J292j075
2754A18Nj73j353J233N6j63J144j172l90J613j247N62J040j910M29J183j559Q89
2772C05P33j717O73Q19q63P48l43p20N05o07O39J108j582J71L07j657J264R27
2790G10r27P10L46j439R49J02j064J238o07k51J154j229k13O03p90N21O41j416
2808i62P76J03o54J127j63p15J693j394o46J571j266l87J488j104K58J210j207
2825b72l0J62p39J046L40k12P39j155q72J581n42j93J338j528n61J412j187L57
2843c16J044j318R46p1q42J230q38j23J667p43m49J247j696k93J077r77L57M82
$$ plain form
2861 384 -757 119 545 -828 109 -136 -853 740 829 -204 856 -94 -640 578 -8 219 419 -1254
2879 -1254 -843 -476 -1260 615 204 -1029 183 -475 -1256 777 324 -379 778 142 -138 528 -375 -200
2897 -200 187 -896 120 179 -779 439 105 -757 463 259 -533 978 143 -699 931 -123 -12 1065
2915 1065 -324 249 555 -983 25 566 -142 998 599 -752 221 -431 -450 844 -11 39 586 -861
2933 -861 38 1145 -612 498 887 -638 313 649 -857 326 231 -880 89 -144 -321 88 -685 -250
2951 -250 639 -642 834 755 -723 329 -79 -1281 363 251 -774 247 -433 -1328 173 -401 -179
2968 -179 778 111 41 664 -314 646 822 -470 113 -204 -974 296 -550 -513 592 -362 -32 757 -546
2987 -546 -167 589 -758 66 909 -407 0 329 -963 -361 -18 -425 355 135 43 265 -328 -215 247
$$ packed form
2861C84j141Q76M26j373R37k45p17J593Q9j033J060r50n46J218n86K27K00j673
2879a254M11L67p84J875m11j233J212o58p81K033m53p03J157o36k80O66r03J75
2897b00L87j083J016N9r58J218l34q62J220k04p92J511q35q42J630j054J11J077
2915A065j389N73L06j538J008N41p08J140l99j351R73o52j9J294q55N0N47j447
2933h61Q99J107j757J110L89j525R51L36j506J183r5j111R69k33j77M09p73M35
2951b50Q89j281J476p9j478J052m08j202J644j12j025J021o80q95J501n74K22
2968a79R57o67p0O23r78R60J76j292N83l17p70J270q46L7J105r54L30P89j303
2987e46L79P56j347Q24Q43j316M07L29j292O02L43m07P80k20r2K22n93J13M62
$$ plain form
3006 247 -535 586 672 -1225 52 254 -861 789 729 -368 609 -25 -625 1061 223 29 848 -474
3024 -474 -155 265 -810 -224 -68 -595 491 332 -60 852 141 -492 1258 180 131 1122 -589 -742 461
3043 461 -669 -474 192 -729 -170 284 -232 559 576 667 1394 453 288 693 -828 -263 826 -818 -272
3062 -272 66 -1397 -531 151 -880 194 120 -817 530 429 -202 806 -53 -215 372 -460 -127 -68 -999
3081 -999 -562 224 -279 938 489 -915 653 77 -226 1456 640 -389 986 -201 -703 609 -338
3098 -338 53 578 -3 447 467 -155 639 299 -88 851 100 -415 617 -190 -125 1064 -371 -66 737 -578
3118 -578 29 633 -470 304 955 -115 366 201 -813 -286 -379 -384 397 -404 63 -24 -1119 35 544 -468
3138 -468 265 -7 -1033 -63 -45 -851 22 -502 -1250 -367 -832 -942 -87 -896 -46 473 -391 320 268 -708
$$ packed form
3006B47p82J121Q6j897J277K02j115J650o0j097R77o34o00J686q38j94Q19j322
3024d74L19M20j075N86J56n27J086j59l92R12p11o33J750j078m9R91j711j53J203
3043D61j130J95O66r21N59M54n16P91J7R1P27r41j65M05j521N65J089j644N46
3062b72L38j463Q66O82j031J074p4r37J347j01o31J008q59j62N87q32L33N9r31
3081i99M37P86n03J217m49j404J568n76l03J682q16j029J375j187n02J312r47
3098c38L91N25n81M50K0o22P94l40l87R39p51n15J032q07O5J189j435L05Q03j315
3118e78O07O04j103P74O51j070M81j65j014N27r3nP81q01M67q7j095J154N09j012
3138d68P33k72j026R70J8q06Q73n24p48Q83m65j10Q55q09Q50N19q64P11n2r76
$$ plain form
3158 -708 114 259 -363 439 -607 -843 186 -794 -870 594 -785 -443 991 124 194 1071 -99 415 869
3177 869 95 402 -324 -311 265 -378 -104 883 -1004 -569 460 -614 167 1326 -157 245 751 -135 509
3196 509 652 -410 449 45 -423 679 -166 -811 210 -514 -307 431 -297 -213 109 -570 533 372 -560
3215 -560 670 -184 -761 503 -350 -1032 220 -447 -560 338 -723 -985 -158 -558 89 318 -460 244 -216
3234 -216 -892 882 136 -316 412 -469 -705 538 -192 -248 270 -841 417 741 -167 331 289 -378 843
3253 843 1112 189 607 -171 -215 577 352 428 790 -397 414 566 -403 542 599 -441 807 683 -389 504
3273 504 238 -438 620 495 265 561 -600 168 529 32 582 221 -948 97 83 -696 97 -266 -646
3292 -646 383 -1 -245 669 -662 -302 680 -241 341 696 -1068 -504 -199 -765 131 -238 -973 96 -680
$$ packed form
3158g08Q22J45o22Q02j046k36J029r80p6J464j379L42J434q67P0Q77j170N14M54
3177H69p74L07p26J3N76o43K74R87j887M35J029j074P81J159j483M02N06q86O44
3196E09J43j062Q59m04m68J102q45o45J021p24K07P38p28Q4L22o79J103j61r32
3215e60J230q54n77J264q53o82J252o67j13Q98j061k62Q27m00O47K29p78P04m60
3234b16o76J774p46m52P28q81k36J243p30n6N18j111J258L24r08M98m2o67J221
3253H43K69r23M18p78m4P92k25P6L62j187Q11J52r69R45N7j040J248j24j072Q93
3273E04k66o76J058j25k30K96j161P68L61m97N50l61j169J045j4p79P93l63l80
3292f46J029l84k44R14j331L60R82r21N82L55j764N64L05n66Q96l69p35J069p76
$$ plain form
3311 -680 -421 426 -242 -75 420 -425 124 568 -417 202 339 -404 286 3 -894 -264 -372 -504 448 -257
3331 -257 -238 808 -179 89 878 -399 94 685 -78 420 235 -246 10 -170 -466 526 -194 -615 211 -360
3351 -360 24 1049 255 348 485 -383 229 273 -238 454 254 -481 284 -291 -749 398 -278 -230 626 -286
3371 -286 -111 596 -386 152 266 -573 -54 116 -748 66 -327 -373 601 -317 -605 113 -550 -472 507 -503
3391 -503 -83 471 -351 215 98 -736 60 398 1 574 28 -435 81 -511 -274 283 -474 -417 3 -609
3411 -609 -193 367 -294 227 -3 -437 708 370 -397 556 34 -62 1032 -56 -181 187 -609 -279 697
3430 697 -203 596 377 -655 288 232 -98 742 265 -14 790 225 93 426 -471 267 728 -329 271 37
3450 37 -432 556 519 3 297 -104 -538 515 48 -200 692 -193 -112 153 -472 -218 -23 -875 -171 80 -342
$$ packed form
3311f80K59Q47o68J67M95q45N49M44r85O19J37p43O90k83q97O30j08j32R52p05
3331b57J9J046r87K68P89j277M93N91p63M98j85m81K56j80k96R92p20m21Q26n71
3351c60L84J025p94R3J37q68O12M4n11O92k00p35P65n75m58J147o76M8Q56r12
3371b86J75P07r82N38J14q39N19J70q64Q14l93m6R74r18k88P18o63P8R79j010
3391e03M20N54q22N66j17q34P96L38l97N73n46m63N16n92K37N57p57N7M20o12
3411f09M16N60o61N21k30m34J145l38p67R53n22r6J094j088j25L68p96L30R76
3430F97r00P99k19j032R43n6l30Q40m77k79Q04n65j32L33q97P38M61j057O00k34
3450C7m69R88l7n16K94m01m34J053m67k48Q92q85Q1K65o25K54J95q52P04K51m22
$$ plain form
3471 -342 255 -254 -604 20 -193 -180 579 -424 -562 229 -428 9 428 -430 -312 -199 -994 16 35 -423
3491 -423 257 -76 -225 308 -220 -252 570 -222 514 707 -346 29 468 -558 480 87 -814 28 -122
3510 -122 -443 454 67 -215 386 298 558 1156 -104 282 413 -184 655 927 -518 178 -323 -451 598
3529 598 232 -86 520 83 -142 802 167 16 544 -104 52 587 -316 -275 95 -793 -8 -51 -578 -23 -472
3550 -472 -469 532 -37 -147 454 -570 -44 626 -688 -5 366 -389 457 383 -693 28 -568 -554 592 -107
3570 -107 -304 439 -671 -51 609 -289 325 335 -701 107 211 -220 567 144 -18 633 -1 -35 462 -248
3590 -248 1 703 -83 243 307 -266 191 214 -386 791 495 -304 836 137 -361 476 11 -108 667 -225
3610 -225 -14 345 -434 195 79 -249 353 68 -402 216 0 110 699 -184 -316 75 -752 -402 289 -687
$$ packed form
3471c42N97n09l50O24k13J3P59j003j38P91o57M37M19q58J18J13p95J010J9m58
3491d23O80l33j49N33n28l2Q22p92P36J93j053L75M39j026J038l93r01Q42j50
3510a22l21Q97l87k82O01q8K60N98j260L86J31n97Q39K72j445O96n01j28J049
3529E98l66l18O06m37k25R44o35j51N28o48J56N35r03M1L70q88P85m3n27N55m49
3550d72LJ001n69j10O01j024N26O70j314O83L71p55Q46p4j076P21n96J4J146o99
3570a07j97P43j110O20O60q98O14J0j036Q08J04m31P87m23j62O51o34l4M97p10
3590b48K49P02p86L26O4n73M57K3o00J177k96p99J140o99m98Q37m65j19P75q92
3610b25K11L59p79O29j16l28O02k85m70O18k16J10N89q83j32L91q27L50O91r76
$$ plain form
3630 -687 -273 76 -526 -10 -5 -923 70 183 -392 506 142 -187 640 -163 -336 210 -796 -201 51 -700
3650 -700 -139 -188 -736 376 -157 -410 227 23 -283 491 42 90 465 -358 -218 364 -579 128 273 -580
3670 -580 42 145 -673 216 170 -74 382 -123 48 667 -117 -19 634 -197 242 484 -481 -69 167 -431 286
3691 286 -8 -514 407 -86 -438 39 -164 15 748 191 161 437 -608 -169 262 -290 149 -55 -481 78
3711 78 24 -108 620 -35 -273 542 -296 98 579 -164 158 157 -221 126 -5 -483 62 -76 -342 499 161
3732 161 -90 431 -218 -142 318 -246 75 612 -425 56 12 -639 -52 431 -354 431 43 -346 376 306 150
3753 150 485 -282 -163 273 -258 41 464 -119 285 460 -128 451 419 -427 407 199 -162 519 -266 -261 103
3774 103 -271 -89 368 -214 411 486 -196 627 424 79 425 231 133 447 235 -408 73 -519 -15 140 -532
$$ packed form
3630f87M14L49o02N16Nr18R93J13n75Q98l64l29Q27q03j73N46j006N95K52p51
3650g00N61m9n48J112n33k53O37k04l06P74m49M8L75q23J40N82r43P07J45q53
3670e80O22J03q18Q89m6k44M56n05J71O19p84R8O53q31M39K42r65M12K36n98P17
3691B86k94n06R21m93l52M77k03J79P33n57l0K76j045M39M31n52M39k04m26N59
3711G8n4j32P28o55k38Q15q38L94M81p43L22jl78L47j31m78N45j38k66Q41l38
3732A61k51N21o49P6M60n64L21N37j037M81m4o51N87M83p85P85l88l89P22p0j56
3753A50L35p67J19M36n31K99M23n83M04J75n88N79l2q46Q34k08l61O81p85NL64
3774A03l74J82M57n82O25P5o82Q23k03l45L46j94r8L14k12o43M81n92N04J55o72
$$ plain form
3795 -532 -152 169 -369 570 627 26 357 340 -54 261 -21 -566 -71 -685 -629 -144 -634 -373 -256 -425 19
3816 19 275 -88 176 155 -367 571 118 -291 197 -469 -687 165 -333 -206 330 -237 131 31 -252 19 325
3837 325 -311 261 -121 25 263 -251 -158 644 -280 -99 317 -487 -61 155 -126 182 219 -333 270 186 -289
3858 -289 474 151 -84 657 137 189 207 -378 25 432 -338 171 257 -257 -86 -122 -707 519 45 -669 320
3879 320 107 -507 265 139 80 175 -524 8 -94 -343 132 48 -382 158 -179 -395 271 -414 -616 220 -274
3900 -274 -161 425 -293 -84 293 -439 -248 342 -228 181 162 -571 7 -67 -413 378 -187 -217 300 -352 95
3921 95 602 -329 250 673 -538 121 141 -351 224 191 -206 -14 -294 -462 453 -221 -215 473 -260 297 336 -223
3943 -223 453 329 -317 409 203 -482 120 -266 -529 350 -252 -198 157 -485 -184 434 -299 148 390 -79
$$ packed form
3795e32L80L21n38R39N7o01L31j7l94L15k82n45M95o14N6M85m90K61J17j69M44
3816A9K56l63K64k1n22R38m53m09M88o66k18Q52m98J27N36n67L68j00k83K71L06
3837C25o36N72l82J46K38n14R3Q02r24J81M16q04M26K16k81L08L7n52O03q4m75
3858b89P63l23k35P41n20N2J8n85M03M07p70N09Q6n14J71l6n85J226m74p14R89
3879C20k13o14P72j26n9R5o99N32j02k49M75q4m30N40l37k16O66o85k02Q36m94
3900b74J13N86p18K09L77p32J91N90n70M09j9p33N78p4l46P91n65l0N17o52M47
3921I5N07r31N79M23j211O59K0m92N75l3l97J92k80j68R15o74OO88p33N57L9n59
3943b23O76j24o46P26k06o85O02l86k63Q79o02N4L55o42L01O18p33M47K42m69
$$ plain form
3963 -79 216 220 -315 102 -125 -155 625 -283 -338 347 -398 -406 376 -78 382 213 -481 226 370 -212 342 -19
3985 -19 -218 266 21 -369 300 -109 -184 365 -402 -190 288 -674 -89 262 -396 398 144 -401 190 170 -479
4006 -479 328 -3 -226 472 -273 -44 244 -125 -103 2 -299 285 138 -7 408 163 -52 755 -1 -130
4026 -130 338 -69 107 222 -359 -491 160 -388 -407 108 -249 140 348 -15 401 10 42 271 -307 -43 553
4047 553 -415 56 439 -589 27 306 -210 136 69 -429 95 285 -433 163 23 -166 342 -65 -156 191
4067 191 -520 -132 156 -268 70 204 -661 411 27 -403 567 -190 -423 364 0 -500 126 -29 -10 198
4087 198 -42 256 -9 -309 78 208 -399 363 -327 -594 222 -51 174 761 -286 -250 547 59 154 170 -106
4108 -106 -162 337 41 302 -109 -412 172 -202 -229 375 -319 -323 201 -235 181 687 -331 152 235 -493 218
$$ packed form
3963g9K95Mn35M17k27l0P80r08n5O85p45qP82m54M60j69o94P07J44n82N54l61
3985a9j99M84k45l90O69m09p5N49p67K12M78r62N85L51o58P94k54n45N91k0o49
4006d79Q07l31k23O98p45K29K88l69K2J05l01N84j47j45M15k45k15Q07p56j29
4026a30M68m07J76J15n81j32O51n48j9N15l57L89K08l63M16l91L2K29n78K64N96
4047E53r68M71L83j028O16K79n16L46o7m98N24J90p18N96j40j89N08m07r1L47
4067A91p11L88K88m24L38J34q65J072l84m30R70p57k33P87l64n00O26j55J9K08
4087A98k40K98k65l00L87J30o07P62o90k67Q16k73K25N87j047L6P97m88R5J6k76
4108a06n6M99k96K61m11l03N84l74k7O04o94mN24m36M16N06j018M83Q3p28P11
$$ plain form
4129 218 226 -209 136 42 -503 291 -124 -486 -20 -316 -37 333 -294 37 277 -92 411 226 -463 206 -119
4150 -119 -388 559 -52 -335 207 -619 -450 397 -53 -130 295 -537 312 523 -221 194 17 -359 461 10
4170 10 -287 179 -360 -393 340 -173 -38 256 -387 96 275 -270 189 290 -412 439 367 -273 349 -384 -250
4191 -250 386 -230 36 224 -602 5 515 -81 532 204 -389 548 302 -268 406 4 -464 329 75 93
4211 93 245 -377 -101 285 -157 220 149 -622 81 40 -34 402 -18 -400 83 -165 118 380 -86 -224 781
4232 781 -167 135 403 -515 -425 105 -364 125 -16 -342 183 -210 13 429 -105 -240 453 -215 155 588
4252 588 -37 20 49 -315 72 -1 -225 -112 -260 -76 581 150 -111 132 124 203 590 -43 136 331 -507 37
4274 37 -38 -829 -129 0 -460 264 -22 -117 484 -106 113 738 -15 40 124 -349 -48 86 -525 289 -320 -630
$$ packed form
4129B18Qm35L45r4n45P94m15l62M66k96K79L70o27L31K40l69N03j85o89O69l25
4150a19k69R47o11k83N42q26J69Q47m50p7M25q32Q49K11p44M15j77l76Q20m51
4170A0k97M66n39l3P33n13J35K94o43M83J79n45M59J01p02Q51p2o40O22p33J34
4191b50O36o16K66J88q26O07N10n96O13l28n93R37k46n70O74m02m68P93k54J8
4211I3J52o22K76L86m42L77p1p71P03m1p4M36m20l82M83k48K83K62m66j38J005
4232G81r48L02K68r18R0N30m69M89j41l26N25l93K23M16n34j35O93o68L70M33
4252E88o25N7K9l64L87p3k24J13j48J84O57m31k61K43qP9L87o33J79J95q38N44
4274C7p5p91P00J29m60P24k86r5O01n90K19O25p53N5Q4m73L01J34o11Q14o09l10
$$ plain form
4296 -630 149 55 -156 523 102 -37 478 179 -247 275 -248 167 136 -105 109 102 -444 60 -79 -144 183 -214
4318 -214 -404 252 -353 92 451 -299 -78 298 -312 70 108 -255 235 162 -167 311 19 -302 135 -144 -89
4339 -89 516 -524 -164 271 -287 86 462 -103 274 310 -288 528 38 -308 188 37 -387 244 -199 -262 229
4360 229 -184 59 430 -16 276 419 -220 214 347 -381 321 -155 -403 586 -48 -74 41 -345 -49 98
4380 98 -503 -125 225 -184 119 344 -120 232 -312 -288 190 -211 -49 241 -395 -247 186 -248 -90 334 -601
4401 -601 -36 169 -273 164 122 -272 145 87 90 291 -43 -87 368 -319 148 170 -563 13 62 -351 122 272
4423 272 -260 102 -193 -45 403 -147 -275 230 48 -245 247 -297 -254 -42 -247 558 -209 -520 64 -234
4443 -234 -232 538 79 -345 315 14 119 563 -316 -277 -49 -248 8 277 -403 98 -13 -236 283 131 -214
$$ packed form
4296f30P79r4k11O79m21j39N15k99m26N22n23M15l1k41K14pn46N04j39o5L27l97
4318b14j90O56o05M45L59p50K21L76o10L82L8l63M90p3l29M78k92l21M37k79N5
4339h9O05j040L60M35n58L73L76n65L77L6n98Q16m90l46M96j51m24O31m43o3M91
4360B29m13K43L71m46K92J43o39M34J33p28P02m76k48R89o34k6J15l86K96J47
4380I8o01L78L50m09L03K25m64L52n44K4M78m01J62K90o36J48M33m34J58M24r35
4401f01N65K05m42M37m2l94M17n8LK01l34m4M55o87M67K2p33N76M9m13M73J50
4423B72n32L62k95J48M48n50j28N05j82k93M92n44M3K12k05Q05p67l11N84k98
4443b34KP70m59m24O60l01J05M44q79L9K28j99K56K69o80N01j11k23N19j52l45
$$ plain form
4464 -214 170 -333 137 550 -24 7 379 -299 12 235 -221 120 -51 -424 224 333 -189 164 -56 -287
4484 -287 398 28 -39 223 -391 144 408 -137 347 414 -357 415 61 -405 128 -226 -522 567 -76 -208
4504 -208 115 -93 -46 260 32 -15 37 -277 156 38 -384 67 -332 -146 178 -62 -121 205 -350 -134 268
4525 268 -147 240 170 -397 26 224 -237 97 173 -483 75 36 -131 297 -335 -316 71 -254 -54 126 -550
4546 -550 237 394 -266 440 166 -285 188 334 -32 254 17 -81 329 -287 -58 151 -126 80 -51 -190
4566 -190 271 204 -528 581 144 -261 322 102 -371 56 -429 -233 463 -272 -176 -26 -380 55 202 -77
4586 -77 -57 93 107 364 57 -88 397 -300 -236 264 -310 104 45 -165 133 177 -561 -113 -41 -245 30 281
4608 281 -47 91 -77 127 461 -123 -62 53 -508 -33 183 -494 -136 -5 -228 263 46 -142 313 -76
$$ packed form
4464b14L84n03M70M13n74L1L72o78L11K23m56L41j71l73O48J09n22L53k20k31
4484b87O85l70o7K62o14N35K64n45M84O7p71P72l54m66N33l54k96J089o43j32
4504b08L23k08M7L06k28m7N2l14M33j18m22M51l99J86L24k40n9L26n55K16M02
4525B68m15L87p0n67M23J98m61L34P6o56N58l9j67M28o32J9L87l25K00J80o76
4546e50P87J57o60P06k74m51M73J46l66K86k37r8M10o16K29K09k77K06j31j39
4566a90M61o7p32J109m37m05N83k20m73M27m85J96O96p35R6J50l54M35J47k79
4586g7K0J50J4K57l07j45M85o97O4N00n74M14n9k10K98M4p38M48P2k04K75K51
4608B81l28J38j68K04L34n84O1J15n61M75K16o77L58J31k23M91k17j88M55l89
$$ plain form
4628 -76 -94 545 55 -119 122 -80 -117 148 -200 26 158 -20 209 -55 -225 533 -86 -234 438 -15 24
4649 24 589 29 -176 349 46 -143 347 -304 -26 -227 -273 95 -47 115 191 -14 -231 463 -247 67 244
4670 244 -166 198 126 -214 149 476 -224 56 167 -252 349 27 -88 197 -292 -180 195 36 220 310 -206
4691 -206 2 579 -352 46 165 -263 125 -139 -565 219 10 -177 370 -130 -222 80 -97 -60 165 -81 304
4712 304 104 -146 300 -126 -137 368 -213 -223 366 -60 10 248 -227 -88 -57 -49 134 82 -209 350 429 -9 261
4735 261 -68 -86 69 -34 -114 -44 -457 -29 -18 -90 21 165 -237 59 83 -259 377 71 -293 157 -74 -567
4757 -567 -49 -322 -423 184 -89 -108 -31 -280 33 309 -206 91 18 -371 297 -15 -419 272 -204 -313 35
4778 35 -76 -10 52 -454 -27 262 -157 347 337 -135 141 49 -232 217 -50 -116 17 -59 -386 350 -27 119
$$ packed form
4628g6j8O39m90j74K41k02l7K65l48K26J32j78K29k64j70P58o19j48O72m53L9
4649B4N65n60k05N25l03j89M90o51K78k01m6L68j42J62P6k05k17O94p10L14J77
4670B44m10L64p2l40L63L27p00K80J11m19O01l22j15K85m89J12L75j59J84R0n16
4691b06K08N77r31L98J19m28L88k64m26P84k09j87N47n00r2L02j77L7K25k46L85
4712C04k00k50M46m26j1N05n81j0N89m26P0K38m75J39L1QJ83n2k91N59P9m38K70
4735B61l29j8J55j03q0P0m13M28J1p2J11J44m02K96K4l42O36l06l64M50k31m93
4757e67N18k73j01O07k73j9P7k49L13K76n15K97p3l89O68l12m04O91m76j09L48
4778C5j11O6O2n06M27K89m19N04j0m72K76r2k81M49k67o6J33p6l27P36l77J46
$$ plain form
4800 119 298 -292 280 319 -100 314 145 -166 335 194 235 241 -78 5 356 83 73 48 -181 118 525 -363
4822 -363 133 -2 -369 222 161 -206 86 -66 -34 191 131 130 191 -282 90 20 -293 199 -169 -506 -52 138
4844 138 -347 137 -343 -330 488 -163 -23 567 -316 -186 531 -191 -147 43 -477 -118 -12 -25 -20 2 30 299
4866 299 85 241 451 -52 -139 142 -83 78 176 -18 9 -16 123 301 75 -36 140 -102 -89 291 -181 -324
4888 -324 183 -103 52 452 -32 382 159 -35 57 74 -166 -184 -241 -332 307 -265 -443 -24 -42 187 326 -271
4910 -271 140 387 -10 425 246 -342 144 -112 -256 497 138 -385 91 -162 -62 254 -101 107 286 -98
4930 -98 81 159 -272 -131 -189 -177 154 -79 -128 -128 -250 -322 47 -338 206 222 -247 378 151 100 294 279 -142 85
4954 85 -127 -161 128 -90 -48 538 -118 96 249 -189 104 -42 -280 170 331 -299 -57 157 -144 163 -13
$$ packed form
4800A19J79n90N72L9m19M14j69l11N01j41M1Ol19Q3L51k73j0k5k29K99M07q88
4822c63M96j35l67N91o1l67K92j52L2K25o0jO1m73L72p0l13M92l68l37M54J90
4844A38m85M84m80J3Q18o51J40N90q83J30P17p22M4J90n20L59J06j3NK2K8K69
4866B99k14J56K10n03q7K81k25J61R8j94K7k5J39J78k26j11J76k42J3L80m72j43
4888c24N07k86J55M00m84M14k23j94R2J7k40j8n7r1O39n72j78M19j8K29J39n97
4910b71M11K47l97M35j79n88M86k56j44P53l59n23M76k53J00L16l55K08J79l84
4930i8J79P8m31J41n8J2L31k33m9%j22p2L69l85N44J6m69O25k27n1J94j5m21K27
4954H5k12l4K89k18M2N86o56K14J53m38K93j46k38M50J61o30K42K14l01L07j76
$$ plain form
4975 -13 -305 172 -119 -180 272 -201 -190 227 -276 -140 311 -358 184 164 -359 378 -92 -419 163 50 -129
4996 -129 397 -175 -137 277 29 -273 -25 -184 128 -19 -262 256 82 -134 158 242 131 231 4 -139 141
5017 141 -211 -87 288 -239 55 224 -270 112 119 -230 61 -161 -139 286 250 -160 166 -84 246 127 -164
5038 -164 -182 -118 -149 39 4 3 200 -162 -35 406 115 114 135 -18 -39 325 48 -145 183 -254 -67 103 -223
5061 -223 165 165 -421 -11 15 -113 -43 54 -189 450 -377 8 100 -113 -162 -10 32 -94 -224 -463 129 28 -144
5084 -144 171 -134 -242 279 -153 58 298 -396 6 409 -291 439 232 -165 43 88 -220 -100 -139 -219 123
5105 123 -16 -9 441 -147 49 124 -404 -75 393 -445 118 -76 -148 -54 125 -306 -28 -30 -255 176 -109 -207 -14
5128 -14 -40 119 220 -61 209 -39 97 127 83 -333 -126 -85 -117 228 114 -92 130 -157 -68 286 -50 -49 62
$$ packed form
4975a3k92M77k91o1M52m73J1M17n03J36M51o69N42k0n23P37m70l27N82j13j79
4996a29N26n72L8M14k48l02K48j59L12j47k43N18j74k16K92Q4j11J00k27j43K80
5017A41l52J24L75n27K94J69m94L82Pl49K91k22K2M25l6m10L26k50L30j19k91
5038a64j8O4l1J88l5jJ97l62J27M41k91jK1j53k1L64k77j93L28m37J87J70l26
5061b23L88%n86M10K6j28P0R7k43O39q27L85R2k13m9J52M2j26j30k39N92j01j72
5084a44L15l05j08N21m32K11K40o94M02M03p00P30k07l97K08M5l08J20l9q0L42
5105A23j39PM50n88J96P5n28L29M68q38N63j94p2R4J79m31K78kk25M31k85r8J93
5128a4k6J59J01k81K70k48J36L0m4m16K07M1l2L45j14k06K22k87Q9L54l36JJ11
$$ plain form
5151 62 -80 234 18 93 168 45 -563 241 83 53 128 -190 -164 -42 -422 90 148 -400 113 79 -33 110 82
5174 82 -126 180 210 -3 -14 -434 -117 124 -17 -90 -110 -45 75 76 -145 136 50 -544 299 30 -168 308 -128
5197 -128 -116 128 -139 -238 320 -479 127 62 -201 239 143 -372 -95 38 58 375 -66 -65 17 124 212 257 -303
5220 -303 -185 113 -275 29 152 -322 14 -13 -53 218 -161 -225 352 44 308 334 2 -30 211 -128 331 145
5242 145 -271 -76 56 -231 145 160 -358 81 -155 94 236 -32 -245 34 -127 24 155 -124 13 -246
5262 -246 -283 132 -32 -231 207 -30 -21 259 30 12 -13 123 178 180 -73 -7 54 -110 210 -102 -176 124 -168 -354
5286 -354 224 123 -40 108 -56 -250 322 -137 152 65 -185 101 295 -14 46 183 -372 -8 80 -46 -112
5307 -112 -1 -210 -65 -5 -65 246 -142 -102 170 -196 161 -246 -119 -68 181 -53 35 -179 -81 153 42 -230
$$ packed form
5151F2j42L14k16P5P5j23o08Q04j58l0P5l18K6J22l80N12N8n48N13l4j12J43k8
5174H2k08L06L0k13j1m20L17K41j41p3k0O5J20Jk21K81q6n94Q43k69j98M76m36
5197a28J2K44k67r9N58p99O06o5k63M40r6n15K77J33K0L17m41JQ2J07Q8M5n60
5220c03J18K98l88L04J23m74L36k7m0K71l79o4N77l08K64K6l32l2K41l39M59j86
5242A45m16J95J32k87L76J5n18M39k36K49J42k68k13K79j61J51J31k79J37k59
5262b46l7M15j64j99M38k37RK80k29j8k5J36N5Kk53O6O1j64L20l12p4L00k92j86
5286c54N78j01j63J48j64j94N72m59K89q7k50K86J94l09O0J37n55L64Q8j26o6
5307a12J11k09J45O0o0L11l88M0K72l66L57m07J27N1K49k34Q8k14R8K34j11k72
$$ plain form
5329 -230 66 -288 140 370 -212 87 305 -203 252 86 -176 170 54 -82 -223 -251 228 -4 -124 -32 294
5350 294 -191 86 357 -507 257 -13 -161 279 31 -230 102 -145 -234 142 -39 -76 -9 -307 92 154 -161
5371 -161 -168 22 -207 329 -87 -161 169 -37 -78 444 114 -67 177 -358 -190 -25 -324 -4 3 -187 212 -88
5393 -88 -38 184 106 -112 337 82 42 86 13 -76 -123 -111 172 129 -64 89 48 -280 52 -20 64 170 89 30 227
5418 227 24 -23 -18 -114 -247 73 -178 74 277 -168 30 148 -174 -95 -139 -162 219 -86 -202 175 -226 -88
5440 -88 253 -129 62 -52 -13 -7 -80 -237 86 36 -160 143 -285 -150 271 -227 45 192 87 192 32 -60
5462 -60 15 60 33 96 -291 -65 -120 -202 257 9 13 -50 397 -90 129 496 -392 -47 74 -47 190 194 -341 -19
5486 -19 24 -99 231 -186 -53 114 -17 -146 269 46 113 89 -177 229 10 -426 -106 62 -109 78 27 -44
$$ packed form
5329b30K96l54M28K30n82K99K18n08M55j66k62L46j16j36j41k8M79k32j20R2L26
5350B94m85K77K71q64P64k70j48M40k48k61L32k47q9L76j81l7O7k98L99O2l15
5371a61pJ90k29N36m16p4L30k06m1N22l30j81K44n35J68J65k99L20Pj90L99l00
5393h8N0K22p8k18M49k55m0M4p3q9m7J2K83m3j93J53m1l28L32p2Q4J06q1n9J97
5418B27k03m7Nr6j33L20k51K52K03m45J98J18l22P9m4k3L81l05j16L77m01J38
5440h8L41l82J91j14L9Op3j57L23n0j96L03m28J35M21m98K72J47j05J05j60r2
5462f0P5M5k7O3l87K26n5q2M59k48Mo3M47m87K19L67q88L45J21j21K37Mn35L22
5486a9M3j23L30m17J33J67j31j29M15k23O7k4k66M06k19m36L20J68j71J87n1p1
$$ plain form
5508 -44 -106 -113 -196 -69 -309 113 123 -81 158 -72 39 -89 245 -262 29 -17 -386 68 -196 7 85 -214 -159
5531 -159 169 0 209 33 -313 356 145 -235 176 40 -66 225 -61 35 83 79 3 71 -33 45 43 74 213
5554 213 226 49 227 116 -88 420 -9 -41 193 -19 39 232 -332 25 262 -121 107 23 73 438 50 -147
5576 -147 101 213 -134 -46 -99 -85 -77 -283 -250 -53 -145 -331 9 -332 -119 -80 -46 110 106 -113 166 115 -299 182
5600 182 131 -11 28 67 68 56 -149 -1 119 -369 141 85 -84 152 234 -51 63 227 -177 246 -63 84 25
5623 25 -195 111 196 -145 -100 128 -220 161 92 -3 53 -335 -97 57 -78 230 174 126 20 -53 48 110 147 -196
5647 -196 114 39 -142 11 -107 -157 97 -96 0 271 -259 -120 18 -157 121 103 -156 191 -3 11 -34 8
5669 8 -159 303 -293 -163 31 52 20 213 -97 301 173 -219 78 -112 -169 39 -89 -279 149 -58 -57 60
$$ packed form
5508d4o2pq3J27k40M22J0k04K39k30J11j28L34n07K91m6l69M54k64K03P8k99N5
5531a59L28j69K09j76l46O69k11l80M11j36j06K91k86R6M8mp6O8j04P8kL1J39
5554B13J3j77J78j11k04N08m29l2K34k12N8J93n64L57K37l83K28q4N0L65l88j97
5576a47K48J12l47Q8n3J4Qk06L3J97r2j86L40l41K13L9L4J56mk19K79n1m14M81
5600A82n1j42L9L9Jj2k05J48J20m88N10n6j69K36Q2k85J14J64m04M23l09J47n9
5623B5k20L06Q5l41M5K28l48L81o9r5N6l88K38J54j35L08n6m8j06p3J01O2L7l43
5647a96L10p5j81J53j18n0K54j93R6K71n30J39J38j75K78j8k59L47j94J4m5M2
5669Hj67M62n96J30J94K1l2J93l10L98j28l92K97j90n7K08j28j90M28k07JJ17
$$ plain form
5691 60 171 82 170 -197 -195 395 -18 71 113 -26 -57 -297 -130 193 -147 -105 47 34 -22 360 51 -204 139 -129
5715 -129 -138 193 179 72 339 -332 269 143 -1 69 -253 -93 89 -65 155 156 -334 -43 378 -199 -317 -45
5737 -45 70 -6 -30 -27 257 -107 -267 135 -205 -266 8 -141 -25 59 -102 41 -20 -150 -58 165 -91 202 55
5760 55 -35 51 -128 -71 321 -161 -123 -2 -88 69 17 -166 -54 -112 -111 32 12 -149 138 -86 -152 45 -9 -83 -74
5785 -74 -7 -1 149 -73 -98 94 7 96 -45 -118 213 -47 -150 180 -75 -182 135 -70 -39 -90 -292 28 250
5808 250 -269 12 167 -16 68 165 -222 129 107 -13 -139 -12 -313 -44 60 -72 68 -18 132 39 -1 158
5830 158 -9 -41 85 8 -212 248 146 -285 167 1 1 237 -122 68 -10 -32 194 -9 -269 -91 -109 -274
5852 -274 -18 -17 116 186 -172 -108 194 -235 88 -86 -25 171 146 87 185 -21 -180 -101 -193 -156 53 -35 -43 25 -199
$$ packed form
5691F0J11q9Q8l67KN90m13Q9M2j39l1k40J67L23l40M2J52j3n6L82l09k55L43k68
5715a29rL31j4j07K67o71O01j26j44P0l22J60J82j54K20Jm90K91M21n77j18K72
5737d5J15p6k4LK84l64j60M02l40o1K74j49J16Q4j61J43o1j30R2K23k56K93j47
5760E5r0Q6j79N7L92m82L8J21q6J57n2j83J12n8JJ43k0j61K87k24o6J97n4p4R
5785g4O7OJ50k22k5J92q7Q9j41p3L31k60j03L30k55j07L17k05L1n1k02L20K22
5808B50n19K81J55j83Q4R7l87L51k2j20j26J27l01K69J04j32J40q6J50r3m0J59
5830A58j67l2J26p7k20M60j02m31M52j66%K36l59J90p8k2K26k03k60J78j8j65
5852b74K56JJ33P0l58O4L02m29L23j74O1J96k5n9R8k06j59P9r2L7K09q8qO8k24
$$ plain form
5877 -199 -216 134 64 279 129 -199 116 100 -61 342 127 -184 -13 -110 -105 254 -28 57 71 -142 -3 134 -348
5900 -348 161 -172 -183 -69 19 -187 200 101 -109 292 -30 -27 61 -56 -211 -59 -75 -140 79 0 -82 -160 81 62
5924 62 -103 -364 88 -47 -123 48 -131 -57 33 -99 124 6 -203 69 61 -22 206 80 -256 111 1 12 -44
5947 -44 -142 -74 133 28 48 198 -1 60 -28 -156 81 26 -189 195 79 128 231 179 -231 110 -115 -124 -91 -79
5971 -79 76 -181 -124 294 197 -16 330 59 -206 269 291 -123 -38 214 164 71 41 -355 -184 -25 -46 132 -311
5994 -311 159 10 75 159 -345 -306 165 27 -110 373 10 -41 253 -251 161 -101 -97 20 42 -412 56 -79
6016 -79 -97 -91 98 -126 209 31 -90 65 -85 217 -130 94 -147 140 -235 -30 57 -112 -99 -38 -48 186 121
6039 121 -38 23 218 49 160 70 43 -102 -186 136 30 -236 -228 -31 -182 113 -232 -20 205 23 119 174 -189
$$ packed form
5877a99j7L50p0K15j50l28L15j6j61M03k15l11J71r7NL59k82Q5J4k13J39J37m82
5900c48N09l33j1J14Q8k06L87r9k10M01l22LQ8j17j55J52j6o5K19p9q2p8K41j9
5924F2j65k61M52j35p6J71j79P4R0j32K23j18k09K72qq3K28j26l36L67j10J1n6
5947d4r8O8K07j05K0J50j99O1q8j28K37n5k15L84j16M9J03n2m10L41k25rL3J2
5971g9J55k57N7M18r7k13L46k71k65M75K2m14Q5K52n0r3l0l96J71J59k1J78m43
5994c11M70j49O5Q4n04L9M71j38j37M83l63n1K94n04M12k62MJ17K2m54M68j35
6016g9j8OJ89k24L35j78j21J55j50L02l47K24k41K87l75K05Q7j69J3O1j0K34o5
6039A21j59O1J95j69J11r0k7j45q4L22j06k66QJ97j51K95l45K12K25j82R6N5l63
$$ plain form
6062 -189 90 -83 -66 -127 -180 -36 -43 416 -62 130 -4 -228 174 -79 -243 181 -107 122 -234 25 -133 244
6084 244 -63 -100 124 -67 108 23 -21 68 -53 129 42 -162 146 63 125 0 110 60 -134 20 -126 -55 -93
6107 -93 -38 -13 1 -18 108 -31 -115 -44 -23 163 -33 -15 -44 154 -56 156 -89 -170 32 122 122 65 -71 -145 492
6132 492 -47 -94 393 -215 32 -179 30 183 239 290 -205 119 -122 230 -155 -15 170 62 -80 -48 -72 79
6154 79 140 -221 242 -19 -121 78 -161 37 -164 34 44 169 98 -150 42 30 82 56 -232 87 -65 -126 30
6177 30 127 -13 -85 -229 84 -29 103 271 280 -33 41 41 -113 139 -141 138 116 71 11 -38 24 89 73 -151 -100
6202 -100 93 -61 -2 24 149 84 20 -233 110 -83 43 -27 7 128 -18 -327 4 -133 118 224 32 -97
6224 -97 78 59 -147 -1 243 -38 149 81 -225 199 10 -144 -21 -4 2 -42 -278 10 200 2 141 228 99
$$ packed form
6062a89K79j73J7o1n3J44pM59m78J92j34k24M02k53j64M24k88K29l56K59j58L77
6084B44l07l7K24j91J75q5m4Q9j21J82q7k04L08q3O2j25J10n0j94J54j46P1l8
6107i3N5K5J4j9J26j39q4P1K1J86j96J8k9J98k10K12k45q1K02R0%n7j36p4O37
6132D92n39m7M87o08K47k11K09J53N6N1m95L24k41L52l85J40J85j08j42L2k4J51
6154G9O1l61M63k61j02J99k39J98k01J98J0J25p1k48J92j2N2k6k88L19j52o1J56
6177C0R7j40p2j44L13j13J32J68Rl13P4%j54K52k80K79k2m5o0m9O2O5j6k24N1
6202a00J93j54N9K6J25o5o4k53L43j93J26p0L4J21j46l09L31j37K51J06j92j29
6224i7J75j9k06J46K44k81J87o8l06M24j89j54J23J7Om4k36K88J90j98J39Q7j29
$$ plain form
6247 99 -31 -95 -279 59 52 -145 -121 -227 -13 79 105 -69 127 3 -23 -107 148 90 54 -207 236 131 -79 -96
6271 -96 192 -169 156 -125 -62 10 60 40 -21 -304 39 301 -113 -1 -41 -165 90 191 337 88 118 -20 211
6294 211 -113 157 102 18 -21 47 122 -28 226 133 -236 -151 -4 98 -6 -200 137 32 91 56 68 -172 -29
6317 -29 60 318 -12 -142 137 10 78 -8 110 124 189 -50 -47 152 -143 -120 -59 -45 146 13 -126 -68 21 -61 69
6342 69 354 7 98 39 -218 114 69 -226 -88 69 58 234 -48 -274 -74 -57 130 -8 98 -167 48 230
6364 230 64 10 -15 113 45 39 315 -158 51 -19 111 -65 -143 -309 83 235 -116 188 25 193 157 5 -91
6387 -91 -70 -22 -13 2 -24 -97 78 -28 -171 121 164 170 -111 -230 133 -96 -336 383 -83 -45 -166 -101 -160 106 -100
6412 -100 -207 158 -26 -235 8 -58 -204 -41 -5 50 -172 95 98 165 -44 -143 -76 -8 214 -328 190 -129 -245
$$ packed form
6247I9j30o4j84L38pj97K4j06K14R2K6j74J96j24k6q4K55n8l6k61M43j05k10j7
6271i6K88l61L25k81O3P2N0k0o1k83L43K62m14J12m0j24K55J01J46k49L0j38K31
6294B11l24K70n5q4l9O8P5j50K54r3l69Q5J47J02j04j94L37j05N9l5J2k40J43
6317b9Q9K58l30j30K79j27O8q6J18J4O5k39LJ99k95K3O1J4J91j33j39N8Q9q2J30
6342F9K85l47R1n9k57L32m5k95J38J57j1J76k82k26K00J7J87j38J06k65K15J82
6364B30j66n4k5J28o8oK76m73K09p0J30j76p8j66L92J52l51L04j63J68l6j52r6
6387i1K1M8RJ5k6p3J75j06j43K92M3Ok81j19L63k29k40P19m66L8j21O5n9K66k06
6412a00j07L65j84k09K43o6j46J63L6N5k22K67LO7k09r9O7O8K22n42N18l19j16
$$ plain form
6435 -245 -305 208 -121 40 150 -130 128 -39 -96 49 114 -20 113 -161 -5 121 122 108 -235 -54 7 -121
6457 -121 -333 78 11 -13 117 -150 132 86 118 158 -32 -265 -5 -44 265 24 118 44 -16 133 -89 35 -126
6480 -126 -104 61 -57 52 122 -109 46 81 77 73 -44 28 15 95 96 -137 171 -151 -135 160 15 -132 -341 -23
6504 -23 -48 -163 199 90 -167 42 -94 -4 -83 -24 57 66 -430 -139 -217 -191 -116 161 6 20 -14 -102 175 -66 258
6529 258 91 -11 56 14 104 85 220 186 49 21 -319 -233 116 40 133 57 110 39 -54 -26 236 -16 -109 174 89
6554 89 -158 -25 112 164 -202 -21 -210 149 -97 161 150 -147 -8 171 -201 -52 109 122 -115 -48 27 4
6576 4 -196 40 -1 -121 -142 146 -271 197 150 92 -50 -112 -199 24 -209 -126 -5 -98 50 -160 -134 -133 62 -75
6600 -75 -18 65 -37 80 122 -8 -147 -144 -73 -142 21 -66 -72 11 -104 38 -89 -34 191 -115 128 -4 -30 113 124
$$ packed form
6435b45o0N13l29J61J10k80K58j67n7J45O5j34J33k74J56J26Jj4l43J81O1j28
6457a21k12M11o7k4J30k67K82m6L2M0j90k33K60l9L09k41R4p4o0J49k22J24j61
6480a26K2J65j18J09P0k31J55L5mmj17P2j3Q0Jk33L08l22J6K95j45j47k09L18
6504b3k5j15L62j09k57K09j36R0p9N9Q1Rm96K91p8K6P5K77j55J4l4q8K77k41L24
6529B58j67j02O7m2R0j9J35l4j37k8l40Q6L49p6R3p6N3p1r3K8K62k52r3K83q5
6554H9k47J33J37N2l66J81j89L59k46K58j1k97J39J79l72J49J61J3k37O7P5k3
6576Dk00K36m1j20k1K88m17M68m7n8j42o2q7K23k33Q3J21r3J48k10K6JJ95j37
6600g5N7Q3j02J17M2j30j39LP1o9J63q7oQ3j15J42j27N5K25l06K43j32k6J43J1
$$ plain form
6625 124 -174 37 20 141 -107 -112 182 -25 15 -1 -99 18 193 -100 -145 65 115 65 81 7 53 -32 35 103 55
6650 55 -65 238 254 -64 -35 33 14 296 202 7 7 85 -212 82 -285 -155 -166 -64 375 52 -113 -191 58 94
6674 94 -205 -19 218 112 155 -86 -108 -12 -53 106 202 41 6 -40 18 96 14 -98 269 -17 157 40 -50 15
6698 15 -161 19 33 109 210 48 -10 101 3 -153 -75 158 158 318 -28 -223 24 73 -80 -91 -24 -140 41 30
6722 30 66 -135 -155 -40 138 -234 279 -91 25 243 128 -189 -144 77 -68 57 -1 -205 -126 -268 -56 146
6744 146 -167 -1 122 -111 -175 -58 -312 81 16 115 344 160 -197 168 -40 -102 -102 58 -30 32 -63 82 57
6767 57 67 59 -93 -21 240 -148 -187 18 53 -103 255 -54 -235 240 30 36 288 -38 -263 -22 -111 228 146 57
6791 57 -83 -42 150 119 -3 7 139 -1 64 100 -132 -22 -39 -70 -89 16 89 22 -216 -56 8 -18 201 300 -133
$$ packed form
6625A24k98K11j7J21k48nK94k07M0j6r8J17J75k93m5K10N0n0J6p4M6q5O7O8m8
6650E5j20L03J6l18K9O8j9K82r4j95%P8k97K94l67J30j1J02M39l23j65p8K49L6
6674I4k99J86K37j06M3k41k2R6m1J59R6j61l5m6N8P8q2j12L67k86J74j17r0O5
6698A5j76J80J4P6J01j62n8J11r8j56P8K33%J60l46j95K47M9j53j1O7j16J81j1
6722C0L6k01k0J15J78l72N13l70J16K18j15l17M5K21j45J25n8k04P9j42K12K02
6744A46l13J66J23k33o4J17k54L93o5R9K29j84l57L65k08o2%J60q8O2r5J45k5
6767E7J0qj52P2K61l88l9K05L5j56L58l09j81M75k10OK52l26k25K41q9L39q2q9
6791E7j40M1J92l1j22J0J32j40O5L6k32J10j7l1j9J05P3o7k38J60O4k6K19R9m33
$$ plain form
6816 -133 -58 376 5 -129 -65 56 -95 -230 2 -148 278 -291 45 -52 93 -16 -99 196 -200 -122 19 -109
6838 -109 -69 -57 25 83 -60 -10 -114 74 -4 8 -34 -36 -15 324 -150 98 87 -153 143 28 53 81 80 -105 33
6863 33 119 6 -71 19 -61 -90 -112 40 112 -297 224 58 35 122 124 11 280 198 -144 250 203 32 134 151 16
6888 16 175 -65 151 309 -154 73 -120 46 52 -108 -74 104 79 -193 -24 -95 -164 -74 -19 -121 42 -40 -86 42
6912 42 196 -89 81 -181 81 -168 104 192 -1 3 104 82 -115 -138 123 42 -163 -58 179 221 -176 175 76
6935 76 -44 -121 -363 -3 -139 -47 28 69 -14 -148 62 116 -21 186 -157 -285 117 16 264 98 -472 50
6957 50 115 26 -35 -95 -137 107 129 -243 97 -104 206 -56 186 132 -135 -30 47 -99 223 -123 50 -51 278
6980 278 -181 -31 99 -86 -133 146 -82 61 -121 47 18 220 72 55 -61 -105 35 -197 -67 48 -64
$$ packed form
6816a33P5M34l71j34O4J21j51j35K32j50M26n69L36r7J45j09q3K95l96P8J41j28
6838a09M0J2Q2N8j43N0j04J88p8J2m2kK1L39m74K48j1k40K96j15K5K8jj85J38
6863C3Q6j13p7R0q0k9k2J52P2m09N21j66k3Q7Kj13K69q2l42L94m7j71J02J7j35
6888A6J59k40K16J58m63K27j93J66Oj60L4J78k5k72J69p1o9R0N5j02J63q2m6J28
6912D2J54k85J70k62K62k49K72Q8j93MJ01k2j97k3K61q1k05J05K37M2l97L51r9
6935G6j20p7k42L60j36R2P5M1q3j34K10N4j37K07l43j28M02j01K48j66n70N22
6957E0O5q9o1o0m2K44K2l72L40k01L10k62K42n4k67J05P7j46L22l46J73j01L29
6980B78m59J50J30j85m7K79k28J43j82J68k9K02j48j7j16m4J40k32J30J15j12
$$ plain form
7001 -64 108 141 -130 118 208 201 130 -71 96 61 120 48 290 -62 -256 217 -213 99 -71 28 215 -52 173
7024 173 125 -126 -120 79 -73 -166 -8 -105 -11 34 46 151 -47 22 -134 28 83 137 -28 -42 -45 -92 100 262 -50
7049 -50 138 -118 97 221 -268 -85 -95 -176 -270 87 -252 -243 2 -10 -89 150 -40 -236 381 -61 -133 225 13
7072 13 230 -7 110 86 28 19 157 189 -153 62 -63 -32 -230 53 -77 -120 -6 99 59 73 225 116 -197
7095 -197 27 306 -153 92 59 72 -23 39 -15 -162 22 -275 14 -233 -111 -281 -226 74 -240 -68 261 -101
7117 -101 -70 -23 -272 73 156 -198 -254 -88 -74 116 -154 13 89 -127 -161 221 -13 6 -52 212 -214 231 -27
7140 -27 -212 173 -53 23 111 166 19 -184 13 -62 55 -8 36 157 -100 92 -25 -27 87 99 -101 192 0
7163 0 12 280 -104 63 -169 -44 -18 -120 83 -193 29 -9 186 -22 -82 -107 -325 134 -6 -227 17 -160
$$ packed form
7001f4J72L3k71K48R0pp1k01J67l5N9p2K42l52j94M73m30L12j70R9J87k67K25
7024A73m8k51OJ99j52r3J58r7R4M5J2J05j98O9j56J62N5N4j65j4lm7J92J62l12
7049e0J88k56K15J24m89J83j0q1r4L57l39RK45j2p9K39j90j96O17m42p2L58k12
7072A3K17k37J17k4n8rJ38L2l42K15j25L1j98K83j30m3J14J05m0J4J52j09l13
7095a97K24K79m59K45l3J3r5O2n4j47J84k97K89k47J22j70N5L00l14J72L29l62
7117a01L1M7k49L45Q3l54n6J66J4J90k70J67P6k16l4L82k34J9n8K64m26M45k58
7140b7j85L85k26P6Q8N5j47k03J97p5J17o3M4J21k57J92j17kJ14J2k00K93j92
7163@J2K68l84J67k32J25K6j02K03k76K22l8J95k08o0k5k18M59j40k21K44j77
$$ plain form
7185 -160 -77 -36 153 -79 112 36 33 -217 233 -176 124 29 -187 -198 19 2 57 54 -67 94 26 -61 62 -361
7209 -361 73 -38 -17 181 229 111 37 -192 217 181 -94 -122 30 -39 -46 -149 46 139 78 201 67 163 -48 249
7233 249 -127 -34 240 50 271 -165 -313 -168 2 -12 21 165 -88 -143 -28 25 101 -6 79 351 -158 -304
7255 -304 -107 104 -33 265 -193 -41 -89 -160 -33 -24 -69 -53 50 -208 224 -306 -11 166 13 81 151 46 195
7278 195 79 -149 46 75 -120 90 85 -63 105 -139 -175 56 -83 57 303 -120 120 91 -18 -37 149 -38
7300 -38 -5 -19 -57 276 41 127 -12 130 119 293 -269 235 -91 221 59 -105 113 -95 -100 -101 64 63 -136 269
7324 269 -73 -1 0 91 158 -185 205 -102 12 361 -209 -85 -134 16 99 130 -102 -61 61 156 -230 -68 123
7347 123 109 87 -114 -50 -166 147 -3 92 -142 9 -184 209 88 189 -84 -69 -48 61 -233 31 115 56 20
$$ packed form
7185a60Q3M1J89k32J91p6lk50M50m09L00r5k16j1K17j7N5lj21J61o8q7J23m23
7209c61M34j11K1J98M8j18p4k29M09l6k75k8J52o9pj03J95R3o1J23j34R6k11K97
7233B49l76R3K74j90K21m36j48J45J70j4L3J44k53n5J15N3P6j07Q5K72n09j46
7255c04J97K11j37K98m58J52m8p1J27Rm5J6J03k58M32n30K95J77j53O8P0j05J49
7278A95j16k28J95K9j95K10nj48J68k44l6K31j39J40K46m23K40k9j09j9J86j87
7300c8L3j4l8L33k35Q6j39J42j1J74n62N04l26L12j62j64K18k08njJ65jj99M05
7324B69l42P2JR1O7l43L90l07J14L49n70J24m9J50Q3L1k32M1J22R5l86J62J91
7347A23j4k2k01O4j16L13j50R5k34J51j93L93j21J01k73J5K1J09k94K64Q4n9l6
$$ plain form
7370 20 -203 -31 96 -207 51 196 -21 45 -104 -101 40 -88 -188 118 -79 -51 -38 -101 133 -220 -187 1 40
7393 40 -50 13 36 -264 -21 -82 -17 2 42 63 -48 50 -73 -159 -115 75 62 -130 230 155 -86 122 -80 259 -201
7418 -201 -50 -185 164 -67 24 -114 -235 196 -73 -31 -138 66 24 23 -28 -30 45 -62 -179 133 -111 -199 118
7441 118 4 104 -145 -197 316 -132 25 -176 92 -18 4 -44 75 -55 77 340 33 -18 -138 113 78 178
7463 178 42 101 -134 23 -2 3 -48 -145 153 -236 9 276 -146 177 271 -82 41 25 53 -132 73 260 -9
7486 -9 -177 -5 -219 110 -147 -63 269 -229 -61 -119 -53 124 -51 -201 -46 -77 74 -121 33 75 111 34 13
7509 13 -29 -212 73 91 90 -32 -143 84 55 204 108 99 -73 34 -2 -320 91 51 11 -87 153 177 -19 66 -17
7534 -17 252 -252 66 3 -173 186 -137 -212 -7 -63 43 81 -42 -8 -5 -40 -259 -190 -54 29 191 10 58 -62
$$ packed form
7370B0k23J72J27l03K58J45k17O6j49LJ41j28j00L06j97K8J3o3K34l53L3J88L9
7393D0r0O3K3l00K43o1O5J9M0K1j11R8j23q6M4J90j3j92L60p5k41K08k02L39m60
7418b01J51j35L49k31R1j38j21M31k69M2j07K04m2jn1kP5j07j17L12k44q8L17
7441A18j14J00k49n2N13m48J57k01K68j10K2m8J19j30J32K63l07n1j20K51l5J00
7463A78j36N9k35J57k5Nn1r7K98l89K45K67m22L23R4l53J23j6K8j85K05J87k69
7486ij68J72k14L29k57Q4L32m98J68n8O6J77j75j50J55l1J51j95J54M2L6p7k1
7509A3m2j83K85J8jj22j11K27k9J49r6rj72J07l6l18M11m0m0r8K40K4j96Q5q3
7534a7K69n04L18o3j76L59l23p5K05n6J06L8j23L4Ll5k19O9J36Q3J62j81M8j20
$$ plain form
7558 -62 -111 109 -23 -161 -53 -112 -29 272 -109 -50 115 15 -167 485 -68 -89 -62 -276 93 13 255 74 39
7581 39 104 -28 68 65 131 -15 128 -41 -77 267 -79 183 98 -46 14 74 86 104 93 -29 149 -41 -87 143 115
7606 115 -119 40 -13 29 -103 -221 -260 6 -41 -134 183 -94 221 -186 -47 10 71 -31 38 216 41 -7 -69
7629 -69 52 194 -165 -78 16 -71 -30 -54 -93 -9 -38 120 -11 15 -111 -155 -31 -125 214 -174 -314 -50 198 91
7653 91 -55 107 -29 -60 -67 102 98 -96 -13 41 -64 95 163 -12 -11 -63 -55 195 -25 -163 12 285 106 103 -104
7678 -104 -20 5 65 114 119 18 77 -145 -52 -25 -88 -32 189 33 65 174 59 -43 108 -5 -26 13 67 108 -96
7703 -96 135 63 -22 73 183 47 149 101 -129 310 156 -56 142 82 -182 47 -249 -39 11 165 118 2 -84
7726 -84 -68 -189 -110 -145 -57 2 -327 -4 -191 -18 217 -120 90 224 -242 -132 -41 33 85 -12 63 112 -26 37
$$ packed form
7558f2m9K20j32j38J08n9Q3L01l81N9J65j00j82O52n53k1K7k14L69q0K42j81l5
7581C9O5j32R6lO6j46J43j69l6L44l46K62q5j44O0O0J2J8j1j22J78j90m6K30k8
7606A15k34J59n3M2j32j18l9K66m7r3L17k77L15m07J39N7O1j02O9J78j75m8o2
7629f9J21J42l59Q7R4q7M1k4l9Q4k9J58j31K6j26m4J24r4L39l88j40K64K48j07
7653I1j46J62j36l1pJ69mj94Q3N4j05J59O8j75Jn2QK50k20j38J75K73j79lk07
7678a04Q4K5O0M9Nj01N9k22R3K7o3N6K21j56L2J09j15j02J51j13k1L9N4M1k04
7703i6K31p2q5R5J10j36J02m8k30M39j54k12J98o0k64K29k96K10N0J54m7j16q6
7726h4J6j21P9l5Q8N9l29L23j87J73K35l37K10J34m66J10R1P4N2r7P5M9j38O3
$$ plain form
7750 37 25 -151 9 -57 -145 -137 122 -225 143 244 -24 80 10 28 178 231 -109 -23 58 -148 149 45 182 -36
7774 -36 131 350 175 41 190 68 87 125 -143 -50 97 136 25 173 -202 3 15 119 -221 -183 113 -133
7796 -133 -180 226 37 318 74 30 -69 88 -64 -84 -155 59 151 -214 -357 14 -81 -144 -70 -104 -154 -128 30 -31
7820 -31 -23 -121 -188 75 50 -176 -48 -125 -87 -31 22 -52 55 182 -245 -18 201 42 -29 9 61 -121 -222 -172 -38
7845 -38 -2 211 -82 -109 -48 -70 -31 8 84 -153 -27 -206 135 -140 44 110 137 -69 -45 -31 -195 18 -91 -133
7869 -133 -155 237 14 101 -178 -331 197 22 76 83 -19 305 137 -99 95 26 -180 25 -208 61 9 44 -62
7892 -62 -192 69 28 267 158 115 222 -60 -188 125 -137 77 -175 -167 -174 99 -61 250 76 30 66 -23 -207
7915 -207 -4 52 -59 -41 -180 54 219 25 145 52 198 184 -43 84 63 279 -122 157 -57 -67 120 26
$$ packed form
7750C7j2j76J60o6q8QK59l47L68J01k68J04p0J8J50N3l40Q6Q1k06K97j04J37k18
7774c6J67K19j75j34J49j22J9L8k68R3J47L9j11J48l75K05J2J04l40L8K96k46
7796a33m7M06j89K81k44m4r9J57j52k0p1K14R2l65j43L71r5o3P4l4n0K6J58o1
7820c1Qr8o7K63k5k26J28p7L8N6N3p4J07J27m27K27K19j59p1L8N2j82j01N0J34
7845c8L6K13k93k7O1k2L9L9P6k37J26j79L41k75J84O6K7k06K4J4j64K13j09m2
7869a33k2L92k23Q7k79j53N28j75N4Pj02L24j68k36J94o9k06K05k33K69n2L5j06
7892f2j30K61m1K39j09m3J07k82j28L13k62K14k52QpK73j60L11j74m6L6q9j84
7915b07K03N6j11J8j39K34J65j94J20r3J46j4k27J27k1K16m01K79k14j0J87r4
$$ plain form
7937 26 -114 28 -94 -191 -185 7 51 96 -143 -68 109 -10 50 78 -25 96 -13 -78 -103 -110 93 184 -176 95 -95
7962 -95 -97 87 -262 -114 36 -147 85 96 -180 50 -219 -80 -163 90 51 -60 187 -251 -71 36 160 45
7984 45 -9 93 22 -316 -117 164 -113 127 -87 -274 56 70 64 241 -4 38 -21 153 -12 -6 100 34 174 -106
8008 -106 83 123 27 48 257 -39 -127 -469 10 -16 5 -104 78 -141 -171 37 32 98 161 -38 86 -4 -311 -118
8032 -118 114 169 110 59 140 222 151 179 51 141 -77 267 -61 -26 82 -53 59 94 -53 -34 -7 128 268 -74
8056 -74 -283 141 132 -121 110 -82 -63 -81 103 40 -203 181 -33 56 125 -257 30 -152 -39 -197 117 -23 -96
8079 -96 147 -44 -96 -90 41 128 49 -84 13 49 81 165 142 -89 232 19 71 -8 85 -35 -157 -159 -175 -153 134 -36
8105 -36 211 67 -96 -48 -220 121 282 -13 -183 101 118 -36 -70 46 -250 131 -140 27 251 -38 -23 36
$$ packed form
7937B6j40J42j22r7OJ92M4M5k39P5J77j19O0K8j03J21j09o5k5pK03R1l60K71j90
7962i5kJ84l49J48J50j83K32J1k76K30k69J39q3K53l9j11K47m38J80J07J24j15
7984D5n4J02p1l38J99K81k77K40k14j87L30J4oJ77k45M2n9J74j65OJ06o6J40k80
8008a06J89M0r6K1K09k96q8l42M79k6K1j09J82k19l0K08nO6O3j99J24r0l07J93
8032a18K32N5n9n1Q1Q2p1K8j28R0k18L44l28L5J08j35J12L5j47J9K7J35J40l42
8056g4k09M24rk53K31j92J9j8J84o3k43L84k14Q9O9l82K87j82J13j58L14j40p3
8079i6K43j91n2OJ31Q7p9j33R7L6L2Q4k3k31L21k13N2p9R3j20j22kj6K2K87j70
8105c6K47j44j63M8j72L41J61k95j70K84J7j54l4J16k96L81k71J67K24k89J5N9
$$ plain form
8127 36 -18 129 85 68 275 119 88 59 16 112 127 -66 2 -86 161 -216 -88 -73 -23 6 88 154 -99 -176 -28 -82
8153 -82 -133 64 245 86 -200 -157 108 -47 -123 -152 42 -190 -251 230 73 -77 30 -307 -126 0 416 55
8175 55 -148 63 96 -109 68 78 75 -173 -28 -166 48 -93 -175 23 5 308
$$ packed form
8127C6n4J47m4j7K07j56l1k9m3R6J5j93O8q8K47l77J28J5N0K9Q2O6k53p7J48n4
8153h2n1J97J81j59k86M3K65j55p6k9J94k32o1M81j57j50J07l37J81J26M16l61
8175E5k03K11L3k05J77J0lk48J45j38K14j41q2J98j8L03
8191C08
$$ Imaginary data points
##PAGE= N=2
##DATA TABLE= (X++(I..I)), XYDATA
$$ plain form
0 0 0 0 0 0 8 -8 8 -8 16 -16 24 -24 32 -43 56 -64 75 -88 107 -128 147 -171 199 -228 264 -301 344 -389
28 -389 442 -499 562 -631 707 -790 881 -980 1092 -1213 1344 -1489 1649 -1825 2022 -2240
44 -2240 2479 -2750 3058 -3407 3809 -4278 4832 -5499 6322 -7359 8717 -10588 13326 -17723
58 -17723 25916 -46226 193513 194867 -269667 137445 191752 -184027 14071 294212 -97842
69 -97842 -191514 133373 59350 -150318 80898 126835 -133971 -45412 174062 17676 -41821
80 -41821 81434 -341 -63292 48784 39100 -18279 -43851 -67956 1154 30135 -32089 32636
92 32636 27695 -103300 -8628 104883 -40338 -55303 75043 -25706 -101252 76669 55536
103 55536 -157980 -42270 108703 -83989 -55950 170627 -49436 -188461 130234 89344
$$ packed form
0@%%%%Qj6J6j6K4l2M0m8N6p5R9j20J39j63J95k35K75l18L70m27M92n65O45p33
28c89Q31r41J061j193J338j497J671j861K072k305K557k833L138l474L847m262
44b240M719n229N808o465P216q087R110j0331J1821j3681J6076j9305K3914l1049
58a7723M3639p2142K39739J354m64534M07112N4307l75779J98098K80141l92054
69i7842r3672L24887p4023k09668K31216M5937k60806Q8559K19474j56386n9497
80d1821J23255q1775o2951J12076r684n7379k5572k4105O9110K8981o2224O4725
92C2636m941j30995R4672J13511j45221j4965J30346j00749p5546J77921k1133
103E5536k13516J15710J50973j92692K8039K26577k20063j39025L18695m0890
$$ plain form
113 89344 -150434 69916 105803 -194962 -53453 170153 -48347 -103291 97503 -6346
123 -6346 -133117 71186 113288 -95499 -36072 102288 -25377 -21983 123150 785 -90400
134 -90400 39559 27778 -16728 63404 22432 -37972 18368 14487 9856 51641 2629 -23860
146 -23860 29624 14884 -7662 27322 6424 -39791 3925 44198 -18833 -35807 18114 -32890
158 -32890 -47131 73526 29885 -77325 18720 15456 -88843 29641 71446 -83277 -38455
169 -38455 52105 -50691 -45294 52792 -29869 -97736 8366 34079 -49028 -8113 39960 -62300
181 -62300 -53110 69670 8444 -53186 30468 -15989 -80448 25433 32652 -45159 -3691 -479
193 -479 -53707 -13502 14022 -18833 -15639 5136 3721 129 9800 9177 -16685 -6326 24099 9610
$$ packed form
113H9344k39778K20350L5887l00765J41509K23606k18500n4944K00794j03849
123f346j26771K04303M2102k08787N9427J38360j27665L394J45133j22365r1185
134i0400J29959j1781m4506Q0132m0972o0404N6340l881m631M1785m9012k6489
146b3860N3484j4740k2546L4984k0898m6215M3716M0273o3031j6974N3921n1004
158c2890j4241J20657m3641j07210R6045l264j04299J18484M1805j54723M4822
169c8455R0560j02796N397R8086q2661o7867J06102K5713q3107M0915M8073j02260
181f2300R190J22780o1226o1630Q3654m6457o4459J05881P219p7811M1468L212
193d79n3228M0205K7524l2855L194K0775j415l592R671o23k5862J0359L0425j4489
$$ plain form
207 9610 9938 17091 -15210 -3643 20586 -752 16994 14219 -31282 9011 32093 -15834 18547
220 18547 37511 -25934 4218 54459 1898 -15450 22362 3217 -19919 25352 48116 -16008
232 -16008 -36031 16355 -11644 -34805 46001 28917 -48611 3328 26280 -26616 8481 34493
244 34493 -16416 -19767 7873 5375 -5499 -7860 2501 -7106 -19844 11554 12086 -24883 -9715
257 -9715 4680 -8409 8526 15544 -1169 -9750 -17625 -1989 5421 -17181 1463 10789 -23287
270 -23287 1055 21147 -25013 -16217 12972 -9249 1225 22062 -4334 -18233 -5980 7128
282 7128 11412 6068 10615 -4260 -24879 9146 25282 -143 15669 12330 -23156 1727 18823
295 18823 -5898 2623 4761 -8037 9458 14933 8743 5179 -12374 -2307 16095 5723 15187
$$ packed form
207I610L28P153l2301J1567K4229k1338J7746k775m5501M0293K3082m7927L4381
220A8547J8964o3445L0152N0241n2561j7348L7812j9145k3136M5271K2764o4124
232a6008k0023N2386k7999k3161Q0806j7084p7528N1939K2952n2896L5097K6012
244C4493n0909l351K7640k498j0874k361J0361r607j2738L1398N32l6969J5168
257i715J4395j3089J6935P018j6713q581p875J5636P410k2602J8644R326l4076
270b3287K4342K0092m6160Q796K9189k2221J0474K0837k6396j3899J2253J3108
282G128M284n344M547j4875k0619L4025J6136k5425J5812l339l5486K4883J7096
295A8823k4721Q521K138j2798J7495N475o190l564j7553J0067J8402j0372R464
$$ plain form
308 15187 14934 -15762 -6043 10883 -1133 2891 2789 -8015 -4863 -4146 5720 8332 -12115 5130
322 5130 18599 -10403 2093 13186 -24104 -8545 25515 2598 -2829 5219 -16516 -20557 -1939
335 -1939 9246 2853 -12688 -3496 638 -14093 7929 14286 -20926 -9631 10294 -6947 4730
348 4730 10821 -14145 -10615 -961 773 10356 -3653 -14611 -6079 -12856 -215 20321 1391 -5170
362 -5170 2162 -8735 -1722 8808 2123 6018 3679 2612 11498 -4098 -7898 6169 -7127 35
376 35 19350 -5624 -9087 8670 -4023 3765 20727 2224 -2508 5364 2343 8984 10136 6234
390 6234 5388 -4886 4332 13008 -8750 -5270 3581 -13764 4220 23430 -117 -3262 2290 -10576
404 -10576 1096 13903 8664 6754 -4845 -6015 3490 -7001 -1963 6909 -13603 -10990 4003
$$ packed form
308A5187k53l0696R719J6926j2016M024j02j0804L152P17R866K612k0447J7245
322E130J3469k9002J2496J1093l7290J5559L4060k2917n427Q048k1735m041J8618
335a939J1185o393j5541R192M134j4731K2022O357l5212J1295J9925j7241J1677
348D730O091k4966L530R654J734R583j4009j0958Q532o777J2641K0536j8930o561
362e170P332j0897P013J0530o685L895k339j067Q886j5596l800J4067j3296P162
376C5J9315k4974l463J7757j2693P788J6962j8503m732P872l021O641J152l902
390F234q46j0274R218Q676k1758L480Q851j7345J7984J9210k3547l145N552j2866
404a0576J1672J2807n239j910j1599j170R505j0491N038Q872k0512K613J4993
$$ plain form
417 4003 -9628 -6813 4814 -2537 1440 3986 236 2347 -8025 -4470 10769 -3620 -3475 10293
431 10293 -12121 -14722 4276 -10101 -11876 2906 -2282 -605 5853 1383 877 -6150 -4149 9864
445 9864 812 -527 7219 -11916 -12629 5467 -2286 -80 6178 -7955 -6007 -248 -2357 10850
459 10850 8708 -1019 7921 -2125 -10160 4989 -2375 -6946 7540 -109 -3653 4953 -2263 -2041
473 -2041 1655 -1750 3685 1121 -1866 5628 -6580 -10448 2362 -10980 -10154 8258 -8215 -11940
487 -11940 5379 -6649 -5304 13980 5024 -1738 1275 -6014 -7703 -5423 -254 3595 -7424 -5806
501 -5806 -328 -14317 -6554 8735 -3609 3174 13757 -2289 2242 8183 -4587 2672 3267 -9559
515 -9559 -803 -2755 -11912 499 199 -7368 2647 4811 1575 4393 4408 5671 -988 1516 16327
$$ packed form
417D003j3631K815J1627p351L977K546l750K111j0372L555J5239j4389J45J3768
431A0293k2414k601J8998j4377j775J4782n188J677O458m470n06p027K001J4013
445I864r052j339P746j9135p13J8096p753K206O258j4133J948N759k109J3207
459A0850k142r727Q940j0046q035J5149p364m571J4486p649l544Q606p216K22
473b041L696l405N435k564k987P494j2208l868J2810j3342Q26J8412j6473l725
487a1940J7319j2028J345J9284q956o762L013p289j689K280N169L849j1019J618
501e806N478j3989P763J5289j2344O783J0583j6046M531N941j2770P259N95j2826
515i559Q756j952r157J2411l00p567J0015K164l236K818J5J263o659K504J4811
$$ plain form
530 16327 3517 -5134 8823 -10611 -21017 9385 3705 -8485 14038 4620 -12406 6914 10490
543 10490 1752 9456 9772 2060 -842 2630 4532 -5159 -3147 4049 -10360 -7181 4638 -11767
557 -11767 -5779 11179 -4294 1629 15706 -5572 -3339 11135 -5735 -2893 11067 -1368 -2807
570 -2807 6163 -1400 -7066 -3325 1760 455 1591 13404 5653 -8649 6775 5457 -6212 15111
584 15111 10808 -13753 2556 4861 -9895 11977 15336 -6672 1785 5751 -6644 2551 8962
597 8962 -96 -3229 3210 3909 -5418 -2455 3844 -11585 -6388 15309 -261 -2470 16796 -4750
611 -4750 -10271 15967 1538 -7963 11649 -1859 -13232 4293 178 -9101 -67 2814 -4323 -4572
625 -4572 1298 -3231 -10774 4932 10085 -6943 1444 1457 -22345 -6565 9635 -9279 -384 7479
$$ packed form
530A6327j2810q651J3957j9434j0406L0402n680j2190K2523r418j7026J9320L576
543A0490q738P704L16p712k902L472J902r691K012P196j4409L179J1819j6405
557a1767N988J6958j5473N923J4077k1278K233J4474j6870K842J3960j2435j439
570b807Q970p563n666L741N085j305J136J1813p751j4302J5424j318j1669K1323
584A5111m303k4561J6309K305j4756K1872L359k2008Q457L966j2395R195O411
597H962r058l133O439O99r327K963O299j5429N197K1697j5570k209J9266k1546
611d750n521K6238j4429r501J9612j3508j1373J7525m115r279R034K881p137k49
625d572N870m529p543J5706N153j7028Q387J3k3802J5780J6200j8914Q895P863
$$ plain form
639 7479 -15350 -6119 8800 -4607 -2325 3312 -7515 -2861 6340 3269 -1818 -2932 -704 -1888
653 -1888 2341 12091 -2075 -9846 5905 -1977 -3965 19648 3064 -15655 6470 41 -12716
666 -12716 12780 10618 -8724 5781 10121 -4289 -2653 2869 -3430 -7680 3573 7054 -11170
679 -11170 -9820 2721 -9223 -2535 16129 -2837 -8577 8545 -36 2346 15304 -644 -6579
692 -6579 756 -6756 -2721 924 -12179 -11282 -3360 -1374 4314 3426 -3495 -9307 -7022 8559 9390
707 9390 -171 6476 -4748 -19046 4508 6549 -13135 182 1026 -16689 870 10534 -5587
720 -5587 -2534 4578 912 2106 4690 2978 -5371 -4771 10005 7781 512 7326 -2867 -9031 8942
735 8942 7152 -83 7880 -854 -3530 10739 3216 -3467 1195 -6812 -1977 11450 5884 -543 -3491
$$ packed form
639G479k2829R231J4919j3407K282N637j0827M654R201l071n087j114K228j184
653a888M229R750j4166p771J5751p882j988K3613j6584j8719K2125o429j2757
666a2716K5496k162j9342J4505M340j4410J636N522o299m250J1253L481j8224
679a1170J350J2541j1944O688J8664j8966n740J7122q581K382J2958j5948n935
692f579P335p512M035L645j3103Q97P922J986N688q88o921n812K285J5581Q31
707I390r561O647j1224j4298K3554K041j9684J3317Q44j7715J7559R664j6121
720e587L053P112l666J194K584j712q349O00J4776k224p269O814j0193o164J7973
735H942j790p235P963q734k676J4269p523o683M662q007M835J3427n566o427k948
$$ plain form
750 -3491 -6723 1480 7135 7463 4205 -9196 -8484 2928 1312 7084 7687 -9561 -6209 2896 -4460
765 -4460 2795 4913 -9500 -574 7664 -659 1780 -676 -9206 -2863 3126 5302 3107 -6067 -4155
780 -4155 -1762 -4786 5133 2580 -11555 -2273 2315 -3365 4663 1688 -7375 1770 3162 2429 4938
795 4938 -7173 -9607 1141 1320 6205 7282 -7489 -9268 -3202 767 10443 7508 -250 2443 -687
810 -687 2119 11951 1596 -4586 638 -4020 535 6484 -4002 -5111 -2320 -4561 6039 6740 -3480
825 -3480 -765 -1499 -2169 8808 6253 -146 630 -5528 -2833 2842 -4237 -2326 984 -3870 3086 3930
841 3930 -5895 -3825 -3758 -2102 8759 4375 -2333 514 -6379 -2372 9632 2724 -1891 -1029 -7923
856 -7923 -2239 4896 287 1024 -3193 -7391 1989 1253 -2881 1233 -4403 -3616 7157 5001 3765 2102
$$ packed form
750c491l232Q203N655L28l258j3401P12J1412j616N772O03j7248L352R105p356
765d460P255K118j4413Q926Q238q323K439k456q530O343N989K176k195r174J912
780d155K393l024R919k553j4135R282M588n680Q028k975r063R145J392p33K509
795D938j2111k434J0748J79M885J077j4771j779O066L969R676k935p758K693l130
810f87K806R832j0355o182N224m658M555N949j0486j109K791k241J0600P01j0220
825c480K715p34o70J0977k555o399P76o158K695N675p079J911L310m854O956Q44
841C930r825K070O7J656J0861m384o708K847o893M007J2004o908m615Q62o894
856g923N684P135m609P37m217m198R380p36m134M114n636P87J0773k156j236j663
$$ plain form
872 2102 -7763 -2445 3022 -841 6249 3475 -8674 -1204 1253 -4078 2817 1852 -2645 2138 1080
887 1080 1625 3644 -2295 1947 5945 -712 1561 -470 -8768 -1599 1823 202 5386 -1798 -7084
902 -7084 1043 -2608 -985 7572 -924 -3288 4610 744 1208 2571 -4464 -2765 -1406 -452 6040 408
918 408 -6001 -531 -3022 -1206 7973 1543 -2687 -1093 -5361 1206 7093 668 3263 870 -7986
933 -7986 -127 2678 -3327 1992 2160 -1888 2660 563 -1560 -536 -4829 953 4590 -1739 1941
948 1941 1308 -6270 1644 4257 -1896 2745 237 -4071 3504 1350 -997 2921 -2379 -2224 3908 -1556
964 -1556 -2507 -1943 -6380 646 5803 2853 4682 -2245 -7562 1123 1918 2621 7770 -2024 -5834 319
980 319 -2537 -25 3241 -5277 -3785 607 -2248 3985 3289 -3104 1662 2553 1143 5749 -263 -4203
$$ packed form
872B102r865N318N467l863P090k774j2149P470K457n331O895r65m497M783j058
887A080N45K019n939M242L998o657K273k031q298P169L422j621N184p184n286
902g084Q127l651J623Q557q496k364P898l866M64J363p035J699J359R54O492n632
918D08o409N470k491J816R179o430m230J594m268O567N887o425K595k393q856
933g986P859K805o005N319J68m048M548k097k123J024m293N782L637o329L680
948A941o33p578P914K613o153M641k508m308P575k154k347L918n300J55O132n464
964a556r51N64m437P026N157k950J829o927n317Q685P95P03N149r794l810O153
980C19k856K512L266q518J492M392k855O233o96o393M766Q91j410M606o012l940
$$ plain form
996 -4203 -12 -2127 1463 4854 -3620 -3158 -2174 -6586 1131 3147 -2579 3491 3941 -250 5359 1247
1012 1247 -4208 1215 730 1761 4854 -3169 -5245 -2983 -4187 3498 4354 -4173 -1915 -2787 -3155 7260
1028 7260 6325 14 2754 -2235 -1890 4237 -1177 -3012 -1324 -5704 352 4466 -2676 -2301 -3466 -6591
1044 -6591 2729 5282 1556 3294 -1705 -3186 3012 403 -96 1916 -4997 -2174 1375 -3916 -534
1059 -534 491 -3842 2886 3073 -3261 -477 -2705 -3415 5341 4214 748 300 -6290 -4295 1422 -929
1075 -929 1639 400 -5479 842 2833 -1348 2429 -1505 -5881 2123 2438 335 2246 -4234 -4175 1785
1091 1785 626 3993 2710 -5316 -1473 1542 -147 6580 4265 -2885 433 -1319 -3268 1861 -1514
1106 -1514 -1381 2824 -656 1131 2148 -4401 282 3704 582 5426 3566 -3556 1125 1016 -906
$$ packed form
996d203M191k115L590L391q474M62R84m412P717K016n726O070M50m191N609m112
1012A247n455N423m85J031L093q023k076K262j204P685Q56q527K258q72l68J0415
1028G260r35o311K740m989L45O127n414j835J688m380O056M114p142L75j165l125
1044f591R320K553l726J738m999j481O198k609m99K012o913K823L549n291L382
1059e34J025m333O728J87o334K784k228p10Q756j127l466m48o590J995N717k351
1075i29K568j239n879O321J991m181L777l934m376Q004L15k103J911o480N9N960
1091A785j159L367j283q026L843L015j689O727k315p150L318j752j949N129l375
1106a514J33M205l480J787J017o549M683L422l122M844j860p122M681j09j922
$$ plain form
1121 -906 3213 -1801 -4482 -218 -2669 74 3778 -2402 114 3964 431 4373 3721 -3608 -193
1136 -193 1182 436 5692 1109 -4170 -2978 -6317 -2470 3747 -1149 219 1897 -3946 1374 4527
1151 4527 -1566 2614 2823 -2469 1685 1110 -2839 310 -1434 -1110 1596 -2509 -1514 -464 -3573 2528
1167 2528 4985 -393 4477 3636 -2126 3689 2221 -2508 2433 1229 -381 3808 -942 -3325 -914
1182 -914 -3960 505 4806 464 1811 1240 -1965 3386 4370 2381 4477 -1640 -3353 1722 -2501 -570
1198 -570 4647 -3185 -2413 2812 -3775 -1699 3147 -1380 962 4108 820 1464 -445 -2068 -739 -3415
1214 -3415 -1320 1733 -3426 -798 1515 -4916 -836 2257 -3716 1167 2406 -4902 -964 -1035 -5273
1229 -5273 1109 1132 -3325 -1188 -3582 -4794 -33 837 3004 3032 -1134 698 -1391 -3885 2626 -353
$$ packed form
1121i06M119n014k681M264k451K743L704o180K516L850l533L942o52p329L415
1136a93J375p46N256m583n279J192l339L847O217m896J368J678n843N320L153
1151D527o093M180K09n292M154n75l949L149j744L24K706m105R95J050l109O101
1167B528K457n378M870q41n762N815j468m729M941j204j610M189m750k383K411
1182i14l046M465M301m342J347n71l205N351R84j989K096o117j713N075m223J931
1198e70N217p832P72N225o587K076M846m527K342L146l288O44j909j623J329k676
1214c415K095L053n159K628K313o431M080L093n973M883J239p308L938p1m238
1229e273O382K3m457K137k394j212M761Q70K167K8m166J832k089k494O511k979
$$ plain form
1245 -353 -4508 2532 -1677 -4887 2997 -638 -3427 3613 584 -310 5106 1717 541 2328 -194
1260 -194 989 669 -992 -128 -3152 -3399 631 -1992 1565 6008 -1178 341 4223 -3598 773 7518
1276 7518 -134 1302 4112 -4256 -3705 398 -2570 -1071 -113 -880 -867 -1919 1379 2879 -1338 2682
1292 2682 2874 -4214 1275 2059 -5107 262 926 -5268 263 -616 -5706 -913 -2223 -4006 2098 1587
1308 1587 362 2721 -657 -2108 -1190 -1055 1654 91 -540 1754 -4141 -3820 3431 -2196 -2061 6241
1324 6241 -2047 -4459 4923 144 -1842 5988 2329 -2254 721 654 -514 -291 2193 3296 -1192 1325
1340 1325 4965 -2150 -913 4234 -2760 -516 5926 -405 -56 2505 -3229 -429 2581 -146 3502
1355 3502 3111 -1738 1945 1507 -952 2561 1349 -1089 -1320 -3288 -1564 -1862 -2007 4320 393 -4015
$$ packed form
1245c53m155P040m209l210P884l635k789P040l029q94N416l389j176J787k522
1260a94J183l20j661Q64l024k47M030k623L557M443p186J519L882p821M371O745
1276G518p652J436K810q368N51M103k968J499R58p67J3j052L298J500m217M020
1292B682J92p088N489P84p166N369O64o194N531q79n090M793j310j783O104n11
1308A587j225K359l378j451R18J35K709j563o31K294n895L21P251n627J35Q302
1324F241q288k412R382m779j986P830l659m583K975o7j168K23K484J103m488K517
1340A325L640p115J237N147o994K244O442o331L49K561n734K800L010k727L648
1355C502l91m849L683m38k459L513j212k438k31j968J724k98j45O327l927m408
$$ plain form
1371 -4015 3503 -940 -5788 5148 3248 -4465 2845 1213 -6197 -1250 43 -4192 -3605 -1569 -248
1386 -248 -2118 -983 3308 -1858 -3681 4600 394 -2357 4293 -1932 -5614 1631 -589 -1406 3114
1401 3114 -2051 -3487 -101 -3047 821 4115 405 1618 2235 -1163 -347 -239 887 1729 -427 2859
1417 2859 2232 -3440 2160 4045 -3120 2986 5473 -3941 496 4775 -2175 498 3502 -1023 -401
1432 -401 1581 1451 390 -1079 1981 2567 314 4851 3488 -3841 -106 -396 -3621 3149 2633 -2656
1448 -2656 821 -2109 -3991 3267 656 -1188 3431 -418 -2149 2334 774 -399 37 -599 -314 -3269
1464 -3269 -2414 439 -4203 -2057 4280 -2504 -2669 4057 -2735 -3232 4498 61 -1139 3742 508 -938
1480 -938 -145 -1858 -1789 -2388 -641 2366 -1157 -1039 1110 -3144 -35 4963 794 1998 2490 -2872 952
$$ packed form
1371d015P518m443m848J0936j900p713P310j632p410M947J293m235N87K036J321
1386b48j870J135M291n166j823Q281m206k751O650o225l682P245k220q17M520
1401C114n165j436L386k946L868L294l710J213O17l398Q16J08J126Q42k156L286
1417B859o27n672N600J885p165O106K487r414M437M279o950K673L004m525O22
1432d01J982j30j061j469L060N86k253M537j363p329L735k90l225O770n16n289
1448b656L477k930j882P258k611j844M619l849j731M483j560j173M36o36K85k955
1464c269Q55K853m642K146O337o784j65O726o792m97P730m437j200M881l234j446
1480i38P93j713O9n99J747L007l523J18K149m254L109M998m169J204M92n362L824
$$ plain form
1497 952 3525 -282 3360 1320 -4691 -308 52 -2838 1713 1403 -967 1588 1700 1458 790 -300
1513 -300 2034 615 -709 4809 686 -4188 1915 -1291 -5226 2782 454 -4039 948 134 -2427
1528 -2427 944 790 61 903 -855 -213 -2208 -3721 859 -474 -1777 2042 -2580 -5246 -902 -2977
1544 -2977 -1585 2976 -1675 -1864 774 -3933 -1158 1646 -3522 -1987 37 -3159 -678 195 -1713
1559 -1713 -1171 -1693 -364 1109 -1819 182 -117 -4850 591 2781 -2897 939 749 -5855 -1602 1693
1575 1693 -1575 1984 3120 -409 920 407 -81 1044 -706 1554 2017 -1799 628 52 -3352 1656
1591 1656 1873 -1319 2540 589 -1334 3889 2268 1430 4460 -9 -659 2670 -915 -766 1180 -1939
1607 -1939 -402 1788 181 1154 -1061 -1761 1348 636 2957 5982 -105 -1040 1707 -2547 404 3693
$$ packed form
1497I52K573l807L642k040o011M383L60k890M551l10k370K555J12k42o68j090
1513c00K334j419j324N518m123m874O103l206l935Q008k328m493M987q14k561
1528b427L371j54p29Q42j758O42j995j513M580j333j303L819m622k666M344k075
1544b977J392M561m651j89K638m707K775K804n168J535K024l196K481Q73j908
1559a713N42n22J329J473k928K001k99m733N441K190n678L836j90o604M253L295
1575A693l268L559J136l529J329n13m88J125j750K260M63l816K427n76l404N008
1591A656K17l192L859j951j923N223j621q38L030m469o50L329l585J49J946l119
1607a939J537K190j607R73k215p00L109p12K321L025o087r35K747m254K951L289
$$ plain form
1623 3693 -2150 -1972 -211 -3521 -389 1362 -1048 649 255 -231 1955 47 510 2269 -129 1740
1639 1740 2728 -2181 -1095 -433 -3925 125 1333 -2340 1008 369 -1638 2089 632 -823 2814 902
1655 902 1252 3968 197 -913 360 -1451 1636 2313 -885 -86 -1911 -1394 4196 2719 1755 3881
1671 3881 -1244 -1081 3899 996 1365 3668 -860 -108 2481 -712 133 121 -1374 1383 2094 1067 2570
1688 2570 -750 -700 2331 -485 737 2434 -2785 -1120 1380 -2079 481 1160 -2161 691 618 -1999
1704 -1999 59 -1427 -1832 2195 579 -1244 -965 -4660 -4117 -677 -1084 524 -238 -3582 -1165 -752
1720 -752 -1110 2395 -718 -3539 386 -1952 -2195 1299 -2987 -4145 -768 -2449 -1238 390 -2312 -1286
1736 -1286 610 479 3297 1954 -381 529 -2078 -1478 1947 -1352 -1197 1535 -2649 -1538 1070 -2522
$$ packed form
1623C693n843J78J761l310L132J751k410J697l94m86K186j908M63J759k398J869
1639A740R88m909J086O62l492M050J208l673L348o39k007L727j457j455L637j912
1655I02L50K716l771j110J273j811L087O77l198P99j825N17N590j477r64K126
1671C881n125J63M980k903L69K303m528P52K589l193Q45j2j495K757P11j027J503
1688B570l320N0L031k816J222J697n219J665K500l459K560O79l321K852p3k617
1704a999K058j486m05M027j616j823K79l695N43L440m07J608p62l344K417M13
1720g52l58L505l113k821L925k338k43L494m286j158L377j681J211J628k702J026
1736a286J896j31K818j343k335R10k607O00L425l299J55K732m184J111K608l592
$$ plain form
1752 -2522 -303 2747 823 3082 2646 -543 1348 1181 385 2677 -272 -1994 -820 -2491 -15 1959
1768 1959 -1006 386 338 -1720 2222 2192 -997 1952 1001 -1119 3077 989 -2408 -844 -2532 -1974
1784 -1974 1382 299 -130 -476 -2611 -619 320 -490 1577 -546 -2502 293 -1154 -1722 1635 -1462
1800 -1462 -1738 1410 -2102 -2365 491 -1777 -396 2110 -687 -722 -1021 -2567 -704 -163 53 1788 -976
1817 -976 62 2868 -186 564 2357 -1677 521 3276 -72 601 777 -2183 -149 1489 370 2045
1833 2045 -167 -1082 1257 709 2561 4218 735 316 708 -1443 804 1896 -748 1410 326 -1851
1849 -1851 1592 79 -1770 2386 941 -226 2999 1048 -779 1136 -162 -147 326 -792 -24 -1346
1865 -1346 -1779 1346 -1045 -1993 2195 -773 -1965 1910 -1522 -2992 955 -425 -626 1483 -907 -2236
$$ packed form
1752b522K219L050j924K259m36l189J891j67p96K292k949j722J174j671K476J974
1768A959k965J392m8k058L942l0l189K949r51k120M196k088l397J564j688N58
1784a974L356j083m29l46k135J992R39q10K067k123j956K795j447n68L357l097
1800a462k76L148l512k63K856k268J381K506k797l5k99j546J863N41K16J735k764
1817i76J038K806l054P50J793m034K198K755l348O73J76k960K034J638j119J675
1833B045k212r15K339n48J852J657l483m19L92k151K247J092k644K158j084k177
1849a851L443j513j849M156j445j167L225j951j827J915j298J5M73j118P68j322
1865a346m33L125k391r48M188k968j192L875l432j470L947j380k01K109k390j329
$$ plain form
1881 -2236 -2053 -2003 607 749 -422 1000 -1976 -2048 1050 -720 -382 1083 -2013 -1245 1536 -1078 760
1898 760 1648 -1493 808 1829 -1178 729 840 -1791 572 1056 346 529 -1094 -1093 -728 -1765 1450
1915 1450 1499 -864 2331 1633 -1696 2062 1531 -1438 2899 2259 -1221 749 -219 -1750 537 734 321
1932 321 57 -1108 138 583 1043 3789 1502 -346 2136 -71 -1086 2579 -687 -1905 1725 -943
1948 -943 -1353 1711 -1717 -2387 481 -431 493 1938 374 -284 -807 -213 1253 -713 337 829 -2633
1965 -2633 -899 1224 -2294 -29 1996 -1962 -193 1221 -2587 -514 1837 -496 1194 1578 -1303
1980 -1303 -1086 -693 -641 346 -207 528 -494 -1832 825 -184 -2361 1255 -53 -2657 2438 1135 -2016
1997 -2016 1528 562 -1952 2045 1565 -864 -11 -419 -846 281 1092 1567 -304 -1286 566 -1307 -823
$$ packed form
1881b236J83N0K610J42j171J422k976p2L098j770L38J465l096P68K781k614J838
1898G60Q88l141K301J021l007J907J11k631K363M84p10J83j623JL65j037L215
1915A450M9k363L195o98l329L758n31k969M337o40l480J970r68j531K287J97m13
1932C21k64j165J246M45M60K746k287j848K482k207j015L665l266j218L630k668
1948i43m10L064l428o70K868r12R24J445j564o58n23N94J466j966J050M92l462
1965b633J734K123l518K265K025l958J769J414l808K073K351k333J690L84k881
1980a303K17L93N2R87n53P35j022j338K657j009k177L616j308k604N095j303l151
1997b016L544r66k514L997m80k429Q53m08m27J127Q11M75j871r82J852j873M84
$$ plain form
2014 -823 3237 317 -318 2601 -801 -1032 2216 -1168 -1196 2193 -950 -984 1140 -1478 -1219 886 -468
2031 -468 -608 -417 -377 -430 -1169 487 645 -1919 550 1057 -3026 122 1038 -4036 -5 2347 -1913 -91
2049 -91 822 -3542 -2060 248 -866 -302 65 -620 -1452 -1893 310 314 -1400 1302 -88 -2220 1470 262
2067 262 -1912 1455 -364 -2657 670 -1039 -2443 1033 -192 -1314 2203 1077 -547 1314 658
2082 658 402 699 1313 1740 -98 676 1211 -2454 -1109 1807 -1705 -63 3288 -1452 -866 2984 326
2099 326 803 3861 646 -389 934 28 61 642 815 92 -1494 -530 -252 -2165 802 1680 -789 1751
2117 1751 2132 -950 1487 1682 -1881 1080 1252 -1418 791 501 -2168 -525 -171 -1048 143 252 342
2134 342 -534 -610 1101 141 373 2509 -576 -1963 970 -1220 -1754 2573 318 -1492 1501 -776 -1659
$$ packed form
2014h23M060k920o35K919l402k31L248l384k8L389l143l4K124k618K59K105j354
2031d68j40J91M0n3p39J656J58k564K469N07m083L148R16n074M031K352m260J822
2049i1R13m364J482K308j114N64L67o85q32m41K203Mj714K702j390k132L690j208
2067B62k174L367j819k293L327j709j404L476j225j122L517j126j624J861o56
2082F58k56K97O14M27j838P74N35l665J345K916l512J642L351m740N86L850k658
2099C26M77L058l215j035J323r06L3N81J73p23j586R64K78j913K967Q78k469K540
2117A751L81l082K437J95l563K961J72k670K209k90k669J643L54q77J191J09R0
2134C42q76p6J711r60K32K136l085j387K933k190n34M327k255j810K993k277q83
$$ plain form
2151 -1659 1134 342 61 1336 391 189 641 42 455 -430 106 1264 -643 265 1752 -1064 555
2168 555 2408 -766 801 2357 -1385 19 1588 -1266 254 1956 -316 390 28 -1248 -458 90
2184 90 1260 1552 325 858 28 -2122 587 883 -1337 766 -182 -2603 273 351 -1270 940 -318
2201 -318 -1331 923 -140 -556 816 -366 -233 612 -701 -378 -1212 -2145 -831 -1164 -860 1469 -368
2218 -368 -781 957 -1210 -565 1949 -266 76 1654 -1137 -929 72 -1729 -336 -17 -1028 -459 -956
2235 -956 -1218 729 350 1009 1488 -789 -450 922 -869 729 1162 -1528 87 310 -1641 22 -912
2252 -912 -2066 4 285 11 1776 -229 -797 594 -493 755 1451 -267 73 -58 -1349 687 411
2269 411 -881 571 -676 -1252 724 -817 -537 1952 276 552 1043 -1188 -831 551 -302 1009 1303
$$ packed form
2151a659K793p92k81J275r45k02M52n99M13q85N36J158j907R08J487k816J619
2168E55J853l174J567J556l742J404J569k854J520J702k272P06l62j276P90N48
2184I0J170K92j227N33q30k150K709K96k220K103r48k421K876P8j621K210j258
2201c18j013K254j063m16J372j182J33Q45j313L23q34r33J314l33L04K329j837
2218c68m13J738k167O45K514k215L42J578k791K08J001j801J393L19j011N69m97
2235i56k62J947l79O59M79k277L39J372j791J598M33k690J615K23j951J663r34
2252i12j154K070K81k74J765k005n68J391j087J248O96j718L40j31j291K036k76
2269D11j292J452j247n76J976j541K80K489j676K76M91k231L57J382q53J311K94
$$ plain form
2286 1303 -687 221 -459 -783 1019 35 -233 694 -548 191 1496 -454 -26 664 -721 875 1505
$$ packed form
2286A303j990R08o80l24J802r84k68R27j242P39J305j950M28O90j385J596O30
$$ [...]
8191a62
##END NTUPLES=NMR FID
##END=
