##TITLE=1H_54-2021
 CDCl3, 8 sc, 
 7.07.2021
##JCAMPDX= 6.0         $$ Bruker NMR JCAMP-DX V2.0
##DATA TYPE= NMR FID
##DATA CLASS= NTUPLES
##ORIGIN= UXNMR, Bruker Analytische Messtechnik GmbH
##OWNER= root
$$ XWIN-NMR		Version 3.5
$$ Wed Jul  7 10:43:00 2021 Russian Standard Time (UT+4h)  she@DPX200
##.OBSERVE FREQUENCY= 200.131506
##.OBSERVE NUCLEUS= ^1H
##.DELAY= (6, 6)
##.ACQUISITION MODE= SIMULTANEOUS
##.ACQUISITION SCHEME= undefined
##.AVERAGES= 8
##.DIGITISER RES= 18
##SPECTROMETER/DATA SYSTEM= spect
##.PULSE SEQUENCE= zg30
##.SOLVENT NAME= D2O
##.SHIFT REFERENCE= (INTERNAL, D2O, 0, 15.7039)
##AUDIT TRAIL= $$ (NUMBER, WHEN, WHO, WHERE, WHAT)
$$ ##TITLE= Audit trail, XWIN-NMR		Version 3.5
$$ ##JCAMPDX= 5.01
$$ ##ORIGIN= Bruker BioSpin GmbH
$$ ##OWNER= she
$$ F:/spectra/data/she/nmr/H-F/1/audita.txt
$$ ##AUDIT TRAIL=  $$ (NUMBER, WHEN, WHO, WHERE, WHAT)
(   1,<2021-07-07 10:41:39.60 +0400>,<she>,<DPX200>,
      <created by zg, POWCHK disabled, PULCHK disabled
       configuration hash MD5:
       00 E9 B6 7A A2 85 ED C7 34 08 36 98 17 FE 4E 26
       data hash MD5: 16K
       1A 5E 39 AF 8B 25 84 98 0D C7 19 E8 F4 3E 86 12>)
$$ ##END=
$$ 
$$ hash MD5
$$ FB 92 3C A9 9B F0 37 E5 10 AC E3 84 D4 AB CF 35
##$RELAX= 
##$RELAX= 
##$RELAX= 
##$RELAX= 
##$RELAX= 
##$RELAX= 
$$ Bruker specific parameters
$$ --------------------------
##$DU= <F:/spectra>
##$EXPNO= 1
##$NAME= <H-F>
##$PROCNO= 1
##$TYPE= <nmr>
##$USER= <she>
##$AMP= (0..31)
100 100 100 100 100 100 100 100 100 100 100 100 100 100 100 100 100 100 
100 100 100 100 100 100 100 100 100 100 100 100 100 100 
##$AQSEQ= 0
##$AQ_mod= 1
##$AUNM= <au_zg>
##$AUTOPOS= <>
##$BF1= 200.13
##$BF2= 200.13
##$BF3= 200.13
##$BF4= 200.13
##$BF5= 200.13
##$BF6= 200.13
##$BF7= 200.13
##$BF8= 200.13
##$BYTORDA= 1
##$CFDGTYP= 0
##$CFRGTYP= 5
##$CHEMSTR= <none>
##$CNST= (0..31)
1 1 145 1 1 1 1 1 1 1 1 1 1 1 1 1 1 1 1 1 1 1 1 1 1 1 1 1 1 1 1 1 
##$CPDPRG= <>
##$CPDPRG1= <>
##$CPDPRG2= <>
##$CPDPRG3= <>
##$CPDPRG4= <mlev>
##$CPDPRG5= <mlev>
##$CPDPRG6= <mlev>
##$CPDPRG7= <mlev>
##$CPDPRG8= <mlev>
##$CPDPRGB= <>
##$CPDPRGT= <>
##$D= (0..31)
0 1.2 0 0 0 0 0 0 0 0.06 0 0.03 0 0 0 0 0.0002 0 0 0 0 0 0 0 0 0 0 0 0 
0 0 0 
##$DATE= 1625640099
##$DBL= (0..7)
120 120 120 120 120 120 120 120 
##$DBP= (0..7)
150 150 150 150 150 150 150 150 
##$DBP07= 0
##$DBPNAM0= <>
##$DBPNAM1= <>
##$DBPNAM2= <>
##$DBPNAM3= <>
##$DBPNAM4= <>
##$DBPNAM5= <>
##$DBPNAM6= <>
##$DBPNAM7= <>
##$DBPOAL= (0..7)
0.5 0.5 0.5 0.5 0.5 0.5 0.5 0.5 
##$DBPOFFS= (0..7)
0 0 0 0 0 0 0 0 
##$DE= 6
##$DECBNUC= <off>
##$DECIM= 32
##$DECNUC= <off>
##$DECSTAT= 4
##$DIGMOD= 1
##$DIGTYP= 9
##$DL= (0..7)
0 120 120 120 120 120 120 120 
##$DP= (0..7)
150 150 150 150 150 150 150 150 
##$DP07= 0
##$DPNAME0= <>
##$DPNAME1= <>
##$DPNAME2= <>
##$DPNAME3= <>
##$DPNAME4= <>
##$DPNAME5= <>
##$DPNAME6= <>
##$DPNAME7= <>
##$DPOAL= (0..7)
0.5 0.5 0.5 0.5 0.5 0.5 0.5 0.5 
##$DPOFFS= (0..7)
0 0 0 0 0 0 0 0 
##$DQDMODE= 0
##$DR= 18
##$DS= 0
##$DSLIST= <SSSSSSSSSSSSSSS>
$$ [...]
##$SUBNAM2= <"">
##$SUBNAM3= <"">
##$SUBNAM4= <"">
##$SUBNAM5= <"">
##$SUBNAM6= <"">
##$SUBNAM7= <"">
##$SUBNAM8= <"">
##$SUBNAM9= <"">
##$SW= 20.0188882624521
##$SWIBOX= (0..15)
0 0 2 0 0 0 0 0 0 0 0 0 0 0 0 0 
##$SW_h= 4006.41025641026
##$TD= 16384
##$TD0= 1
##$TE= 0
##$TE2= 300
##$TE3= 300
##$TEG= 300
##$TL= (0..7)
0 120 120 120 120 120 120 120 
##$TP= (0..7)
150 150 150 150 150 150 150 150 
##$TP07= 0
##$TPNAME0= <>
##$TPNAME1= <>
##$TPNAME2= <>
##$TPNAME3= <>
##$TPNAME4= <>
##$TPNAME5= <>
##$TPNAME6= <>
##$TPNAME7= <>
##$TPOAL= (0..7)
0.5 0.5 0.5 0.5 0.5 0.5 0.5 0.5 
##$TPOFFS= (0..7)
0 0 0 0 0 0 0 0 
##$TUNHIN= 0
##$TUNHOUT= 0
##$TUNXOUT= 0
##$USERA1= <user>
##$USERA2= <user>
##$USERA3= <user>
##$USERA4= <user>
##$USERA5= <user>
##$V9= 5
##$VALIST= <valist>
##$VCLIST= <CCCCCCCCCCCCCCC>
##$VD= 0
##$VDLIST= <DDDDDDDDDDDDDDD>
##$VPLIST= <PPPPPPPPPPPPPPP>
##$VTLIST= <TTTTTTTTTTTTTTT>
##$WBST= 1024
##$WBSW= 4
##$XGAIN= (0..3)
0 0 0 0 
##$XL= 0
##$YL= 0
##$YMAX_a= 503086
##$YMIN_a= -783415
##$ZGOPTNS= <>
##$ZL1= 120
##$ZL2= 120
##$ZL3= 120
##$ZL4= 120
##$ABSF1= 10
##$ABSF2= 0
##$ABSG= 5
##$ABSL= 3
##$ALPHA= 0
##$AQORDER= 0
##$ASSFAC= 0
##$ASSFACI= 0
##$ASSFACX= 0
##$ASSWID= 0
##$AUNMP= <proc_1d>
##$AZFE= 0.1
##$AZFW= 0.1
##$BCFW= 1
##$BC_mod= 2
##$BYTORDP= 1
##$COROFFS= 0
##$CY= 11.3945322036743
##$DATMOD= 1
##$DC= 2
##$DFILT= <>
##$DTYPP= 0
##$F1P= 15.9154993809931
##$F2P= -4.1035820241983
##$FCOR= 0.5
##$FTSIZE= 0
##$FT_mod= 4
##$GAMMA= 1
##$GB= 0.15
##$INTBC= 1
##$INTSCL= 1
##$ISEN= 128
##$LB= 0.24
##$LEV0= 0
##$LPBIN= 0
##$MAXI= 10000
##$MC2= 0
##$MEAN= 0
##$ME_mod= 0
##$MI= 1.114404
##$NCOEF= 0
##$NC_proc= 0
##$NLEV= 6
##$NOISF1= 3.799351
##$NOISF2= 2.8
##$NSP= 1
##$NTH_PI= 0
##$NZP= 0
##$OFFSET= 15.70392
##$PC= 1
##$PHC0= -11914.44
##$PHC1= 13.20099
##$PH_mod= 1
##$PKNL= yes
##$PPARMOD= 0
##$PSCAL= 0
##$PSIGN= 0
##$REVERSE= no
##$SF= 200.130013532006
##$SI= 16384
##$SIGF1= 3
##$SIGF2= 2
##$SINO= 400
##$SIOLD= 16384
##$SREGLST= <1H.CDCl3>
##$SSB= 0
##$STSI= 0
##$STSR= 0
##$SW_p= 3612.71676300578
##$SYMM= 0
##$S_DEV= 0
##$TDeff= 0
##$TDoff= 0
##$TI= <>
##$TILT= no
##$TM1= 0
##$TM2= 0
##$TOPLEV= 0
##$USERP1= <user>
##$USERP2= <user>
##$USERP3= <user>
##$USERP4= <user>
##$USERP5= <user>
##$WDW= 1
##$XDIM= 8192
##$YMAX_p= 0
##$YMIN_p= 0
$$ End of Bruker specific parameters
$$ ---------------------------------
##NTUPLES= NMR FID
##VAR_NAME=  TIME,          FID/REAL,        FID/IMAG
##SYMBOL=    X,             R,               I
##VAR_TYPE=  INDEPENDENT,   DEPENDENT,       DEPENDENT
##VAR_FORM=  AFFN,          ASDF,            ASDF
##VAR_DIM=   8192,          8192,            8192
##UNITS=     SECONDS,       ARBITRARY UNITS, ARBITRARY UNITS
##FACTOR=    0.0002496,     1,               1
##FIRST=     0,             0,               0
##LAST=      2.0444736,     0,               0
##MIN=       0,             -783415,         0
##MAX=       2.0444736,     503086,          0
$$ Real data points
##PAGE= N=1
##DATA TABLE= (X++(R..R)), XYDATA
$$ [...]
2616A315k419j658L495L401k333j991k419J212M437r26k478k066p70M433J322
2631B555k681k251j671L482L188j878j931k495J795M547k59j900k352o08M706
2646B247J461k163k349j499L057L175j792k502k644J786L855p22j778k908r32
2661c708M469J276k344k113j507L343K865j137k045k582K055M468p11j460k641
2676a772m46M659J423k455j967j464K814K259j040k277k756J644M011r20k014
2691c01k049r71M320J277k342k075j536L298K555j049j922k771K005M309m73k015
2707B60j992q00M288J750j828k922j545L113K515o67j805l437J289M550o87j870
2723B12k397r14L609J799j135k949j595L147J819n54j027l457J162M462m46j934
$$ y = [1315, -1104, -2762, 733, 4134, 1801, -190, -2609, -1397, 3040, 2114, -364, -2430, -3200, 1233, 2555, -126, -2377, -4048, -566, 2622, 744, -1187, -3682, -1887, 2660, 2401, 501, -1851, -2459, 2247, 3708, 1545, -804, -2303, 754, 3929, 2137, -365, -3009, -1223, 2632, 1910, 132, -2776, -3708, 761, 2037, -307, -2420, -3927, -584, 2281, 1144, -901, -3483, -1428, 3040, 2329, 869, -1772, -2218, 2441, 3864, 1409, -558, -2022, 792, 3051, 2011, -266, -3022, -1378, 2633, 1713, -301, -2350, -3321, 999, 2276, -66, -2141, -3677, -379, 2176, 1127, -795, -3566, -1561, 2748, 2275, 260, -1732, -2532, 1756, 3506, 1678, -1244, -2789, 324, 2839, 2172, 367, -3070, -1781, 2769, 2082, 212, -2185, -3099, 510, 2309, 1174, -1775, -3370, -223, 1596, 1042, 15, -3442, -2280, 2182, 1736, -198]
2739a98j946P1K886J532r92l124j008L960J213j143j267k777J703M574q17k872
2755b05k194L89L578J052r53l592k283M868J849j326j525l391Q13N166N32k769
2771Ik708j17L012J972L80l273l318M181K626j196m22k935k75M139P91k104k364
2788a602J32K389n2J141k702k817L907J664k120l58j834M46L100P64k286k534
2804b762J433L124m16J3k137l037M654K918k388j640j733P76L301J047k121m104
2820c072R57L851k71k20k118l211L647L008j408k238j738P87K887J572j316m730
2836c613J239M515n04p6j701l391L289L659j340k662k002J290K610J651j050m998
2852c084j28M743L77k68j590l812K126M181Q1k714k197O30J860J586P13m298j185
$$ y = [-198, -2144, -2073, 813, 2345, 1353, -1771, -2779, 1181, 2394, 1251, -16, -2793, -1090, 3484, 2667, -205, -2399, -2010, 1568, 2620, 1667, -1925, -4208, 660, 2509, 1183, -342, -3733, -2920, 2246, 2778, 9, -2699, -2816, 196, 2168, 2548, -725, -4043, 138, 2764, 1568, 1146, -1789, -2064, 2075, 2866, 762, -1602, -1470, 919, 867, 2008, -694, -3511, 396, 2060, -60, -418, -2252, -1806, 1294, 2058, -228, -2762, -1329, 1795, 1379, 1392, -745, -3782, 872, 3790, 1402, -238, -1971, -1195, 2106, 3153, 1032, -3072, -2115, 1736, 1465, 1245, -873, -4084, -437, 2571, 1163, -1075, -2813, -2026, 861, 2433, 1117, -3613, -2374, 2141, 1637, 1561, -140, -3531, -242, 3417, 2077, -585, -2587, -1297, 1313, 2964, 1914, -3084, -3212, 1531, 1908, 1640, 50, -3762, -1636, 2545, 2626, -88, -2285, -1655, 205, 1791, 2504, -1794, -2979]
2869b979L590m2L58J76l323J118K298J14j867q35J406L18N68L57l176K47L945
2886B273p40j898n54q89K053K442m32l693j756L332J902m26o28m289pN250P71
2903B711j832k937j684K447L392R80l848l647K662L237O46L19m580j965M786K291
2919B978n28k657k264Q70K922K274j977m616J624J952O88R33l235k342K817K114
2935A553j57k218j252P96J335J882j359l224J937J744l55O83k355r51K389J515
2951A963o08k221n53K071P52N86j651l258K647K435p90q55k436o74L222J694j356
2968I68l122m71K700J309N46j747l910K383L441M07j270l260l33K816K341k11
2984B587l859j931K753J698J656j909l988P05L392Q78o11k634j330J951K181J139
$$ y = [-2979, 611, 569, 927, 1103, -2220, -1102, 1196, 1310, -557, -1392, 14, 332, 900, 1257, -1919, -1672, 2273, 1533, -365, -919, -1808, 245, 2687, 2255, -1438, -3194, 138, 2040, 1614, 986, -3303, -3310, 1940, 2711, 879, -2058, -3742, -1295, 2097, 3077, -771, -4418, -1756, 1481, 2127, 2446, -2134, -4099, 687, 2978, 2450, -207, -2471, -1601, 1321, 3595, 1618, -2998, -1374, 578, 1266, 2199, -1036, -3378, -561, 1553, 1396, -822, -2074, -1278, 57, 1939, 580, -2644, -707, 1037, 682, 1365, -990, -1941, 448, 1963, 1355, -866, -1419, 652, 1404, 1990, 339, -2919, -272, 2163, 1373, 518, -1918, -2592, 630, 2324, 968, -2154, -2625, 75, 1384, 1930, 183, -3727, -1344, 2097, 2504, 1234, -2026, -2359, 457, 2798, 2587, -1272, -3203, -450, 1248, 2904, 995, -2993, -2288, 1104, 1982, 1371, -1263, -2593, -642, 1539, 2678]
3000B678l492j696J898J126J202n97l158O85K128J143o88k386k46J416J269N87
3016A869k813j293K329O53J067j569k984J537J955P82r14k908L14K002J614K06
3032A847k791j554K566J355P14j417l224J186K364J163p58l191n10K480J569P61
3048B560l129k354K230J674J181j415l140R82J641J522m6l493k95J721J258J200
3064B097k896j911K223J093J333j470k458O14J987J436o80k938k54K162J188R28
3080B454k851j633J541J622Q36j594k441N79K200J099m15l209j26J802J407M28
3096A699k225j989J803J558J510k037k956J356J607J523l22l151k95J701J794
3111A576R85k850j893J376J510J659j555k818P94J543J555l69k903q09J945J342
$$ y = [2678, -814, -2510, -612, 514, 1716, 1119, -2039, -1354, 774, 1917, 1229, -1157, -1403, 13, 1282, 1869, -944, -2237, 92, 745, 1812, 243, -2741, -1204, 751, 1533, 619, -2289, -1975, 27, 1641, 1847, -944, -2498, 68, 1423, 2137, 720, -2504, -1318, 1046, 2209, 1451, -1740, -2250, 230, 1799, 2560, -569, -2923, -693, 981, 2162, 747, -2393, -1411, 230, 1752, 1706, -1787, -2082, -361, 897, 2097, -799, -2710, -487, 606, 1939, 469, -1989, -1375, 612, 2048, 1368, -1570, -1824, 338, 1526, 2454, -397, -2030, -489, 1133, 1969, 375, -2066, -1487, 713, 1812, 1397, -1812, -1938, -136, 1271, 1699, -526, -2515, -712, 846, 2356, 319, -2637, -1281, 326, 1849, 1527, -1624, -1919, -218, 1576, 2561, -289, -2182, -806, 704, 2363, 808, -2010, -1216, 327, 1882, 1513, -1390, -2199, -254, 1088]
3127A088P38k531j564J619J398J303j319k618O97J437J870l52l004j26J375J351
3143A362R23k558j745J490J264J686j941k691O90J324J787l27l207l05J698J494
3159I44Q85k418j729J376J484J634j350k637Q58J374J834m69k811l42J525J482
3175A640Q27k604j315Q16J504J022j362k571P21J034J850n18k710l99J378J546
3191H59Q04k373j301R04J310K074j542k413J47J701K065k98k667l99P53J769J045
3208B438k472j482N83J779J521j762k373L94J186J751m03k662k80J054J547J021
3224A840k489j193N76J310J813j148k419L11J180K071p5k593o48Q63K189R41k650
3241a21j503P20J352J820j525k157Q6J038K107j92k781l47L90J776J342k501j364
$$ y = [1088, 1826, -705, -2269, -650, 748, 2051, 732, -1886, -1189, 248, 2118, 1766, -1238, -1364, 11, 1362, 2285, -273, -2018, -528, 736, 2422, 481, -2210, -1520, -196, 1591, 1264, -1943, -2248, -550, 944, 1829, -589, -2318, -942, 542, 2176, 826, -1811, -953, 421, 2255, 1786, -1025, -1367, 158, 1640, 2467, -137, -1452, -636, 868, 1890, 528, -2043, -1322, -288, 1562, 1044, -1666, -2065, -687, 859, 1663, -710, -2011, -1107, 203, 2277, 735, -1678, -1531, 170, 2235, 1937, -730, -1129, -376, 1393, 2438, -34, -1516, -933, 846, 2367, 605, -1768, -1374, -188, 1563, 1160, -1502, -1782, -728, 819, 1840, -649, -1842, -1266, 44, 1857, 709, -1710, -1399, -219, 1852, 1777, -816, -1464, -601, 1588, 2529, -121, -1624, -904, 448, 2268, 743, -1414, -1328, -290, 1817, 1625, -1156, -1503, -1113, 663, 2005, -496, -1860]
3258a860R33J025K004j435j932J45P70J867J63k613l16P91J461J059k334j214
3274a486P23J080J846j873j787L97O83K008q4l102J2R78J379J091k358j685Q05
3291a373J409K211j643k174K38P47K216J70k573o50N54J732J195k237q21q5J232
3308A48J930j349j985M86L23J623L85k288m92K66J691J022k290p72qJ363K121
3325B174j579j892k9R57J672K24k270p20O71J982N60j756p57M5Q28K002j189k031
3343a108J72L61J939n3k025n01K83K010N00k088p03j4J191K325j613k018j36J155
3361c23J782m07j459j226M09K462O64k209q80k33J395K293j002k389k44R23J936
3378A492M5j451j576m30K635J269k202m68o07Q20K256m85j972p73Q26J594K99
$$ y = [-1860, -927, 98, 2102, 667, -1265, -1120, -350, 1517, 1680, -933, -1249, -458, 1003, 2062, -272, -1486, -763, 317, 2163, 290, -1497, -1100, -417, 1591, 1507, -1595, -1583, -605, 774, 1865, -493, -2178, -1373, 36, 2247, 604, -1570, -1332, -585, 1631, 1801, -772, -1422, -868, 864, 2059, -178, -999, -1084, 148, 2078, 729, -1256, -770, -447, 1176, 1561, -727, -1219, -953, 738, 1760, -530, -1302, -1310, 53, 2174, 595, -1297, -1326, -369, 1303, 1527, -743, -1463, -792, 1190, 1750, -6, -763, -718, 110, 2112, 923, -1108, -936, -575, 1364, 1311, -714, -1215, -932, 1078, 1578, -510, -1213, -1227, -36, 2289, 676, -1342, -1478, -323, 1459, 1052, -407, -1633, -1224, 1238, 1902, -307, -1187, -1420, -25, 2268, 1266, -1123, -1367, -444, 1492, 1537, 86, -1490, -1920, 715, 1984, -218, -686, -1293, -473, 1783, 1298, -674, -1447, -621, 973, 1272]
3395A272j041o53r66J994J245j949n58J3P59J716j005j707k64R94J555r42q81
3412d18m49m55K580R75l057o52Q37R05J727q50k429m17J261K184p79j554n96m17
3430a604K435J824k610j254J84P95K019m27j728j450N95K761j60j645k04j390
3446a859J944J986j851j223J05O03J175o9p77r61K17J815r06q34M51o41R02J633
3464A710k014j177Q56J146N27r50n02j167R54L036j640k049J79M42J235J851k261
3481A76k061M50K018J256j180p34k049J046L281j46k727l57r22J737K245j120
3497I13j887j099J677J529m44k82j467o52K843M00j910L29q93P00J372k07j355
3514d33o10J454P52j141K95o04n38K246k35j970J32M28P92M85n78j521o24K135
$$ y = [1272, 231, -422, -1388, 606, 1851, -98, -656, -643, 116, 1832, 827, -880, -1144, -150, 1405, 463, -418, -867, -1322, 1258, 2233, -824, -1476, -639, 266, 1993, 1143, -1286, -1703, -442, 1742, 963, -591, -1187, -1604, 831, 2655, 45, -1209, -1025, -230, 1789, 1362, -366, -1816, -1221, 1540, 1380, -265, -469, -1859, 85, 2071, 220, -1003, -898, -295, 880, 811, 34, -927, -710, 1105, 199, -635, -184, -825, 77, 1710, -304, -1481, -625, 521, 1048, 98, -404, -1571, -617, 2419, 779, -1270, -1091, -649, 586, 2437, 176, -1885, -1435, 583, 1839, 659, -75, -2124, -1078, 2203, 2057, -670, -1027, -1949, -212, 2033, 913, -974, -2073, -396, 1133, 689, 407, -1060, -1712, 1131, 1531, -379, -50, -943, -243, 1129, 922, -433, -1043, 411, 1163, 22, 317, -287, -825, 1421, 1186, -784, -652, -224, 568, 1053, 475, -1046, -1670, 465]
3532D65J097j644l41n50j07K501Q0k307m10L61J367Q92r63j225j154J964K026
3549B052j768n33o82k93K318O39k102r94O40J117R15j95j612j412J584K565j538
3566G01r04o62P1J893Q18j697j593L91J580N26k93j322j590J662J921j091r42
3583e31k61l97J571Q45j098j255l06J944J63l20n5j474P90J932j136o29j84j16
3601e17R67N31o93j019J30J734p9j080L09j323J001J677j279r40r5L00J234J17
3619I75r87j213m24K527M59j182q30r98R95K141n06j637n60J23J976K68m63j796
3637a132q22K447J033r89n78j389P77K027k25j155r13K36J751m6k85j263q22J966
3655F18M75o84n66q87P48J011k59o14j187M64J432k0j68j071q61J885O43r07p34
$$ y = [465, 1562, -82, -423, -973, -1080, 1421, 1501, -806, -1216, -855, 512, 1404, 441, -784, -1938, 26, 2052, 284, -249, -931, -1224, 1094, 1733, -369, -1363, -723, 394, 1309, 1114, -498, -1910, -326, 2239, 701, -203, -865, -794, 1099, 1917, 220, -1373, -982, 598, 1124, 831, -491, -2081, -419, 1502, 411, -531, -792, -1189, 382, 1227, 129, -1126, -1432, 512, 675, 355, 300, -1174, -384, 1548, 412, -217, -401, -517, 450, 981, 288, -731, -601, 1133, 1054, -26, 283, -1040, -39, 1638, 359, -581, -676, -376, 858, 975, -12, -1225, -1649, 878, 1337, 155, -675, -1673, -678, 1463, 957, -680, -1240, -1117, 859, 1127, 664, -1132, -1954, 493, 1526, 537, -41, -1430, -653, 1374, 1149, -6, -919, -683, 1068, 1022, 737, -526, -1348, 618, 1093, 409, -157, -1044, -296, 715, 456, -158, -1345, -881, 551, 531, 363, -708, -1569, 316, 959, 52, -682]
3674f82n99R06J499k39r86r64L03J801k56l49r08p24J545Q18m68n78j157J160
3692A22J217n00n04j429L31J878j22m07j068o92J310J009p31n76j205J018J093
3709G44m5p43j363L21J860k95l65j045m72J761O36o13p23r89J186J020m1l71j353
3728h90J31J799Q6o38j142n46J529O94k37q10j064Q14J329j63o14j612M39J457
3746E62j74j36r09n47J249Q48m87q02r96J068J200n91K30j746L88J594j9M8j061
3765b81p27J341N89k91n84j223J312O17r4m17j218J29J714j78%j243o86J321Q20
3784I01o13o32r56R98R18j60k13j031k3J461K40o48p47n06J276N11j01p50j091
3803a166Q73R30l79p5r00o8J162M94n97r09n28J261M20K33q56j119J337P11l58
$$ y = [-682, -1281, -375, 1124, 885, -101, -1065, -762, 1039, 783, 434, -474, -1198, 347, 1165, 697, 119, -1038, 122, 1339, 839, 335, -1094, -763, 1115, 993, 586, -482, -1174, 136, 1145, 414, -162, -1367, -349, 744, 699, -44, -1407, -1086, 774, 479, 114, -931, -1403, 358, 994, 381, -342, -1331, -145, 875, 834, 463, -890, -759, 1040, 1126, 488, -654, -1200, 329, 1023, 786, -24, -1088, -274, 1055, 892, 278, -1334, -895, 562, 388, 252, -657, -1204, 45, 893, 406, -396, -1392, -324, 876, 285, 515, -1231, -843, 751, 732, 780, -281, -1008, 333, 922, 631, 47, -1176, 136, 753, 659, 242, -976, -847, 867, 689, 689, -554, -1240, 81, 901, 288, -344, -1300, -302, 616, 456, 243, -788, -811, 650, 890, 242, -505, -1011, 265, 776, 675, -75, -1166, -293, 637, 258, 183, -717, -785, 377, 871, 274, -635, -1163, 98, 518, 751, -105, -1224, 113, 824, 466]
3822D66R3j407j25J677j2m57n86o43J203J74L13o36j490R73J125m6r0j174j93
3841h35J380L22l01j064k40J169J85j0j97j608R19J298n24l07p92m5J048K94J09
3860H01j650J43J305j62K57l79j191L22J306l01n16p14J69Q91M21N7j333p78J994
3879F42J13k50j34j676P14J227K17q11q10L11M79Q17J02j578l79J356Q8K51k81
3898C98j302J76J235L56n90r07J84L17M42L70j227p75J555Q0m44J46o76k34J320
3917D24L7p83n74P56K98J49M91j408m57J660L54p74o0k09j80R10O03j075j294
3936a132R99M29j0R67j684j307J917J099j135n92l77k55J058J570j385j507Q08
3953e37O28P9R44j281j554J250J374j58p44q9m87J15J532m9j749O09K62n95J518
$$ y = [466, 559, -848, -973, 704, 692, 235, -351, -994, 209, 383, 696, 60, -1430, -457, 668, 622, 532, -642, -835, 545, 867, 566, -498, -738, 431, 616, 606, 409, -1199, -280, 1018, 494, 187, -605, -650, 398, 692, 801, -849, -706, 599, 437, 694, 315, -876, -554, 752, 451, -65, -779, -610, 281, 702, 759, -574, -1352, 642, 755, 505, 371, -1305, -591, 636, 853, 42, -768, -457, 22, 839, 941, -637, -1016, 340, 428, 679, 398, -904, -728, 507, 863, 273, -634, -450, -133, 309, 679, -548, -1323, 232, 312, -132, 14, -662, -896, 424, 461, -322, -896, -140, 158, 307, 798, -610, -1067, 593, 947, 173, 113, -96, -276, 634, 1237, 162, -1132, -133, 296, 286, 1253, -431, -1738, 179, 1278, 143, -449, -826, -1081, -23, 1547, 162, -1345, -537, 91, 170, 1114, -167, -1721, -471, 903, 745, 1, -88, -575, -460, 1072, 1023, -726, -117, 145, -450, 1068]
3972A068l39j287O27L15m29J2O01m50n51J028J90j508N04R05j229K54L20p16L11
3991c74J524r61j587Q23R32l74O40k95k317J162J747l94l29j82j352O49J901L51
4009A564k333j85P18L27R86L96k494q7J783N1Q9j30j345m87J389J114j466l01
4027d11P22r10P70Q86j706m12J276j24l98K77n9n51N49P85j438M9R67l81j6Q61
4047G36j199n49J657k24o59k9L79l66N68R85j597q53J697p7k72P31r64o88Q68
4066A44N26l42o42N87n84K14J305j167j507J653K75n94K6k31n74N89J073p65q85
4085h99P56k30J73J198j103j499J247R21k92J02p21p74Q82J499o06j405P16j60
4103a95%J267l28j539M06R86k7j76j85q34j91J712k81j002J13K61p11J067J78
$$ y = [1068, 729, -558, 69, 384, -45, -33, 568, 118, -433, 595, 785, -723, -219, 686, -543, -289, 31, -685, -374, 1150, 189, -1398, -575, 357, -17, 623, 328, -1989, -827, 920, 526, 197, 15, -1337, -688, 1213, 1564, -769, -954, -236, 91, 1077, 1473, -1021, -1108, 675, 726, 815, 685, -660, -1147, 242, 1356, -110, -411, 311, -599, 171, 1057, -649, -1061, 215, 91, -307, -30, -89, -640, -91, 694, -744, -695, 272, -109, -125, 736, -463, -1012, 645, 421, -238, -267, 112, -254, 314, 1299, -298, -1151, 546, 469, 197, 928, -36, -724, 144, 670, 328, -314, 273, -311, -97, 1208, 41, -1466, 187, 462, -132, -106, -337, -911, -322, 751, -14, -899, -143, -373, -200, 998, -105, -1604, -357, 564, 272, 374, -347, -1121, -239, 1260, 654, -751, -35, -195, -195, 1072, 744, -795, -389, 597, 570, 394, 209, -625, -816, 896, 615, -387, -274, -13, -724, 343, 521]
4122E21j206K10Q89n21O1J40l60k93R30J70j282L71O54o49R63q1j019J06R33M1
4142E78o73J08M5j53P41L45j553k71J179k47K50N21j587j39J082P74r92k48K2
4161b18m56J134N90j503m66Q99k52N80J40q39n87R29O24o22l31J56j97M57P37
4180G75r65o92R79n8N34j72o29k30L52R39p85n39L92oL10O87j015n85M54N08o2
4201A92O9m78k68M16Q58n23r50N58j38M88M34o20o10K61N23L40n01m68P5K14P77
4222F49j56p69J12%J77Q50r11l98K03M63M77q49Pp5m0Q14l06q67J50M47L60L45
4244F83q34o33N24O40L2m38l89J19K73M28K6r52K89J40L67L02p37k56K71L12K00
4265C67l52o56L56M34K31j13p16KM6N68L74n15l92j40M56N60o12m09J53K02O99
$$ y = [521, -685, -475, 414, -107, -46, 94, -266, -559, 371, 541, -741, -370, 284, -365, 598, 517, -502, -396, 537, 578, -95, 13, 58, -95, 646, 991, -562, -833, 346, 99, 349, 870, -717, -856, 226, 1000, 8, -240, -218, -674, 460, 1050, -453, -919, -20, -272, 308, 448, -391, -978, -49, 575, -47, -378, -222, -419, 38, 775, -190, -882, 97, 39, 573, 401, -228, -458, -106, 833, 48, -491, -99, -105, 205, 892, -123, -708, -254, 254, 192, 261, -217, -485, -69, 789, 266, -684, -126, -264, 224, 658, 38, -572, -311, 212, 552, 51, -417, -342, -128, 649, 493, -276, -164, -164, 13, 863, -48, -446, -243, 220, 697, -152, -145, -220, -260, 554, 248, -619, -469, -22, 338, 683, -151, -784, -260, 380, 412, -26, -415, -296, -23, 405, 431, -521, -232, -92, 275, 577, -160, -416, -145, 167, 367, 15, -641, -285, 149, 380, 267, -449, -447, -401, 167, 541, 26, -366, -506, -50, 510, -102, -511, -358, -156, 543]
4286E43k64o63PJ86L44K21n12m27M16M54L54m87o94K83J97M09O8p71J38J72K60
4307B34M30q72M4k1O37J83m63n02J59K61N51m27m62m9j09P36K06o98j58M0J13
4328a67P27m60m82K1N91J14j39l48m19L69M61K22o85j79K28J15O83n58l08j11
4348c25o2Q20M7m88l29K89J18K43m82M2m27M60L81j53l90j66OP65k95m2m59k41
4370f88Q74J67l22n63J93J86N20l39j17j89P6M52K76k52k99k29P65Q8p16M3O5
4391ij6N06l54m39rK43O79m28k75k51j10O80K73o08k4l23L94M31m8p12j03M26
4413g7M54m43R5m45q2R20M00j058k67N41k00N79K17o86o04N51O14l48j95J82n73
4434d25O85M50r30L4J21N1J28K10m08k96K70P98n69m43J55n72Q31N08r44k12N45
$$ y = [543, 279, -384, -377, -191, 153, 374, -138, -565, -149, 305, 659, 172, -522, -239, -42, 367, 435, -336, -198, -26, 234, 664, -208, -164, -185, 452, 635, 172, -330, -171, 90, 641, 214, -248, -297, -406, 330, 536, -162, -320, -280, -167, 560, 100, -382, -361, 230, 344, 205, -143, -562, -193, 268, 490, -195, -374, -146, -31, 652, 94, -214, -325, -387, 433, 480, -8, -337, -48, 70, 313, -169, -127, -554, -94, 287, 134, -256, -422, -416, 349, 54, 12, -447, -688, 186, 353, 31, -532, -339, -153, 367, 28, -89, -278, -202, 250, 526, 274, -25, -254, 511, 599, -117, -74, -9, -25, 481, 127, -312, -321, -78, 601, 173, -102, -353, -463, 217, 490, -118, -142, -465, -71, 360, 312, -400, -503, -77, 377, -66, 29, -416, -498, 422, 822, -236, -503, 38, -162, 417, 634, -52, -656, -105, 509, 161, -34, 148, -425, 260, 710, -220, -186, -65, -14, 114, 324, -84, -380, -110, 688, 119, -324, -169, -741, 90, 598, -346, -558, -13]
4455a3N3N6q2k63l17O58O01o30j75L69o21L55Q07j006l11N45L63JK2o30m44O38
4477b4Q27l77o57L70n79L98N76k81o68j44Q57m6l54M76j040n1J470l68p15M41
4497A11k10l46R48m35n02J53P16n82j47Q80r42K6R24m90n24N54K7l58M33l19r4
4518a77l15J191k31q33M59l28k96R26J86j234L25N25N3j09N59j297k82J168L59
4537F49r80P47n09q89J479L53r99k63N29k10j02J042r75o34J250J46n97q5J86
4556A38p90P33L39n50k51N92k09j95M32N9j242J006O60j202K68L15n26N00Q41
4575I18q98p72P78L95o05M76j56o23N66Q41j212j03N59l27M9O60l10r37O97L91
4595C87p31L23L23q64L08P98n97k92N28j84k86M96K06j057M01Q96o03m21O52n99
$$ y = [-13, 40, 96, 14, -249, -566, 92, 693, 63, -112, 257, -364, -9, 798, -208, -519, 26, 389, 390, 412, -218, -662, -24, 803, 426, -231, 139, -440, -42, 534, 253, -415, -559, 298, 252, -102, 374, -666, -717, 753, 385, -330, 111, -99, -445, 503, 68, -434, -281, 435, -147, -294, 586, -356, -330, 594, 104, -420, 134, 161, -197, 236, -83, -177, -492, 699, 468, -365, 94, -234, -530, 396, 582, -652, -327, 198, 251, 142, 701, -596, -878, 290, 649, -331, 416, -93, -982, 497, 850, -149, -412, 117, -93, -195, 847, -128, -762, 488, 634, 37, -48, 138, -652, 81, 420, -130, -381, 211, 2, -193, 239, 298, -944, 62, 722, -480, -212, 103, -423, 77, 918, 20, -752, 26, 421, -184, 292, 136, -487, 79, 920, -292, -395, 164, -163, -114, 546, 236, -701, -4, 387, -344, -21, 302, -562, -254, 544, -53, -345, 183, -1, -287, 209, 415, -642, -241, 655, 52, -369, 283, -316]
4615c16j70J088k84j033P14J06j38J77K05j069J78J220o37m24N93l56l93J037
4633D98j18q67K40L09l01L00L38q15n23J619k62q43P63l42n88J074R8p51k54P33
4653C08j24k02M82p31l37J041J3q13M65j57k68N72K84p77k54Q50P9n97M17m19
4673a68k36P07M1k91j93L32l87K23N69r22k98N97K46k11%jp96R28M09o79j8o5
4695b13n9K32O74m62q90L60Q02m94J74K0p32N86N52l44m49K13o1k47M91j17p04
4716f68N96N98m62j38K59o26M25O62l55o06K64J09J09j31J32p14K75Q63j62o51
4736b21J01j85K87O24k43o84q5P42n87N87m3p34J11M07L40m85l2R6l36O71Ro25
4758b85J9M45j66J78o5m26k6N88l6l05J13%p1K77O3k69l98O44j72J91P1p20oO68
$$ y = [-316, -486, 602, 318, -715, -1, 105, -33, 144, 349, -720, -542, 678, 41, -383, 210, -146, -539, 498, 380, -487, -247, 62, -239, 61, 399, -416, -939, 680, 418, -425, 338, -4, -592, 482, 580, -171, -425, 308, 184, -18, 464, -267, -604, 437, 450, -363, 102, -55, -323, 249, 533, -244, -498, 352, 431, -166, 251, -168, -404, 303, 344, 53, -140, 192, -195, 28, 597, -325, -623, -26, 220, 9, 9, 8, -788, 140, 549, -130, -148, -213, -272, -40, 634, 172, -718, -358, 444, -50, 124, 144, -588, -2, 550, 206, -243, -30, -91, -338, 153, 36, -668, -72, 526, 64, -74, 185, -441, -16, 646, 291, -315, -51, 58, 167, 36, 168, -546, -271, 592, 430, -221, -120, -305, -18, 606, 363, -321, -406, 336, -251, 336, 293, -441, -330, 77, 417, -68, -100, -4, -340, 331, 340, -285, -266, 179, 13, 191, 126, -300, -326, 262, 226, -79, 34, 34, -37, 240, 303, 34, -364, 280, 108, 299, 370, -350, -356, 312]
4782C12k88J97n64K49M9K11K84m49n57P92j99k15M05o43o1P21r7J95m79nJ42l5
4804c5L03o28pP05k42j12%kk24N22k61L05n26J07L25k78L90o25q1K27M68l93L49
4827B87n16J95K24q5q8n58K75K74K09K38n21o89O58M00j30j74j76J55O9K0J66
4848B33n24MM57j23K14l40m84O43K19j96k4l70K37Q3K12j19m41n6N45M8J85l16
4870H7k79K96q9J00k15o5%J71m3J4k22j15M90K03j64l12m59P27l4k6k78J02J32
4893B1J28p4k8k95k27O96j8l1p3l12K20L27j02l95j02j95M35q7K74m48r9O57j04
4916A68K11m02l27J83L45N1j46l93K42j8L2M83m87l06O21j62R1l61L01j90P0K93
4938B99k82j49j13M40M1j37j68k66M71N5p9l26p4M78j16M04m85k99N35MMK38p61
$$ y = [312, 24, 221, -343, -94, -45, 166, 450, 1, -556, 236, 37, -178, 227, -416, -477, 244, 147, 342, -137, -142, 0, -35, 268, -360, -367, 338, 96, -16, -16, -18, -242, 280, 19, 324, -202, -95, 230, -48, 342, -283, -364, -137, 331, -62, 287, -229, -34, 190, 105, 17, -541, -266, 8, 217, 455, -66, -755, -97, 303, 173, -1, -177, -22, 47, 67, 233, -291, -287, 170, 47, 261, -79, -563, 80, 299, 103, 79, -291, -54, 29, 241, 122, -319, -375, 170, 218, 403, 87, -192, 104, 15, 115, -100, -165, -165, 6, -37, -23, -245, -360, 130, 333, 169, -143, -602, 125, 91, 65, -213, -111, 21, 149, 75, 47, -248, -475, 221, 203, 172, 99, -213, 7, 334, 232, -163, -265, -460, -25, -112, 162, -286, -385, 272, 168, 379, -23, -350, -167, 178, 229, 83, -310, -68, -86, -54, 429, -58, -364, 257, 95, 186, -175, 126, -64, 6, 299, 17, -132, -245, 195, 236, 99, -69, -335, 136, 191, 112, -214, -288, 190, 74, 478, -7, -306, 229, 233, 237, 475, -286]
4961b86J2M85m9j04k66J02j65Q4M01k94m09M87L74m56L46l50j75M02K04j72m69
4982b98K3L66k29M35j06p72P26J51j96P3m68Q6J94L08j91j82m1MK41L31j85o66
5004c96K88L94j0K03m25l24n8N64jn78K83K98m74M96M6p80K53N07j48j28J81m12
5026b21J92M64lo99j1O61n37K52P3n03K86L16q8j55m0ok89M37K14q80K26O32l90
5049f9J28L63o05J26M75j16o01j66L23k32L79M83q76mO19l64j1M53k92o30R21
5070C04m0m78J43N7r1qO32o68k94M09K93n10M60l01k14L57K03m25l29P39k09k69
5092b39O27m12n34J115k43n87L15n5m13M20P47p84k81N04j00l72Q81n79o19M70
5112a39P58n56l6K38o10L18N43j24j135P36j18j46P50j58r06N26N09n38pO45p41
$$ y = [-286, -274, 211, 162, 58, -208, -106, -271, -187, 214, -80, -489, -2, 372, -84, 262, -88, -263, 139, 343, 171, -298, -275, 91, -138, 297, 191, -581, 145, 296, 100, 173, -295, -209, -15, 293, 102, -80, -121, -117, 124, 455, 270, -396, -108, 286, 276, 479, 54, -270, -328, 236, 235, -343, -60, 238, -236, 260, 306, -474, -221, 286, 138, 10, 191, -221, -29, 435, 432, -267, -278, 383, -154, 98, 171, -332, -46, 270, 182, 27, -13, -19, -308, 129, 343, -537, -311, 321, -69, 59, 422, -183, -57, 418, 302, -299, -465, -142, -374, 5, 488, -388, -392, 227, -137, -148, 305, 13, -617, 304, 264, -214, -71, -14, -105, -113, 519, -149, -443, -34, 259, -251, 209, -92, -306, 51, 254, -171, -500, 239, 30, -239, 388, -24, -558, 557, 314, -273, 42, -13, -426, -6, 741, -43, -324, 180, 80, -292, 589, 10, -609, -139, 619, 63, 27, 265, -345, -27, 516, 392, -743, -7, -125, -271, 479, 321, -585, -59, 450, -88, -95, 550, -191]
5133a91m48R86j87m87M48J94o52P91l14o09L40O63n06n03P35j50n05Q74n80n99
5153g00P10N59p11K50K44q07k30J043M9r44K20K21j94O57m3q20L35N07k73p7L42
5174C38m80o08J013M8o14L00K32p25K5R05q57J95O79j94m24P57l53n23M25K91
5194D30j088N06Q78q84J2Q49q48k12Q18j61q12L62J30m48P19M25j075j89P28j57
5214a7j2M53m78n63Q16K87m20J3M2l86K02P98o00o94P63j98l95J091l85o05L4
5235b54L51l60M26L86q71l9Q08n55k59M64K2m67L87M2l58M0O27n46l4L66rn38
5257c71P78k81p77O80K76n55L43j69k58J40Q69o12m93O01j99l84J029j49q30J77
5277a85L69n7j08K22n50j89Q97N7r81M17K57m40N79O3p59QM38O7j62J71l5k31
$$ y = [-191, -639, 347, 160, -327, 121, 315, -337, 454, 140, -469, -129, 534, 28, -475, 260, 110, -395, 479, -101, -700, 10, 569, -142, 108, 352, -455, -685, 358, 407, -537, -317, -96, -290, 367, 324, -496, -161, 346, 73, -4, 338, -142, -750, 263, 311, -303, -3, 229, -496, -471, 434, -423, -228, 451, 257, -167, 590, 237, -286, 139, 430, -658, -152, 726, -158, -146, 703, -145, -357, 461, 300, -512, -150, -20, -468, 251, 676, -399, -588, 140, -17, -29, 424, -54, -617, 199, 486, 66, 79, 121, -265, -63, 735, 135, -559, 204, 6, -389, 702, 317, -288, -254, 97, -263, 163, 549, -322, -361, 447, -108, -367, 97, 119, -348, 39, 81, -277, -237, 390, -156, -190, 176, 167, -371, 407, 126, -651, 29, 305, -250, 93, -76, -334, -194, 675, 63, -430, 171, -28, -412, 617, 468, -362, -185, 184, 127, 19, 241, -309, -498, 399, 456, -525, -108, 149, -291, 288, 351, -408, -400, 38, 105, -57, 114, 79, -152]
5299a52M36O7p93L01J81m9M11J70q32MM00n0N7j91K32m67N64M43m63m85L37j2
5321A09k6J42k90k86L38P9L7k10J50k94M79j7m46k50N82l83J82J96l71m3M68O5
5343B11o30R9K57k28O07J56m03l27N68q2J1k90m4q3L02K43j99j03j95P5J3M06
5365C64j45k73k6L04n8j45N8j98L74j0j36l51N06m38p4K72r1j80m3M47J14j48
5387A23j62n2j24L93K12l52jKQ0J12k08n3k02M76K03n36l05J49n9L83J99k73k23
5410b18J43m7L24j20n75L85J23P7j8k12l10K27L05P3m06j45K74J05J94n56J44
5431b33L9K55L19k65j78j80J38K23k0r6l3j50M27J04m15l6J69P6L28l72l63l3
5453b96P3N32k12j73n0j94N32j86K41j56n45N27K04m06k47K67K8J3J32k35j98
$$ y = [-152, 284, 351, -442, -141, 40, -9, 402, 572, -260, -256, 144, 94, 151, -40, 192, -275, 289, 732, 269, -216, 121, 109, 83, 225, -65, -351, -13, 66, 103, -107, 43, -251, 228, 211, -235, -485, 97, -286, -104, 92, -279, -322, 146, 211, -419, -320, -63, -291, 316, 472, 69, -258, 310, 228, 239, -51, -95, -178, 124, 367, 168, 65, -130, -55, -42, 364, 219, -54, -80, 224, 166, 21, 79, -119, 255, 245, 109, -242, 264, -174, -248, 24, -67, -247, -290, 157, 271, 123, -39, -91, -215, 178, 390, 38, 37, 39, 119, 231, 23, -30, -232, 244, 447, -89, -394, -245, -304, 79, 278, 5, -218, -75, -122, 202, 82, -493, -108, 15, 92, 74, -138, -448, -221, 84, 157, -249, -394, -120, -15, 179, -377, -233, -194, 61, 380, 115, -63, -243, -105, 118, 98, 2, -31, -181, 246, 350, -65, -101, 68, 144, 472, 100, -263, -296, -223, 309, 97, -76, -126, -320, 212, 26, 267, 111, -434, 93, 297, -109, -356, -89, -61, -48, 84, -151, -349]
5474c49J96L46j16k40K73k14L62o6k29r2j65J82K23L13l65k81o3L91K41j56k85
5495i4l02L14O30q96K86J73l32L94l6m57J24k63N77Q9m13N9n0PM17l06k86L18
5517d7QO9R6j09j50j09O34k53l23L87k56M04q7o82N7K53L10J59j63k6m07j59O33
5540B39m44j82M03o8J9K78j17m15K3L87k17k16N47m00m13Q34j00l65J60J22RK26
5562C10j7l74J25J03P1m07K29j79j30O65j31o15N42l04N2K19Q4l00l96L50M3R8
5584C8o4J03n87Q42l1m40Q9N8l09O32J17m91n5l55O55l34J17J63p18N96K85m40
5606a29k2L48k94%K70q7n90N68M52p23N4L85o43L69M77n05j25N90n70P9N50l23
5628A31o95Q12L46o41q5L90p14O85M56m93o77N47K30m03K43R2p51J78Q97n83J04
$$ y = [-349, -153, 193, 77, -163, 110, -104, 258, 192, -37, -129, -294, -112, 111, 424, 59, -222, -285, 106, 347, 191, -94, -396, -82, 548, -348, -62, 111, -221, 173, 137, -320, -196, -459, 118, 207, -206, -147, -197, -190, 227, -79, -365, -47, -39, 30, 126, 17, -133, -242, 392, 139, -184, 203, -53, 351, 264, -418, -361, -108, 202, 361, 198, 172, -235, -394, 239, -205, -387, 16, -52, -33, 245, 128, -287, -264, 123, -94, -310, 237, -163, -576, 258, 158, -207, -47, 75, 84, 310, 293, -81, 44, 147, 218, -189, 40, -139, -269, 396, 265, -350, 192, -112, -60, 159, 243, -57, -453, -103, -60, 38, -26, 77, -510, 332, 301, -139, -50, 8, -301, 331, 448, -43, -98, -453, 202, -132, -15, 148, -570, 26, 311, -129, -151, 197, -97, -97, 173, 86, -504, 64, 516, -207, -153, 232, -411, -42, 435, -70, -195, 395, -175, -96, 454, 131, -564, 248, 594, -47, -132, 258, -456, 229, 685, 192, -485, 62, 292, -111, 132, 224, -527, -349, 548, -35, 69]
5649F9K43p06J19O70j65k28K16K00n55K61J33n77K2J071m74l26K29k05k68N59
5669B88J70q36J86O22n27j62O52q05j49J470p55m47J96J95L9L2L85j111J45J017
5689F05l17o92J090o81n75R95j53m35K95j48l92M64L93q27k63J015p76j05P73
5708B66j28o87O43L98j024J90M12m82N3R63q39m42J114k17o22M01j6k93L41K59
5728B90m93m52J065j27k62K89k80p23Q88N59j046L54P5l63M59O20j044l01O69
5747A77j8m45K87N01j303O28N77n21K43M4m62J71R17o52n87N62J10m20N48O8q27
5768d02M21L83o10J49M55k86l66O68K8r73M80N26o40k0O41q29L49O07p08m33O58
5789I8Q0o04M83K96p59L06L63n23L0M13k79l32R65l31o33M15L39m63K26L64o24
$$ y = [69, 312, -394, -275, 395, 230, 2, 218, 418, -137, 124, 257, -320, -298, 773, 299, -27, 202, -3, -271, 288, 458, -378, -192, 430, -97, -259, 393, -412, -561, 909, 154, -293, -97, 98, 137, 169, 554, -557, -412, 605, 288, -404, 686, 5, -570, 425, 272, -163, 132, -16, -408, 56, 449, -378, -641, 374, -402, -507, 266, 138, -549, 94, 492, -532, -342, 70, -412, -359, 604, -235, -677, 437, 220, -402, -1, -17, -310, 31, 290, -203, -655, 410, 283, 21, 310, 30, -693, 195, 754, -292, 62, 137, -226, 233, 853, -191, -492, 177, 159, -286, 1, 502, -801, -173, 404, -117, 126, 170, -292, -121, 796, 144, -443, 119, 229, -191, 357, 425, -402, 19, 402, -208, -59, 396, 110, -256, 412, 440, -533, -53, 473, -167, -187, 454, -375, -26, 581, -127, -560, 98, 178, -426, 57, 353, -406, -100, 263, -260, -230, 183, -96, -428, 537, 206, -427, -12, 327, -136, 90, 454, -170]
5810a70MQ44p89n2M71m27l90Q31j01m99J59L73o68J49R01r69K51N56k53k79M95
5831D37k75k87J62M26p89M7M47n4k50M61m57o1N05j12k97J02K67k81J69R8k07
5852E1n38J014m20j69K39k78l43O07J91n80J12J54j3J0K06l82m09L90L12j16q4
5873d6J38l79M55L83o61Q6M1n9k94N63O6p54L35N03m37j19L78l22L22L27m89l90
5895c53L51Q8Q6p4q0l08M56L49p09K03K8m27M64J41j51k02J56pk50K94J3m04J77
5918a59L79l95P0j49J37K60l49M55q42N45K33l59J86J61n77J05O29j07l60l05
5938d42L76J9L68n2k18k48K53l0J25k6n10J93L29K04m19m2j47K59K17K42m98j97
5960b44M22N8Oj72j46M0p8K69l97K78M7P0o9K95o98K86Q8J97%m39lK32O6J4k49
$$ y = [-170, -166, 678, -111, -163, 308, -119, -509, 322, 221, -278, -119, 254, -414, -265, 636, -333, -82, 474, 221, -58, 437, 162, -125, 37, 463, -326, -279, 168, 114, -136, 325, -132, -193, 312, 200, -97, 5, 272, -9, 160, 258, 51, -487, 527, 107, -62, 177, -101, -444, 163, 354, -226, -114, 40, 27, 37, 243, -139, -548, -158, 154, 38, -46, 92, -287, 168, 551, -110, -24, 17, -42, -336, 227, 293, -461, -126, 377, -60, -179, 199, -123, 199, 526, 37, -353, -2, 86, 172, 98, 18, -290, 166, 515, -194, 9, 37, -390, 74, 215, 64, -138, 18, 11, -239, 55, 68, -336, -159, 220, -175, -105, -254, -117, 143, -206, 249, -593, -48, 185, -174, 12, 173, -404, -299, 330, 223, -137, -442, -66, -47, 321, 269, 51, -197, 56, 26, 151, 125, -385, -192, 137, 341, -78, -120, -267, -8, 209, 451, -47, -244, 178, 236, 242, 70, -76, -36, -114, 155, -242, 36, 83, 153, 84, 379, -319, -33, 55, 252, 252, -187, -190, 42, 108, 122, -127]
5985a27l7L09j89k0l2k55J41J87J07J0k79j20K42J22j81K55j56l2J24k2K78m47
6007a22L0L4L12k35J42k83K84k04K16l87L9j63M61j20Km8k2l7L03p0k62p4R5K13
6031A04Q9L0p15P15j2k10N9k8k10K02J09K5l58j93L43N4J21Ln93M0Q42n60L20
6054A77k78k20N12m1N1k02l10K07j09L41j8n19M91j09k8J50k21J22j16l4J61Q8
6076I5j68OP6k7J70m36L01K64r8J25q7Pj31K9Pj95j01M78k52L9j96j56N8L16j53
6101b9L4p6j24m7L26K27o54J34K82l6j38L36n70K51K60K5l7l17K71l89L52L61
6123D42m70l59N02k99q2M90k61m29N76L4l06J0J97l29L26J99n71j69P94J6m57
6144a46N84o37k09M80M55n33r2K71q3k17N87n56j10L54J11j96l5J05n00M92J69
$$ y = [-127, -164, 145, -44, -64, -96, -351, -210, -23, 84, 94, -185, -305, -63, 59, -122, 133, -23, -55, 69, 47, 325, -122, -92, -58, 254, 19, 161, -122, 162, -42, 174, -213, -174, -337, 124, 4, 6, -42, -64, -101, 202, 132, -130, -204, -109, 104, 193, 223, -492, 223, 211, 1, 60, 32, -178, 24, 133, 158, -200, -393, -50, 4, 125, 128, -465, -425, 417, -143, 177, -101, -321, 191, 150, 201, -1, -311, -104, -213, 128, 110, -409, 82, -27, -55, 95, -126, -4, -120, -154, 7, 95, -73, -67, 9, -18, 152, -284, 17, 281, 183, 308, 221, 228, 97, 126, 133, -62, -163, 315, 63, 102, -94, -250, -192, 124, -29, 5, -71, -195, -242, 84, 311, -343, -209, 73, 37, -101, 235, -335, -84, 176, 201, 164, -153, 118, -271, 81, 442, -28, -387, 115, -184, -266, 224, -37, -466, 110, 144, -162, -152, 45, -284, 42, 241, -330, -499, 295, 311, -146, 438, -199, -408, 72, 527, -6, -98, 173, 90, -127, 460, -96, -206, 148, 259, 63, 28, 133, -367, 125, 294]
6165B94j97l98K96j17j92M89j9l85L58J65k25k67L48j64J6K07Kq53Q76J4m77P31
6187E02m36n88N08N14n58K62R6l56k1L31j56m40M12J41m78N51p9m22l3P87l45
6208A92m98M78m46m39Q29K99p06J19M27l70M80k75m65j32R05m9n71M71j22p44
6228f17P60K09j050N15M59l90j06N69o34j5M13m5m16M29J86o13O70K46j018M37
6248a1L98l00j68M30j14p83Q31J38p91K32N80o01l8Q43q69l70J193n26l25K95
6268D4n9m84L82P42n13m68N59n95K98Q26n14p02P54K65q52P32l2q20J43J166r08
6289c6n38J015o54k46J371p73p58P52K89o22K3N53n08J6O05p72k46J108o46k05
6309b72N11j81m04N99L34n36r26J003j65l27Q88m22r03R19L27m44L72j59q24m0
$$ y = [294, 97, -301, -5, -122, -314, 175, 156, -229, 129, 294, 69, -198, 150, -14, 2, 209, 211, -642, 234, 248, -229, 502, 66, -522, -14, 500, -58, 204, 300, -56, -77, 254, 98, -342, 70, 211, -267, 284, 205, -217, -250, 537, 192, -306, 172, -274, -713, 116, 415, -291, -172, 255, -115, 365, 90, -375, -507, 398, 349, -222, 249, 127, -617, 143, 352, -698, -183, 276, -114, -220, 349, -285, -300, 113, 68, -348, 81, 267, -346, 324, 570, -448, -11, 387, 87, -81, 349, 235, -548, 283, 421, -370, -138, 442, -159, -197, 646, -223, -593, 600, 74, -251, 44, -15, -499, -117, 625, 112, -356, 203, -392, -94, 732, 218, -484, 270, 535, -317, 415, 383, -437, -294, 872, -36, -574, 441, -213, -459, 912, 139, -619, 133, 422, -200, -177, 376, -132, -116, 489, -283, -529, 579, -67, -272, 239, 58, -346, 253, 587, 51, -875, 128, -37, -364, 524, 102, -801, 118, 445, 1, 373, 214, -610, -650]
6329f50Q66J43o20N10m12k17P23R9j013M45M43m30m1O82n19j71L14K91r06Q35
6349C72j14p07L36L89o08j47O65k86j05M72j25n14N78Jo15M53O0k63K63K10m64
6370a49j01P90m81q5J9J06m43Q52R9j309N01M09m92O04J13p97k09O30L02m67M5
6391f3L16m14M13J68n86nL91m55K96L90k98l83K31L66n02J29K26o01L52L27j47
6412A51k78M06j34k2J44k59m39M50K91l98l1K39k30j70M04k03l84N47L0j89J9
6433e6K03k71l3N32l48n63Q59l83j18M77l16j39J07M13k71J1J42m57P2M78l40
6454am67M06J75k06N58l82m30J34K02J62l96L01l81P6K73J14l53K13j80m2O24
6475D00r8l55K5K01N3j43J01K17p10N25K3o52N83%l4j23M6j63l2J66J42j70K33
$$ y = [-650, 216, 359, -261, 249, -163, -380, 343, 442, -571, -126, 317, -113, -154, 528, 9, -162, 152, 443, -463, 372, 258, -449, -113, 276, -332, -479, 186, -100, -205, 267, 142, -372, 206, 207, -408, 45, 105, -158, 105, 315, -149, -250, 540, 59, -26, -7, 99, -344, 508, 607, -702, -201, 208, -284, 320, 433, -364, -573, 57, 359, -108, -63, 253, -161, 252, 420, -166, -171, 220, -235, 61, 451, 153, -230, 1, 367, -135, -6, 220, -381, -29, 298, 151, -127, 279, 145, 123, 267, 8, -431, 19, 310, -88, -119, 120, -110, -280, 124, -79, -463, 84, 114, -75, -56, 147, -124, -157, 375, 27, -536, 323, -60, -178, 299, -17, -156, -49, 364, 93, 104, 246, -211, -139, 339, -1, -468, -62, 113, -93, 465, 83, -347, -213, -11, 151, -245, 56, -325, -249, 24, 138, -215, -2, -182, -224, 400, 302, -53, -28, 173, 226, 83, 184, 401, -309, 216, 239, -413, 170, 170, 136, 13, 59, -104, -136, 30, 172, 2, 235]
6498B35n02o7O46j26m40M42j31K9N3R4k52k01L65K85m97K00p2j10M65k00l80l1
6520a95J51J20l15L54O0k36J28N8k75j5R1j25K12K09l06O4Lj83L28j72Q0m46L03
6543a07L29l45pL2j19L29K02m78n2R3L75k46q3P3P1K0J94l18N5k38J14K09j28
6566b5o5N4j81L72R2j78k1l29L76K91L0k59m01L71J7j02r2K00l81L11j23j38J95
6589A4j97J98K30k79j86J23o7M67k77Qp5n05Q10j09k62J82k71P6M78k95N1l21
6611b07R0K03M1j42m8p7J06J94j37J20k57N2P3m1l84L44j16L21Mp7l41J17M04
6634B42r9j91p7N44l15M6J05k00j40PK22j81L9O8K3K61j07m18J73j16k36L77K0
6657D7k89j32N20l26q7L24p2j34Q2J13l28N8J83O7J40R2m32L25k04L35l26R6Q5
$$ y = [235, -267, -334, 312, 186, -254, 188, 57, 86, 139, 233, -19, -220, 145, 430, -67, 133, 61, -49, 416, 216, -164, -195, -44, 76, -239, 115, 175, -61, 67, 125, -150, -165, -74, -199, 13, 222, -84, -20, -17, -200, 128, -44, 36, -410, -107, 222, -123, -130, -98, -217, 112, 314, -164, -216, -123, 252, 6, -77, -4, 67, 87, 281, -37, 18, -220, -106, 103, -25, -90, -36, -217, 155, 247, 69, 48, -281, 95, 386, 416, 157, -244, 127, 144, 42, -50, 150, -231, 80, -43, -181, 14, -183, 15, 245, -34, -220, -97, -164, 303, 26, 34, -41, -546, 264, 155, -107, 75, -196, -120, 358, 63, 114, -207, -117, 86, 127, -15, -63, -140, -34, 160, 23, 143, -114, -62, 11, -30, -414, -70, -186, 135, 139, 62, -279, -162, 242, 143, -48, -125, 419, 104, 150, 255, 55, -85, -78, 144, -37, 2, 70, 93, 354, 247, -171, 2, -114, -350, 27, 47, -242, -374, 146, -180, -267, 57, -15, -149, -67, 46, -282, -224, -41, 26, 166, 258, -174, 151, -53, 282, -44, 52, 137]
6680A37m82L43K49n11j2M06j58K08R5k62m55N23K13m78j15M69n22O42qm51j76
6701c45M85n1p0K72k68l47P6M73j70M5R0n06K07J75J77n42K63k9j19K03p4l97
6723d52L40M47m82M6K0O2j15L76Q8o94J68O54m38j28M23m20N8M38l49k80K78k6
6745A4L5J90J2n02n0P71j88l82J75o1l44O87j69l53K8K87n04K08M89n11j18N83
6767B97n46l03R25o28j03O81k7o89K43O68m51r7N16n86k03Q07l75m26K52P3n37
6788e09M20M91n32j88N38l34p8M08m51k35M38L15p38N70j32m08M90K84k35k93
6808a79q6L55m17N39K18p55K70M00n25O4M64n11j12J88m2l13M44K61o99O69J06
6829C39m29Q2L95j090L91O53k45j78N96n25q50R51M78o32j36M69p23O08K87n39
$$ y = [137, -345, -2, 247, -264, -276, 130, -28, 180, 275, 13, -442, 81, 294, -184, -299, 170, -352, 290, 282, -169, -345, 140, 89, 19, 291, 23, -324, -248, 225, 55, 100, 190, -316, -109, 66, 243, -299, -36, -65, -184, 19, -55, -452, -112, 335, -147, -101, -81, -19, -134, 242, 330, -364, -196, 458, 20, -108, 315, -105, -47, 391, 42, -238, 40, 14, 49, 239, 251, -251, -301, 470, 282, -100, 75, 14, -330, 357, 188, -165, -137, 150, -354, -146, 343, -168, -286, 297, -249, -552, 373, -255, -358, 323, 296, -393, -150, 518, 67, -30, 486, -100, -303, 504, 129, -297, -45, 28, -509, -89, 402, -130, -318, 220, -114, -192, 216, -235, -470, -32, 283, -455, 115, -17, -425, 65, 349, 114, -179, -265, 90, -327, 212, 430, -325, -55, 345, -180, -116, 348, -163, -275, -87, -129, -442, 2, 263, -436, 233, 339, -90, -8, 387, -703, -312, 341, 96, -82, 514, -11, -861, 90, 568, -64, -200, 269, -454, 154, 441, -98]
6849i8k81N17k79J69L77k06q49L48N49j36J09N5o65K25M18j35l06L58j91l05P69
6870D43mq68K78M41n73K51O14o94o56R60j33q12R83J45m61k77L52l43m4P14m88
6891a72k10Q31m65M0K84k37l54L33J96n66J19O97q27k2Q51m58k59R3J89l22K45
6912a4O86j280K55R42n14k85O15n03l43P23j8o61L20rj15J48N55n40l97Q61k94
6933A32l78P30j65q65O75L5l68J25L18m79R8N37n11o21Q95j74p24P36K08m59K19
6954c6K98m40j54L19K53n68O38N9m24K81J84o73K93J01n51M88J82n83m7M70j31
6975d1k25L53K19q67N51N25p57J87J68o72O54j78r8L7OQ5m5K44P9l32J50L45m09
6998b1j93L25l66n5P48j26l93J12J84m09L03j54m32L08M83l11j26J14n5ML2K95
$$ y = [-98, -379, 138, -141, 28, 405, 199, -650, -302, 247, 111, 220, 275, -390, -165, 253, 118, -188, 170, -21, -326, 443, 439, -429, -151, 290, -283, -32, 582, -112, -768, 192, 59, -753, 230, 375, -86, -363, -11, -354, -398, 316, -172, -382, 449, -16, 24, 308, 71, -283, 50, 246, -320, -201, 496, -331, -353, 498, 40, -219, -126, 63, -259, -14, 672, -608, -353, 589, 75, -210, 405, -98, -441, 282, 264, -397, -77, -86, -201, -53, 502, -38, -435, 426, 132, -246, 484, 319, -546, 129, 164, -204, -79, 239, -240, -142, 395, -116, -737, 158, -16, -740, -4, 204, -255, -36, 262, -178, -332, -13, 240, -328, 310, 369, -55, 226, 410, -263, 30, 131, -420, 68, 250, -333, -380, 90, -41, -266, 87, 306, -561, -10, 515, -242, -55, 113, -559, 95, -83, -181, -144, -138, -53, -98, 146, 225, -107, 43, 388, -21, -214, 111, -255, -310, 438, 312, -81, 31, 215, -194, 109, -45, -477, -169, 314, 3, -123, -9, -64, -60, -28, 267]
7020B67m98n1P31n78K11L08l68j75M34L3n77J43K50J14m8J34p57J60N90m08L0
7041e5J09o5k77N72l38l87K92K38k41M35l59k35Q1N17m8l15K07j09j9L37j81Q8
7063B47m47L22l41J24M36l60l43J88K59j90J68m9k83K0L52k66KK69j73q8M0Mk62
7086c71M04J5k55L87k54M4J1J96l12j07K54K07k88K80L8l64L75r0k4k91M1L0j10
7109a84J5K06j22j14oK83J37k83p4p6J15K06R7l03J61P7j76K76o37M26P4J4j82
7132g0J24O9j58N9J4j10O5N6k04N9J53l32J56J66k35k2M2L33o13K99L56l00j34
7155b27K46R5J30j67j13j64K12K19l1k67J26q6j19J72q7j29J43l64M31k4j21O6
7177e9k48M44o9j82o9M5J98j0l59K42L66l30L18j60j93J42j14K59r5r9K0J32j50
$$ y = [267, -231, -282, 449, -129, 82, 390, 22, -153, 281, 314, -263, -120, 130, 244, 196, 330, -427, -267, 323, -85, -55, 54, -11, -288, 284, -54, -441, -149, 89, -152, 283, -76, -311, -230, 287, 239, -76, 131, 22, 3, 340, 159, 247, -200, 122, -219, -95, 341, -19, -362, -174, 85, -105, 63, 14, -269, -249, 103, -163, -161, 108, -65, -153, -113, -109, -371, 33, 48, -207, 180, -74, -30, -19, 177, -135, -242, 12, 219, -69, 211, 249, -115, 260, 170, 146, -145, -104, -74, -184, -169, 37, -85, -199, -205, 78, 215, -68, -142, -218, -103, 103, 200, -103, 58, 135, -41, 235, -402, 24, 98, 112, -70, 54, 123, -35, 24, 38, -72, -7, 49, -155, -96, 57, -275, -119, 47, -188, -210, -168, 165, -448, -149, 207, -93, -227, 19, 114, 244, 77, -36, -200, 12, 231, 200, -67, 59, -27, -146, 26, -61, -190, -47, -411, 20, -4, -125, -59, -307, 137, 68, -114, -183, -138, 60, 50, -309, -67, 299, -31, 287, 127, -66, 76, -38, 221, 126, 27, 47, 179, 29]
7200B9J75l31J70J42j55k5q0l02Q9L60j5r9l9K02j93P4Q3j58o9J6K83n4%j6k16
7225a29J18J50j93l29L09J20J85J33m40j58M07j94K14q7l52K10m6J00J33n12K05
7246a56M41o48O98l37m64P61l98K30j74J02L6o1J46R0n19L22q6J18M5l0l92J28
7268a48K87j63O3k17O1r8K89j84r0Q9l3J90L85l43l28J67J74n6r3K70k65l88P46
7291C15j33n09M04O8k27K28k51n6J1L18l31j3J57Ln5M21l37p42O02L23m37K09
7313c2ll06K35K26l9l84N58k76l59M31J95o58K44L91k72J91Q0j08k99L21M56q09
7335b17J0M71q09L65Q53q00k47O39k59j34o2J61k59K38L80o74M64K72n62J34M17
7356C81m72j13K64L6k09J53J72n66L66R15j242K03M24m19M0M64n82Q1M57M0m27
$$ y = [29, 204, -127, 43, 185, 30, 5, -75, -377, -288, 72, 57, -42, -81, 121, -72, 2, 85, -73, -142, -126, 157, 103, 103, 87, -129, -11, 139, -54, -383, -74, 46, 231, 364, -76, -234, 173, -21, 193, 106, -246, -36, -82, 18, 151, -361, -156, 285, -363, 335, -2, -466, 295, -103, 127, -47, 55, 91, 30, 176, 266, -253, 69, -17, 101, 146, 116, -276, -148, 139, -24, 39, -178, -117, -215, 74, -110, -200, -111, -144, 46, 431, 88, -240, -73, 101, 45, -48, 222, -43, -431, 315, 182, -327, 77, 145, -82, 146, -105, -161, -150, 168, -163, -176, -19, -16, -71, 350, 13, -729, -127, 196, -241, -32, -35, -341, -106, 120, 81, -303, 255, -21, -380, 51, 246, -412, -168, 223, -49, 142, 222, 114, -185, 136, 592, -217, -207, 264, -545, -180, 673, -127, -374, 265, 6, -128, -190, -29, -288, -50, 330, -344, 120, 392, -170, -36, 381, -91, -204, 60, 96, -113, 40, 212, -354, 12, 927, -315, -112, 312, -107, -67, 397, -185, -104, 353, 393, -34]
7377c4O4L2j94k52R13m48n28P40k39p4K91r3n33K78L77l81k10L43j84j35Q48n81
7399@k14K73J13l85M7L74l44l9N19m36p2K92l43m9P33J6r36N50K80m87M2J54l52
7422b64m4R45p03m6L78q3n94J019n23l66r5P69m05l97P53o35j7M58K10o99N19
7443A80m48j14M36L46o41k09O26n5k24O45l65n40M61N81r33K71L72p54M14L3k58
7464a76j34K92N3m13M87J69p39O11Ol97K21J97m24J95nk14j18K74L29k63L0J42
7486A23l06J17N49n20r2J74R2O6Q2m43j55K40L90m63j83L25k69N5N25o26m8M66
7508I9j96j82K25J22n13K01R09p51k4M00n45J2Q16n29l52P40j94l01n5L13l89
7529a94J93K52m08n0K63k17K35J5k53j56M22k8j31l21L94q4k0L36l3l53L14k07
$$ y = [-34, 30, 62, -132, -384, 529, 81, -447, 293, 54, -20, 271, 178, -355, -77, 300, -81, -291, 52, -132, -267, 581, 0, -214, 59, 172, -213, -166, 208, -136, -175, 344, -92, -164, 128, -215, -264, 469, 485, -451, 99, 379, -108, -66, 88, -264, -308, 637, -66, -112, 266, 183, -411, 608, 85, -281, -376, 393, -12, -409, 344, -291, -308, 150, 360, -339, 180, -268, -382, 54, 400, -241, -450, 176, 121, -103, 542, 177, -363, 98, 679, -254, 17, 389, -365, 49, 82, -176, -310, -18, 35, -378, 109, 278, -461, 150, 156, -241, -20, 177, -247, -52, -57, -271, -389, -115, 214, -49, -19, 123, -183, -66, 483, -37, -129, 45, 137, 203, 285, -158, -313, -73, 317, -146, -329, -4, -273, -218, 307, -319, -367, 99, -97, -279, -54, 68, -445, -244, 665, -86, -110, 290, -255, -243, 573, 44, -308, 432, 238, -63, -118, 195, -194, -1, 251, -157, -207, 56, -161, 74, 89, -164, -320, 102, 74, -57, -378, 16, -68, -88, 248, 215, -138, 176, -31]
7551c1q8K70q3k95R3L84j43k47M89n17j70P98m15l89M03l4j07j78K54k97KP4L67
7574A40k77K69r9j84N64j96m09r7M59m5k1J39k13j06K56Q7l11R6L5m20K19O7j35
7597a82n4L00j17j10l1J24l49L67K43k11N8M0m49M62M0k72n2LL28j61j02J79j93
7620a39L01J32l65J38k6l45N50j15l13N1R6l7K53m22J41k79L6L34L7j27J38k37
7642a98J53M17l65k70K37J14J1J06L0l89L21J43k61j23j22K57j70J23j33J86k09
7663a42K91j69j72J16n1J47J41k66L41n65K50LPJ46o1k51L80k26K41j99K34o8
7685A27J72m05j74P0K56k02K21k17J24r7M38J21m88L4j57L82k46k9J22j21j11
7706a80K60k44P9r6R4K52j86J4J8L4q0J02J27r3k63J86L22o25K95K46l09M53k38
$$ y = [-31, -119, 151, 68, -227, -134, 250, 107, -140, 349, -168, -338, 460, 45, -344, 59, 25, -82, -260, -6, -303, -301, -227, 140, -137, 132, 33, -151, 413, 217, -192, -289, 170, 125, 104, 243, 30, -76, 180, 267, -44, 52, 87, -333, -114, -47, -182, -236, 64, -53, -163, -194, -70, -419, -52, 191, -20, 38, 78, -371, 91, 131, -141, -193, -190, 138, -23, -125, 54, -139, 162, 294, -71, 67, 41, -304, 246, 131, -182, -131, -35, -72, 181, -241, -100, -379, -343, -9, 28, -99, 39, -198, -45, 372, 7, -263, -26, 88, 99, 205, 235, -154, 167, 310, 49, -74, -196, 61, -109, 14, -119, 67, -142, 149, -20, -192, -76, -127, 20, 161, -105, 236, -329, -79, -76, -69, 77, 16, -235, 145, -81, 160, -39, 195, 127, 299, -106, -280, -210, 46, -156, 65, -152, -28, -125, 313, 434, -54, -20, -177, 205, -41, -70, 52, -69, -180, 80, -164, -85, -181, -87, 165, -21, -7, 11, 45, -35, 67, 194, 101, -162, 24, 346, -279, 16, 262, -47, 406, 168]
7729A68j49j94K2J07L02l38J55k78M66l31J32R9j2l46M71k35p3L09n33N85k54
7750G3J62k32p5N2K22l74J28J92k20J36J42p5o15O17k42n8K25K0l00q5P08n42
7772a41N6Q2j32J51L39n29J28j43O8J93j11J15k9J36K17o20K0J02J64j18L26m1
7794B33l17k18N32p4k07N1j59j6M98k40j15Q3r7q1LQ9j27k5K48K5l31N12m79L14
7818A02K78n61j8L42o0j10J16r3j34k6N93p11J97K53k96L5N39p34K61r8P9j46
7840a92Q1K12q9j46K27J89j01m1l80L76q5N24j034J02N45o8J59r2n25k26O49k1
7862F4mQ2k56k81O33J0k75p2J86l4j96L31k01j74M60k80M3p0pk82M04j14j5K1
7886b7J49P7l80L82j42j78K84j65p5K5J18k3mJ41m2l27L72K4j85J98j22m09N40
$$ y = [168, 19, -175, -153, -46, 256, -82, 73, -205, 261, -70, 62, 161, 149, -197, 274, 39, -34, 275, -258, 327, 73, 235, 3, -72, -20, 202, -172, -44, 148, -72, 64, 206, 131, -484, 133, -109, -167, 58, 78, -222, -307, 401, -141, -85, -3, -135, 16, 355, -174, -46, -189, -121, 72, -39, 76, 47, 183, 400, -220, -200, -98, 66, -52, 274, 233, -84, -302, 230, 156, -51, 0, -159, -175, 323, 83, -32, 51, -46, -127, -124, -35, -162, -187, 61, 86, -245, 267, -212, 102, 380, -181, -199, 143, 83, -27, 89, -4, -138, -164, 429, -282, -85, 168, -128, -93, 446, -288, -27, -125, -46, -192, -111, 101, 12, -134, 93, 282, 181, 140, -240, 136, 51, 575, -459, -357, 188, 120, 279, 187, -338, -564, 85, 64, 60, 142, -114, -395, 238, 248, -27, -99, 87, 53, -143, 188, -13, -187, 273, -7, 36, -34, -41, -323, 81, -33, -48, -27, 122, 199, -181, 201, 59, -119, 165, 0, -75, -50, 68, 45, 41, 182, 140, -187, 185, 209, 24, 222, 100, -309, 231]
7909B31J95l31j74m1k6O4L38J89p54L67J96n07K10J49o43N62k24j46L21L23j92
7930A07j65J23K40n38L53K52n73L87P3m89K94J02k35j19M5M14j65L8p4k10l28
7951d68P98k71k18Np6j1L81j14l00J58L95m73L1L64n26L0O07k26OL8j30j55L57
7974B02P8r3k90L25m75J59K07j44j75P10n45n7L59j07n57M45N7l19J35J30p9j27
7996a61O07o15j93N96k96j53J65K08j37J90r4m48K25O82m05l62N13k40m24P65
8016D23k52l45J3J6J03k1K37l80J0L94l5l77K59j93L8Q0L66n95K6L04K5l66O02
8039C32O4o84N64pn32M34j38j79K63K31l27j96N1K22l78K63k3m61K55N95p49N82
8061A82k2m69%O37q1l77K18K17n08N48j14m34L42L24k37k10n7p8j09L99o7l19
$$ y = [231, 426, 95, -79, -120, -146, -82, 256, 445, -309, 58, 254, -253, -43, 106, -537, 25, -199, -345, -24, 299, 107, -58, 65, 305, -233, 120, 372, -201, 186, 259, -230, 64, 166, -69, -188, -143, 271, 106, 144, 70, -140, -468, 330, 59, -159, -154, -230, -241, 140, 26, -274, -116, 279, -194, -163, 201, -325, -295, 312, 86, 92, 130, 0, -155, 202, 280, 187, -103, 222, -253, -94, 113, -31, -206, 504, -41, -98, 261, 154, -403, 42, 99, -220, -85, 45, -34, -161, 446, -169, -362, 234, -62, -215, -50, 158, 21, 211, 117, -331, -106, 576, 171, -191, 322, 82, -342, 423, 171, -174, -161, -145, -42, -63, 174, -206, -196, 198, 163, -214, 45, -148, -110, -30, 336, -259, -233, 71, 96, -270, 332, 396, -288, 276, 269, -263, 171, 33, -146, 117, 348, 21, -175, -124, 98, -280, -17, -40, -501, -246, 349, -400, 182, 160, -309, -309, 328, 247, -130, 88, 305, -203, 345, 231, -203, 139, 463, 226, 16, -41, -119, -228, 171, 104, -215]
8083b15J43L02m84K88M8o62O22j26j03K39j58o0J20p5M14p77L50P15q23M00O5
8104B23l60M6K35J03m16J53J02j84J26L76p45J19L84k98Q3o9J29l54L33K17m18
8125b15K53n7Mk9P3l39K62L87k13J20K4l84p2L79N4j13j56J38k06J97j00k13j39
8148c45K11J2nJ13m07L99J7j4j70k22N65k88k15L61j34J0L65l8k02P2q0j1j53
8171a59R1q9J55j42J40j50M06k05k39J77N2J94n0l21R3O9L71j72l17j8
$$ y = [-215, -72, 230, -254, 34, 82, -580, 42, -84, -187, 52, -106, -166, -46, -121, 293, -484, -134, 581, -242, 158, 223, -137, -91, 144, 247, -169, -16, 86, -98, 28, 404, -341, -222, 162, -136, -53, -122, 7, -347, -14, 203, -215, 38, -19, -15, -44, 29, -310, -48, 339, 126, 246, 270, -114, -186, 193, 247, 134, -22, 116, -90, 107, 7, -206, -345, -134, -122, -127, -14, -421, -22, -5, -19, -189, -411, 154, -134, -349, 12, -122, -112, 253, 215, 13, 85, 5, -6, -159, -68, -157, -2, -144, -4, -154, 252, 47, -192, -15, 37, 231, 181, -140, -47, 22, 393, 221, -96, -114]
8191a14
$$ Imaginary data points
##PAGE= N=2
##DATA TABLE= (X++(I..I)), XYDATA
0@%%%%%%%%%%Qj6J6j6K4l2M0m8N6o9Q0r8J19j38J59j85K15k50K90l30L74m26M85
33B58n49O19o95P78q72R75j086J207j340J488j647J819k008K214k440K689k963
50a553L262l593L961m372M836n357N949o637P441q392R538j0954J2754j5122J8390
65A0151k3192L0930m5354Q0778l15934m39564P60737O4316j64756J85565m15591
76b71914n11501O20473N33108m22586j42263K13566l53284J67573O69914l90021
86A13065m73053M51132N4738j89088L93725M420n57385J37927L94520l39856p3709
97h3564M32810l02597k64975M27568j80154l60040M39207Q7629m63043J10120
107a57039K50873k52539R4971L51056m36645l11992N42676Q3203k34045K71560
$$ y = [0, 0, 0, 0, 0, 0, 0, 0, 0, 0, 0, 8, -8, 8, -8, 16, -16, 24, -24, 32, -37, 43, -55, 64, -74, 85, -100, 115, -135, 155, -175, 199, -227, 258, -291, 328, -367, 411, -461, 514, -572, 635, -705, 783, -864, 955, -1053, 1161, -1279, 1410, -1553, 1709, -1884, 2077, -2295, 2541, -2816, 3133, -3504, 3937, -4455, 5083, -5871, 6883, -8239, 10151, -13041, 17889, -27465, 53313, -262621, -702185, 58552, 122868, -41888, 143677, -271914, -783415, -162942, 370166, -52420, -194683, 18883, -334401, -166828, 503086, 113065, -359988, 91144, 145882, -43206, 350519, 354939, -202446, -64519, 330001, -9855, -83564, 349246, 46649, -218326, 209242, 29088, -330952, 108255, 195884, -267159, -157039, 93834, -158705, -63734, 287322, -149323, -461315, 81361, 164564, -69481, 202079]
117B02079j77798m38003M18483L87838l62176j54558J64004j88634O8103M98627
127D17965k70133n33237L07115J73374j75975K72595l1184m94076J54982M34630
137B56056j79907j89579J76479j44342j06231M52695l0573m71910J90982J98930
147A52600k18096J46581J14014l44919J1751L72719j12977k72779J66581l350
157A2125j75994L00740M6714m30823J03965K73350j66589m531J11305k28295m9149
168b07182L55588M707l17848Q6553R9564j51119K14296J19848l68115M233K97758
179A38283o7590p4882R2460j32629j08412K83160R8672l07034Q818J53872j29542
190d4824J03547J36946k88037p2852K67804O201j33048L4336m8080j20161J93740
$$ y = [202079, 24281, -413722, 4761, 392599, 30423, -124135, 39869, -148765, -80662, 417965, 147832, -385405, -78290, 95084, -80891, 191704, 160520, -333556, -178574, 256056, 76149, -113430, 63049, -81293, -187524, 265171, 234598, -237312, -46330, 152600, -65496, 81085, 195099, -149820, -138069, 234650, 121673, -151106, 15475, 12125, -163869, 136871, 183585, -247238, -143273, 130077, -36512, -41043, 70262, -158033, -207182, 148406, 153113, -164735, -78182, 21382, -129737, 84559, 204407, -163708, -159475, 138283, 70693, -4189, 88271, -44358, -152770, 130390, 229062, -77972, -69154, 84718, -44824, 58723, 195669, -92368, -165220, 102584, 108785, -24263, 10073, -38007, -158168, 35572]
201C5572J46073k76736p1678J80716n9729L9167J19454k09702j10943K26424R6821
212A15439j20283k2794O015q7810J35247J83255k07537j26336J59980O939J3909
223E6024Q9564j44462j32011J49056J32441r8201p9713J7918o5849O5264J65648
234A55679j52134j56579J18267M6265j282M8055r0806j09527R7083J49916o1524
245D3413j07606L2167j5678M0874J43867j01831j53468Q6002P7934O189N905o8962
257a1194q3471N4278J41906l1851j33008J0344J3472K9383J12519p1537j40435
268a09594M7694R1225L2638j9342o2045n1424L4979J29937J550j33247j2778L0684
280a9723L4888Q3311o0799j22803J6570Q2308M9378l8824p4570l3023K4430J09731
$$ y = [35572, 181645, -95091, -166769, 13947, -45782, -6615, 112839, -96863, -207806, 18618, 115439, -4844, -27638, -21623, -109433, 25814, 209069, 1532, -124804, 35176, 42115, 56024, 145588, 1126, -130885, 18171, 150612, 52411, -27302, -9384, -75233, -9969, 155679, 3545, -153034, -34767, 11498, 10216, 58271, -32535, -142062, -44979, 104937, 43413, -64193, -32026, -47704, -6830, 137037, 35206, -118262, -32260, 45674, 51863, 57768, -11194, -94665, -40387, 101519, 69668, -63340, -52996, -39524, -10141, 102378, 30841, -109594, -61900, 29325, 61963, 42621, -19424, -70848, -35869, 94068, 95618, -37629, -50407, -19723, 15165, 98476, 37677, -85126, -68556, 13752, 63130, 24306, -50264, -83287, -58857, 50874]
292E0874J7995j22005k8850L9857N2153P0073n0747r3677J0338P9432P1519l6252
304F0710p7607j7767K5500R2253K2031j10443m5348K7689N3479N0862o3124q6791
316f8556m192N7086P1737l6310q7353j6710K8714Q3721K5738r1370m1579K8966
328e0108O9494O0153n7210o8315M446N6617Q0977k6099q6885j7611L0175P7619
340G3253J7702r0601m9253J3543O2726N1749o7463p3980l483M6254P4851k6123
352B9175q5725k0072L1135P9249K1430q0753m1201J6578O7705N7259n7156o4912
364d7288k077M7974P5566k4139q0210k0185K4648P4144J9855p9980m5297J2839
376d4150O2474N0439n4346o0183q389M6185P9170k4893p6011j3988K3095P1422
$$ y = [50874, 68869, -53136, -81986, -42129, 10024, 80097, 29350, -64327, -53989, 25443, 96962, 60710, -16897, -34664, -9164, 83089, 105120, -5323, -50671, -22982, 30497, 81359, 18235, -68556, -72748, -15662, 56075, 19765, -67588, -84298, -55584, 28137, 53875, -37495, -79074, -50108, 19386, 79539, 22329, -45986, -41540, 15077, 96054, 69955, -16930, -34541, -4366, 73253, 90955, 354, -48899, -35356, 27370, 79119, 11656, -62324, -65807, -19553, 55298, 29175, -56550, -76622, -45487, 33762, 55192, -25561, -66762, -50184, 17521, 74780, 17624, -47288, -49365, -1391, 74175, 50036, -30174, -50359, -25711, 48433, 68288, -11692, -56989, -44150, 18324, 68763, 14417, -45766, -54155, -7970, 71200, 46307, -29704, -43692, -20597, 50825]
388E0825K6907p3963n0241J3011O6143M3088n4629n5332j8825L7298Q2382k8870
400C7794q4724j3419J9926N9971K9278o4677n7346J0527P6047M0187n2224l6592
412c5252j6307L1030R3986j7836q4517m214L0144M8555K7469m6941o1374J41Q2254
425D7138L0451o7628k7589j6744R908Q8936j3761j00608r712M2182L6423J4187
437C3183l2093o3479j3056R9610L9820q1203j9314k037J065R3827R759j07795
449d1713k2469O1796L9370J064j3837n8826l9360J04557N6216r5902k2913J2586
461a9431j7211P7099L2910j03783m3914P2123M3597k2431m2l4947o0733R6802
473B0039P7170j05042l1440L8173k0091N0209N0675r0495p0258P9427O2006m8602
$$ y = [50825, 77732, 3769, -46472, -33461, 32682, 75770, 21141, -34191, -53016, -15718, 66664, 37794, -46930, -60349, -40423, 19548, 48826, -15851, -73197, -62670, 13377, 53564, 1340, -35252, -51559, -20529, 73457, 55621, -28896, -33110, -2966, 45589, 73058, 26117, -35257, -35116, 47138, 77589, 9961, -17628, -34372, -24464, 64472, 50711, -49897, -59609, -17427, 18996, 33183, 1090, -62389, -75445, 24165, 63985, -17218, -36532, -38569, -37504, 56323, 66082, -41713, -64182, -2386, 36984, 38048, 24211, -34615, -73975, 30582, 86798, -9104, -32017, -19431, -36642, 40457, 73367, -30416, -74330, -2207, 41390, 18959, 18917, -16030, -76763, 20039, 97209, -7833, -39273, -1100, -21191, 29018, 79693, -10802, -81060, -1633, 60373, 11771]
485A1771l397r883q1146P7392J03981j05476n7265N4809j5705J8766O8267o0568
497A546r8785P0707Q6598o4256p274L0792q6596M2448J23805q8278p5617P8747
509A3837P363k3683N8075k1068j05459O3266J14970q9744m9382O2482o0542J4832
521a5053J25529q7102j24613Q0108O0640l8876K3940j1406j29238M1374J70307
532I5610o6223j00382N0762m6003Q26J59567l0816j64376L1950R3857j7626L4239
544D1385L9317j43347l2628J85022o467r6921N8197m4875p1082J35859M5340j42481
556c2681q165Q3553n9262j1221J00853q7394q6425J39376r298j22444Q7620L5935
568C0447r7469N7078N5453j19002L095J50231m5555r7405Q4023k1961o5548J57997
$$ y = [11771, 8374, -1509, -82655, -5263, 98718, -6758, -64023, -9214, -24919, -6153, 62114, 1546, -97239, -26532, 60066, -4190, -11464, 19328, -67268, -24820, 98985, 10707, -64910, 13837, 21200, -2483, 55592, 34524, -70935, -7669, 107301, 17557, -31825, 30657, -29885, -15053, 110476, 23374, -101239, -21131, 39509, 633, 24573, 13167, -116071, -74697, 95610, 29387, -70995, -20233, -66236, -65410, 94157, 63341, -101035, -69085, 24772, 7146, 41385, 80702, -62645, -95273, 89749, 83282, -13639, 44558, -317, -71399, 64460, 109800, -32681, -40846, 42707, -16555, -27776, 73077, -14317, -100742, 38634, 29336, -93108, -5488, 30447, -67022, -9944, 45509, -73493, -70398, 79833, 34278, -63127, 20896, -1065, -66613, 91384]
580I1384J8540j85627K8715J00671m4576L3958N4825j46727p0417J78664L6784
591I6194j18631L4078l0485j05848J51115J04522j68856n0541Q2046l1074K5184
602a2296J12808r5910j40644J28824Q1960r5673N0283J6826j41184P4489J38760
613A18243j07715n9982Q9955l6083m9038J10179j6367j39390Q8310Q2826j31351
624e0413J8559Q3648j03360J1827J18339r3970q6816J19921K8591r0136N6109
635A2299J6661j27244Q2800J34653j28916n2355R1635n0350m45J25256o5579j40604
647a02189Q5345Q9780p4113K2225L0792j40522K9504J67719p4850r1470O5057
658G278l2588l1012J21861j21j50016K6743J04894n8435L590P0239j14261l0222
$$ y = [91384, 109924, -75703, -46988, 53683, 9107, 43065, 97890, -48837, -119254, 59410, 96194, -22437, 11641, -18844, -124692, 26423, 130945, -37911, -88452, -6406, -37480, -12296, 100512, 4602, -136042, -7218, 74742, -20931, 29352, 46178, -95006, -20517, 118243, 10528, -49454, 40501, 4418, -44620, 65559, 49192, -90198, -1888, 80938, -50413, -31854, 51794, -51566, -39739, 78600, -15370, -102186, 17735, 46326, -43810, 12299, 28960, -98284, -15484, 119169, -9747, -62102, 29533, -20817, -21262, 103994, 38415, -102189, -16844, 72936, -1177, 21048, 51840, -88682, -59178, 108541, 33691, -57779, 7278, -25310, -56322, 65539, 65418, -84598, -57855, 47039, -11396, -7806, 62433, -51828, -82050]
670h2050J52738k6735r4865O2315L138o1784P6491M4832j21434j340J16129n6359
682A1076m3360Q2189o1644n0819J24678q769j15559M3356N2930n4972K7605M9164
694E5875j06046k4992J35738k2153q1603N6140k7706n1848J12290K7178j22357
705d9484l336P3706k3271P385N7875q7526o4260J24617K5164q1575L1204r983
717E16o2029Q0708O1120r4856l9290O5842p027j5733O1792m8057q2825Q9899M4986
730E5046p6281J4306J6428n2974L9056O3424o4831n3026O6060J4913l8985M2698
742B5834j6366p5200O9661N8936p2859j2957L0243k6240J8334N6788m6455o9025
754e9306N6162M2792m1704J9418l514p0015M7457P1103n4221l6484K3286q108
$$ y = [-82050, 70688, 43953, -50912, 11403, 14541, -47243, 29248, 74080, -47354, -48694, 67435, 11076, -32284, 49905, -11739, -62558, 62120, 53351, -62208, -18852, 34078, -20894, 6711, 55875, -50171, -75163, 60575, 38422, -43181, 12959, -14747, -66595, 45695, 72873, -49484, -52820, 20886, -2385, 5000, 62875, -24651, -88911, 35706, 60870, -20705, 10499, 516, -61513, 19195, 80315, -14541, -53831, 12011, 4984, -10749, 51043, 2986, -79839, 10060, 55046, -21235, -6929, 9499, -43475, -4419, 59005, -5826, -58852, 7208, 22121, -16864, 25834, 9468, -65732, 3929, 62865, -9994, -22951, 7292, -18948, -614, 56174, 9719, -59306, -3144, 39648, -2056, 17362, 13848, -56167, -8710, 62393, 8172, -28312, -5026, -13134]
766a3134N532M9179k2061p5564L3279N6622l2589L485O647n6329K5252O8317l0583
779A8053m4658J5171J0386j432L3284m261o7173J6226O1947k2489j3721P108l8187
792b9746J3568N6652j5969n0371K213K4201R49J6017J496n8546L599O2365r324
805A7104k2432J157k4053J0598M7663k425m6166j0137L1394Q278O715M555m7247
818b4996n619N6068K037k4556p285j5669R157L4440L840l9542k0857L0163J4079
831A1260n35K032l7209r472M6988J0549k1292j5033q939J3834K5716P688l1021
844e434k5626K7438K1773k808k758k9585q693L8645J3934j7507k1877p710J8210
857a998J9304M754k4948k6909K2651K5272k313p492k5511n498L3342J4178j2474
$$ y = [-13134, -7602, 41577, 19516, -56048, -22769, 33853, 1264, 4749, 11396, -44933, -19681, 48636, 18053, -26605, -11434, -1048, -2480, 30804, 26543, -40630, -24404, 37543, 15054, 1333, 8441, -29746, -16178, 40474, 24505, -25866, -23653, 548, 1497, 17514, 19010, -39536, -35937, 26428, 17104, -5328, -4171, -28224, -17626, 30037, 27612, -18554, -28691, 2703, 10981, 17696, 22251, -24996, -30615, 25453, 27490, 2934, -4351, -20020, -10863, 23577, 27417, -12125, -32982, -2819, 11260, 10725, 12757, -24452, -33924, 13064, 23613, 2321, -12712, -21651, -7817, 17899, 25587, -5434, -31060, -3622, 18151, 15343, 12585, -17000, -25693, 12952, 26886, 9379, -12498, -20208, -1998, 17306, 22060, -2888, -29797, -7146, 18126, 15813, 8321, -17190, -22688, 10654, 24832, 12358]
870A2358k4700q748K1767J6899K319k1006k6545J7458K5846k03j1093k5875k386
883b3909K7949J2453p899k5564j1087K4218J6996J524j8128k3919J6516K6234
895A5384L780j1107k4586M74K7708J1825n818k4622j2451K3317J7043o83j8953
908A311k3559J3085K2732L801j2245k6992j6K4990J0172n092k4448j2628K2622
921f267J7128R40j7437k1323J3984K2792O127r205k4670J242K4445J1754l222
934A6288k3196j1676K1893J5515J606j6274k2731J2591K1443N080j1196k4160
946a4817NK1124J1018l460k5174j1457K1605J3283R37j4730k2814J0837K3033
959I390N382j2040k2569K320J9382J1818J39k5966j0812K3758J2896O27j2077
$$ y = [12358, -12342, -21090, 677, 17576, 19895, -1111, -27656, -10198, 15648, 15445, 4352, -21523, -23909, 4040, 16493, 8594, -16970, -28057, -3839, 13157, 14681, -3447, -27366, -10850, 15384, 19164, 8057, -16529, -16055, 11653, 23478, 17660, -6962, -19413, 3904, 20947, 20264, 1311, -22248, -9163, 13569, 17370, 5125, -21867, -21883, 3107, 13279, 8187, -16261, -28889, -6267, 10861, 11801, -5636, -26959, -12975, 9817, 15944, 6739, -17931, -16689, 7756, 19510, 16288, -6908, -18584, 3309, 18824, 20430, 4156, -18575, -5984, 15459, 20539, 9343, -14817, -14812, 6312, 17330, 13870, -11304, -22761, -1156, 12127, 13064, -1666, -24480, -13643, 9390, 14772, 2732, -19837, -17517, 1865, 13683, 13822, -12144, -22956, 802, 13698, 14325, 2248]
972B248k1184Q388K3342P881j4198k1856M390J5106J0068L660k6692j4562K4788
985A379J1955k462j0276j8820L822K1698J1274j5896k2502Q755J3248P218Q465
998A7858k5375j7203K7039J4811o596r180j3268m15J9232J6409j8267k6829J2747
1011i037J2731J318R741k2507k2493K5987J8726j0023j1207p260j061J4726K2481
1024B2122j5679k9999J7475J6319l174J2411j4910k4883K3552K4187j1749j6482
1036h10p14j572N733K3259j3291l7823J6484J9248j0732O651r143k7326J5788
1049a4248L0112j1154k3679M727M648l04K6910m720m1699J6045L0552j1012L121
1062I299l21k5324Q468L6719n518l2889N376R758r524K4153K238m7079P003L4638
$$ y = [2248, -18936, -10548, 12794, 20675, 6477, -15379, -10989, 4117, 14185, 17845, -8847, -23409, 1379, 13334, 10872, 596, -18224, -14402, 7296, 18570, 2674, -19828, -11073, 2175, 9393, 17858, -7517, -24720, 2319, 17130, 10534, 1354, -11914, -12329, 6903, 23312, 5045, -21784, -9037, 3694, 5012, 14753, -7754, -30247, -4260, 14466, 4443, -6764, -14024, -15085, -359, 22122, 6443, -23556, -6081, 10238, 7064, 19475, 4565, -20318, 3234, 27421, 15672, -810, -1524, -3096, 2637, 25896, 12605, -25218, -8734, 10514, -218, 6433, -2710, -30036, -14248, 15864, 4710, -18969, -14242, -9594, -9898, 17012, 12292, -29407, -13362, 17190, 6178, 9299, 8978, -16346, -7878, 28841, 23323, -9566, -4190, 5568, -3956, 20197, 22435, -24644, -17641, 16997]
1076A6997j2216o125M875k2152k925L6770L085l8883M907J9763j5156J8157J3930
1089B1027m3150p3M0798q488j5591J0505j0635j1804L2257J1494m4028M91L0201
1102A3004j6169N511J8672l8873q354M4548J58k7293O093J079j4667K9115K1663
1115C4487m8306j1289L9390q707k102K1242l5078k1813M5137J4546l2392k591
1127g476O965k1908K1097L6374m2944k5514L8202m525q962K9217k0078l2842L2531
1140A37K4945k9062k096K0548k4618J197M0742k7281k7663L9207j854k6879K1240
1153H563R58k8764K0681K5224l7363j5844L5744q100j2362L0191k5410l4921M5622
1166D219K1603l1472L45L501k3092K2163M4017l1985m0192K8800P032p391L5995
$$ y = [16997, 4781, -1344, 3531, -18621, -21546, 15224, 18309, -20574, -15667, 4096, -11060, 7097, 21027, -22123, -22196, 18602, 10114, -5477, 5028, -5607, -17411, 14846, 26340, -17688, -17197, 13004, -3165, 2346, 21018, -17855, -26209, 18339, 18497, -8796, -2703, -1624, -16291, 12824, 34487, -13819, -25108, 14282, 5575, 3473, 24715, -10363, -32176, 12961, 27507, -4885, -7476, -511, -22419, -1322, 35052, -7892, -33406, 4796, 271, -8691, 20526, 448, -32394, 137, 25082, -3980, -6076, 14472, -10146, -8949, 31793, 4512, -23151, 16056, 14202, -12677, 8563, 9521, -19243, 1438, 26662, -10701, -26545, 9199, 1099, -11263, 18928, -6482, -41403, 4219, 25822, -5650, -5305, -1804, -24896, -2733, 41284, 9299, -30893, -2093, 4939, -2452, 33543]
1179C3543j7749n4396K6270L8089j7231m184M392l3303k37N3253p375m3567J7496
1192d999L070k0397L6948R869m7897N298L1915j5934m762K3908j8293k1175L6983
1205A4534K241l7843K4518J7040l2732J1825J6811l1292N195L5923j8407k9096
1217b1283K1324M951j6406K8822J844n0265J4290L7417j7356j649R810l1308l993
1230b3802M5913K627l7495M661Q078j6339K9554J8927m8805p367L4445o722k513
1243A162J5739k2740k1152L4366J6075l1579J650J3695k3066J4447K6697l3916
1255h622j2607L1048m935j3715J5176o380k0284K3291J8893l3345l947K4746j4284
1268d965L168K2950k7403j6589L2801P667j8744M099J21j8277J8923K6328l0598
$$ y = [33543, 15794, -38602, -12332, 25757, 8526, 4342, 8734, -24569, -24806, 28447, 21072, -22495, -4999, -1929, -22326, 14622, 24491, -23406, -18108, 13807, -2127, -6889, 17019, -1274, -22449, 14534, 16775, -21068, 3450, 20490, -12242, -417, 16394, -14898, -9703, 26220, 7813, -21283, 41, 4992, -11414, 17408, 19252, -31013, -16723, 20694, 3338, 1689, 11499, -19809, -23802, 22111, 24738, -12757, -8096, -18, -16357, 13197, 32124, -16681, -24048, 10397, 3675, 1162, 16901, -5839, -26991, 7375, 23450, -8129, -6479, 7216, -15850, -1403, 25294, -8622, -21229, 9819, 4884, -8831, 6345, -35, -20319, 2972, 21865, -11480, -15427, 9319, -4965, -1797, 21153, -6250, -22839, 9962, 17629, -1115, 2984, 3105, -15172, 3751, 30079, -519]
1281e19j7189K2948n740j248K0821k0785k4550K2815J6350j5944k935M513j7132
1294a8595Q097K9494j9242k0947K1034L89n135J8137p856k1447J5456K0268j2838
1307F815q117J0464j0538J25K5408j4352k4302J7753O029r449Q311n458j9329
1320a6640P943K1979j0818j6790Q913l322j847K2493q419k5078J2778J4448m594
1333A046L267j890j4405M405K4532m013j9861N753J607k437J8085m788k4581N556
1347g724J4977j210k883k377j1141q24K1239J585k0867J945M740j641J3992n86
1361I225j9570J226J4439L593n060k684o079l218J6840M428j9509j408N725j266
1375c318Q976q12j6270j270J2821N785o928m251j416j947J4083O701j6679l001
$$ y = [-519, -17708, 5240, -500, -1748, 19073, -1712, -26262, -3447, 12903, -3041, -5976, -1463, -18595, -10498, 18996, -246, -21193, -159, 230, -4905, 13232, 5376, -16071, -615, 19653, 6815, -1302, 9162, -1376, -1251, 24157, 9805, -14497, 3256, 9285, -164, 8147, 2689, -16640, -8697, 13282, 2464, -14326, -5413, -8735, -10582, 11911, 3492, -21586, -8808, 5640, 1046, 4313, 2423, -11982, -7577, 16955, 12942, -6919, -1166, 441, -1996, 16089, 11301, -13280, -7724, 7253, 6043, 3160, 783, -10358, -11182, 10057, 11642, -9225, -7280, -2540, -4181, 9811, 9225, -10345, -9119, 5320, 8913, 3853, 1169, -4910, -8128, 8712, 13140, -6369, -7777, -2052, -3318, 5658, 4846, -11424, -12694, 127, 5912, -1016, -5267, -6683, -8630, 5453, 12154, -4525, -7526]
1389g526Q461K896O732j417j2422k171J1600Q746p950q139p67j169J0823N393
1403A3090j6393o513N768M712M955m778j0391k923Q922J0961o171r582L41J178
1417f824J0230O348j2365o179N213P384N918n247q256k018O814J0512m696j0452
1431c618o76J377Q493M327j1388o700L132P540N375o474p470j482N678J0550l817
1446D847j0225j479L361Q670L330r998n966K514Q040N688p572p695k84N352R387
1461G970l932r872j812L066Q994K627r887m692J645Q144O386o996o937k07N726
1476B23Q796k833q947k232L184R056K188r437m708J183P382O122p319p338p40
1491e420M937Q794l511r306k457L232Q803J350q939n054J220P887N467p442n870
$$ y = [-7526, 935, 3831, 10563, 9146, -3276, -5447, 6153, 14899, 6949, -1190, -1957, -3126, 7697, 13090, -3303, -9816, -4048, 664, 5619, 841, -9550, -12473, -3551, 7410, 1239, -8343, -8002, -6824, 3406, 9754, -2611, -8790, -3577, 3807, 9725, 4478, -3778, -5796, 1018, 11530, 6834, -3618, -4294, -2917, 5576, 9903, -1485, -8185, -5053, 2487, 7862, 1388, -6082, -7564, -1886, 8664, 4847, -5378, -6857, -3496, 5174, 8504, -1494, -7460, -4946, 3094, 8782, 1210, -6485, -6769, -1417, 7970, 4038, -5834, -7646, -4580, 4414, 7041, -2846, -7538, -5893, 2251, 8637, 1641, -5296, -5503, 223, 9019, 6186, -2761, -4993, -1809, 7247, 9435, -2, -4710, -3527, 3855, 9977, 2658, -4680, -5420, -483, 8311, 4800, -4506, -6963, -3731, 5072, 6422, -2517, -7571, -6351, 1536, 7003, -439, -6309]
1506f309q49N066Q948l025r067j675L596Q762J895q304m334R97Q666N369p458
1521B278n593j97M626Q803l290q847k695L534P693O72p775m952p77Q669M863q760
1537a748n387l42L745Q586k380q959k423N168P926j48n534l968o03R896O802r168
1553A463m947J154L356Q016j053r235m395M872Q768k164o137l545l089Q578P028
1568H670r566o127J780K810O223N25p808n598N956J0088l751m443r22l074P950
1583B713Q381r616o836L708L851L244J03o615p048N720J1183n454p077J223l745
1598f265O080R919r244r406M143O151K185M32l883q636M576J3804m811q088K539
1613e04l462L397J0405o619j0995L460P332m43j337o40q816J879J4647n093j0404
$$ y = [-6309, -7158, -2092, 6856, 3831, -5236, -6911, -3315, 5447, 7342, -962, -5296, -4299, 4367, 9736, 2278, -3315, -3512, 1114, 9917, 6627, -2220, -4915, -1381, 6312, 6984, -791, -5743, -6520, 2149, 7012, -1748, -7135, -7477, -3732, 4854, 2474, -6485, -8908, -3740, 4186, 4038, -1496, -5464, -6067, 3829, 10631, 1463, -3484, -2330, 1026, 9042, 7989, -1246, -5641, -769, 7999, 5835, -302, -3847, -6936, 1642, 8670, -896, -7023, -5243, -2433, 3790, 4315, -3493, -9091, -3135, 6953, 3202, -1241, -2163, -5237, 2713, 11094, 1478, -5358, -1650, 2201, 5445, 5548, -1067, -8115, -2395, 8788, 3334, -3743, -2520, -6265, -185, 9734, 490, -8916, -4773, 1378, 3563, 3995, 112, -8524, -3948, 9856, 5045, -3043, -504, -3966, -569, 9836, 3217, -7778, -4318, 3014, 2571, 1234, 594, -8222, -6343, 8304, 3211, -7193]
1628g193M476k97J474R535m540j2689L888J2127q29m651O86q019R14J7696l865
1643H713j4946K639K278M35R374k069j5966j430J4489J563n815J896q581m774
1657a2194J8831K775j3930N87K661k351Q105N253j1844n729J2861J314p761O882
1671E460l342q700J1766L147j4002K413P918n207q21M352p863m724J5663R21j5392
1686h411L946L860m986J1994L380j8172k333J4398K504l078K554r964q988J9386
1700F090R972j7070k541K109o724J2113J0929j6612j1630J0547N311k593O363
1713F264o024j6200J2548J3981j1857j176M369r025M053J3228p309j0872R271
1726A251M617q367N592K849j3170P201J2244j4182m796J0436l636j819Q469o840
$$ y = [-7193, -2717, -3014, -1540, 7995, 3455, -9234, -5346, 6781, 5952, 1301, 1987, -6032, -5118, 12578, 8713, -6233, -3594, -1316, -881, 8493, 6424, -9542, -10972, 3517, 5080, -735, 1161, -7420, -12194, 6637, 9412, -4518, -3931, -1270, -3621, 4484, 9737, -2107, -7836, 5025, 6339, -1422, 5460, 2118, -6582, 5184, 8331, -5671, -3258, 4660, -547, -1368, 2984, -4879, -9603, 6060, 6981, -8411, -4465, -605, -5591, 6403, 9783, -8389, -10722, 3676, 6180, 3102, 5656, -4308, -13296, 6090, 16062, -1008, -3549, -1440, -8164, 3949, 14878, -1734, -13364, -2817, 2494, -99, 6264, 240, -15960, -3412, 10569, -1288, -2464, 1905, -7120, -3067, 10161, 2852, -8020, 1251, 5868, -2499, 3093, 5942, -7228, -27, 12217, -1965, -6761, 3675, 39, -1780, 6689, -151]
1740a51j2418J1317J1252j1945j415M046j1024P231J6348j2847j1413R014K215
1753B10o34Q802l630j6697P108J6559q186l301M853j1474K029J7839o554j3346
1767f422N730L098m517P345K092j6130J505J5879p559o386P835p690k268J4424
1781F936l254j4034N555Q124n127J720M807j2623q4J8318m955j0925O647j768
1795f63k785J2657k14j5884J308J1921k616j925M403j1390m753J8006n42j3236
1809e713L477j48l785R829L777j4312l715J2817m40l988O477p940o962J5389L687
1824H450j2086K054L030l949N700N915j1009n940J2739J209p467M650l633p859
1838h196J2275M831j3158j454N685j208J730N066q603p797J2351N551r055K000
$$ y = [-151, -12569, -1252, 10000, -1945, -3360, 686, -10338, -3107, 13241, 394, -11019, -2005, 210, -424, 8378, 4748, -11949, -4841, 11718, 3532, 231, 5084, -6390, -4361, 13478, 6924, -6422, -692, 2406, -2111, 5234, 7326, -8804, -7299, 8580, 1021, -5365, 2470, -5220, -7488, 6936, 3682, -10352, -4797, 3327, -1800, -80, 4727, -7896, -7980, 10338, 5383, -5542, 1105, -663, -3448, 9209, 8995, -6889, -5581, 6340, 3724, 1799, 6202, -5188, -9941, 8065, 7523, -5713, -2236, -2384, -6169, 3660, 7437, -6875, -10590, 2227, 1787, -2201, 4276, -3664, -10626, 4763, 8450, -3636, -1582, 1448, -2501, 3199, 9114, -1895, -7835, 4904, 6113, -1354, 3296, -337, -8196, 4079, 8910, -4248, -5702, -17, -1225, 505, 5571, -3032, -10829, 1522, 7073, -1982, 18]
1852A8o71o971J0600P269j0766n283N961J767Q4M757o177r924R692Q251q184j325
1868i02J61o232O911Q353q332p350M470L655r98L881k803r887P108R468p034j793
1884a324J229l939M398P286n241q161L632O031k252J259j026r182N270R719o170
1899A529m662J197j382L235N417l566q824K119Q354j540j041o89p094M182R850
1914G085l979n845j48Q86L015M450k081q635M0R078j28k030p78o637K780Q959
1930F032j561o294k053J813L062L045n14p626j925Q702J269k661r23m879J621
1945b892P592kn776l162K308L488J573k03o367k187P731K439l349j882l543J808
1961b424O039L70n032l590K864M262K37q62n047k279P610K524l419k524k915L004
$$ y = [18, -653, -7624, 2976, 10245, -521, -5804, 157, 1924, 2008, 6765, 588, -9336, 356, 8607, 423, -902, -741, -6973, -62, 8291, -41, -7391, -2921, 734, -264, 3617, 814, -9073, -1965, 7503, 469, -1324, -95, -4034, 364, 7650, 2409, -5752, -2120, 3911, 1659, 2918, 1892, -7290, -2020, 7699, 1529, -3133, -1936, -3318, -83, 5334, 1768, -7056, -4937, 3417, 1877, 836, 147, -6947, -2765, 7085, 3106, -2739, -2887, -2001, 1014, 5464, 3383, -5252, -5212, 3866, 3738, 1708, 930, -5707, -2927, 6032, 4471, -1823, -3876, -2063, 999, 4044, 3530, -4096, -6021, 2681, 3950, 1289, 366, -4513, -2892, 4700, 4698, -1078, -4240, -1932, 1556, 3129, 2926, -3441, -5628, 2103, 4542, 1193, -689, -4232, -2424, 3615, 3985, -1047, -4637, -1773, 2489, 2726, 1864, -3183, -5462, 2148, 4672, 1253, -1271, -4186, -1182]
1977a182N050L98m769m684L045N355r7j283n092k008O474L304k853l762k691L056
1993a739N121K63l687m922J903N963M90j870m640j792N935L549j932m205k820
2008d383L516M410P0l139n254K129N760O66j921m986j336N814K819j625m083l434
2024d977M341M186l73k940m949J708N909O95k142m684j262N794K649j203m231
2039a479l347M194M152O5k828n195J757N536Q91j892m936j405N735K663j076m346
2055a511l465M123L823R6l077m658J664N328J112j806n069r63N382K611j036m630
2071b076k996M473L698M2k581n310K157N494O79k414m312q91M949K797o82m623
2087a596k945M016L632J58k455n219J476N476J025k184m739p81M437K794k41m933
$$ y = [-1182, 3868, 4266, -503, -5187, -2142, 3213, 3116, 1833, -3259, -5267, 1207, 4511, 1658, -2104, -4795, -1739, 3382, 3645, -42, -4964, -3061, 2902, 3392, 1522, -3118, -4910, 1025, 4574, 2642, -1563, -4383, -867, 3543, 3613, 474, -4780, -2651, 3109, 3775, 1854, -3132, -4468, 1346, 4165, 2540, -1543, -4977, -636, 3550, 3177, 237, -4712, -3004, 2905, 3600, 1458, -3226, -4488, 1306, 3955, 2752, -1479, -4826, -632, 3520, 3585, 757, -4438, -2681, 2855, 3746, 1854, -3082, -4487, 1248, 3911, 2835, -1511, -4976, -853, 2970, 3066, -11, -4669, -3005, 2323, 3435, 1629, -3440, -4403, 979, 3590, 2554, -2076, -5072, -599, 3099, 3141, 560, -4750, -2593, 2901, 3580, 1166, -3146, -4037, 912, 3709, 3027, -1596, -4541, -525, 3107, 3265, 810, -4409, -2933, 2543, 3568, 1384, -3355, -4136, 301, 3095, 2854, -2079]
2103b079l411M890K942L42k183n167J741N426J674k514m574j95M185K711L29n044
2119i27l601M835L569o11k140n026O02N761J659l054m955K12L702K063R58m846
2135a799m340N258L451o35j504m193L77M926K780k462n564J332L504J563J459
2150D153m301m778N177M235j935k426k986r6M615K949l134o416J463M413L80J330
2166B643m459n411N377N750j771l062k928N40L766M637k497p243J479N240J67
2181B228K037k899o829M174N993r68l479k304J33J748M798p54q647J407N138j219
2197E57J224j450n819L074N652n22m981q58K211J85L643J27q378J689P137j305
2213B186n56j034m509J979P111j9o945j579L524M71L479P08r570l84Q485j61j980
$$ y = [-2079, -5490, -600, 2342, 2684, 501, -4666, -2925, 2501, 4175, 1661, -2913, -3108, 1077, 3788, 4117, -927, -4528, 307, 3876, 3265, 1125, -3901, -3299, 2462, 4121, 1067, -3888, -3676, 26, 2089, 3047, -1799, -6139, -881, 2570, 1935, 431, -3762, -3385, 1541, 4321, 1859, -3705, -2373, 1131, 2694, 4153, -148, -4926, 251, 4486, 2551, 125, -2861, -2957, 1658, 4607, 1473, -4943, -3480, 933, 1313, 2643, -1816, -7227, -1850, 3900, 2129, -933, -3861, -3321, 445, 5082, 2585, -4658, -3179, 2061, 2228, 4265, 1366, -5463, -1289, 4704, 3736, 257, -2047, -1914, -166, 4632, 3878, -4769, -3362, 1776, 557, 1781, 331, -5488, -2414, 3238, 2716, -2265, -3123, -912, -727, 2916, 3043, -5335, -3646, 3491, 2186, 1630, 596, -3913, -1934, 5177, 5158, -1787, -3366, 158, 629, 4108, 4816, -4754, -5138, 3347, 3186, 1206]
2230A206j402l967J03P226J868p267l114M374R5K616L016q733k561Q508J350k398
2246I20k23k747j279N734M253p175l740N785p91P33L701p462l177P698J708m287
2262c49o69q93j506L747M778o889m856O911N40j457M002n935l635P733L797m419
2278I00k946J240m84K711N963o374p305P155K511j909K301m598n219O031O002
2293E979m487n257J756j16Q33O730m460q581N807M032k103J799k590m919M017
2308a560P389k933o323K708J176j240P019k985r064M757N462k355m16j210m507
2323d082J953P464j564q044K014J971j659N617r41r537L065O602j746j077j63
2338a27l318m39P799N00q455J445M037k641L979O70p922J442O578r14l203K47
$$ y = [1206, -196, -4163, -4060, 3166, 5034, -2233, -5347, -973, -878, 1738, 4754, -3979, -6540, 1968, 3318, 920, 697, -2050, -3329, 2405, 6658, -517, -4257, 1528, 737, 1470, 5171, -2291, -5468, 2230, 3938, -349, -1018, -1911, -3417, 330, 5108, -1781, -6637, 274, 814, -643, 3359, -2576, -6211, 1522, 5319, 900, -2046, -806, -1290, 1421, 7384, 1010, -6295, 860, 3371, 1462, 3763, -835, -6054, -23, 5979, 1492, -3765, -2009, -2125, -1292, 5438, 978, -7603, -1796, 2236, 133, 1932, -658, -5577, -1560, 5829, 2896, -3427, -719, 457, -783, 6236, 3251, -5813, -1056, 4406, 2051, 1635, 425, -4082, -2129, 5335, 3771, -4273, -2259, -288, -1947, 3670, 2729, -6808, -3743, 2859, 1113, 36, -127, -3445, -3884, 3915, 4415, -4040, -2595, 1442, -1199, 2780, 3450, -4472, -3030, 3548, 2634, -569, -322]
2354c22p40j291N846J093q890R11O243k574J167Q43o614N86P670M25n891j441
2370b979J399n82N308K352r902j884P663P6R87jo810j187P687L993n581l264R69
2387a756q44N206N089q855m299N824J216R52J088n324l226M706M922l632l400
2402b333J626j980K218N524o101m006M991J218p45P84k053k399L054M691l866
2417F23l633L703k54J72L744m825l897N106K531j829j888j199r54K194N003l973
2433F24o242L841K026L59K623m738m374M692M768o93l556j674k6K448O081l178
2449B981p440K404K937J125K709m203n150K131O006P24m182k742o59J754N700
2464D095n23p621L54K887J729K732k942m617P73M840K293l711j934K48K63M552
$$ y = [-322, -1062, -2353, 3493, 4586, -4304, -3393, 2850, 276, 1443, 2286, -4328, -3742, 3928, 4353, -1538, -2979, -1580, -2162, 3146, 5498, -4404, -6288, 1375, 1451, 2438, 2437, -4373, -5560, 2127, 6120, 539, -2725, -1756, -2600, 2606, 7695, -1160, -5459, 365, 1581, 2533, 3621, -1703, -4929, -223, 4699, 1067, -2333, -707, -2687, -469, 5055, -1046, -5052, -61, 1157, 412, 1196, -857, -3256, -202, 4489, 623, -3010, 693, 439, 611, 4355, -470, -4367, 739, 3270, 1441, -447, -1646, -2600, -406, 4597, 624, -5618, -1777, 249, 608, 3231, -1507, -5881, -1189, 3579, 2886, -670, -2344, -2370, 78, 6159, 2981, -4459, -2055, 882, 2007, 4716, 513, -4637, -2506, 3500, 4224, 42, -2700, -3359, -1605, 4095, 3572, -4049, -3695, -808, 921, 3653, 711, -3906, -3133, 1707, 4000, 289, -1645, -1397, -1134, 3418]
2480C418L51n900K64K229Q24J115j867l013P08L253J942m084j548J396Q9L314
2496B491l98n511O46L321J726m0l052j975R35M135K127m706l126K117J591L222
2512C503r56n825k3K950L183K31m192k216M43M322L194m542l277J359J172L701
2528C027M5n317q78K355L374Q39m015j807O0L004L546l565l171O47J289L534l64
2545B603m426q46J587L440N01l598j624K94K855L094l162l461R44J604L223r94
2561B034m352l95J322L648O52m406j265Q23K574L119l106l245N97J865L531j022
2577B374l712p13R43M079O50m195j403K82K807K858l358l197K63J922L232j141
2593A691l835q62R51L827J204m253j713P16L095K680l059k716O0K031M077j321
$$ y = [3418, 3769, -2131, -1867, 362, 1186, 2301, 434, -2579, -1871, 1382, 3324, -760, -2308, -912, -823, 2491, 2093, -3418, -2772, 549, 2275, 2235, -817, -2792, -1857, 2278, 4405, -301, -3427, -1310, 281, 3503, 2547, -3278, -3301, -351, 2832, 3063, -1129, -3345, -2902, 1420, 4614, 72, -3205, -1846, -674, 3027, 3072, -2245, -3123, -768, 2606, 3445, -570, -2377, -2317, 687, 4233, 668, -2503, -1856, -567, 2967, 2603, -1823, -2669, -1082, 2358, 2859, -739, -2363, -2069, 786, 3880, 718, -2743, -1799, -195, 3028, 2034, -2318, -2713, -1391, 2257, 2909, -1497, -2762, -1939, 635, 3754, 648, -2597, -2000, -135, 3396, 2374, -1338, -2051, -1108, 2971, 3621, -574, -1977, -1695, 1112, 3970, 612, -2585, -2322, -400, 2832, 1691, -2144, -3006, -2055, 1772, 2976, -1277, -2990, -2274, 821, 3501, 442, -2274, -2214, -183, 3894, 2573]
2609B573l756o26P79L923J065m334j866L13K693K712l409k781k41J463L870j139
2625A239l722p30Q48L854J222l932j567N50L041K778k315l094j57K219M044j568
2641B710l444r14M71L898J004m309j517N5K586K342k698k701q39J834L756p02
2657A532l820n14K83M055J504m119j348O07K920K966k424k613j058K031M190j442
2673B750l230j290P33L127J488l773k245L30K473K576k740k379j130J711L975
2688B376j476l038n58M98L740J201l525j645M24L213K144k535j976q57K089L938
2704D013j805l387n45M00L507J475l678k615K99L309K188k946j967j404J576M787
2720C207j643l554l89J31L445J751l075k528QL595K049k673r76j705J210M470
$$ y = [2573, -1183, -1809, -1030, 2893, 3958, -376, -2242, -1929, 764, 3476, 67, -2714, -2955, -1492, 2378, 1239, -2483, -3213, -2365, 1489, 2711, -1221, -2788, -2238, 803, 3581, 1266, -1828, -1985, 234, 4278, 2710, -734, -1648, -1177, 2721, 3725, -584, -2101, -2046, 540, 2882, 184, -2517, -3356, -1522, 2234, 1532, -2288, -2802, -2519, 1536, 3040, -1079, -2427, -1820, 1100, 4066, 1642, -971, -2029, 2, 4192, 2750, -480, -1770, -1037, 2090, 3578, -195, -2440, -2110, 363, 2939, 199, -2180, -3310, -1599, 2376, 900, -2138, -2696, -2198, 1542, 2743, -782, -2427, -2003, 1210, 3354, 819, -1157, -2014, 75, 4013, 2208, -1179, -1724, -1324, 2183, 3658, -20, -2635, -2336, 973, 3161, 215, -1752, -3156, -1580, 3207, 1564, -1990, -2379, -2248, 1197, 2948, -127, -2655, -2647, 948, 2997, 324, -652, -2357, -1147, 3323]
2736C323j258l330l07N74K816J253k584k072l43L466J945l420j265m38O62M471
2752C493j516l798q39J324L377M40k587k754n07M606K502l744j559j163J139N118
2768C532m37m135j509J069L569J012j777k582j906L890L373l075j549j405j01
2783b031M354J17l319j826P94K809O0j246j158j756L318K819l368q55L7N83K899
2800B231j12l143j386J879L304r13j496j225j589L842K868m151j972j30J165K865
2816B037P7l166k754J679M746r47k210q56j998L656L498k732k898k32J569K920
2832B389o9j846l476J544M505m06k492j096j840L125L687k657l723j40J814K707
2848B026L47j885l712k8N791k27k250j194k163K223M235j010l385j264J423K169
$$ y = [3323, 2065, -1265, -1572, -998, 1818, 3071, 487, -1585, -1928, 1538, 3483, 63, -1202, -1640, -978, 3493, 1977, -1821, -2660, -1336, 2041, 2481, -106, -2860, -3367, 1239, 3741, -3, -1562, -2725, -1586, 3532, 3095, -1040, -2549, -1480, 2089, 3101, 1324, -1258, -3164, 726, 4099, 1024, -525, -1930, -2031, 2323, 2440, -879, -2705, -1911, 898, 958, -288, -1446, -3202, 116, 2935, -433, -1288, -1251, -668, 2231, 2119, -1024, -2410, -531, 2773, 1860, 364, -861, -2450, 1392, 4260, 109, -1863, -1993, -828, 2037, 2114, -1052, -3806, -2127, 2619, 1672, -538, -1394, -3392, 264, 3762, 1030, -1868, -2100, -531, 2389, 2320, 474, -3002, -1458, 3047, 2641, 149, -947, -2787, 338, 4025, 1368, -2355, -2495, -681, 2026, 2373, 488, -3224, -3252, 2539, 2312, 62, -1132, -3295, -1072, 3163, 2153, -1232, -2496, -1073, 1096]
2864A096O54k64l215j448M689M53k012j35j829J264K591m51k026j297K179J129
2880A378j017K22j778p7L750q28k752j02j49J808J946j670l100o72L948K097k490
2897E14j429k090L97N549L64m321j778K34K907L079j027l865k396L201M304j154
2913B489j600k729j443N225K189k717l031j152K219K570K99k638l567K363L150
2928A627n64n63j912j887L530K177j828j597j049J720J576N52j108l070J963K725
2944B292j316l17r17j286K911Q18j643j739m67K561N09p33j269k139K286K997
2960B548k085j426r63m5K952J140k177k159m9L793P69j394j583k313K238M052
2976C298j170k289k178M51L393J424j583l543r92L696J664p60j564l192J276M357
$$ y = [1096, 1750, 1486, -1729, -3177, 1512, 1965, -47, -182, -2011, -747, 1844, 1393, -633, -1930, 249, 1378, 361, 583, -1195, -1272, 2478, 1650, -1102, -1204, -1353, 455, 2401, 731, -2369, -3041, 907, 3004, 514, -915, -3005, -2608, 2941, 3305, -1016, -2794, -2560, 347, 3426, 2399, -1466, -3862, -661, 3643, 2489, 889, -1840, -3283, 1942, 4131, 1414, -1617, -2769, -550, 2020, 2319, -319, -3886, -1523, 1627, 1063, 500, -1412, -3299, 231, 2408, 580, -1017, -2066, -346, 1230, 1782, 674, -2396, -433, 2292, 976, 659, -258, -1544, 1367, 2185, 542, -1197, -1664, 897, 1406, 673, -596, -2735, -449, 2548, 463, -963, -1926, -1971, 981, 2121, -56, -2215, -2264, 1529, 2298, 904, -679, -2992, -754, 3298, 2128, -161, -2339, -1888, 1505, 2929, 1346, -2197, -3189, 507, 2171, 1411, -153, -3345, -2069, 2288]
2992B288k6j995k144m70L067J283l51k778j630K761J697l41r45k676R00L096p7
3009A659j228j908o9K419M74m57k149j293K982J436j027j139j642J153K851n49
3025A513j728j958Q58K810M56q81k122j552L488J487j040j452k304J167L216J18
3041B076j972k325J34K923R56m83k774j635L022K110n25j649k388R60L289M4j040
3058G23k890L2L004P96l34k095j883K663J897m42j267k355J183K271K34q84k686
3075b033P57K427L49l89j899j689K687J133k56j551j928J252K558L6p67k911Q1
3092b143L113P70m63k292j383K337K116m58j529k224J172K672N11j363k588j79
3108a931L106N73k09k256j776K463J322K90j450k815J695K305K80o93k832j3K707
$$ y = [2288, 2262, 267, -1877, -2347, 720, 2003, 1652, -1126, -2756, 5, 1702, 1361, 416, -2260, -1360, 1736, 1659, 431, -1477, -1546, 873, 1347, 890, -1259, -2552, 430, 1866, 839, -300, -1942, -789, 2062, 1513, -215, -2173, -1315, 1495, 1951, 1070, -1052, -2604, 884, 2371, 1331, -121, -2425, -1258, 1958, 2076, 104, -2221, -2087, 836, 1792, 1309, -1465, -3100, -78, 2032, 1507, -142, -2530, -1570, 1719, 1763, 723, -2167, -2135, 869, 1665, 1331, -764, -2647, 16, 1913, 1471, 204, -2151, -968, 1303, 1537, 653, -2033, -1276, 1151, 1500, 1111, -788, -2477, 210, 1343, 1087, -464, -2392, -1140, 1418, 1454, 687, -2224, -2143, 970, 1740, 1277, -1015, -2398, -61, 2055, 1597, 68, -2156, -984, 1688, 2199, 836, -1752, -1931, 1175, 1748, 1539, -717, -2493, -30, 1292, 1582, 132, -2683, -988, 1317, 1597, 904, -1928, -1941, 766]
3125G66P25j29j801j830K541J446L65j769k715J430K315L55q22k658j43K522Q30
3142A428k31k241j427K013J883m17j307k446J548K188L96m21k609l78K493J343
3158A815j93k098j771K442J634J27j470k659J546J843O16o84l028K0K442O56m6
3175A192k182j694J992J577L64j515k644J689J918O80o71k647L01K182Q03N43
3191A888k358j371J941J686K71j355k465J302K095K37n99k991N4K142Q26K60k397
3208h34j540K005J266M85j401k756J823J583P97m56k787j22K159J290J48k512
3224h52j265J943J525M43j275k559J273J697P88l32l004j37K170J191j25k270
3240g89j352J570J420Q51j580k418R06J808J022m16k774R8J526J464K65k118j423
$$ y = [766, 1491, 1362, -439, -2269, 272, 1718, 2083, 314, -2401, -971, 1344, 1699, 877, -1781, -1924, 598, 1428, 1197, -1044, -2471, -458, 1425, 1008, -299, -2745, -1197, 991, 1387, 966, -1643, -2021, 472, 1815, 1622, -476, -2247, 195, 1829, 1956, 486, -2173, -627, 1216, 1832, 1148, -1880, -1860, 582, 1238, 1192, -990, -2684, -692, 885, 1249, -266, -2910, -1221, 697, 1377, 706, -1941, -1640, 542, 1345, 1888, -470, -1841, 100, 1786, 2057, 702, -1763, -461, 1634, 1871, 1272, -1719, -1665, 477, 1303, 1563, -834, -2374, -369, 897, 1382, -19, -2775, -952, 631, 1428, 972, -1815, -1937, 222, 1512, 1660, -852, -2117, -174, 1351, 1794, 519, -2040, -767, 930, 1718, 1386, -1618, -1755, 415, 1606, 1481, -789, -2141, -571, 849, 1700, 120, -2298, -1392, 416, 1438, 1022, -1752, -1654, -128, 1336, 1601, -517, -1940]
3257a940J528J448N73j436j770Q69J395R48o25k299k5K063J39N96k037j523J723
3274c73J292N67j452k298J258J724O11n63k308j83J860J327l1k225j512J468K011
3291A173R68j707k460J141J632R19j07k725n40J982J101L74k132j230J012J094
3307D95J292j484k208P59J252J255j58k633k11J573J258M96k380j199J548J111
3323G66J304j934j990J145J353R13k93k636j09J736J069J63k239p38R88J077J280
3340A855j663k321J023J392P81O5k245m44J455J195K50k339o42J352Q56J204j423
3357C51k440J385J249J119m92k321m79J456J827L72l097o55J507N86J611j332
3373F47k920P90J956J201o13k142n31Q21K171P70k706j050J126L02J670k74k551
$$ y = [-1940, -412, 1036, 1609, 173, -1597, -728, 667, 1615, 990, -1309, -1334, 729, 868, 1464, -573, -2096, -373, 919, 1486, 34, -2264, -1006, 718, 1329, 766, -1542, -1725, 135, 1462, 1431, -794, -2306, -838, 1173, 2141, 434, -2026, -885, 747, 1666, 1559, -1166, -1706, 276, 1377, 1751, -381, -1611, -599, 495, 1787, 303, -1905, -1146, 106, 1361, 1203, -1430, -1641, -68, 1190, 1686, -694, -1893, -345, 766, 2070, 136, -1854, -709, 644, 1557, 1264, -1372, -1481, 255, 1324, 1487, -752, -1490, -502, 575, 1855, 192, -2129, -1106, 286, 1067, 1132, -1113, -1557, -102, 1093, 1343, -996, -1638, -286, 570, 1774, 351, -2089, -704, 545, 1664, 1172, -1149, -1628, -172, 1655, 2027, -1070, -1725, -218, 368, 1979, 647, -2273, -1483, 473, 1674, 1061, -1081, -1612, -791, 1380, 2150, -556, -1606, -480, -178, 1492, 1218, -1333]
3390a333L00J146J261Lj670o88O43J260R54k533m53J195K29R36n94k024N49J343
3408E24O62q25j522L59M77J192R02k847q51J821N32J010j208j959K89K149J178
3425A883j124k372M91N50J646J428k931j767J606J129J063l01k698m14J345K339
3441A873o00k249J13L6J059K084k380j563J239M01R89k75j309o94Q85J693p31
3458E71j552P16j04P06J275k007j011J571J062k36q97j127K41J123J974j499k560
3475a754P47J199Q29J116k615j800J391K092P20j898j493k67J049K784m79l265
3491a644RQ23O37K503j831k365M7K093J557j066j093n23m80K520P56k557j3L48
3509b79L56R17l95j197j48J168R97j920j9M48n15J502K10k709L29J311L88L03
$$ y = [-1333, -1033, 113, 1374, 1377, -293, -981, -338, 922, 1876, -657, -1110, 85, 314, 1250, 656, -1368, -819, 524, 1186, 361, -1161, -802, -325, 867, 1769, -1078, -1929, -108, 424, 1434, 226, -1733, -1444, 705, 1883, 759, -1613, -1122, -572, 1074, 2502, -429, -2196, -590, 539, 1602, 1301, -1397, -1811, -466, 1873, 1273, -976, -863, -827, 232, 2316, -64, -1627, -388, 13, 1002, 727, -582, -1276, -391, 1302, 571, -981, -265, -369, 337, 1612, -395, -1406, 165, 1227, 991, 94, -1033, -792, 331, 2305, 806, -1754, -1007, 192, 1021, 2137, -478, -2278, -887, 1205, 1925, 27, -1466, -1733, -684, 2100, 1621, -1644, -1635, -812, -175, 2328, 497, -1868, -1821, 272, 1829, 763, -330, -853, -1333, 1187, 1943, -614, -627, -279, 77, 994, 599, -598, -746, 422, 1419, -501, -520, -72, -587, 915, 1125, -1584, -1255, 56, 444, 747]
3527G47j084p26j32J840R65j809j242J072o2J613J79k547j22J277J165L3j061
3544A06j295j12J728J579j847j593P99p8J825O54k467o06Q90J502J05j140r63
3561i13k37J327K088k011j479P09J0J467O90k193r88P83J519K68j053q38n48J093
3579c06K106j170j872N09K16R02J258j754j056L15J783J98j194j43p06N61K082
3596A729r78j676O49K13Q78K71j231n40j80J720K06j465O7k56L89J825j609j302
3614a290O84L30J363o79j152m11N7K011M81j656r39P8J022J554n74k117J49N24
3632e65J821p4j264j083k02K389P24j758n35l33N61K069p79j566j73N00J402l8
3650A096j016p90n75J747R89j839l60j59N62J483p49j051n58N60J428n8j171j00
$$ y = [747, -337, -1063, -1195, 645, 1610, -199, -1441, -369, -431, 1182, 1361, -1186, -1308, -31, 1134, 1167, 106, -1189, -1301, 427, 2006, 159, -1434, -635, -713, 1112, 1766, -701, -1307, -417, 1085, 1190, 50, -913, -1150, 177, 2265, 254, -1225, -516, -506, 961, 1651, -542, -1530, -747, 772, 1040, -13, -851, -1399, -306, 1800, 630, -1242, -733, -517, 385, 1643, -111, -1167, -852, 931, 1129, -65, -208, -914, -353, 1729, 751, -925, -276, -63, 815, 1086, -145, -685, -865, 855, 1061, -404, -337, -593, -204, 1621, 12, -1290, -606, -276, 1087, 408, -744, -1155, -1098, 913, 1394, -262, -1201, -1123, -101, 1453, 879, -1238, -1089, -565, 1256, 1182, -82, -1165, -1367, 1022, 1746, -12, -547, -880, -319, 1750, 971, -595, -768, -268, 1134, 1096, 80, -710, -1285, 462, 1451, -388, -748, -907, -345, 1138, 389, -662, -1220, -660, 768, 710, -461, -561]
3668e61m75J768P24j702n07J77R82J016q19j119l54M88J711n64q27n57j75J560
3686G66R02j725o21n4M59J544q53p56q11M85J572k34j311j4m29J359R55j285q38
3705h89j18Q46J177o14r61l58J11J979l43j269M7k94J185R29j175n66l67N89J327
3724A236m44r60p64M05J781k41j224m76j11J205O33q71p59n89J216R12n17o56
3742b24q32K23J631j30r30n78k78J347M53m28m20q97R47J194n61p59o32M28J649
3761A203l18q93o40J8J196M71r75m90p21J182J017n04q26p26K69J622j50j043
3779c08l01l96J313N42p52l12q30J092J036p64p16k32j17J720j58p05r55n0J572
3798F79P2l67j090j29O94J373q61n35o24O1J469L92j254n08j68J128M07l74p75
$$ y = [-561, -1036, 732, 1456, -246, -753, -576, 406, 1422, 603, -516, -870, -382, 1329, 765, -62, -619, -794, 766, 1668, -57, -678, -732, -273, 1271, 418, -338, -1149, -664, 908, 674, -637, -651, -1080, 279, 1234, -51, -889, -1007, -161, 1016, 402, -559, -917, -806, 1173, 830, -439, -392, -686, 499, 1428, 253, -313, -680, -91, 1236, 792, -168, -932, -527, 1254, 1013, -211, -687, -798, 407, 1040, 169, -590, -1179, 37, 949, 432, -224, -1056, -833, 798, 668, -262, -840, -1118, 229, 682, 254, -166, -1063, -116, 1078, 517, -242, -874, -446, 1203, 885, -8, -648, -630, 566, 1037, 62, -428, -1149, 33, 1050, 546, -280, -1006, -737, 885, 735, -308, -609, -1005, 308, 850, 98, -214, -1044, 48, 1084, 320, -396, -628, -745, 975, 817, 112, -843, -893, 679, 751, 384, -706, -835, -141, 1232, 371, -164, -788, -727, 742, 1134, -120, -628, -796, 332, 739, 365, -410]
3817d10o78J186N89m77m62p81L74J703j26q60n74k28J284L71n06p08q11J053R93
3836I32m45p79j09j55J278L01q77p53j24J230N2j88l54p60O92J114r52k75m64
3855f36j62J283K42m64j038j09J481J07n06j47j042Q10R78o79n31k38J41R16K29
3874F35k20j038l82J670K61r23j27n49L02J528k60j151n97M66Q99K73j49j397
3892g59m84J868L45j032J93q42n8J441j76p52l59K34N91K3M14j176n75J515L56
3911G67j112J47P4l01J283p6q67n34J067Q8p1K47p87p66J692N6j076mk69L48O31
3932E37N10j294j073J037J100p12J47q90r67J965Q84j311p62P0K72Q34P06p93
3950B60j809R36J652n96R8n70j296J295J610p58j046m39K23K74J538k33k036M10
$$ y = [-410, -1088, 98, 687, 210, -252, -1033, -659, 1044, 918, 58, -516, -744, 540, 911, 405, -303, -1114, -61, 932, 487, -292, -401, -556, 722, 1023, 146, -607, -731, 499, 551, 363, 9, -751, -59, 1055, 103, -172, -636, -798, 485, 727, 263, -775, -884, 597, 704, 198, 51, -991, -181, 797, 118, -413, -651, -510, 406, 635, 415, -623, -1005, 665, 926, 3, -124, -673, -371, 1157, 897, -254, -851, -385, 514, 787, 638, -759, -1243, 625, 970, -62, 131, -711, -769, 672, 496, -256, -615, -381, 210, 233, 647, -529, -1104, 411, 767, -345, -198, -124, -425, 858, 782, -85, -619, 448, 536, 465, 712, -75, -841, 851, 907, -169, -173, -442, -94, 537, 1047, -247, -1320, -283, 817, 105, 252, -638, -1605, 360, 1244, -67, -829, -759, -487, 347, 1053, 260, -1549, -613, 1039, 443, 541, -29, -1325, -30, 1580, 822, -224, -663, -440, -166, 1372, 1139, -897, -487]
3968d87J108q02P33K21j627L69J041l65n79N09Pq65O47N67j358O19R83j461j78
3987i18R99p23O02Q22q42j002O32J141n28K75r4j666R92K177q59j470M48o42Q20
4006A64J461m49k184j20J626M00%K85k577r5K244N92j231j84q32p3J581M22j429
4025c99p29J134j61o3J050j125j240J918N3j075O26n0m70P51N30n70j268J925
4043H37k65r10P56o39m97J525J0j104J30L03J98m27R51q31j442K027K30j118K61
4062ek19r67J350P38j317m91N12L11q3O71n02j551J288J057j389O68l59o15J232
4081C29M96p56j137R81N94k63P02p08j640J331J442q89l82k1p27P45J223o49j717
4100a046O60Q49k73O21l51j719M07J799p52M0j38r69J62J554j05j453r7R14k63
$$ y = [-487, 621, -181, 552, 773, -854, -485, 556, 191, -388, 121, 128, -737, -90, 477, -881, -262, 721, -740, -918, 81, -642, -40, 782, -60, -1062, -430, 711, 183, 458, 364, -1302, -310, 1867, 1008, -462, -14, -656, 164, 1625, 1176, -1008, -1128, 498, 898, 898, 1183, -1394, -1489, 755, 1347, 116, -68, -900, -973, 608, 1030, -399, -1128, 6, -155, -218, 832, -293, -1533, 385, 438, -637, -11, -61, -531, 220, 750, 180, -1088, 837, 572, -338, 418, -221, -718, 807, 817, -287, -157, 146, 344, -83, 868, 37, -1405, 622, 852, -266, -5, -224, -1191, 159, 897, -420, -911, -399, -88, -171, 500, -2, -1553, -265, 792, -597, 71, -288, -903, 329, 825, 69, -1068, -87, 507, 244, 946, 238, -1402, -71, 1371, 482, 100, 79, -648, 97, 1320, 671, -1046, -386, 463, 190, 811, 460, -1259, -852, 947, 195, 235, 97, -872, -710, 844, 739, -714, -811, 103, -160]
4119a60L33M83j482R4J329r4p83R9L11l43P69q7j021J42J062l47j62K21q60J28
4139c68J131k78p56j46M14j74L73L96j041l85J449k81n58K91q79j7J043L46q21
4158b61o17N15L02K76N21j031q99J510n5j52L2n32k06J008O33r06n16N29j14J53
4178A90O55p65o34Q08Q7k70jl79J4N68L70k74j153N21N93m88O91p47n36P52M98
4199E00m60J0n37j12O44O31l66j250O59N09j85N33q36n50Q96M26l86o4m70o9O52
4220A75K02P1j230M48R81l69K33p58l7O05k97L21o07l66M15R8R11n86j058L10
4240e38Q76k04L87o38n47O64K02L59p38j98L92j0L42j02p63L30M43J99j59l97
4260a00l68L74K48K79n19m38O04R2N1J12p70l7N96L04k0p54O0K94L50K84p35n67
$$ y = [-160, 173, 656, -826, -732, 597, 503, -280, -181, 130, -213, 556, 469, -552, -410, 652, 305, 143, 364, -496, -368, 763, 485, -271, -417, -3, -177, 196, 592, -449, -834, 615, 334, -224, 67, -812, -829, 214, 560, -261, -878, -363, -61, 215, 736, -295, -1194, 316, 261, 109, 141, -391, -597, 411, 1044, 138, -378, 151, 37, 190, 845, 80, -554, 254, 341, 71, 70, -309, -295, 273, 643, 369, -784, -263, 330, -158, 533, -214, -750, 2, 500, 40, 50, -487, -599, 45, 676, 310, -940, -281, 228, 43, 576, -260, -810, 86, 512, 126, 62, -408, -477, 175, 377, 448, -782, -334, 647, 278, 511, -247, -284, 321, 24, 345, -262, -628, -213, -115, 796, 210, -848, -538, 338, 134, 521, -117, -664, 0, 202, 561, -177, -375, 17, 7, 349, 247, -516, -186, 257, 456, 297, -100, -468, -94, 154, 433, -86, -524, 80, 172, 223, 335, -435, -472, 124, 428, 408, -346, -286, 8, 358, 642, -93, -660]
4282f60N05N12o0o8o74J85M98q0J15k14l75Q5K24P48n04o96L38N22P4l38o68K29
4304c02L70L69j03p49m0j2P04P5m27m01M12R5K71r0m90j5K61J58L15o14n57Q48
4326G8p3M10m35l20K28k9M55j5l72l56L93L15M17j067j39M26J99L42p61n0P2M60
4348A78q0O4n45J24O8K93K56p52k17L16L40J45l89m49N84K06J75j15n43J72L17
4369A48J74l6m22k18M26oL80l62m63K56K64L09j88m45k18K20O22M6q50L2M14j74
4391i1P32n83m97K59j21O49j04n45J44j16M89K92j038O4M49M1O70m12p48L34K72
4412A40K94j76m53J99j82K10P51j160j00N66j43L12jn41m8K66N11m24m71M93k76
4433b33L49M97r40m33P05Q9J08q4j23l68L99M13m44j59K00k41L09M30p30p1O12
$$ y = [-660, -155, 357, 297, 229, -445, -260, 238, 158, 273, 59, -316, -231, -7, 741, 237, -459, -121, 401, 475, 137, -531, -302, 68, 437, 334, -415, -455, -467, 237, 312, -115, -516, -104, -9, 262, 172, -318, -333, -72, 86, 401, -213, -770, 78, 5, 415, -20, -340, -112, -141, 314, 299, -73, -429, -36, 279, 696, -371, -510, -84, 115, 457, -304, -354, -282, 178, 98, 162, -383, -259, -191, 102, 358, -394, -611, -295, 45, 190, -199, -648, -64, 142, 317, 202, -341, -169, 148, 322, 286, -136, -354, 72, 66, 446, 84, -379, -123, 141, 450, 262, -183, -401, -181, 441, 487, -363, -331, 83, -91, 641, 58, -439, -180, -301, 348, 244, -301, -157, -273, 216, 508, -530, -466, -17, 24, 694, 282, -466, -132, 140, 434, 258, -195, 4, -178, 32, 783, -377, -477, 89, -54, 258, 257, -284, -332, -66, 445, 21, -450, 43, -233, 116, 613, -327, -760, -55, 34, 142, 58, -65, -433, -34, 379, -65, -224, -24, -265, 44, 474, -256, -327, 285]
4454B85K86m02n5j18m04M43P42o20n80O32j14J14M91m76q63Q38K92k59k27j91
4474a86J9J9Q69o59o57M38Qo4P51k48j060K45Q33R0k78k9o08PJ021o5j022M46
4496a30J91j91N77j00o66k35Q23m7n47L47j63l02Q41j10p71M32K33o4J29j92l34
4517b79l02J197m24o73M16%k30Q25Lj150K0Q69j20N8J11m19o30J036M83j018K19
$$ y = [285, 571, 169, 114, -4, -408, 35, 777, 157, -423, 209, 95, 209, 700, 224, -639, 199, 491, 232, 5, -186, -167, -148, 721, 62, -595, -157, -149, -213, 538, 290, -770, -525, 308, 398, 120, 91, -517, -510, 511, 446, -576, -130, 61, -130, 447, 347, -319, -554, 269, 222, -325, 22, -141, -443, 398, 288, -483, -51, 182, 118, 247, 55, -279, -581, 616, 192, -481, -65, -65, -295, 530, 533, -617, -597, 272, 152, 210, 321, -98, -728, 308, 791, -227, -8]
$$ [...]
8191H8
##END NTUPLES=NMR FID
##END=
