##TITLE=1H_53-2024
 CDCl3
 8 sc, 
 9.8.2024
##JCAMPDX= 6.0         $$ Bruker NMR JCAMP-DX V2.0
##DATA TYPE= NMR FID
##DATA CLASS= NTUPLES
##ORIGIN= UXNMR, Bruker Analytische Messtechnik GmbH
##OWNER= root
$$ XWIN-NMR		Version 3.5
$$ Fri Aug  9 13:38:48 2024 Russian Standard Time (UT+4h)  she@DPX200
##.OBSERVE FREQUENCY= 200.1313
##.OBSERVE NUCLEUS= ^1H
##.DELAY= (6, 6)
##.ACQUISITION MODE= SIMULTANEOUS
##.ACQUISITION SCHEME= undefined
##.AVERAGES= 8
##.DIGITISER RES= 18
##SPECTROMETER/DATA SYSTEM= spect
##.PULSE SEQUENCE= zg30
##.SOLVENT NAME= Acetone
##.SHIFT REFERENCE= (INTERNAL, Acetone, 0, 15.7039)
##AUDIT TRAIL= $$ (NUMBER, WHEN, WHO, WHERE, WHAT)
$$ ##TITLE= Audit trail, XWIN-NMR		Version 3.5
$$ ##JCAMPDX= 5.01
$$ ##ORIGIN= Bruker BioSpin GmbH
$$ ##OWNER= she
$$ F:/spectra/data/she/nmr/H-F/1/audita.txt
$$ ##AUDIT TRAIL=  $$ (NUMBER, WHEN, WHO, WHERE, WHAT)
(   1,<2024-08-09 13:37:40.54 +0400>,<she>,<DPX200>,
      <created by zg, POWCHK disabled, PULCHK disabled
       configuration hash MD5:
       00 E9 B6 7A A2 85 ED C7 34 08 36 98 17 FE 4E 26
       data hash MD5: 16K
       24 F1 91 C2 23 10 14 D2 2D 61 2D 17 ED 16 0A 85>)
$$ ##END=
$$ 
$$ hash MD5
$$ 29 27 64 04 48 79 73 7F 93 EC 27 C2 7E 3A 89 34
##$RELAX= 
##$RELAX= 
##$RELAX= 
##$RELAX= 
##$RELAX= 
##$RELAX= 
$$ Bruker specific parameters
$$ --------------------------
##$DU= <F:/spectra>
##$EXPNO= 1
##$NAME= <H-F>
##$PROCNO= 1
##$TYPE= <nmr>
##$USER= <she>
##$AMP= (0..31)
100 100 100 100 100 100 100 100 100 100 100 100 100 100 100 100 100 100 
100 100 100 100 100 100 100 100 100 100 100 100 100 100 
##$AQSEQ= 0
##$AQ_mod= 1
##$AUNM= <au_zg>
##$AUTOPOS= <>
##$BF1= 200.13
##$BF2= 200.13
##$BF3= 200.13
##$BF4= 200.13
##$BF5= 200.13
##$BF6= 200.13
##$BF7= 200.13
##$BF8= 200.13
##$BYTORDA= 1
##$CFDGTYP= 0
##$CFRGTYP= 5
##$CHEMSTR= <none>
##$CNST= (0..31)
1 1 145 1 1 1 1 1 1 1 1 1 1 1 1 1 1 1 1 1 1 1 1 1 1 1 1 1 1 1 1 1 
##$CPDPRG= <>
##$CPDPRG1= <>
##$CPDPRG2= <>
##$CPDPRG3= <>
##$CPDPRG4= <mlev>
##$CPDPRG5= <mlev>
##$CPDPRG6= <mlev>
##$CPDPRG7= <mlev>
##$CPDPRG8= <mlev>
##$CPDPRGB= <>
##$CPDPRGT= <>
##$D= (0..31)
0 1.2 0 0 0 0 0 0 0 0.06 0 0.03 0 0 0 0 0.0002 0 0 0 0 0 0 0 0 0 0 0 0 
0 0 0 
##$DATE= 1723196260
##$DBL= (0..7)
120 120 120 120 120 120 120 120 
##$DBP= (0..7)
150 150 150 150 150 150 150 150 
##$DBP07= 0
##$DBPNAM0= <>
##$DBPNAM1= <>
##$DBPNAM2= <>
##$DBPNAM3= <>
##$DBPNAM4= <>
##$DBPNAM5= <>
##$DBPNAM6= <>
##$DBPNAM7= <>
##$DBPOAL= (0..7)
0.5 0.5 0.5 0.5 0.5 0.5 0.5 0.5 
##$DBPOFFS= (0..7)
0 0 0 0 0 0 0 0 
##$DE= 6
##$DECBNUC= <off>
##$DECIM= 24
##$DECNUC= <off>
##$DECSTAT= 4
##$DIGMOD= 1
##$DIGTYP= 9
##$DL= (0..7)
0 120 120 120 120 120 120 120 
##$DP= (0..7)
150 150 150 150 150 150 150 150 
##$DP07= 0
##$DPNAME0= <>
##$DPNAME1= <>
##$DPNAME2= <>
##$DPNAME3= <>
##$DPNAME4= <>
##$DPNAME5= <>
##$DPNAME6= <>
##$DPNAME7= <>
##$DPOAL= (0..7)
0.5 0.5 0.5 0.5 0.5 0.5 0.5 0.5 
##$DPOFFS= (0..7)
0 0 0 0 0 0 0 0 
##$DQDMODE= 0
##$DR= 18
##$DS= 0
##$DSLIST= <SSSSSSSSSSSSSSS>
$$ [...]
##$SUBNAM2= <"">
##$SUBNAM3= <"">
##$SUBNAM4= <"">
##$SUBNAM5= <"">
##$SUBNAM6= <"">
##$SUBNAM7= <"">
##$SUBNAM8= <"">
##$SUBNAM9= <"">
##$SW= 24.0689771365484
##$SWIBOX= (0..15)
0 0 2 0 0 0 0 0 0 0 0 0 0 0 0 0 
##$SW_h= 4816.95568400771
##$TD= 16384
##$TD0= 1
##$TE= 0
##$TE2= 300
##$TE3= 300
##$TEG= 300
##$TL= (0..7)
0 120 120 120 120 120 120 120 
##$TP= (0..7)
150 150 150 150 150 150 150 150 
##$TP07= 0
##$TPNAME0= <>
##$TPNAME1= <>
##$TPNAME2= <>
##$TPNAME3= <>
##$TPNAME4= <>
##$TPNAME5= <>
##$TPNAME6= <>
##$TPNAME7= <>
##$TPOAL= (0..7)
0.5 0.5 0.5 0.5 0.5 0.5 0.5 0.5 
##$TPOFFS= (0..7)
0 0 0 0 0 0 0 0 
##$TUNHIN= 0
##$TUNHOUT= 0
##$TUNXOUT= 0
##$USERA1= <user>
##$USERA2= <user>
##$USERA3= <user>
##$USERA4= <user>
##$USERA5= <user>
##$V9= 5
##$VALIST= <valist>
##$VCLIST= <CCCCCCCCCCCCCCC>
##$VD= 0
##$VDLIST= <DDDDDDDDDDDDDDD>
##$VPLIST= <PPPPPPPPPPPPPPP>
##$VTLIST= <TTTTTTTTTTTTTTT>
##$WBST= 1024
##$WBSW= 4
##$XGAIN= (0..3)
0 0 0 0 
##$XL= 0
##$YL= 0
##$YMAX_a= 331901
##$YMIN_a= -316945
##$ZGOPTNS= <>
##$ZL1= 120
##$ZL2= 120
##$ZL3= 120
##$ZL4= 120
##$ABSF1= 10
##$ABSF2= 0
##$ABSG= 5
##$ABSL= 3
##$ALPHA= 0
##$AQORDER= 0
##$ASSFAC= 0
##$ASSFACI= 0
##$ASSFACX= 0
##$ASSWID= 0
##$AUNMP= <proc_1d>
##$AZFE= 0.1
##$AZFW= 0.1
##$BCFW= 1
##$BC_mod= 2
##$BYTORDP= 1
##$COROFFS= 0
##$CY= 11.3945322036743
##$DATMOD= 1
##$DC= 2
##$DFILT= <>
##$DTYPP= 0
##$F1P= 15.6554695791079
##$F2P= 12.8336369535428
##$FCOR= 0.5
##$FTSIZE= 0
##$FT_mod= 4
##$GAMMA= 1
##$GB= 0.15
##$INTBC= 1
##$INTSCL= 1
##$ISEN= 128
##$LB= 0.24
##$LEV0= 0
##$LPBIN= 0
##$MAXI= 10000
##$MC2= 0
##$MEAN= 0
##$ME_mod= 0
##$MI= 1.114404
##$NCOEF= 0
##$NC_proc= 0
##$NLEV= 6
##$NOISF1= 3.799351
##$NOISF2= 2.8
##$NSP= 1
##$NTH_PI= 0
##$NZP= 0
##$OFFSET= 15.70392
##$PC= 1
##$PHC0= -25641.44
##$PHC1= 16.98749
##$PH_mod= 1
##$PKNL= yes
##$PPARMOD= 0
##$PSCAL= 0
##$PSIGN= 0
##$REVERSE= no
##$SF= 200.130013532006
##$SI= 16384
##$SIGF1= 3
##$SIGF2= 2
##$SINO= 400
##$SIOLD= 16384
##$SREGLST= <1H.CDCl3>
##$SSB= 0
##$STSI= 0
##$STSR= 0
##$SW_p= 3612.71676300578
##$SYMM= 0
##$S_DEV= 0
##$TDeff= 0
##$TDoff= 0
##$TI= <>
##$TILT= no
##$TM1= 0
##$TM2= 0
##$TOPLEV= 0
##$USERP1= <user>
##$USERP2= <user>
##$USERP3= <user>
##$USERP4= <user>
##$USERP5= <user>
##$WDW= 1
##$XDIM= 8192
##$YMAX_p= 0
##$YMIN_p= 0
$$ End of Bruker specific parameters
$$ ---------------------------------
##NTUPLES= NMR FID
##VAR_NAME=  TIME,          FID/REAL,        FID/IMAG
##SYMBOL=    X,             R,               I
##VAR_TYPE=  INDEPENDENT,   DEPENDENT,       DEPENDENT
##VAR_FORM=  AFFN,          ASDF,            ASDF
##VAR_DIM=   8192,          8192,            8192
##UNITS=     SECONDS,       ARBITRARY UNITS, ARBITRARY UNITS
##FACTOR=    0.0002076,     1,               1
##FIRST=     0,             0,               0
##LAST=      1.7004516,     0,               0
##MIN=       0,             -316945,         0
##MAX=       1.7004516,     331901,          0
$$ Real data points
##PAGE= N=1
##DATA TABLE= (X++(R..R)), XYDATA
$$ [...]
$$ plain form
2050 330 -1826 848 24 -811 220 599 805 1971 3244 1164 209 1721 -1146 -487 1751 -2225 348
2067 348 2791 -1515 1715 2041 -2461 1513 2189 -1728 1394 434 -2568 -509 -478 -2327 -1401 783 288
2084 288 693 3257 850 -860 2854 -240 -2023 2376 -1176 -1430 3607 232 -108 3362 237 1196
2100 1196 3659 1196 1209 2038 241 -515 296 -62 -688 1321 2417 426 1858 2371 -1103 999 248
2117 248 -2874 756 -66 -2048 1756 -348 -1903 1576 -471 -802 1657 -80 -346 398 -260 -1169 -875
2134 -875 399 -661 565 2668 -108 924 2472 -1739 -346 1305 -2219 466 2153 -849 1611
2149 1611 1305 -665 1189 364 -643 486 37 -87 -660 -776 -996 -1852 -313 -204 -965 1593 -189
2166 -189 -1161 1019 -2131 -2474 38 -2548 -1342 588 -1754 -328 749 -828 8 148 -141 75 74
$$ packed form
2050C30k156K674q24q35J031L79K06J166J273k080r55J512k867O59K238l976K573
2067C48K443m306L230L26m502L974O76l917L122r60l002K059L1j849R26K184m95
2084B88M05K564k407j710L714l094j783M399l552k54N037l375l40L470l125R59
2100A196K463k463J3Q29j797p56Q11l58o26K009J096j991J432N13l474K102p51
2117B48l122L630q22j982L804k104j555L479k047l31K459j737k66P44o58r09K94
2134h75J274j060J226K103k776J032J548m211J393J651l524K685J687l002K460
2149A611l06j970J854q25j007J129m49j24n73j16k20q56J539J09p61K558j782
2166a89r72K180l150l43K512k586J206J930k342J426J077j577Q36J40k89K16j
$$ plain form
2183 74 525 -1090 -1352 -282 -1955 -161 1199 -794 1416 1692 -43 1664 -362 -1804 125 -1217
2199 -1217 -860 -46 -1863 -681 -174 -1089 -73 -44 -148 364 119 15 -1540 -2315 -1112 -2326 -1181 182
2217 182 -1563 838 1981 -378 764 80 -1756 186 -225 -1076 -153 -1129 -303 397 -294 955 333
2234 333 980 2309 625 554 -133 -1620 34 -443 -647 1063 -249 815 2162 -29 146 -63 -1315
2251 -1315 574 -6 -575 208 -986 1 739 -811 166 51 -62 1651 127 -349 -110 -920 467 373
2269 373 -334 1029 283 1109 1949 -302 -131 211 -629 1619 1321 60 1453 694 742 1391 -732 325
2287 325 650 276 1537 -27 -1112 -110 -876 143 196 -807 631 572 964 1351 -1027 -320 119 -608
2305 -608 1126 219 -930 919 468 251 984 -695 -113 1280 655 1348 -1 -800 20 -734 -18 157
$$ packed form
2183G4M51j615k62J070j673J794J360j993K210K76j735J707k026j442J929j342
2199a217L57Q14j817J182N07r15J016K9j04N12k45j04j555p75J203j214J145J363
2217A82j745K401J143k359J142o84j836J942m11q51R23r76Q26P00o91J249o22
2234C33O47J329j684p1o87j487J654m77k04J710j312J064J347k191J75k09j252
2251a315J889n80n69P83j194R87P38j550R77j15j13J713j524m76K39q10J387r4
2269C73p07J363p46Q26Q40k251J71L42q40K248k98j261J393p59M8O49k123J057
2287C25L25l74J261j564j085J002p66J019N3j003J438n9L92L87k378P07M39p27
2305f08J734r07j149J849m51k17P33j679N82J393o25O93j349p99Q20p54P16J75
$$ plain form
2323 157 -1079 851 994 715 1231 -802 -463 803 -192 580 39 -1580 411 101 -883 -125 -1107 73
2341 73 1552 877 756 -383 -894 234 -799 -855 -573 -1362 673 942 101 351 -1278 -658 810 -365
2359 -365 -80 -85 -1508 356 -19 -1727 -255 -1018 -209 1600 564 451 -131 -293 397 -114 -155 3 -1129
2378 -1129 936 905 -979 -130 -982 -894 1245 -109 -253 285 -899 496 254 -2054 -705 -637 -453 964
2396 964 -203 -379 -107 232 861 216 -417 4 -730 1003 865 -1394 -425 -726 -613 1568 25 -692
2414 -692 1156 -105 719 526 -1882 -762 26 -8 873 -284 -742 -92 154 617 -482 -675 286 77
2432 77 1164 920 -1511 -199 160 -370 1624 98 -698 1269 513 256 430 -978 -402 1146 799 834
2450 834 -263 -494 -16 -165 97 -1010 -1464 996 191 566 964 -1417 -75 1202 -288 1414 309
$$ packed form
2323A57j236J930J43k79N16k033L39J266r95P72n41j619J991l10r84P58r82J180
2341G3J479o75j21j139n11J128j033n6K82p89K035K69q41K50j629O20J468j175
2359c65K85nj423J864l75j708J472p63Q09J809j036j13n82j62O90n11m1J58j132
2378a129K065l1j884Q49q52Q8K139j354j44N38j184J395k42k308J349O8J84J417
2396I64j167j76K72L39O29o45o33M21p34J733j38k259R69l01J13K181j543p17
2414f92J848j261Q24j93k408J120P88l4Q81j157m58O50K46M63j099j93R61k09
2432G7J087k44k431J312L59n30J994j526p96J967p56k57J74j408N76J548l47L5
2450H34j097k31M78j49K62j107m54K460q05L75L98k381J342J277j490J702j105
$$ plain form
2467 309 -1505 992 560 -670 183 -859 -318 1420 947 578 -335 198 371 -241 199 -1099 -1460 1585
2485 1585 528 -104 934 -1257 -408 1767 -312 -40 420 -760 1159 792 -1071 -707 -732 -71 756
2502 756 222 -343 -861 453 873 -268 487 -447 -628 2153 557 -1061 669 -1367 -1013 1390 -959
2519 -959 -714 1166 241 953 1082 -616 -1042 -205 517 -210 -509 -209 -1017 446 1558 -994 -33 921
2537 921 -358 1676 1161 -2002 -402 -512 -1267 677 -887 -1237 549 571 734 266 -969 -385 -55 853
2555 853 -14 -1141 -330 -615 -34 1371 -1334 -472 1491 -251 1372 1217 -2079 -236 546 -1184 -152
2572 -152 -540 -1371 522 1130 292 -570 -188 100 66 1174 44 -1448 508 162 -876 893 -1130 -1321
2590 -1321 1889 794 154 1072 -1351 -521 944 -599 -608 -294 -389 506 803 162 -964 -535 559 -5
$$ packed form
2467C09j814K497m32j230Q53j042N41J738m73l69r13N33J73o12M40j298l61L045
2485A585j057o32J038k191Q49K175k079K72M60j180J919l67j863L64k5O61Q27
2502G56n34n65n18J314M20j141P55r34j81K781j596j618J730k036L54K403k349
2519i59K45J880r25P12J29j698m26Q37P22p27k99L00q08J463J112k552R61R54
2537I21j279K034n15l163J600j10p55J944j564l50J786K2J63m68j235N84L30R08
2555H53q67j127Q11k85N81J405k705Q62J963j742J623j55l296J843P82j730J032
2572a52l88q31J893O08q38q62L82K88l4J108j130j492J956l46j038J769k023j91
2590a321L210j095o40R18k423Q30J465j543rL14r5Q95K97o41j126M29J094n64
$$ plain form
2608 -5 755 123 -1700 434 921 -1467 403 -376 -1246 1959 1159 -669 367 -618 -727 532 -269 -772
2626 -772 -113 449 1023 752 517 -648 -699 909 -236 -671 156 -1632 -106 1137 -1562 -188 718 -572
2644 -572 1823 1413 -1046 -210 -381 -714 -247 -503 -643 -376 1134 1472 -149 474 71 -636 1205 19
2662 19 -1762 -49 -844 -813 1209 -1017 -617 1470 548 915 1126 -789 -140 -420 -474 -497 -893 -316 -255 848
2682 848 1405 -461 -290 635 -747 978 702 -1660 -4 209 -1066 622 -689 -1376 928 430 552
2699 552 540 -420 -327 -468 87 -275 -1297 -60 172 -76 734 -768 -696 1065 -7 434 989 -785 284
2718 284 835 -606 20 -378 -483 932 811 593 472 -225 123 -234 121 -225 -1161 106 523 -408 757
2737 757 -443 -1146 1160 256 -320 648 -793 -303 639 -552 -416 -415 -1 1071 526 650 240 -743 27
$$ packed form
2608eP60o32j823K134M87k388J870p79q70L205q00j828J036r85j09J259q01n03
2626g72O59N62N74k71k35j165n1J608j145m35Q27j788J526J243k699J374R06j290
2644e72K395m10k459Q36j71l33M67k56j40K67J510L38j621O23m03p07J841j186
2662A9j781J713p95L1K022k226M00K087r22L67K11j915O49k80n4k3l96N77O1J103
2682H48N57j866J71R25j382J725k76k362J656K13j275J688j311o87K304m98J22
2699E52j2r60R3j41N55l62j022J237K32k48Q10j502P2J761j072M41N55j774J069
2718B84N51j441O26l98j05J415j21k18j21o97L48l57L55l46r36J267M17r31J165
2737G57j200p03K306r04n76R68j441M90R42j191J36JM14J072n45J24m10r83P70
$$ plain form
2756 27 -199 -938 159 -676 252 1358 -111 449 360 -509 1012 535 -744 421 -339 -238 513 -543
2774 -543 -186 66 412 1198 262 90 400 -987 273 -320 -1231 178 -450 -196 1323 -98 -289 542
2792 542 -218 454 387 -633 -139 -382 -409 -9 -813 -179 -23 170 1347 266 -97 805 -313 27 61 -1117
2812 -1117 -170 -86 -25 811 -458 -753 595 -237 590 522 -406 393 -65 85 -427 -1258 -381 -171 -618 931
2832 931 -36 -483 998 -249 -264 387 -1075 -297 441 -262 -31 -765 -788 -133 -224 335 264 -345 805 -307
2852 -307 -429 213 -1234 -384 332 -321 235 78 -698 644 138 -404 469 -574 -1 366 -334 124 -260
2871 -260 -448 144 -38 81 180 -187 627 -357 -852 -104 -1185 -9 775 -589 40 193 -806 152 88 -721
2891 -721 173 41 337 399 -91 411 -203 17 627 -560 257 409 -462 675 168 -896 365 -56 -439
$$ packed form
2756B7k26p39J097q35R28J106j469N60q9q69J521m77j279J165p60J01P51j056
2774e43L57K52L46P86r36j72L10j387J260n93r11J409o28K54J519j421j91Q31
2792E42p60O72o7j020M94k43k7M00q04O34J56J93J177j081l63R02j118L40L4j178
2812a117R47Q4O1Q36j269k95J348q32Q27o8r28P99m58J50n12q31Q77K10m47J549
2832I31r67m47J481j247j5O51j462P78P38p03K31p34k3O55r1N59p1o09J150j112
2852c07j22O42j447Q50P16o53N56j57p76J342n06n42Q73j043N73L67p00M58l84
2871b60j88N92j82J19R9l67Q14r84m95P48j081J176P84j364O29J53r99R58o4q09
2891g21Q94j32K96O2m90N02o14K20O10j187Q17J52q71J137n07j064J261m21l83
$$ plain form
2910 -439 1349 219 -87 496 -307 41 -319 -522 89 -208 144 648 45 369 253 -51 775 57 343
2929 343 803 -315 252 263 -731 465 404 -237 1019 181 220 1062 -26 51 -62 -262 83 11 228 -10
2949 -10 -411 379 23 -329 725 -166 223 1189 -48 303 591 -570 279 386 -152 627 258 -19 566
2968 566 -11 24 106 -150 423 166 91 557 -452 30 -102 -639 349 122 -409 744 -181 -135 957 -428
2988 -428 17 411 -540 360 250 -590 -133 -639 -98 165 -44 590 -174 -12 625 -306 -25 31 -933 210
3008 210 157 -721 357 -102 -490 596 -615 -213 310 -18 401 217 -661 -436 -777 -452 -170 -712 312
3027 312 214 -1 911 -177 -435 145 -769 -214 0 -1292 -419 -220 -802 327 -402 -358 419 -192 254 57
3047 57 -717 -412 -791 -222 38 -564 313 222 173 1101 -109 -664 604 -462 -245 327 -536 65 -195 -301
$$ packed form
2910d39J788j130l06N83q03L48l60k03O11k97L52N04o03L24j16l04Q26p18K86
2929C43M60j118N67J1r94J196o1o41J256q38L9Q42j088P7j13k00L45p2K17k38
2949a0m01P90l56l52J054q91L89R66j237L51K88j161Q49J07n38P79l69k77N85
2968E66n77L5Q2k56N73k57p5M66j009M82j32n37R88k27n31J153r25M6J092j385
2988d28M45L94r51R00j10q40M57n06N41K63k09O34p64J62O37r31K81N6r64J143
3008B10n3q78J078m59l88J086j211M02N23l28M19j84q78K25l41L25K82n42J024
3027C12r8k15R12j088k58N80r14N55K14j292Q73J99n82J129p29M4P77o11M46j97
3047E7p74L05l79N69K60o02Q77r1m9R28j210n55J268j066K17N72q63O01k60j06
$$ plain form
3067 -301 305 -349 -332 300 21 -71 -19 -716 -260 -383 -220 208 -368 374 431 -479 443 -392 -1075 76 -860
3088 -860 -325 888 -597 0 471 -160 416 -38 -172 552 210 127 127 -444 184 -35 17 897 9 678 975
3109 975 58 473 -185 -857 285 -10 -324 420 -269 156 793 121 247 244 -20 392 241 -11 -480 -953
3129 -953 -223 -231 -336 551 -140 337 1314 90 234 566 -505 350 479 -353 337 87 210 896 376 537
3149 537 669 461 1219 297 179 -62 -750 75 -66 -603 226 93 313 1012 -51 37 288 -555 138 161
3169 161 -832 -181 -53 -447 208 -121 -248 110 253 709 -149 -202 42 -563 29 302 -722 458 453 -3
3189 -3 1162 123 -689 273 64 317 -205 -446 -165 -305 3 55 -690 -310 446 -302 36 -193 -686 -25
3209 -25 -592 -72 -178 -815 121 218 -328 143 -478 -1332 89 -355 -464 -45 -603 -240 -213 36 -222 -806 38
$$ packed form
3067c01O06o54J7O32k79r2N2o97M56j23J63M28n76P42N7r10R22q35o83J151r36
3088h60N35J213j485N97M71o31N76m54j34P24l42q3%n71O28k19N2Q80q88O69K97
3109I75r17M15o58o72J142k95l14P44o89M25O37o72J26lk64M12j51k52m69m73
3129i53P30qj05Q87o91M77R77j224J44L32j071Q55J29q32O90k50J23O86n20J61
3149E37J32k08P58r22j18k41o88Q25j41n37Q29j33K20O99j063Q8K51q43O93K3
3169A61r93O51J28l94O55l29j27L58J43M56q58n3K44o05N92K73j024J180nm56
3189cJ165j039q12R62k09K53n22k41K81j40L08N2p45L80P56p48L38k29m93O61
3209b5n67N20j06o37R36R7n46M71o21q54J421m44j09M19n58L63K7K49k58n84Q44
$$ plain form
3230 38 372 -174 216 -235 -804 594 189 -443 192 -468 305 900 156 87 -458 -487 374 -30 -237 -320 -750
3251 -750 108 -91 -614 3 -629 -204 405 -134 -116 -140 -920 78 -702 -1152 91 -525 -227 878 120 -154
3271 -154 346 -62 443 106 23 19 -48 492 59 -297 145 144 478 1360 281 18 278 -165 82 -69 -817 -334
3293 -334 -164 179 798 -158 53 82 5 427 30 -413 -93 -369 59 307 -658 79 276 283 1024 -71 78
3314 78 430 -5 204 240 -464 237 403 515 705 -69 -6 357 198 698 457 -310 617 -5 132 545 -382
3335 -382 118 543 153 654 44 -342 481 -49 85 166 -355 367 557 90 470 -374 -504 337 -444 245
3355 245 50 -334 367 200 -79 325 -639 119 718 68 294 150 -236 327 104 1 160 -457 566 282
3375 282 320 391 -331 -413 514 -153 206 77 -662 -30 42 -352 -122 -418 -233 563 -23 -25 -242 -355 251 -386
$$ packed form
3230C8L34n46L90m51n69J398m05o32O35o60P73N95p44o9n45k9Q61m04k07q3m30
3251g50Q58j99n23O17o32M25O09n39J8k4p80R98p80m50J243o16K98J105p58k74
3271a54N00m08N05l37q3mo7N40m33l56M42jL34Q82j079k63K60m43K47j51p48M83
3293c34J70L43O19r56K11K9p7M22l97m43L20k76M28K48r65P37J97PP41j095J49
3314G8L52m35K09L6p04P01J66J12J90p74O3L63j59N00k41p67R27o22J37M13r27
3335c82N00M25l90N01o10l86Q23n30J34Q1n21P22J90m67L80q44j30Q41p81O89
3355B45j95l84P01j67k79M04r64P58N99o50K26j44l86N63k23j03J59o17J023k84
3375B82L8P1p22q2R27o67L59j29p39O32P2l94K30k96J85P96n86kk17j13O06o37
$$ plain form
3397 -386 -557 -308 -398 171 528 -442 231 -263 -210 714 -534 -189 90 -412 70 13 -575 -355 -374 137 569
3418 569 -305 -51 -9 -498 416 -375 -748 -78 -577 86 544 -408 -37 -23 -187 363 4 -429 -85 -230 317
3439 317 -13 -762 -353 -454 -58 396 -404 128 -68 -315 260 37 -484 398 -22 330 335 -873 5 -81 -237
3460 -237 306 -97 -239 578 316 261 77 -455 133 193 23 274 -247 -329 269 -396 417 142 -319 652 341
3481 341 -2 535 -328 -77 238 -217 -19 7 -175 554 453 372 120 -193 473 146 -159 452 -446 -400 458
3502 458 -56 154 153 -487 578 272 -8 340 -269 -152 327 72 317 -13 245 336 298 322 374 -83 427 551
3524 551 221 411 -140 155 733 -426 -70 89 -148 780 422 -132 222 1 -38 331 -210 -23 73 148 360
3545 360 -69 -126 145 -247 243 243 -544 126 65 -269 556 -404 -569 180 -15 203 203 -492 -69 -218 117 299
$$ packed form
3397c86j71K49r0N69L57r70O73m94N3R24j248L45K79n02M82n7n88K20j9N11M32
3418E69q74K54M2m89R14p91l73O70m99O63M58r52L71J4j64N50l59m33L44j45N47
3439C17l30p49M09j01L96M54q00N32j96k47N75k23n21Q82m20L52Nj208Q78q6j56
3460b37N43m03j42Q17k62n5j84n32N88O0j70K51n21q2N98o65Q13k75m61R71l11
3481C41l43N37q63K51L15m55J98K6j82P29j01q1k52l13O66l27l05O11q98M6Q58
3502D58n14K10jo40J065l06k80L48o09J17M79k55K45l30K58R1l8K4N2m57N10J24
3524E51l30J90n51K95N78j159L56J59k37R28l58n54L54k21l9L69n41J87R6P5K12
3545C60m29n7K71l92M90%p87O70o1l34Q25r60j65P49j95K18%o95M23j49L35J82
$$ plain form
3567 299 -469 -61 298 48 445 -20 -183 305 -48 172 85 -547 -185 -45 -474 334 -199 -59 631 49
3587 49 -22 237 -524 -452 -365 -497 -496 -643 -287 35 -212 151 -199 -540 70 -258 -297 2 -902 -265 -122 -526
3609 -526 -52 -94 196 426 -4 338 347 -220 -354 -231 -527 -55 -401 -214 295 -44 -113 -67 -197 177 22 -458
3631 -458 97 -467 -70 -122 -576 1 -295 -339 143 123 45 112 -189 78 78 -476 158 88 -224 361 -117 185 345
3654 345 -321 378 184 -173 419 51 -174 445 6 85 165 -8 291 -154 -74 506 -86 385 168 -132 146
3675 146 -77 39 259 -239 58 66 -435 105 170 -175 351 -30 -212 254 -250 -195 77 -122 228 154 180 463
3697 463 -167 104 482 -227 63 129 -73 704 142 -13 317 -68 301 360 -184 266 78 -164 181 -239 -92
3718 -92 85 223 213 466 -181 258 -275 -230 189 -535 -205 162 -286 285 -22 -286 259 -18 364 244 -105
$$ packed form
3567B99p68M08L59k50L97m65j63M88l53K20q7o32L62J40m29Q08n33J40O90n82
3587D9p1K59p61P2Q7j32Jj47L56L22k47L63l50l41O10l28l9K99r04O37J43m04
3609e26M74m2K90K30m30L42Rn67j34J23k96M72l46J87N09l39o9M6j30L74j55m80
3631d58N55n64L97n2m54N77k96m4M82k0p8O7l01K67%n54O34p0l12N85m78L02J60
3654C45o66O99j94l57N92l68k25O19m39P9Q0j73K99m45Q0N80n92M71k17l00K78
3675A46k23J16K20m98K97Qn01N40O5l45N26l81j82M66n04N5K72j99L50p4K6K83
3697D63o30K71L78p09K90O6k02P77n62j55L30l85L69N9n44M50j88k42L45m20J47
3718i2J77J38j0K53o47M39n33M5M19p24L30L67m48N71l07k64N45k77L82j20l49
$$ plain form
3739 -105 239 -75 -355 115 -173 -155 214 206 335 312 -73 273 115 116 354 -376 -161 106 -390 242 -284 -395
3761 -395 198 12 127 148 -290 15 -23 -677 -204 -586 -746 -56 -331 -277 16 -198 271 -42 -158 130 -303
3782 -303 -218 89 -563 -120 -26 -428 217 -45 148 326 -136 142 131 -384 206 -153 -154 390 -37 -66 223 -456
3804 -456 128 135 -140 -141 -170 -231 -417 -273 66 -189 -389 84 -156 -65 165 -366 -99 17 -410 -1 -17 5 367
3827 367 47 -78 193 -109 -10 32 -242 370 -114 -186 291 50 77 235 55 355 220 73 480 -356 -67
3848 -67 -113 -453 255 62 -296 160 315 -205 179 -56 -252 -50 -395 -203 -366 -170 184 -295 400 265 -297
3869 -297 153 315 -51 188 -42 -281 163 -3 77 282 58 326 242 112 380 18 336 349 -62 433 16
3890 16 -14 149 -135 107 317 -207 232 406 61 327 212 -54 312 -111 -305 172 -90 4 23 -181 143
$$ packed form
3739a05L44l14k80M70k88J8L69qJ29k3l85L46j58JK38p30K15K67m96O32n26j11
3761c95N93j86J15K1m38L05l8o54M73l82j60O90k75N4K93k14M69l13j16K88m33
3782c03Q5L07o52M43R4m02O45k62J93J78m62K78j1n15N90l59jN44m27k9K89o79
3804d56N84Pk75jk9o1j86J44L39k55k00M73k40R1K30n31K67J16m27M09j6K2L62
3827C67l20j25K71l02R9M2k74O12m84p2M77k41K7J58j80L00j35j47M07q36K89
3848f7m6l40P08j93l58M56J55n20L84k35j96K02l45J92j63J96L54m79O95j35n62
3869b97M50J62l66K39k30k39M44j66Q0K05k24K68q4j30K68l62L18J3m11M95m17
3890A6l0J63k84K42K10n24M39J74l45K66j15k66L66m23j94M77k62R4J9k04L24
$$ plain form
3911 143 81 -116 229 -262 112 77 -179 310 133 -430 70 -265 95 355 -31 183 -72 -417 31 -131 -152
3932 -152 267 -223 300 79 -20 51 -122 27 272 -318 138 262 -282 167 32 -363 330 -135 -111 259 -308
3953 -308 -408 93 -436 -141 -166 -187 -16 36 80 120 -101 40 -162 -163 156 -264 62 225 -66 254 458 -343
3975 -343 86 4 -279 259 -370 -270 191 -127 -98 -71 -149 89 238 -106 161 -264 178 -259 -471 191 -409
3996 -409 -323 363 -232 155 291 -269 313 109 -328 87 -294 -50 128 -366 -454 -339 -208 208 23 69 103
4017 103 -423 24 304 -233 251 -132 -156 13 -130 -173 49 -232 91 222 -249 -50 -106 -109 190 49 112 237
4039 237 -28 322 71 -278 -69 -272 139 310 -366 76 66 -81 448 -116 -136 4 -84 -134 70 -110 -71 -75
4061 -75 193 317 28 -111 56 -5 172 -35 -202 92 -183 -135 257 -361 189 461 -13 261 -30 -375 259
$$ packed form
3911A43o2j97L45m91L74l5k56M89j77n63N00l35L60K60l86K14k55l45M48j62k1
3932a52M19m90N23k21r9P1j73J49K45n90M56J24n44M49j35l95O93m65K4L70n67
3953c08j00N01n29K95k5k1J71N2M4M0k21J41k02jL19m20L26J63k91L20K04q01
3975c43M29q2k83N38o29J00M61l18K9K7p8K38J49l44K67m25M42m37k12O62o00
3996d09Q6O86n95L87J36n60N82k04m37M15l81K44J78m94q8J15J31M16j85M6L4
4017A03n26M47K80n37M84l83k4J69j43m3K22k81L23J31m71J99n6lK99j41O3J25
4039B37k65L50k51l49K09k03M11J71o76M42j0j47N29n64k0J40q8n0K04j80L9m
4061g5K68J24k89j39J67o1J77k07j67K94k75M8L92o18N50K72m74K74k91l45O34
$$ plain form
4082 259 121 -194 119 -161 -42 114 -124 159 98 126 290 -102 483 -50 -203 -69 -150 138 4 -98 -38
4103 -38 345 -26 333 145 -205 191 293 85 33 -169 72 -168 -55 154 -460 -157 452 44 301 134 -399
4124 -399 367 -71 -63 256 -181 -195 413 21 200 115 -408 338 87 110 313 -542 339 25 -156 112 -136 -383
4146 -383 25 -156 -144 245 -580 70 230 -336 -103 -185 -20 238 -264 -38 -42 -347 -40 124 -22 230 -182
4167 -182 -144 209 -294 57 -71 -42 359 24 -325 64 -215 -158 177 -394 43 -45 -40 630 -46 -173 74 -154
4189 -154 120 141 -39 217 -336 -122 27 -285 -236 -24 -54 282 61 -274 59 -165 -167 -46 -247 28 218 74
4211 74 125 -248 -290 140 108 463 131 -201 27 -283 -392 -36 -203 -199 109 335 239 29 -11 114 -137 -145 19
4234 19 -353 -136 13 -180 294 76 -73 469 20 21 97 -481 165 -63 -211 112 -293 13 205 -11 203
$$ packed form
4082B59j38l15L13k80J19J56k38K83o1K8J64l92N85n33j53J34q1K88j34j02O0
4103c8L83l71L59j88l50L96J02k08n2k02K41k40J13K09o14L03O09m08K57j67n33
4124c99P66m38QL19m37j4O08l92J79q5n23P46k51K3K03q55Q81l14j81K68k48k47
4146c83M08j81J2L89q25O50J60n66K33q2J65K58n02K26ml05L07J64j46K52m12
4167a82L8L53n03L51j28K9M01l35l49L89k79N7L35n71M37q8NO70o76j27K47k28
4189a54K74K1j80K56n53K14J49l12M9K12l0L36k21l35L33k24kJ21k01K75J90j44
4211G4N1l73m2M30l2L55l32l32K28l10j09L56j67ML08K26r6k10m0J25k51qJ64
4234A9l72K17J49j93M74k18j49N42m49JP6n78O46k28j48L23m05L06J92k16K14
$$ plain form
4255 203 10 -328 83 -151 -102 -110 -241 -87 121 62 217 174 -12 382 -86 -15 235 -199 259 308 -60 244
4277 244 -243 60 312 -110 -125 0 -113 62 -48 -218 238 -153 -74 308 -44 94 -101 -201 258 -212 -45
4298 -45 86 -161 -66 249 -300 106 -29 17 164 -278 -77 122 -350 120 -147 -118 263 -166 165 226 -50 88
4320 88 158 -54 117 178 -99 -33 -99 -89 141 -272 223 52 204 157 41 207 -59 -119 251 -41 -409 -6 -156
4343 -156 -44 230 -13 -15 119 -207 153 -32 -302 64 -109 -45 -184 -342 -214 111 -141 288 -8 115 225
4364 225 -207 -59 252 -240 -34 -59 -152 119 -87 -34 150 104 69 59 9 133 -145 27 209 62 -16 136 -49
4387 -49 200 -56 -183 212 -291 260 273 -150 -82 64 -65 230 -39 -177 80 -54 24 -265 288 156 -27
4408 -27 -72 -7 -295 210 -4 -239 221 24 -381 130 -106 -184 166 -129 194 339 67 -83 32 -209 58
$$ packed form
4255B03j93l38M11k34M9qj31J54K08n9J55m3j86L94m68P1K50m34M58M9l68L04
4277B44m87L03K52m22j5J25j13J75j10j70M56l91P9L82l52J38j95j00M59m70J67
4298d5J31k47R5L15n49M06j35M6J47m42K01J99m72M70k67K9L81m29L31O1k76J38
4320H8P0k12J71O1k77O6o6J0K30m13M95j71J52m7j16J66k66o0L70k92l68M03j50
4343a56J12K74k43kJ34l26L60j85k70L66j73O4j39j58J28L25k52M29k96J23J10
4364B25m32J48L11m92K06k5r3K71k06N3J84m6l5j0n0J24k78J72J82j47p8J52j85
4387d9K49k56j27L95n03N51J3m23O8J46j29K95k69j38K57j34P8k89N53j32j83
4408b7m5O5k88N05k14k35M60j97m05N11k36p8L50k95L23J45k72j50J15k41K67
$$ plain form
4429 58 -247 29 -23 -10 272 152 -94 119 -379 149 227 -402 228 62 -310 317 43 -195 -55 -277 -124
4450 -124 137 -82 90 -5 23 87 -15 20 119 -176 179 -180 -142 76 -175 -117 135 108 -27 222 -95 318 191
4473 191 -93 141 -341 148 96 -240 88 -59 72 157 -96 17 120 -251 -92 -70 -94 -32 256 66 244 -187
4495 -187 -18 207 -261 224 49 -417 309 21 -67 117 -133 56 198 -208 22 -84 -79 57 47 271 24
4516 24 -11 100 103 -287 372 -194 -113 301 -36 333 159 -120 178 -57 54 244 -198 80 147 -281 86 98
4538 98 -245 287 193 -139 355 -173 218 -85 -230 157 -115 -161 254 -148 -66 297 21 90 273 -91 214 -137
4560 -137 -163 -105 -361 1 -337 -199 184 -86 -280 4 -379 -4 66 -209 85 301 -78 25 -223 -144 -16
4581 -16 110 198 55 35 117 25 -166 -52 -344 111 61 -321 226 -178 -308 -151 -114 -161 127 139 -166 225 11
$$ packed form
4429E8l05K76n2J3K82j20k46K13m98N28P8o29O30j66l72O27k74k38J40k22J53
4450a24K61k19J72r5K8O4j02L5R9k95L55l59L8K18k51N8K52k7j35K49l17M13j27
4473A91k84K34m82M89n2l36L28j47J31Q5k53J13J03l71J59K2k4O2K88j90J78m31
4495a87J69K25m68M85j75m66P26k88q8J84k50J89J42m06K30j06NJ36j0K24k47
4516B4l5J11Ll90O59n66Q1M14l37L69j74k79K98k35J11J90m42K78O7m28L67J2
4538I8l43N32r4l32M94n28L91l03j45L87k72m6M15m02Q2L63k76O9J83l64L05l51
4560a37k6N8k56L62l38J38L83k70j94K84l83L75P0k75K94K16l79J03k48P9J28
4581a6J26Q8j43k0Q2r2j91J14k92M55n0l82N47m04j30J57L7m7K88J2l05L91k14
$$ plain form
4604 11 -68 -120 -94 106 -141 259 -36 -166 36 -184 -113 -22 -116 43 195 -214 183 -5 -326 -19 132 -42
4626 -42 19 -41 -3 -75 -113 -3 -92 -46 99 -6 1 -45 -112 9 18 -152 22 -285 -138 -3 -223 37 336 -211 129
4651 129 64 -199 13 -212 -93 -65 -196 -127 -56 -264 253 -30 -95 -22 -78 45 -200 -322 163 -124 27 260
4673 260 -275 67 47 -4 28 185 -295 227 73 101 -334 -276 89 61 -58 -148 -83 53 161 44 -137 -75 46
4696 46 238 16 4 355 -141 -151 74 -71 201 103 -127 319 40 -9 -18 -290 153 93 30 153 148 -28 11 -240
4720 -240 195 111 9 26 -129 -96 -25 -447 8 -1 23 -161 57 -111 192 177 117 77 -176 -37 19 55 601 -54
4744 -54 105 331 4 -66 -18 22 -111 188 -147 -67 92 -177 293 -64 173 112 -323 221 -55 92 199 -113
4766 -113 -163 107 79 86 238 8 237 -158 -193 178 -39 75 -52 -43 54 -4 -95 201 -103 -152 101 127 112 31 50
$$ packed form
4604A1p9n2K6K00k47M00k95j30K02k20P1R1r4J59J52m09L97j88l21L07J51j74
4626d2O1o0L8p2l8J10q9M6J45j05Pm6o7J21Rj70J74l07J47J35k20K60K99n47L40
4651A29o5k63K12k25J19K8j31O9P1k08N17k83o5P3n6J23k45j22M85k87J51K33
4673B60n35L42k0n1L2J57m80N22j54K8m35N8L65k8j19r0O5J36J08j17j81O2J21
4696D6J92k22j2L51m96j0K25j45K72r8k30M46k79m9rk72M43o0o3J23nj76L9k51
4720b40M35q4j02J7j55L3P1m22M55rK4j84K18j68L03j5o0m0k53J39N6L6N46o55
4744e4J59K26l27p0M8M0j33K99l35Q0J59k69M70l57K37o1m35N44k76J47J07l12
4766a13n0K70k8PJ52k30K29l95l5L71k17J14j27RR7n8r1K96l04m9K53K6j5q1J9
$$ plain form
4791 50 0 -93 -102 155 -17 122 199 -200 176 -26 -162 -118 -69 -154 -39 -33 -59 32 -143 265 9 -128 186 15
4815 15 86 82 -210 93 -134 -152 224 -10 -100 -59 32 -7 -90 8 241 -194 72 9 -182 76 92 -144 -40 27 59
4840 59 231 274 250 124 -37 -112 -45 -111 213 -203 -119 117 -271 -33 188 -60 82 -80 -23 -76 136 -64 33
4863 33 -118 154 -197 -206 189 16 -64 -73 -28 -29 111 -88 198 80 -12 281 -250 -74 54 194 362 -145 -50 75
4887 75 94 -77 71 -406 113 105 -216 38 133 -55 162 -157 29 160 -131 269 181 -100 -151 -192 68 196 -65
4910 -65 -137 13 -116 187 102 34 -28 -68 -201 336 198 21 -68 -161 262 85 13 63 -116 54 -137 47 344
4933 344 -9 94 379 -121 1 -107 -216 151 80 -57 47 81 -100 158 -18 -64 81 40 112 -11 -63 -36
4955 -36 -90 7 70 13 107 5 -89 261 12 -185 254 -39 -82 1 32 20 -28 -120 135 39 -73 130 159 -82 -84 -266
$$ packed form
4791E0n0r3rK57j72J39P7l99L76k02j36M4M9q5J15Ok6R1j75M08k56j37L14j71
4815A5P1mk92L03k27j8L76k34r0M1R1l9q3R8K33m35K66o3j91K58J6k36J04O7L2
4840E9J72M3k4j26j61p5O7o6L24m16Q4K36l88K38K21k48J42j62N7n3K12k00R7
4863C3j51K72l51rL95j73q0rM5jJ40j99K86j18r2K93n31J76J28J40J68n07R5J25
4887G5J9j71J48m77N19ql21K54R5j88K17l19J86J31k91M00q8k81n1m1K60J28k61
4910f5p2J50j29L03q5o8o2m0j33N37j38j77q9r3M23j77p2N0j79J70j91J84K97
4933C44l53J03K85n00J22j08j09L67p1j37J04L4j81K58j76m6J45m1P2j23n2K7
4955c6n4R7O3n7R4j02r4L50k49j97M39k93m3Q3L1j2m8r2K55r6j12K03K9k41kj82
$$ plain form
4981 -266 198 -58 17 211 -87 73 17 -318 227 331 -198 107 -32 134 -11 -148 -81 49 -36 176 -77
5002 -77 129 -368 216 129 86 -367 29 -112 -320 128 -103 -43 153 -88 54 -192 -249 102 -30 36 11 -183
5024 -183 367 3 44 -38 -84 64 40 -129 81 -22 -144 -195 -211 -208 -102 -308 115 155 -111 -20 -1 -87 123 51
5048 51 -162 -104 -63 -39 260 -18 -168 -22 81 195 -182 -91 -272 -57 248 61 63 187 41 44 21 -51 -31 -164
5072 -164 -83 108 163 -4 -34 -12 -46 162 -88 25 26 -131 399 11 -49 55 -173 87 -102 -299 6 99 -220
5095 -220 247 -98 147 66 -97 76 285 -115 -215 6 146 -121 17 -120 23 93 127 -205 -120 265 208 108
5117 108 29 -257 -89 -45 -49 59 -26 51 98 88 -26 116 -122 83 325 118 129 -138 20 -80 30 -45 -34 220
5141 220 271 58 170 153 -101 -54 -138 12 -118 -170 -85 28 -177 -41 -67 -54 110 218 -37 -38 -99 88 8 80
$$ packed form
4981b66M64k56P5J94k98J60n6l35N45J04n29L05j39J66j45j37O7J30q5K12k53
5002g7K06m97N84q7m3m53L96j41k08M48k31O0J96k41J42k46n7L51j32O6k5j94
5024a83N50l64M1q2m6J48k4j69K10j03j22n1j6LJ06k06M23M0k66R1J9q6K10p2
5048E1k13N8M1K4K99k78j50J46J03J14l77R1j81K15L05j87KJ24j46Lk3p2K0j33
5072a64Q1J91N5j67l0K2l4K08k50J13Jj57N30l88o0J04k28K60j89j97L05R3l19
5095b20M67l45K45q1j63J73K09m00j00K21J40k67J38j37J43P0L4l32Q5L85n7j00
5117A08p9k86J68M4mJ08q5P7M7j0j14J42k38K05K42k07J1k67J58j00J10p5J1K54
5141B20N1k13J12j7k54M7q4J50j30n2Q5J13k05J36k6J3J64J08k55jo1J87q0P2
$$ plain form
5165 80 127 -17 -124 -245 -70 87 224 -306 82 28 -203 -83 -143 -57 72 16 -2 236 25 71 -30 -93 -115
5188 -115 73 125 274 126 42 -205 -126 -108 -124 -14 -4 48 61 -55 56 29 15 -126 123 -143 -124 -68 47 93
5212 93 -39 -90 194 87 43 94 -58 32 -144 -114 82 -47 142 145 34 -143 -60 -175 -117 121 -67 108 -123
5235 -123 -224 199 -71 -68 -95 56 -101 -182 -174 283 -288 -36 120 44 150 66 -82 131 8 6 68 -194 -158 -223
5259 -223 94 -21 24 -69 -83 167 297 86 15 -36 -23 -3 234 -54 253 -8 -72 19 147 320 200 -93 119
5282 119 70 -237 15 6 -13 -101 -255 59 37 74 -46 -59 105 47 -12 15 255 -69 -34 -18 111 210 -193 54 179
5307 179 -6 150 147 -94 -70 139 -106 83 112 -94 142 -139 196 -42 -433 -109 -284 -96 52 -140 -49 91
5329 91 148 39 186 -21 66 53 -101 115 -194 82 -59 -104 -286 -150 83 3 -238 61 -103 -33 -70 99 1
$$ packed form
5165H0M7j44j07j21J75J57J37n30L88n4k31J20o0Q6J29n6j8K38k11M6j01o3k2
5188a15J88N2J49j48q4k47P9J8j6J10J0N2J3j16J11k7j4j41K49k66J9N6J15M6
5212I3j32n1K84j07m4N1j52R0j76L0J96j29J89Lj11j77Q3j15N8K38j88J75k31
5235a23j01M23k70Lk7J51j57q1QM57n71K52J56p6J06q4j48K13j23kO2k62L6o5
5259b23L17j15M5r3j4K50J30k11p1n1J3K0K37k88L07k61o4R1J28J73j20k93K12
5282A19m9l07K52rj9q8j54L14k2L7j20j3J64n8n9K7K40l24L5J6J29R9m03K47J25
5307A79j85J56lk41K4K09k45J89K9k06K36k81L35k38l91L24j75J88J48j92R1J40
5329I1N7j09J47k07Q7j3j54K16l09K76j41m5j82J36K33q0k41K99j64P0l7J69r8
$$ plain form
5352 1 -71 284 75 288 33 108 -63 10 126 61 -364 215 56 -352 -19 180 109 -5 -188 9 -11 -185 100
5375 100 -145 77 92 112 100 -1 -178 78 96 209 114 25 201 233 -117 326 77 48 -125 89 -4 278 -5
5398 -5 -220 32 -234 11 56 -50 29 -87 95 152 98 328 239 228 86 193 -92 136 88 59 -218 -60 -100 -5
5422 -5 -115 -18 -156 235 -204 22 -40 20 -58 29 -143 -80 187 -174 235 87 -57 113 92 -262 82 -65 86
5445 86 -99 29 -27 -97 -99 -129 -25 83 2 -93 -28 0 35 120 260 136 -72 82 5 110 -124 186 -57 -379
5469 -379 63 207 -40 -144 -65 -60 -116 -82 208 -121 114 32 -37 -32 305 75 33 207 -167 234 -69 -197 87
5492 87 71 121 -27 -10 -12 228 -103 82 133 16 -47 -339 156 74 209 14 89 -56 111 -149 -5 -64 -230 101
5516 101 -175 -20 -177 23 79 -104 -84 206 -75 -144 148 48 -23 -24 30 -70 -185 113 82 215 -303 -228 -7
$$ packed form
5352Ap2L55k09K13k55P5j71P3J16o5m25N79j59m08L33J99p1j14j83J97k0j74K85
5375A00k45K22J5K0j2j01j77K56J8J13r5q9J76L2l50M43k49k9j73K14r3K82k83
5398ek15K52k66K45M5j06P9j16J82N7n4K30q9j1j42J07k85K28m8k9k77J58m0R5
5422ej10R7j38L91m39K26o2O0p8Q7j72O3K67l61M09j48j44J70k1l54L44j47J51
5445H6j85J28n6p0kl0J04J08q1r5O5K8L5Q5J40j24k08J54p7J05k34L10k43l22
5469c79M42J44k47j04P9Nn6L4K90l29K35q2o9NL37k30m2J74l74M01l03j28K84
5492H7j6N0j48J7kK40l31J85N1j17o3k92M95q2J35j95P5j45J67k60J44n9j66L31
5516A01k76J55j57K00N6j83K0K90k81o9K92j00p1jN4j00j15K98l1J33n18P5K21
$$ plain form
5539 -7 15 -100 -70 98 -24 -38 -34 -116 102 -84 -42 70 79 47 -17 -123 -41 21 -36 -143 64 -193 167 7 -4 34
5565 34 13 -169 -141 -119 13 215 -153 86 104 162 131 -274 -256 72 -56 111 -155 -1 -37 -51 118 299 -175
5588 -175 18 -147 30 -24 -71 -21 27 -75 -21 -90 34 -166 -258 39 220 -62 78 72 -33 88 -29 27 -49 -67
5612 -67 77 180 52 -38 384 -71 168 152 -146 25 164 -73 -42 -231 -210 80 -326 -62 245 26 86 98
5634 98 -54 -44 -139 268 -36 -334 10 -74 20 -190 -242 -51 4 15 112 116 97 179 -317 -79 -1 -195 54 192 24
5659 24 -195 15 102 39 -29 30 9 -43 -114 -16 24 -133 110 240 -119 -131 -165 116 -102 47 92 52 73 54 3 -232
5685 -232 15 -51 50 -168 -117 116 56 171 -201 66 -133 -59 39 33 -235 -93 -108 -85 35 -167 30 -132 -64
5708 -64 60 -101 -24 29 -66 149 -3 -180 151 -201 81 81 57 73 29 -39 -77 87 -146 157 -25 -37 -131 -103 11
$$ packed form
5539gK2j15L0J68j22j4Mq2K18j86M2J12Rl2o4j06Q2O2n7j07K07k57L60j60j1L8
5565C4k1j82K8K2J32K02l68K39J8N8l1m05J8L28j28J67k66J54l6j4J69J81m74
5588a75J93j65J77n4m7N0M8j02N4o9J24k00r2K97J81k82J40oj05J21j17N6p6j8
5612f7J44J03j28r0M22m55K39j6k98J71J39k37L1j89K1K90m06K64L07k19O0J2
5634I8j52J0r5M07l04k98L44q4R4k10n2J91N5J1R7Mj9Q2m96K38P8j94K49J38j68
5659B4k19K10Q7o3o8N9k1n2p1R8M0j57K43J30l59j2l4K81k18J49M5m0K1j9n1k35
5685b32K47o6J01k18N1K33o0J15l72K67j99P4R8ok68J42j5K3J20k02J97j62O8
5708f4J24j61P7N3r5K15j52j77L31l52K82%k4J6m4o8l8J64k33L03j82j2r4K8J14
$$ plain form
5733 11 -138 107 -5 -90 -89 -11 134 -1 -235 190 -9 -203 -158 230 -105 -231 -102 75 16 -44 -61 -178 -46
5756 -46 40 59 267 8 -136 133 -109 35 -99 -136 76 141 -84 37 -60 -83 -239 -117 66 191 -108 -283
5778 -283 80 5 -36 -1 -163 67 -63 -102 97 98 -50 -114 138 -222 -111 -62 0 47 -6 4 1 -127 -92 47 -245
5803 -245 106 15 -237 -67 -9 101 4 42 -44 -93 -74 2 -178 162 105 -99 44 -16 -111 -255 -62 -97 -170 -234 -167
5828 -167 -20 106 -51 -19 55 37 89 95 40 4 109 -77 124 0 -155 -34 31 151 86 113 -75 -75 5 -1 -102
5853 -102 -147 -4 228 165 166 -89 -19 145 -189 -224 -79 -132 -96 91 118 -7 -33 -26 130 -1 94 -82 -184 -9
5877 -9 -107 -93 11 -233 114 147 70 193 -102 77 -223 16 246 -176 158 86 -46 85 127 -53 204 93 102
5900 102 -56 -128 229 -157 -21 -3 122 -180 28 48 -77 -10 -131 46 -76 -61 23 95 -71 -17 77 -83 -79 -269
$$ packed form
5733A1j49K45j12q5JP8J45j35k34M25j99j94M5L88l35j26J29J77n9o0j7j17J32
5756d6Q6J9K08k59j44K69k42J44j34l7K12O5k25J21r7k3j56J22J83J25k99j75
5778b83L63p5m1L5j62K30j30l9J99Jj48o4K52l60J11M9O2M7n3J0lj28L5J39k92
5803b45L51r1k52J70N8J10r7L8q6m9J9P6j80L40n7k04J43o0r5j44J93l5p3o4O7
5828a67J47J26j57L2P4j8N2On5l6J05j86K01j24j55J21O5J20o5K7j88%Q0oj01
5853a02m5J43K32o3Jk55P0J64l34l5J45n3L6J87K7j25k6PJ56j31R5j76j02J75
5877ir8J4J04k44L47L3p7J23k95J79l00K39K30m22L34p2j32J31M2j80K57j11R
5900A02j58p2L57l86J36J8J25l02K08K0j25O7j21J77j22J5Q4P2j66N4R4j60Mj90
$$ plain form
5924 -269 148 21 83 318 68 -1 51 82 49 25 21 -145 -21 -64 -89 -54 119 37 -118 43 -151 -57 108 -173
5948 -173 -7 -70 -18 5 -225 156 -184 -174 75 -214 -58 6 12 17 -35 147 -5 -75 -100 -149 -3 -90 89 -64 67
5973 67 51 -81 -302 73 -127 -5 135 -78 104 -15 -3 -219 272 -67 65 -101 145 -23 -190 -162 -86 -31
5995 -31 27 -10 -192 59 -98 157 397 32 -48 179 72 -157 9 79 161 -22 -62 68 36 64 -44 -61 4 -246
6019 -246 -84 -100 90 7 -201 -56 -89 309 63 -44 144 6 -41 183 161 -102 -163 14 99 28 -43 -121 -71 -7
6043 -7 -83 -168 115 16 -45 -53 -120 109 -68 48 111 257 -62 -13 36 -175 -65 -11 -57 113 115 -2 -224 -79 208
6068 208 105 92 94 183 27 -107 15 85 -48 238 -41 77 19 94 -143 -347 -113 86 -126 -17 -91 89 149
6091 149 -264 43 -61 -59 -201 152 -13 148 -11 -58 101 -131 -25 -92 -132 153 -136 -26 -92 60 -146 -203
$$ packed form
5924b69M17j27O2K35k50o9N2L1l3k4mj66J24m3k5L5J73q2j55J61j94R4J65k81
5948a73J66o3N2K3k30L81l40J0K49k89J56O4ONn2J82j52p0k5m9J46q7J79j53J31
5973F7j6j32k21L75k00J22J40k13J82j19J2k16M91l39J32j66K46j68j67K8P6N5
5995c1N8l7j82K51j57K55K40l65q0K27j07k29J66P0Q2j83m0J30l2K8j08j7O5k50
6019b46J62j6J90q3k08J45l3L98k46j07J88j38m7K24k2k63o1J77Q5p1p1p8N0O4
6043gp6q5K83r9o1qo7K29j77J16O3J46l19M9M9k11J10N4m6J70Kj17k22J45K87
6068B08j03j3KQ9j56j34J22P0j33K86k79J18n8P5k37k04K34J99k12J09p4J80O0
6091A49m13L07j04Kj42L53j65J61j59m7J59k32J06o7m0K85k89J10o6J52k06n7
$$ plain form
6113 -203 -76 14 8 -42 55 -86 -144 -10 -63 -199 -238 -301 45 -199 -104 101 -163 21 -10 8 171 -23 135 -171
6137 -171 116 -63 -28 265 -64 0 -68 135 66 -66 -95 12 -253 -47 100 -51 57 -121 29 -82 -65 -44
6159 -44 187 -60 -33 -163 -45 -32 65 -77 -62 79 -33 -85 -29 104 111 -99 103 -43 393 -64 36 27 179 171
6183 171 -15 -27 -110 -185 -195 -149 179 164 52 -162 37 -37 -32 52 117 48 4 -243 53 -97 -10 -79 235 -257 5
6208 5 129 -36 -60 -90 -194 62 -107 208 108 86 -141 -45 -206 47 125 -72 106 -227 70 24 202 53 -23
6231 -23 -181 158 3 77 78 -142 -40 37 167 116 167 98 -138 -43 -189 24 246 -92 68 -71 -76 -51 -10 -20 -61
6256 -61 6 -189 47 -110 76 -93 62 74 -16 -157 -156 -124 133 54 -15 98 146 -203 153 141 -114 -95 -188 -72
6280 -72 107 -17 20 -52 -17 198 150 -36 -112 -175 158 -77 -3 262 -139 -92 -15 219 -270 -55 199 104 -112 119
$$ packed form
6113b03J27R0on0R7j41n8J34n3j36l9o3L46k44R5K05k64J84l1J8J63j94J58l06
6137a71K87j79L5K93l29O4o8K03o9j32k9J07k65K06J47j51J08j78J50j11J7K1
6159d4K31k47K7j30J18J3R7j42J5J41j12n2N6J33Pk10K02j46M36m57J00rJ52q
6183A71j86j2q3p5j0M6L28j5j12k14J99p4NQ4O5o9m4k47K96j50Q7o9L14m92K62
6208EJ24j65k4l0j04K56j69L15j00k2k27R6j61K53P8j97J78l33K97m6J78j49p6
6231b3j58L39j55P4Jk20J02P7J30n1N1o9k36R5j46K13K22l38J60j39nK5M1j0m1
6256f1O7j95K36j57J86j69J55J2r0j41JL2K57p9o9J13M8l49L56j2k55J9r3J16
6280g2J79j24L7p2L5K15m8j86p6o3L33k35P4K65m01M7P7K34m89K15K54r5k16K31
$$ plain form
6304 119 -122 -164 -78 23 42 141 -109 -106 -71 -14 -120 -160 244 -254 210 -235 41 -224 84 141 11 -48 101 152
6328 152 12 48 -78 52 -57 156 -78 96 -1 305 73 -49 -27 229 46 -254 -39 -74 -109 -156 -15 -214
6350 -214 124 -156 17 -34 -192 90 88 -50 123 -66 -93 -93 51 -352 -44 113 -162 -88 -49 90 103 -11 -180
6373 -180 93 173 44 15 -68 -159 213 67 6 -115 203 -183 179 -22 -97 -65 211 34 -155 5 98 -71 -17
6396 -17 -90 52 -122 -26 -15 -73 -42 50 169 -74 -51 -12 133 42 -48 13 -28 27 273 13 73 4 -173 -62 106
6421 106 33 74 -173 368 67 60 -60 -33 -148 -85 130 77 -58 209 36 -69 -23 311 16 -281 -21 -108 -185
6444 -185 -82 -161 135 62 -62 -25 -102 242 -5 16 -66 23 -60 114 -114 -276 -117 -137 -90 14 190 -104 0
6467 0 72 -19 -8 251 -319 -65 140 -118 184 -6 -182 -68 -265 10 34 138 -80 -116 -159 65 119 22 -84
$$ packed form
6304A19k41m2Q6J01J9R9k50LL5N7j06m0M04m98M64m45K76k65L08N7j30n9J49N1
6328A52j40L6j26J30j09K13k34J74r7L06k32j22K2K56j83l00K15l5l5m7J41j99
6350b14L38k80J73n1j58K82kj38J73j89k7%J44m03L08J57k75P4L9J39J3j14j69
6373a80K73Q0j29k9q3r1L72j46o1j21L18l86L62k01p5L2K76j77j89J60R3j69N4
6396a7p3J42j74R6J1n8L1R2J19k43K3L9J45r1r0O1m1N5K46k60O0o9j77J11J68
6421A06p3M1k47N41l01pj20K7j15O3K15n3j35K67j73j05M6L34k95k97K60q7p7
6444a85J03p9K96p3j24L7p7L44k47K1q2Q9q3J74k28j62J59k0M7J04J76k94J04
6467@P2r1J1K59n70K54K05k58L02j90j76J14j97K75K4J04k18l6m3K24N4r7j06
$$ plain form
6490 -84 -137 42 -134 -10 -169 58 69 -22 93 -216 -33 -62 71 -65 7 6 106 -116 -96 -114 -10 163 54
6513 54 124 -45 -358 -65 -108 80 -34 12 28 128 244 -115 157 115 -145 16 -26 107 -39 47 -142 -129 -136 -78
6537 -78 -208 -22 242 25 61 -25 -92 -1 113 28 -315 1 -53 -42 226 -29 115 1 154 19 -70 -91 -129 41
6561 41 78 77 -57 -53 88 -205 65 188 -65 25 125 -80 -121 68 -107 -58 -40 -297 181 -44 175 -57 -111 266
6585 266 -148 170 57 264 192 30 -58 21 -136 47 225 -199 -75 20 117 -153 76 -189 -65 -33 -140 47
6607 47 185 15 36 79 336 -22 2 0 191 47 -15 357 -84 -181 -46 269 218 18 69 -97 1 164 -62 -90
6631 -90 15 15 -25 159 49 260 21 75 11 -92 108 246 64 -196 -47 11 -14 -114 -17 88 -1 60 -58 77
6655 77 -8 -5 19 98 160 130 -48 -35 -191 3 -81 -133 -140 -38 -70 -33 -75 -283 -55 99 -217 -70 -8 -106 104 -88
$$ packed form
6490h4n3J79j76J24j59K27J1r1J15l09J83k9J33j36P2jJ00k22K0j8J04J73j09
6513E4P0j69l13K93m3J88j14M6J6J00J16l59K72m2k60J61m2J33j46Q6j89J3pN8
6537g8j30J86K64k17L6q6o7R1J14q5l43L16n4J1K68k55J44j14J53j35q9k1l8J70
6561D1L7jj34MJ41k93K70J23k53R0J00k05m1J89j75M9J8k57M78k25K19k32n4L77
6585B66m14L18j13K07p2j62q8P9j57J83J78m24J24R5R7k70K29k65J24L2j07J87
6607D7J38j70K1M3K57l58K4kJ91j44o2L72m41r7J35L15n1k00N1j66R8J63k26k8
6631i0J05%m0J84j10K11k39N4o4j03K00J38j82k60J49N8k5j00R7J05q9O1j18J35
6655G7q5LK4P9O2l0j78J3j56J94q4n2pJ02l2L7m2k08K28J54l16J47O2r8K10j92
$$ plain form
6681 -88 -37 61 -338 6 71 -121 -66 -86 -79 -52 -31 -127 12 -96 253 -48 41 158 42 209 -24 7 109 -46
6705 -46 29 -27 58 -191 14 -38 116 -9 -151 103 -59 -52 -19 -131 452 -77 -53 -23 -70 56 43 265 98 -264
6729 -264 -34 -130 28 3 83 -208 101 253 -40 264 -64 47 121 190 -262 178 69 117 322 206 174 -86
6751 -86 -4 -206 -96 11 -360 -66 -122 99 -167 86 21 5 33 -54 -25 60 -126 -205 114 -112 42 -156 284
6774 284 -49 49 -1 114 -63 -31 -152 212 220 -59 129 86 86 -239 -70 66 -75 -161 155 98 -143 -12 148
6797 148 -210 105 -105 -28 47 -175 81 -242 7 31 55 -97 20 78 294 66 -115 170 177 63 -314 87
6819 87 -186 147 -211 89 124 -70 175 -73 -153 -86 178 99 56 -53 144 -176 -16 155 41 -214 154 -160
6841 -160 -191 31 10 -58 -113 129 -41 9 8 178 165 3 23 -12 -41 -181 -128 130 -36 231 -21 -226 119 -194
$$ packed form
6681h8N1R8l99L44O5j92N5k0PK7K1r6J39j08L49l01Q9J17j16J67k33L1J02j55
6705d6P5n6Q5k49K05n2J54j25j42K54j62PL3j12N83n29K4L0m7J26j3K22j67l62
6729b64K30r6J58k5Q0k91L09J52k93L04l28J11P4O9m52M40j09M8K05j16l2k60
6751h6Q2k02J10J07l71K94n6K21k66K53o5j6K8q7K9Q5j86p9L19k26J54j98M40
6774B84l33R8n0J15j77L2j21L64Qk79J88m3%l25J69J36j41q6L16n7k41J31J60
6797A48l58L15k10P7P5k22K56l23K49K4K4j52J17N8K16k28j81K85Pj14l77M01
6819H7k73L33l58L00L5j94K45k48q0O7K64p9m3j09J97l20J60J71j14k55L68l14
6841a60l1K22k1o8n5K42j70N0jJ70j3j62K0l5k9j40N3K58j66K67k52k05L45l13
$$ plain form
6865 -194 -81 -145 -23 -68 3 231 292 97 -274 -136 199 175 -61 -12 -35 35 68 -3 -160 -61 -245 -8 226 116
6889 116 81 60 -100 27 -65 208 114 164 -47 -117 -19 143 -1 95 -129 126 -140 -52 -131 -97 83 -10 191 -154
6913 -154 43 16 69 139 67 -105 7 28 -80 -143 111 -97 -17 151 -126 -191 -135 -235 277 -125 71 202 -55
6936 -55 166 15 -177 129 -3 -217 -1 -261 -186 57 158 40 91 -390 -261 -82 47 -108 177 -312 84
6957 84 60 177 -291 -23 -124 -69 43 84 121 -58 272 77 -4 42 151 97 35 20 263 -135 332 -69 278
6980 278 206 -10 -114 -230 -112 1 64 25 103 61 17 -40 -174 -19 -20 61 -118 -15 95 -128 -32 40 -250 -181
7004 -181 -16 -6 44 209 -139 184 280 -132 -75 -161 102 -134 71 -226 26 159 255 -119 24 157 -6 -190
7026 -190 -181 53 77 -161 23 175 19 -29 106 109 9 -23 77 40 104 -17 59 89 -121 -146 114 -159 24 -147
$$ packed form
6865a94J13o4J22m5P1K28O1j95l71J38L35k4k36M9k3P0L3p1j57R9j84K37K34j10
6889A16l5k1j60J27r2K73r4N0k11p0R8J62j44R6k24K55k66Q8p9L4J80r3K01l45
6913a54J97k7N3P0p2j72J12K1j08o3K54k08Q0J68k77o5N6j00N12m02J96J31k57
6936e5K21j51j92L06j32k14K16k60P5K43J01j18N1m81J29J79J29j55K85m89L96
6957H4k4J17m68K68j01N5J12M1L7j79L30j95q1M6J09n4o2j5K43l98M67m01L47
6980B78p2k16j04j16J18J13O3l9P8m2m4n7j34J55jQ1j79J03J10k23R6P2k90O9
7004a81J65J0N0J65l48L23R6m12N7q6K63k36K05k97K52J33R6l74J43J33j63j84
7026a90RK34K4k38J84J52j56m8J35Lj00l2J00l7O4j21P6L0k10k5K60k73J83j71
$$ plain form
7050 -147 -40 178 -211 -71 -362 -7 -123 -6 -18 125 -105 55 -118 41 240 -63 143 46 -102 -38 -196
7071 -196 260 56 -124 -3 -283 -33 -178 -173 154 -1 -67 -80 146 214 -158 -76 4 123 214 -85 66 -51 -151
7094 -151 177 7 -80 2 -141 4 -140 -153 73 47 30 -160 13 175 35 136 -6 -190 118 32 145 114
7116 114 -14 -56 10 45 -50 -90 -227 -66 -121 193 41 -272 78 82 -47 -38 106 68 -15 -30 -100 269 4 63 -123
7141 -123 24 -21 -1 -47 -85 114 -46 -40 -13 -25 428 87 31 -99 107 191 44 18 -140 63 117 76 -197 -198 56
7166 56 -26 73 -256 -54 51 18 94 -112 -47 -101 139 171 129 -95 133 75 -16 15 -77 147 -151 -179 158 21 -102
7191 -102 253 -4 111 103 -38 -165 -297 73 -52 175 -311 -21 -244 52 88 -115 -76 -58 -112 93 -56 104
7213 104 170 -130 -51 48 -89 -156 -125 7 123 -45 13 63 59 67 181 -295 -71 -108 161 -62 115 -175 -225 -165 -210
$$ packed form
7050a47J07K18l89J40k91L55j16J17j2J43k30J60j73J59J99l03K06r7j48O4j58
7071a96M56k04j80J21k80K50j45NL27j55o6j3K26O8l72Q2Q0J19R1k99J51j17j00
7094a51L28j70q7Q2j43J45j44j3K26k6j7j90J73J62j40J01j42j84L08q6J13l1
7116A14j28m2O6L5r5m0j37J61n5L14j52l13L50Mj29RJ44l8q3j5p0L69k65N9j86
7141a23J47m5K0m6l8J99j60OK7j2M53l41n6j30K06Q4j47k6j58K03N4m1k73jK54
7166E6q2R9l29K02J05l3P6k06O5n4K40L2m2k24K28n8r1L1r2K24k98k8L37j37j23
7191a02L55k57J15qj41j27j32L70j25K27m86K90k23K96L6k03L9J8n4K05j49J60
7213A04O6l00P9R9j37o7L1J32J16j68N8N0mQJ14m76K24l7K69k23J77k90n0O0m5
$$ plain form
7238 -210 139 31 -6 45 -110 3 -63 -131 119 73 -106 -256 -229 -123 -59 168 54 -74 -252 -110 34 206
7260 206 168 151 -40 57 76 -45 -98 -60 -60 -209 114 -193 76 81 12 24 113 10 -31 -90 96 189 186 154 -94 -93 215
7287 215 36 48 41 -100 75 12 -69 21 116 -37 -217 148 -240 -274 47 59 276 -129 -21 -36 -71 134 99 -127
7311 -127 -17 23 62 0 -362 179 94 -93 -74 -98 184 -171 14 250 -201 -95 21 78 190 -29 -12 21 194
7334 194 252 -108 35 -164 125 24 6 -259 -82 199 -81 -4 319 73 105 -67 -109 219 -152 -8 -11 19 52
7357 52 95 42 227 197 24 98 -8 152 409 -5 -60 -212 -55 -2 201 316 86 -105 -54 -12 42 -201 186
7380 186 28 158 -18 -86 -81 -312 25 -19 -95 150 6 -91 -69 -12 -137 89 238 -80 20 74 85 -123 62
7403 62 -6 -119 -214 122 138 -208 -214 -42 -150 106 -173 -104 -72 -161 -96 52 -228 -146 367 -46 -100 284 -84 -27
$$ packed form
7238b10L49j08l7N1j55J13o6o8K50m6j79j50K7J06O4K27j14j28j78J42J44J72
7260B06l8j7j91R7J9j21n3L8%j49L23l07K69No9J2Q9j03m1n9J86R3ll2k48JL08
7287B15j79J2pj41J75o3q1R0R5j53j80L65l88l4L21J2K17m05J08j5l5K05l5k26
7311a27J10M0L9o2l62N41q5j87J9k4K82l55J85K36m51J06J16N7J12k19J7L3J73
7334A94N8l60J43j99K89j01j8k65J77K81k80P7L23k46L2j72m2L28l71J44lL0L3
7357E2M3n3J85l0j73P4j06J60K57m14n5j52J57N3K03J15k30j91N1M2N4k43L87
7380A86j58J30j76o8Nk31L37m4p6K45j44r7K2N7j25K26J49l18J00N4J1k08J85
7403F2o8j13r5L36J6l46oJ72j08K56k79O9L2q9O5J48k80Q2N13m13n4L84l68N7
$$ plain form
7427 -27 -72 88 29 -16 -100 254 -91 -66 101 71 -146 2 10 -31 -89 108 19 21 -97 -69 64 -189 251 23 121
7452 121 192 -12 -34 -70 41 -98 -35 147 -153 54 -34 23 -185 131 -286 -155 141 -124 -116 54 151 0 -113
7475 -113 -164 -150 -144 -56 -176 -35 50 50 142 59 -159 46 75 -131 105 -10 -108 -111 33 62 -119 146 50 83 89 182 27
7502 27 -71 -10 -36 153 75 -405 232 -113 -144 -118 -2 25 -74 -191 -235 53 24 -47 -9 -105 -38 35 -183 163 20
7527 20 27 -144 -328 24 20 -95 -208 -92 -42 -51 -68 98 -98 -201 117 145 -57 64 44 252 143 -14 162 10
7551 10 249 -149 83 -167 -19 -12 36 -136 -50 -17 34 237 96 9 131 100 -286 220 -115 192 84 -92 51
7574 51 -27 -191 -259 -51 5 -20 4 -17 120 87 -64 -174 -2 180 -110 1 49 -246 -44 -22 -120 -542 -156 150
7598 150 -88 52 83 -34 -74 201 -55 116 -119 -95 -73 -55 -89 218 -167 60 81 6 -109 -79 -176 176 20
$$ packed form
7427b7m5J60n9m5q4L54l45K5J67l0k17J48Qm1n8J97q9Kj18K8J33k53M40k28R8
7452A21P1k04k2l6J11j39O3J82l00K07q8N7k08L16m17J31K96k65QJ70R7j51j13
7475a13n1J4OQ8j20J41Q5%R2q3k18K05K9k06K36j15r8lJ44K9j81K65r6L3OR3j55
7502B7r8O1k6J89p8m80O37l45l1K6J16K7r9j17m4K88k9p1L8r6O7P3k18L46j43
7527B0Pj71j84L52mj15j13J16N0rj7J66j96j03L18K8k02J21k0K08j09j57J76j52
7551A0K39l98K32k50J48PM8j72Q6L3N1K03j41q7J22l1l86N06l35L07j08j76J43
7574E1p8j64o8K08N6k5K4k1J37l3j51j10J72J82k90J11M8k95K02K2r8m22L86L06
7598A50k38J40L1j17m0K75k56J71k35K4K2J8l4L07l85K27K1p5j15L0r7L52j56
$$ plain form
7621 20 -144 -66 -352 -106 198 -88 -26 205 -106 -31 -3 64 -178 -53 -72 111 -180 -35 -46 -107 204 53 -3
7644 -3 266 -47 52 127 -149 -147 12 -198 166 -31 -229 38 -132 -30 12 46 25 169 112 -243 80 109 -8 -22
7668 -22 215 -69 18 18 -206 13 20 37 66 16 -220 -112 102 -54 -30 75 173 92 -61 170 46 148 232 26
7692 26 -74 119 -150 -73 145 -203 198 -193 16 108 24 97 -51 149 -52 20 37 66 120 -176 -195 -165 82 31
7716 31 -98 -166 -183 -85 -113 31 -91 80 40 85 -100 -84 29 -33 43 -89 28 80 39 155 269 -1 211 330
7740 330 -74 -59 25 -273 162 -49 -79 7 56 50 40 -77 -11 -88 160 198 53 -136 -87 66 -107 83 138 3
7764 3 -104 95 103 11 120 -62 7 -1 -8 32 -67 52 53 229 -108 -107 27 -26 345 -238 36 -27 -46 28 315 -95 19
7791 19 77 -133 -63 -79 81 114 -66 132 -21 166 46 -215 -150 56 -43 -36 63 107 64 135 -77 149 62 -114 156
$$ packed form
7621B0j64P8k86K46L04k86O2K31l11P5K8O7k42J25j9J83k91J45j1o1L11j51n6
7644cK69l13R9P5k76KJ59k10L64j97j98K67j70J02M2L4k1J44n7l55L23K9j17j4
7668b2K37k84Q7%k24K19PJ7K9n0k36J08K14j56K4J05R8q1j53K31j24J02Q4k06
7692B6j00J93k69P7K18l48M01l91K09R2q4P3j48K00k01P2J7K9N4k96j9L0K47n1
7716C1j29o8j7R8k8J44j22J71m0M5j85J6J13o2P6j32J17N2m1J16J14k70K12J19
7740C30m04J5Q4k98M35k11l0Q6M9oj0j17O6p7K48L8j45j89M9J53j73J90N5j35
7764Cj07J99Qr2J09j82O9qpM0r9J19JJ76l37JJ34n3L71n83K74o3j9P4K87m10J14
7791A9N8k10P0j6J60L3j80J98j53J87j20k61O5K06r9PR9M4m3P1k12K26q7j76K70
$$ plain form
7816 156 -115 67 -73 -90 -43 -225 130 -124 1 153 62 -98 -58 66 -86 88 37 -23 -173 27 -113 34
7838 34 -72 182 -52 140 92 77 -139 86 -257 242 152 2 1 117 167 52 -94 104 60 -169 60 -54 -190
7861 -190 93 -285 -63 153 5 -38 -47 143 -80 107 -44 93 27 -248 15 348 -134 -215 -188 -173 -79 140 -43
7884 -43 27 -179 50 177 310 232 7 -151 126 -261 147 -199 92 -222 83 68 -171 12 -385 -44 107
7905 107 115 29 46 182 106 -127 -154 -45 -11 -134 -93 -334 103 82 -48 327 3 -136 95 -9 -81 -169 -35 205
7929 205 -108 -28 85 -136 30 146 -5 86 -68 40 -83 -282 -168 -71 -63 -29 86 -6 60 116 -199 1 -33
7952 -33 -109 -113 18 137 -115 -90 51 52 30 -108 93 -19 -10 64 -138 203 -201 -25 179 31 -178 -152 -126 135
7976 135 -65 14 17 -10 146 33 -2 -103 -240 -113 -52 -28 -76 -59 107 -92 35 -106 121 8 -28 -304 -169
$$ packed form
7816A56k71J82j40j7M7j82L55k54J25J52r1j60M0J24j52J74n1o0j50K00j40J47
7838C4j06K54k34J92m8j5k16K25l43M99r0j50jJ16N0j15j46J98m4k29K29j14j36
7861a90K83l78K22K16j48m3rJ90k23J87j51J37o6k75K63L33m82q1K7J5R4K19j83
7884d3P0k06K29J27J33p8k25j58K77l87M08l46K91l14L05j5k39J83l97L41J51
7905A07Qq6J7J36p6k33k7J09L4j23M1k41M37k1j30L75l24j39K31j04p2q8J34K40
7929B05l13Q0J13k21J66J16j51R1j54J08j23j99J14R7QL4J15r2O6N6l15K00l4
7952c3p6mJ31J19k52K5J41Jk2j38K01j12RP4k02L41m04J76K04j48k09K6K6K61
7976A35k00P9Lk7J56j13l5j01j37J27O1K4m8J7J66j99J27j41K27j13l6k76J35
$$ plain form
7999 -169 -228 -124 -149 -68 -113 130 -5 -131 44 -94 36 78 -93 -7 -90 -9 -128 -128 -167 21 -37 293 13 65
8023 65 58 -63 58 -78 21 -68 -4 -4 20 44 132 8 42 -136 44 13 10 89 -117 -120 -22 -170 -23 -29 -99 -265 -101
8050 -101 129 140 -106 52 171 -17 -44 -35 -136 -78 -10 76 19 48 142 134 83 -142 46 -102 -44 220 156 -87 33
8075 33 -177 -147 145 -276 39 -148 -324 29 106 -124 277 159 -206 20 -98 -7 102 52 -6 -37 84 -66
8097 -66 -51 -63 23 5 242 -32 26 283 191 -22 59 84 -64 271 -146 87 262 -78 56 -204 -71 139 -262
8120 -262 9 26 18 -279 -44 -107 -14 -239 -299 -27 -8 71 152 25 24 141 73 70 106 5 240 163 -14 117 -68
8145 -68 144 -16 -132 109 -132 127 -191 -55 30 -20 -21 252 39 53 -13 128 -13 -53 2 157 10 -97 -153
8168 -153 -106 -96 -210 -26 -71 83 -15 171 -199 -33 59 -62 91 43 150 224 -5 -156 37 -61 -15 22 187
$$ packed form
7999a69n9J04k5Q1m5K43j35j26J75j38J30M2j71Q6q3Q1j19%l9J88n8L30k80N2
8023F5pj21J21j36R9q9O4%K4K4Q8j24L4j78J80l1lP9k06lR8j48J47op0j66J64
8050a01K30J1k46J58J19j88k7Rj01N8O8Q6n7K9R4qn1k25J88j48N8K64o4k43J20
8075C3k10L0K92m21L15j87j76L53P7k30M01j18l65K26j18R1J09n0n8l1J21j50
8097f6J5j2Q6j8K37k74N8K57r2k13Q1K5j48L35m17K33J75l40J34k60J33K10m01
8120b62K71J7qk97K35o3R3k25o0K72J9P9Q1j27jJ17o8lL6j01K35p7j77J31j85
8145f8K12j60j16K41k41K59l18J36Q5n0jK73k13J4o6J41j41m0N5J55j47j07n6
8168a53M7J0j14J84m5J54r8J86l70J66R2j21J53m8J07P4k29j51J93r8M6L7J65
8191A87
$$ Imaginary data points
##PAGE= N=2
##DATA TABLE= (X++(I..I)), XYDATA
$$ plain form
0 0 0 0 0 -8 8 -8 8 -11 16 -24 32 -40 48 -56 72 -86 103 -120 139 -166 195 -227 262 -302 348 -396 452
27 452 -514 581 -658 739 -830 931 -1040 1160 -1294 1437 -1597 1770 -1961 2173 -2405 2663
43 2663 -2947 3265 -3624 4028 -4487 5016 -5631 6358 -7235 8309 -9669 11446 -13883 17436
57 17436 -23110 33574 -59092 240160 179552 -316945 267362 99619 -270072 191520 195756
68 195756 -311496 33426 234482 -137419 -21448 197382 -131671 -58739 235589 -4547
78 -4547 -125189 64964 -50985 -75695 66397 -16807 -74737 -1248 45843 90238 568 -35961
90 -35961 30079 -51986 -8769 113176 -70717 -84462 128906 19339 -48115 117341 -27969
101 -27969 -130134 158986 112831 -132898 80573 79862 -183468 94846 160627 -222053 15118
$$ packed form
0@%%%qJ6j6J6j9K7m0N6p2Q8j04J28j58J89k23K59l05L61m22M89n64O50p44Q48
27D52r66J095j239J397j569J761j971K200k454K731l034L367l731M134m578N068
43B663n610O212o889P652q515R503j0647J1989j3593J5544j7978K1115k5329L1319
57A7436m0546N6684r2666K99252o0608m96497N84307j67743l69691M61592M236
68A95756n07252L44922K01056l71901J15971K18830l29053P2932K94328k40136
78d547j20642J90153j15949k4710J42092q3204n7930P3489M7091M4395q9670l6529
90c5961O6040q2065M3217J21945j83893j3745K13368j09567o7454J65456j45310
101b7969j02165K89120m6155k45729K13471p11k63330K78314O5781l82680K37171
$$ plain form
112 15118 211316 -134465 27238 192671 -198612 -86804 207079 -81443 -107740 136894
122 136894 -66211 -115161 162155 11075 -169849 60949 43727 -91814 90417 40367
132 40367 -135009 23578 44376 -72467 -1838 -33228 -68923 42717 27545 -9729 -3191
143 -3191 -62220 -18411 38925 -26060 -19955 10169 -29001 13924 55908 -39924 -55001 40760
155 40760 6725 1039 85066 -32297 -82193 71319 -13952 -83403 56141 -44207 -85520
166 -85520 111185 17089 -96596 40395 -17667 -94669 46932 5050 -123260 -7918 40043
177 40043 -66202 -2645 30669 -99852 -18029 87718 -38701 -18303 44775 -70141 -20654
188 -20654 48751 -67411 -41975 31349 -11255 31834 56742 -21683 -21261 20886 9207 1843
$$ packed form
112A5118J96198l45781J61703J65433l91283J11808K93883k88522k6297K44634
122A36894k03105m8950K77316j51080j80924K30798j7222j35541J82231n0050
132D0367j75376J58587K0798j16843P0629l1390l5695J11640j5172l7274O538
143c191n9029M3809N7336o4985O105L0124l9170M2925M1984r5832j5077R5761
155D0760l4035n686Q4027j17363m9896J53512q5271o9451J39544j00348m1313
166h5520J96705r4096j13685J36991n8062p7002J41601m1882j28310J15342M7961
177D0043j06245O3557L3314j30521Q1823J05747j26419K0398O3078j14916M9487
188b0654O9405j16162K5436P3324m2604M3089K4908p8425M22M2147j1679p364
$$ plain form
200 1843 12946 -9007 -20632 22390 14465 -31324 -18050 -16735 -7529 30763 4514 -9349 -3441
213 -3441 -25398 17556 9694 -56294 -3453 6626 -31571 43774 23743 -60094 5292 32079
225 32079 -24978 10493 37023 -23623 -4250 64726 -3043 -53438 20504 -7846 -33731 68364
237 68364 29995 -42816 37991 29884 -22054 24776 8910 -26670 17658 39973 12663 -9166
249 -9166 813 5477 -1041 29376 22398 -17446 11163 26321 3889 4214 -10021 -17815 -219 17460
263 17460 29070 1542 -3037 26300 338 1517 16554 -30866 -8573 39439 9182 11940 15426
276 15426 -19776 -1479 22985 6069 -2669 6297 13507 7682 14688 7508 -28342 605 32568
289 32568 6418 22550 18418 -22327 9439 18028 -16896 -6970 -5247 -3231 19849 18083 7078
$$ packed form
200A843J1103k1953j1625M3022p925m5789J3274J315R206L8292k6249j3863N908
213c441k1957M2954p862o5988N2841J0079l8197P5345k0031q3837O5386K6787
225C2079n7057L5471K6530o0646J9373O8976o7769n0395P3942k8350k5885J02095
237F8364l8369p2811Q0807q107n1938M6830j5866l5580M4328K2315k7310k1829
249i166R979M664o518L0417o978l9844K8609J5158k2432L25j4235p794J7596J7679
263A7460J1610k7528m579K9337k5962J179J5037m7420K2293M8012l0257K758L486
276A5426l5202J8297K4464j6916q738Q966P210n825P006p180l5850K8947L1963
289C2568k6150J6132m132m0745L1766Q589l4924R926J723K016K3080j766j1005
$$ plain form
302 7078 -11162 -9223 14148 -4115 -8928 3885 -16527 1437 25379 -4810 -16884 -8547 -3202
315 -3202 7219 11748 13798 -8992 -13299 19703 -8246 -29011 4789 -15555 -9595 37680 1310
328 1310 -25146 -639 -9833 -11138 5388 -1917 -14491 -4291 17643 -498 -21144 -5448 -18935
341 -18935 -15957 18258 -5066 -17523 4280 -5388 266 3628 -17932 -10821 -4465 3179 13498
354 13498 -10184 -15109 -6819 -15333 -1435 -1899 -13912 3390 9662 8628 3254 -18932 -18748 -13376
368 -13376 -7255 5847 -10288 -9944 3113 -9966 931 -1569 -25018 1159 8798 -5505 9229
381 9229 -8140 -24799 -2889 -3754 -10209 -5563 -2504 2400 4976 15187 3034 -19620 2764 4795
395 4795 -11422 13393 3396 -14787 14168 7143 -11853 -2971 -4587 1179 11707 15301 11926 -7966
$$ packed form
302G078j8240J939K3371j8263m813J2813k0412J7964K3942l0189j2074Q337N345
315c202J0421M529K050k2790m307L3002k7949k0765L3800k0344N960M7275l6370
328A310k6456K4507r194j305J6526p305j2574J0200K1934j8141k0646J5696j3487
341a8935K978L4215k3324j2457K1803r668N654L362k1560P111O356P644J0319
354A3498k3682m925Q290q514J3898m64j2013J7302O272j034n374k2186J84N372
368a3376O121J3102j6135L44J3057j3079J0897k500k3449K6177P639j4303J4734
381I229j7369j6659K1910q65o455M646L059M904K576J0211j2153k2654K2384K031
395D795j6217K4815r997j8183K8955p025j8996Q882j616N766J0528L594l375j9892
$$ plain form
409 -7966 -2314 5491 -16245 -5496 3536 -11305 7803 15785 -3401 -2687 -1166 1363 3750 4635
423 4635 10879 -5694 -5645 11815 -11002 -12176 7185 -8465 4478 24878 6451 7864 11672 1882
437 1882 2357 -1974 -1391 -71 2249 18404 11691 3572 13125 814 3355 14637 1804 7706 10280
452 10280 -1371 5165 -3846 -8862 4560 1108 10316 17109 2899 7484 184 -11534 -1467 -9175
466 -9175 -8201 7504 566 5099 10367 -166 746 341 -494 -1219 -4880 6623 -495 -6335 12583
481 12583 -2794 -6869 21406 5010 3529 28009 6850 -1299 10309 -7949 -14028 -1431 2408
494 2408 946 6154 15692 2622 -3727 8452 -10219 -13265 5711 -9180 -7915 863 -15882 -9010
508 -9010 -4553 -9713 5194 -232 -861 13030 -3410 -6379 483 -17260 -13955 -782 -5359 -3920
$$ packed form
409g966N652P805k1736J0749R032j4841J9108P982j9186P14J521K529K387Q85
423D635O244j6573M9J7460k2817j174J9361j5650J2943K0400j8427J413L808r790
437A882M75m331N83J320K320J6155o713q119R553j2311K541J1282j2833N902K574
452A0280j1651O536r011n016J3422l452R208O793j4210M585p300j1718J0067p708
466i175R74J5705o938M533N268j0533R12m05q35p25l661J1503p118n840J8918
481A2583j5377m075K8275j6396j481K4480k1159q149J1608j8258o079J2597L839
494B408j462N208R538j3070o349J2179j8671l046J8976j4891J265Q778j6745O872
508i010M457n160J4907n426o29J3891j6440k969O862j7743L305J3173m577J439
$$ plain form
522 -3920 5380 8121 -124 4321 10463 -11220 -4659 14519 -9192 -1174 12279 -20166 -8328 7829
536 7829 -16265 -1177 11993 -3258 9361 10842 -9427 -11394 -9994 -14097 -11289 -1471 -4900 -10009
550 -10009 6429 1120 -9724 8828 -3460 -11319 16467 -2320 -14853 5013 -17607 -18843 5704
563 5704 -11641 -10205 9899 1775 5092 11767 -2735 -11777 -5611 -2885 -8563 1092 4838 -5782
577 -5782 11683 13252 -9369 7403 5392 -9844 20096 9905 -15065 8222 -3784 -16930 10615
590 10615 157 -11565 12229 10267 -3897 1851 -3730 -20580 -9195 6966 -9500 -4776 12169
603 12169 -6958 2778 18866 -13756 -7030 9658 -12296 6308 13097 -15829 1762 11175 -6552
616 -6552 9061 11434 -3333 13117 24330 6403 -401 5579 -8164 -8303 17547 1592 -10615
$$ packed form
522c920R300K741q245M445O142k1683O561J9178k3711Q018J3453l2445J1838J6157
536G829k4094J5088J3170j5251J2619J481k0269j967J400m103K808R818l429n109
550a0009J6438n309j0844J8552j2288p859K7786j8787j2533J9866k2620j236K4547
563E704j7345J436K0104q124L317O675j4502r042O166K726n678R655L746j0620
577e782J7465J569k2621J6772k011j5236K9940j0191k4970K3287j2006j3146K7545
590A0615j0458j1722K3794j962j4164N748n581j6850J1385J6161j6466M724J6945
603A2169j9127R736J6088l2622O726J6688k1954J8604O789k8926J7591R413j7727
616f552J5613K373j4767J6450J1213j7927o804N980j3743j39K5850j5955j2207
$$ plain form
629 -10615 18714 3834 -7318 16830 -9482 -18611 13844 1628 -3184 9004 -11333 -10490 5204
642 5204 -3002 -3636 -358 -652 8113 15506 7122 -4083 1467 554 -3161 13148 -650 -15894 15589
657 15589 7607 -10658 16149 -4301 -19844 23809 14373 -10025 11599 -54 -17974 5144
669 5144 4564 -18222 -5609 16551 6391 7158 18291 -9657 -13617 14695 -2647 -10253 3276
682 3276 -12843 -4448 11922 -4969 -3465 -383 -2016 17187 10754 -4759 -921 -7963 -8947 1166
696 1166 -8879 -17263 -4959 10174 7076 4715 7481 -12169 -9102 15222 -7107 -13997 8316
709 8316 -8381 -1180 20966 -9048 -14575 8609 2270 6685 14089 -3527 -10900 1842 5004 -7702
723 -7702 -6995 -1172 -7248 8265 15057 -12903 -12084 -2588 -11910 2328 1297 -15507 -1241 5706
$$ packed form
629a0615K9329j4880j1152K4148k6312r129L2455j2216m812J2188k0337Q43J5694
642E204q206o34L278k94Q765P393q384j1205N550r13l715J6309j3798j5244L1483
657A5589p982j8265K6807k0450j5543M3653r436k4398K1624j1653j7920K3118
669E144n80k2786J2613K2160j0160P67J1133k7948l960K8312j7342p606J3529
682C276j6119Q395J6370j6891J504L082j633J9203o433j5513L838p042r84J0113
696A166j0045q384J2304J5133l098k361K766j9650L067K4324k2329o890K2313
709H316j6697P201K2146l0014n527K3184o339M415P404j7616p373J2742L162j2706
723g702P07N823o076J5513O792k7960Q19R496r322J4238j031j6804J4266O947
$$ plain form
737 5706 3948 6701 -8211 -10575 1402 2667 5740 293 -8045 -1488 3662 4088 -3818 -9402 750
752 750 3895 10726 12385 -11053 -9209 4688 -5214 2507 3200 -13003 2670 12319 -1015 -3068
766 -3068 -8684 -9768 3355 9272 4207 -6282 -3757 4288 -1455 1165 -3969 -16456 3245 12712
780 12712 1372 5683 -2177 -7283 8757 6641 -2392 -3746 -4915 5320 6817 -798 -4124 -12067
794 -12067 -2209 11602 4979 2967 -362 -2613 5676 -536 -6843 -7537 -11205 7519 15227 -576
808 -576 3214 1416 -4967 9435 7360 -7126 -4900 1793 5064 651 -2340 -3990 -11065 4629 15355
823 15355 -2182 -213 5337 -3710 5372 3814 -11288 -7897 -1635 6328 9442 -1488 -1532 -1402 -2680
838 -2680 6274 337 -7304 105 5867 8876 1358 -6064 -3894 -7978 2400 12224 -6552 -4149 7732
$$ packed form
737E706j758K753j4912k364J1977J265L073n447q338O557N150M26p906n584J0152
752G50L145O831J659k3438J844J3897r902P721O93j6203J5673R649j3334k053
766c068n616j084J3123N917n065j0489K525Q045n743K620n134j2487J9701R467
780A2712j1340M311p860n106J6040k116r033j354j169J0235J497p615l326p943
794a2067R858J3811o623k012l329k251Q289o212o307o94l668J8724P708j5803
808e76L790j798o383J4402k075j4486K226O693L271m413k991j650p075J5694J0726
823A5355j7537J969N550r047R082j558j5102L391O262P963L114j0930m4J30j278
838b680Q954n937p641P409N762L009p518p422K170m084J0378R824j8776K403J1881
$$ plain form
853 7732 -2798 3393 5224 -10231 -3447 7504 6137 3173 -4337 -5580 -5194 -1906 4308 -5129 -5272
868 -5272 5909 4754 8559 4340 -9211 -2894 -736 -1528 5812 -5248 -6309 7305 1563 496
882 496 1147 -8508 -1027 7664 5682 1691 -5431 -4777 -2788 -2039 1915 -5140 -3746 8280 3794 3965
898 3965 1692 -11957 -1748 4941 -1998 4545 -1281 -6637 6210 4224 -3353 -2896 -5305 -345 5839
913 5839 5516 521 -6794 -153 2977 -2797 1807 -3611 -5423 9832 5480 -1512 457 -9661 -3015
928 -3015 7083 -279 988 934 -1985 5461 2890 -4302 -5378 -4243 4770 6543 1914 373 -6780
943 -6780 -1856 5556 -2640 -1370 -861 -1914 9658 5324 -3785 -1242 -7289 -1338 7469 -3296 -3700
958 -3700 912 -785 5353 3385 -4127 -4504 -356 8484 4782 -1328 51 -7108 -3215 5976 -6116
$$ packed form
853G732j0530O191J831j5455O784J0951j367k964p510j243L86L288O214r437j43
868e272J1181j155L805m219j3551O317K158p92P340j1060j061J3614n742j067
882D96O51r655P481Q691j982l991p122O54J989P49L954p055J394J2026m486J71
898C965k273j3649J0209O689o939O543n826n356J2847j986p577M57k409M960O184
913E839l23m995p315O641L130n774M604n418j812J5255m352o992J969j0118O646
928c015J0098p362J267n4k919P446k571p192j076J135R013J773m629j541p153
943f780M924P412q196J270N09j053J1572m334r109K543o047N951Q807j0765m04
958c700M612j697O138j968p512l77M148Q840l702o110J379p159L893R191j2092
$$ plain form
973 -6116 -5677 4205 2632 10289 8014 -4878 -4158 -3243 157 3587 -5429 -4954 -240 -12 4815 88
989 88 -5532 42 3754 8543 3832 -6279 -3273 -5016 -4023 2567 -7968 -7447 5310 4882 7969 5431
1005 5431 -5523 -2346 -14 40 620 -7303 -4322 2511 556 2826 -2993 -6654 2848 5981 7445
1020 7445 2942 -5651 -1498 -1070 -3522 697 -7837 -6162 8581 4916 2288 1753 -6923 -1660 3830
1035 3830 486 -2385 -6028 -1499 2731 -990 -79 -6270 -7336 5581 4746 1098 1812 -4716 -602
1050 -602 2857 -3512 -3686 -6317 -2422 8470 3645 609 198 -5971 1836 5174 -2042 -821 -1290 1163
1066 1163 5331 -543 -2657 -4198 -1668 8613 5232 628 2287 -3655 603 3242 -6551 -4301 -1760
1081 -1760 -650 8534 3486 -2486 440 -1768 1425 2328 -4673 -3938 -1985 1757 3301 -3012 -2062 -489
$$ packed form
973f116M39R882j573P657k275j2892P20R15L400L430r016M75M714K28M827m727
989H8n620N574L712M789m711j0111L006j743R93O590j0535N21J2757m28L087k538
1005E431j0954L177K332N4N80p923K981O833j955K270n819l661R502L133J464
1020G445m503q593M153M28k452M219q534J675J4743l665k628n35q676N263N490
1035C830l344k871l643M529M230l721R11o191j066J2917q35l648P14o528M114
1050f02L459o369j74k631L895J0892m825l036m11o169P807L338p216J221m69K453
1066A163M168n874k114j541K530J0281l381m604J659n942M258K639r793K250K541
1081a760J110R184n048n972K926k208L193R03p001P35J953L742J544o313R50J573
$$ plain form
1097 -489 439 10446 5647 -1926 4286 -876 -2220 1756 -7287 -5349 3706 5102 9129 5136 1300
1112 1300 3265 1104 3700 1575 -5842 -658 381 -813 2239 -3616 -2763 2837 3097 7382 2883
1127 2883 -3299 2834 -2225 -4593 -674 -9244 -6064 4510 2092 4000 4321 -519 1579 2175 1650
1142 1650 -1617 -3435 2853 860 -742 3104 -5699 -3404 6396 1212 4408 6116 -2222 2673 2535
1157 2535 -4561 -2029 -3692 -2615 3746 2106 1129 -818 -1422 1676 -840 609 465 -4395 2704 1852
1173 1852 -5089 -535 -5764 -6935 2842 -1223 -1836 3345 -1348 1194 1809 -4717 -3133 -3690 -2373 1882
1189 1882 -122 -746 -1678 -2130 1350 -1666 414 2767 -2111 4022 3023 -6887 -243 -2069 -6995 4848
1205 4848 2636 -2438 4896 1541 -1893 528 -3127 -5246 -4027 -181 -284 -3263 1125 -1230 -4476
$$ packed form
1097d89R28J0007m799p573O212n162j344L976r043J938R055J396M027l993l836
1112A300J965k161K596k125p417N184J039j194L052n855Q53N600K60M285m499
1127B883o182O133n059k368L919q570L180J0574k418J908L21m840K098N96n25
1142A650l267j818O288j993j602L846q803K295R800n184L196J708q338M895j38
1157B535p096K532j663J077O361j640r77j947o04L098k516J449j44m860P099q52
1173A852o941M554n229j171R777m065o13N181m693K542O15o526J584n57J317M255
1189A882k004o24r32m52L480l016K080K353m878O133r99r910O644j826m926J1843
1205D848k212n074P334l355l434K421l655k119J219L846j03k979M388k355l246
$$ plain form
1220 -4476 3168 -2433 -5673 2329 -3451 -2433 1845 -6597 -3776 -136 -3983 3344 4515 315 4815
1235 4815 2371 -1933 -1615 -3436 -3502 -2692 2672 3464 -1129 4909 3160 -2878 5706 1736 -5254 4555
1251 4555 204 -5244 2166 -4051 -5107 1917 -256 1580 4463 2152 2233 996 -654 -3289 -4440
1266 -4440 -1183 -2939 155 4897 -1957 2381 5327 -4119 2942 5156 -4163 5154 5570 -4205 2235
1281 2235 1074 -5320 983 3286 1242 2958 5926 3897 -746 3069 1014 -4618 3676 1842 -2668
1296 -2668 5416 750 -2410 4827 -1154 269 5251 -342 3466 5069 -2485 1130 14 -4793 -469
1311 -469 1038 70 1791 4969 2274 -2297 2987 668 -6102 4414 2789 -5316 6809 3033 -6999
1326 -6999 4794 1493 -5472 5792 3821 -2002 3013 2018 -2644 -1585 1841 -1155 -1469 6271 1774
$$ packed form
1220d476P644n601l240Q002n780J018M278q442K821L640l847P327J171m200M500
1235D815k444m304L18j821o6Q10N364P92m593O038j749o038Q584l970o990R809
1251D555m351n448P410o217j056P024k173J836K883k311Q1j237j650k635j151
1266d440L257j756L094M742o854M338K946r446P061K214r319R317M16r775O440
1281B235j161o394O303K303k044J716K968k029m643L815k055n632Q294j834m510
1296b668Q084m666l160P237n981J423M982n593L808J603p554L615j116m807M324
1311d69J507r68J721L178k695m571N284k319o770J0516j625q105J2125l776j0032
1326f999J1793l301o965J1264j971n823N015r95m662J059L426k996l14P740m497
$$ plain form
1341 1774 -2311 4323 -2821 -5045 3079 -3585 -2652 4244 -1906 2015 3752 -4061 -247 -522 -4219
1356 -4219 1055 -521 -3104 273 -921 -2220 -1252 189 -961 -512 5576 503 -4020 2509 -5267
1371 -5267 -7665 3898 -4513 -5193 7346 -1344 -2522 5869 -4686 -6304 1751 -2040 -4411 -228
1385 -228 -489 -4533 -646 2458 -5575 -2805 4097 -3928 594 4732 -6582 -2488 1308 -6181 121
1400 121 864 -3470 3460 1947 -1771 227 -4412 -4681 -19 -819 -1022 254 953 -1054 -803 1682 -5795
1417 -5795 -4341 3863 -4423 -1985 4595 -7705 -3405 5918 -4816 -1493 5582 -3047 -22 4913
1431 4913 -2562 -5032 -1449 -951 -2688 2019 3733 -1704 3317 6133 -2065 1122 621 -4598 3306
1446 3306 2334 -2082 3189 -2051 -1843 5403 -1277 -565 5405 476 2356 4979 -1932 -4487 -419 412
$$ packed form
1341A774m085O634p144k224Q124o664R33O896o150L921J737p813L814k75l697
1356d219N274j576k583L377j194j299R68J441j150M49O088n073m523O529p776
1371e267k398J1563q411o80J2539q690j178Q391j0555j618Q055l791k371M183
1385b28k61m044L887L104q033K770O902q025M522M138j1314M094L796p489O302
1400A21P43m334O930j513l718J998m639k69M662q00k03J276O99k007K51K485p477
1417e795J454Q204q286K438O580j2300M300R323j0734L323P075q629L025M935
1431D913p475k470L583M98j737M707J714n437N021K816q198L187n01n219P904
1446C306r72m416N271n240K08P246o680P12N970m929J880K623o911k555M068Q31
$$ plain form
1462 412 -2450 1693 3582 -3901 2587 7008 -4885 140 4932 -4811 3336 7227 -4788 -78 2612
1477 2612 -3022 1491 2269 -673 2366 5400 5463 2591 1998 1048 -1661 3333 2292 -1807 3399 1400
1493 1400 943 6480 -761 -961 5286 131 3681 6239 -3759 -1150 1835 -3963 -576 1015 -2254
1508 -2254 1261 4973 2580 -1524 121 -604 -4431 2128 1153 -6079 2132 2854 -3304 4843 1063 -4988
1524 -4988 4392 3297 -120 3457 -657 -2200 1183 862 -439 -630 2040 3191 3067 4340 -1162 -3968
1540 -3968 788 -2238 -1315 1633 -3999 378 3627 -2421 528 -1396 -5957 1332 385 -3932 -1370
1555 -1370 -4278 -4887 -680 -1431 -2953 -2201 571 1175 -37 1984 -3820 -6155 1149 -2140 -4052 2478
1571 2478 -2832 -1320 6217 -208 -1909 1365 -1715 907 2847 -467 -1913 -2866 -720 -1066 -2847
$$ packed form
1462D12k862M143J889p483O488M421j1893N025M792r743Q147L891j2015M710K690
1477B612n634M513P78k942L039L034O3k872n93r50k709M994j041m099N206j999
1493A400m57N537p241k00O247n155L550K558r998K609K985n798L387J591l269
1508b254L515L712k393m104J645p25l827O559r75p232Q211P22o158Q147l780o051
1524d988R380j095l417L577m114j543L383l21j301j91K670J151j24J273n502k806
1540c968M756l026R23K948n632M377L249o048K949j924m561P289r47m317K562
1555a370k908o09M207p51j522P52K772O04j212K021n804k335P304l289j912O530
1571B478n310J512P537o425j701L274l080K622J940l314j446r53K146l46j781
$$ plain form
1586 -2847 -597 -1792 -259 4682 -36 -1490 -2409 -5265 -737 -2271 -5357 -1879 -4415 -3267 2712
1601 2712 -3390 -3728 386 -1923 970 2365 -2063 -3033 -2445 -837 -1986 -3307 -626 -1113 2058 7371
1617 7371 1403 92 2442 -1417 1607 2588 -3478 -68 1249 -44 3185 -453 -2062 1817 2538
1632 2538 3849 2481 -1289 -874 -2080 -577 -1237 -5097 -1402 512 799 4715 -165 -2749 1330 -755
1648 -755 480 841 -3671 -245 2054 581 2834 -744 -1510 3635 3170 3719 2919 -186 1767 1889 1792
1665 1792 1119 -1774 2407 4924 3653 5882 1083 -1646 3424 1101 312 2083 -2225 825 3928
1680 3928 829 541 -1136 -926 2599 2103 1444 -1109 -2621 1004 -100 -2094 -621 -3153 427 4866
1696 4866 1573 1584 -58 -1649 2629 873 -1170 291 -1836 1774 4237 -53 392 455 767 5122
$$ packed form
1586b847K250j195J533M941m718j454r19k856M528j534l086L478k536J148N979
1601B712o102l38M114k309K893J395m428r70N88J608j149j321K681m87L171N313
1617G371n968j311K350l859L024R81o066L410J317j293L229l638j609L879P21
1632B538J311j368l770M15j206J503o60l860L695J914K87L916m880k584M079k085
1648g55J235L61m512L426K299j473K253l578p66N145m65N49q00l105J953J22r7
1665A792o73k893M181K517j271K229m799k729N070k323p89J771m308L050L103
1680C928l099k88j677K10L525m96o59k553j512L625j104j994J473k532L580M439
1696D866l293J1j642j591M278j756k043J461k127L610K463m290M45O3L12M355
$$ plain form
1712 5122 3582 1647 760 -714 2063 101 -2794 -1326 -2384 1158 4734 13 -134 -8 -2125 1444
1728 1444 -275 -4415 -2333 -3007 -1600 285 -3533 -3375 -1389 385 2950 252 -312 -388 -2014 573
1744 573 -1673 -5749 -2067 -1582 -29 4528 33 -1062 1744 -2 1249 -201 -3324 -1131 -774 107
1760 107 146 -3967 -2572 37 311 2326 -419 -2032 -427 -1821 -1042 -2779 -6164 -1689 -766 -907 1892
1777 1892 -2026 -3193 725 -1277 -1108 -1395 -3751 -745 476 614 -549 -3497 -1233 613 -301 1664
1793 1664 -1138 -2287 1474 -551 -962 -550 -3827 682 3172 856 2189 -533 -2123 1430 -336
1808 -336 -1057 -766 -1047 1599 1685 1256 117 -2814 258 1700 -1803 927 -770 -3052 2190 564 -2205
1825 -2205 -317 -1102 918 3370 1458 746 -737 -170 1756 -595 -230 294 -589 3116 2898 0 774
$$ packed form
1712E122j540j935q87j474K777j962k895J468j058L542L576m721j47J26k117L569
1728A444j719m140K082o74J407J885l818J58J986J774K565k698n64p6j626K587
1744E73k246m076L682M85J553M557m495j095K806j746J251j450l123K193L57Q81
1760A07L9m113J395K609K74K015k745j613J605j394P79j737l385M475R23j41K799
1777A892l918j167L918k002J69k87k356L006J221J38j163k948K264J846r14J965
1793A664k802j149L761k025m11M12l277M509K490k316J333k722j590L553j766
1808c36p21K91k81K646Q6m29j139k931L072J442l503K730j697k282N242j626k769
1825b205J888p85K020K452j912p12j483N67J926k351L65N24q83L705k18k898P74
$$ plain form
1842 774 -862 992 3510 338 1903 1466 -294 3611 1129 -2610 458 163 665 3886 1022 61
1858 61 551 1394 1798 -168 547 84 -690 3767 1537 -2573 967 -583 -821 3957 701 -601 3181
1875 3181 1569 1713 1472 -1490 -700 500 1983 1769 -132 492 -137 287 2132 -1154 -706 2072 302
1892 302 2155 1519 -3290 -23 570 -1093 2502 131 -1648 2111 989 170 318 -1451 -647 1080
1908 1080 2033 137 -1558 6 -1117 -1171 1680 -2479 -1816 3518 1 897 2432 -3448 -1467 1517
1924 1517 -2563 -784 -298 -2363 -143 1110 -1007 -2058 -816 556 -529 1241 154 -3904 -954
1939 -954 -752 -4020 -228 -1505 -3126 3238 1321 -922 1406 -2091 -1926 1404 -1590 -2238 -465 -1318
1955 -1318 -517 305 -361 -2255 -603 1845 -788 405 1581 -3555 -660 1507 -4072 -1079 365 -3303
$$ packed form
1842G74j636J854K518l172J565m37j760L905k482l739L068k95N02L221k864r61
1858F1M90Q43M04j966P15m63p74M457k230m110L540j550k38M778l256j302L782
1875C181j612J44k41k962P90J200J483k14j901O24o29M24J845l286M48K778j770
1892C02J853o36m809L267N93j663L595k371j779L759j122q19J48j769Q04J727
1908A080R53j896j695J564j123n4K851m159O63N334l517Q96J535n880J981K984
1924A517m080J779M86k065K220J253k117j051J242J372j085J770j087m058K950
1939i54K02l268L792j277j621O364j917k243K328l497J65L330k994o48J773q53
1955a318Q01Q22o66j894J652K448k633J193J176n136K895K167n579K993J444l668
$$ plain form
1971 -3303 1735 1747 -3087 -630 -1288 -2995 177 -596 -2090 -888 335 -685 -1443 -570 -2420 -1962 2512
1988 2512 -312 -1440 2381 -1949 -937 3371 -2486 -1270 3153 -1179 1123 3131 -1916 -891 1304
2003 1304 -510 -103 1065 286 -579 2007 1842 -1748 296 505 -1917 2669 1528 -2225 1965 -92
2019 -92 -2527 1762 -1803 -2586 2431 134 -129 2607 -944 -1131 1647 172 -875 813 1100 -869
2035 -869 1192 2477 -2136 532 3713 -864 2904 4620 -1752 1385 3113 -2375 556 1228 -2029
2050 -2029 1806 2925 1234 2089 1834 869 658 1472 225 -1067 970 -510 -1430 1093 -1535 -1514 2912
2067 2912 -140 886 3529 -1755 -349 1433 -3245 -1627 460 -2249 759 2660 232 523 2457
2082 2457 1131 -190 1908 1274 -1539 1966 1245 -2158 1540 383 -2340 3075 1661 -711 3480
$$ packed form
1971c303N038J2m834K457o58j707L172p73j494J202J223j020p58Q73j850M58M474
1988B512k824j128L821m330J012M308n857J216M423m332K302K008n047J025K195
2003A304j814M07J168p79q65K586j65l590K044K09k422M586j141l753M190k057
2019i2k435M289l565p83N017k297k63K736l551j87K778j475j047J688K87j969
2035h69K061J285m613K668L181m577L768J716o372L137J728n488K931O72l257
2050b029L835J119j691Q55k55r65k11Q14j247j292K037j480r20K523k628K1M426
2067B912l052J026K643n284J406J782m678J618K087k709L008J901k428K91J934
2082B457j326j321K098o34k813L505p21l403L698j157k723N415j414k372M191
$$ plain form
2097 3480 766 -1190 1109 -1406 -2506 -139 -457 -537 35 -11 -1349 -884 311 -1466 -977 862 -1870
2114 -1870 -812 416 -3582 -1199 164 -3283 419 943 -1619 1652 732 -1530 455 -272 -1485 154
2130 154 258 -157 23 698 -115 -850 1061 -439 -1236 1774 -590 -1279 1627 -2276 -1996 747 -2113
2147 -2113 -725 1327 -1145 268 126 -2090 -1469 -1613 -1988 -1363 -1058 -249 -911 97 120 -1597 291
2164 291 37 -1887 927 -684 -2596 759 -1307 -1840 1513 -165 123 2827 971 928 791 -889 -890
2181 -890 -990 -471 -633 -785 1302 450 199 1676 -634 -91 1403 -738 67 42 -2135 -514 -992 -1795
2199 -1795 640 -96 348 2348 636 339 168 -1309 -329 -637 -373 -244 -567 1438 810 122 1885 -122
2217 -122 203 2446 416 655 916 -1101 264 644 -766 663 670 1221 2675 1148 1263 654 -269 942
$$ packed form
2097C480k714j956K299k515j100K367l18q0N72m6j338M65J195j777M89J839k732
2114a870J058J228l998K383J363l447L702N24k562L271r20k262J985p27j213J639
2130A54J04m15J80O75q13p35J911j500p97L010k364o89K906l903K80K743k860
2147b113J388K052k472J413j42k216O21j44l75O25L05Q09o62J008K3j717J888
2164B91k54j924K814j611j912L355k066n33L353j678K88K704j856m3j37j680j
2181h90j00N19j62j52K087q52k51J477k310N43J494k141Q05k5k177J621m78q03
2199a795K435p36M44K000j712k97j71j477R80l08K64J29l23K005o28o88J763k007
2217a22L25K243k030K39K61k017J365L80j410J429PN51J454j527J15o09r23J211
$$ plain form
2235 942 -20 -467 540 -636 727 834 -1104 408 -152 -214 1919 345 -113 547 -1024 -217 -107 -1638
2253 -1638 -56 -92 501 1903 257 439 707 -165 715 156 -593 767 379 889 1189 -798 277 663
2271 663 266 2321 431 -54 1177 -524 -67 -150 -1561 54 591 383 1315 -549 -943 -393 -1288 -303
2289 -303 -826 -1628 207 318 160 671 -779 -136 700 71 1076 -621 -1211 596 -909 -297 -205 -1679
2307 -1679 439 1653 402 1041 -289 -998 334 -898 -987 -1019 -1598 474 523 -130 252 -1345 -90 710
2325 710 -312 402 -610 -1272 673 -783 -1187 -594 -1582 571 1300 -245 162 -710 -1120 560 -339 -818
2343 -818 -256 -830 625 129 -539 -540 -1549 -242 993 -644 210 -65 -402 979 -646 -1473 -164 -1277
2361 -1277 469 1595 -895 -215 230 -370 1321 345 -249 370 436 942 136 -1149 -828 -1118 -61 1247
$$ packed form
2235I42r62m47J007j176J363J07j938J512n60o2K133j574m58O60j571Q07J10j531
2253a638J582l6N93J402j646J82K68q72Q80n59p49J360l88N10L00j987J075L86
2271F63l97K055j890m85J231j701M57q3j411J615N37k08R32j864l94N50q95R85
2289c03n23q02J835J11j58N11j450O43Q36o29J005j697n90J807j505O12R2j474
2307a679K118J214j251O39j330p09J332j232q9l2n79K072M9o53L82j597J255Q00
2325G10j022P14j012o62J945j456m04N93r88K153P29j545M07q72m10J680q99m79
2343h18N62n74J455m96o68jj009J307J235j637Q54k75l37J381j625q27J309j113
2361a277J746J126k490O80M45o00J691r76n94O19O6N06q06j285L21k90J057J308
$$ plain form
2379 1247 -522 55 525 -174 1279 -377 -1829 -312 -446 10 1038 -861 -212 625 16 897 444
2396 444 -325 794 924 1351 199 -946 -171 -399 228 1208 -863 -48 1242 -181 1129 -186 -1713
2413 -1713 757 324 210 1378 -848 -403 655 -193 43 -219 -760 1052 971 710 282 -1065 464 348
2431 348 308 858 -777 -107 1504 -195 240 6 -1596 912 1332 146 944 -448 -477 525 -315 -544
2449 -544 -838 -845 879 350 327 -402 -1163 805 720 226 1108 -766 -146 1889 -547 -276 104 -1427 890
2468 890 1268 -789 174 -97 -445 752 116 -636 -804 279 815 151 53 -659 -1688 661 590 -1009 582
2487 582 -293 -416 2075 -200 -1447 -4 -1164 78 1190 -1049 -715 -124 -398 455 -215 -397 -300 654
2505 654 1481 34 -223 -404 -1451 738 495 -1773 314 152 -519 1677 -324 -1720 552 272 115
$$ packed form
2379A247j769N77M70o99J453j656j452J517j34M56J028j899O49Q37o09Q81m53
2396D44p69J119J30M27j152j145P75k28O27R80k071Q15J290j423J310j315j527
2413a713K470m33j14J168k226M45J058q48K36k62n41J812q1k61m28j347J529j16
2431C48m0N50j635O70J611j699M35k34j602K508M20j186P98j392k9J002q40k29
2449e44k94pJ724n29k3p29p61J968q5m94Q82j874O20K035k436K71L80j531K317
2468H90L78k057R63k71l48J197o36p52j68J083N36o64r8p12j029K349p1j599J591
2487E82q75j23K491k275j247J443j160J242J112k239L34N91k74Q53o70j82R7R54
2505F54Q27j447k57j81j047K189k43k268K087j62o71K196k001j396K272k80j57
$$ plain form
2522 115 898 -622 -887 31 466 -234 -803 -278 -64 523 2040 -531 -912 789 -905 -47 819 -1980
2540 -1980 -701 980 -911 230 -72 -1654 880 1216 569 695 -306 -135 211 83 -527 -1522 -144
2557 -144 227 451 1730 -286 -634 1127 -164 -258 748 -1926 -769 1265 -1045 -588 102 -921 589
2574 589 1535 479 -43 108 245 -446 -189 -441 -2022 97 1463 174 732 428 -1433 1227 428 -1308
2592 -1308 551 -784 -758 1504 -371 -984 137 -295 641 1305 173 -520 -382 769 -479 -783 -246
2609 -246 -1200 492 2360 -327 164 987 -1547 714 993 -1555 -83 228 -101 1280 483 -853 -129
2626 -129 515 756 45 63 -436 -924 500 -347 -1701 -3 -449 57 2147 -277 -764 1352 -577 153
2644 153 927 -1783 -465 747 66 187 -164 -324 -40 631 1092 52 -343 500 -874 170 34 -2251
$$ packed form
2522A15P83j520k65R18M35p00n69N25K14N87J517k571l81J701j694Q58Q66k799
2540a980J279J681j891J141l02j582K534L36o47J26j001J71L46j28o10r95J378
2557a44L71K24J279k016l48J761j291r4J006k674J157K034k310M57O90j023J510
2574E89R46j056n22J51J37o91K57k52j581K119J366j289N58l04j861K660p99j736
2592a308J859j335K6K262j875o13J121m32R36O64j132o93J38J151j248l04N37
2609b46r54J692J868k687M91Q23k534K261K79k548J472L11l29J381p97j336P24
2626a29O44K41p11J8m99m88J424q47j354J698m46N06K090k424m87K116j929P30
2644A53P74k710J318J212o81J21l51j60K84O71M61j040l95Q43j374J044j36k285
$$ plain form
2662 -2251 -157 314 -176 1598 364 -946 1358 426 -69 618 -993 -773 352 -102 -356 -738 -448
2679 -448 -75 675 1519 19 -226 1130 -345 -420 -106 -2410 -525 1088 -536 573 707 -732 1124
2696 1124 693 -270 40 -389 -175 -82 -100 -240 -1164 108 1021 257 1046 643 -237 1373 178 -872 154
2715 154 -1151 -44 1311 -269 132 463 -468 582 516 -461 -377 -321 142 272 -333 -400 -820 -190 1218
2734 1218 -406 583 624 -884 619 382 -1486 -194 -405 -399 1146 377 -182 537 -99 462 127 -302 85
2753 85 -185 616 684 -617 24 -273 -276 1284 17 -235 594 -425 364 527 -1388 -311 -93 -90 781 29
2773 29 -321 346 -156 440 -322 -613 121 -355 214 346 -1374 -215 95 -459 1155 420 -850 1018 -15
2792 -15 -159 -15 -1600 -598 -94 -15 182 -405 -79 520 8 817 161 -693 408 61 -471 1 -1505
$$ packed form
2662b251K094M71m90J774j234j310K304r32m95O87j611K20J125m54k54l82K90
2679d48L73P50Q44j500k45J356j475p5L14k304J885J613j624J109J34j439J856
2696A124m31r63L10m29K14R3j8j40r24J272R13p64P89m03q80J610j195j050J026
2715A54j305J107J355j580M01L31r31J050o6r77Q4N6M63J30o05o7m20O30J408
2734A218j624R89M1j508J503k37j868J292k11OJ545p69n59P19o36N61l35m29L87
2753H5k70Q01O8j301O41k97lJ560j267k52Q29j019P89J63j915J077K18LQ71p52
2773B9l50O67n02N96p62k91P34m76N69J32j720J159L10n54J614p35j270J868j033
2792a5j44J44j585J002N04P9J97n87L26N99n12Q09o56q54J101l47n32M72j506
$$ plain form
2811 -1505 -913 228 -483 516 170 -184 891 211 -458 -182 -1056 -287 -119 -465 17 -601 -377 378 -648
2830 -648 568 263 -823 912 288 -818 439 -826 -817 421 -367 -44 249 120 603 139 -154 -178 -684
2849 -684 414 396 -427 563 -220 -574 726 -203 -327 489 -384 551 681 -437 168 -534 -385 620 -272
2868 -272 -145 203 -417 489 6 -565 -84 -644 293 511 -249 523 146 -704 892 -469 -256 1140 -281
2887 -281 389 1172 -301 253 312 -51 474 -89 256 406 -70 702 -238 -357 504 -443 23 744 -694 290
2907 290 520 -472 449 -99 -486 666 336 291 432 -531 124 4 152 729 201 539 955 37 644 -131
2927 -131 -443 475 -149 -163 710 -316 217 677 -432 476 31 -559 490 181 -377 164 -353 -394 -356 -253
2947 -253 391 10 565 672 -319 381 193 -736 288 -37 -493 637 -212 -231 494 -831 -173 357 -410
$$ packed form
2811a505N92J141p11R99l46l54J075o80o69K76q74P69J68l46M82o18K24P55j026
2830f48J216l05j086J735o24j106J257j265RJ238p88L23K93j29M83m64k93k4n06
2849f84J098j8q23R90p83l54J300r29j24Q16q73R35J30j118O05p02J49J005q92
2868b72J27L48o20R06m83n71M81n60R37K18p60P72l77q50J596j361K13J396j421
2887b81O70P83j473N54N9l63N25n63L45J50m76P72r40j19Q61r47M66P21j438R84
2907B90K30r92R21n48l87J152l30m5J41r63O55j20J48N77n28L38M16r18O07p75
2927a31l12R18o24j4Q73j026N33M60j109R08m45n90J049l09n58N41n17m1L8J03
2947b53O44l81N55J07r91P00j88r29J024l25m56J130q49j9P25j325O58N30p67
$$ plain form
2966 -410 319 -168 -282 177 -578 -155 -359 -601 177 -174 -14 462 -751 27 -110 -814 475 58 -446
2985 -446 942 17 -779 142 -842 -792 93 -500 15 275 -245 242 -317 91 -203 -422 404 -519 -534 155
3005 155 -752 -451 369 -921 -278 348 -461 827 299 -655 197 -650 -434 1 -588 104 -34 -135 315
3024 315 -188 -104 117 -169 309 97 -495 22 -657 -661 229 -606 -179 597 -233 808 586 -670 605 18
3044 18 -94 183 -148 212 516 255 572 -72 285 780 -308 629 388 -527 299 -248 -498 528 -563
3063 -563 41 531 63 371 302 -585 -51 54 -318 364 -330 191 93 71 217 -216 13 513 36 486 359
3084 359 -412 550 427 -220 723 59 389 1177 572 121 463 -267 368 57 78 94 -85 516 732 -104 598
3105 598 -12 -304 916 -25 -35 204 -671 67 -58 -633 262 106 47 1260 396 6 169 -597 -335 -426
$$ packed form
2966d10P29m87j14M59p55M23k04k42P78l51J60M76j213P78j37p04J289m17n04
2985d46J388r25p96R21r84N0Q85n93N15K60n20M87n59M08k94k19Q26r23j5O89
3005A55r07L01Q20j290O43O26q09J288n28r54Q52q47K16M35n89O92j38j01M50
3024C15n03Q4K21k86M78k12n92N17o79mQ90q35M27P76q30J041k22j256J275n87
3044A8j12K77l31L60L04k61L17o44L57M95j088R37k41r15Q26n47k50J026j091
3063e63O04M90m68L08o9q87N34J05l72O82o94N21r8k2J46m33K29N00m77M50j27
3084C59p71R62j23o47R43o64L30P88o05m51L42p30O35l11K1J6j79O01K16q36P02
3105E98o10k92J220r41j0K39q75P38j25n75Q95j56n9J213q64l90J63p66K62r1
$$ plain form
3125 -426 -678 -324 -378 289 734 2 479 41 25 1021 -34 -565 250 -294 -270 288 -807 -42 548 431
3145 431 837 285 23 -9 -506 -487 -409 -921 -267 -491 -129 330 -553 -264 30 -434 316 -306 -709 114 -578
3166 -578 -179 54 -991 -146 254 -118 423 105 -224 13 -96 166 -292 -663 212 -70 -73 222 -798 -87
3186 -87 613 -505 388 268 -733 167 -322 -539 -229 -781 -351 -21 -258 236 -599 -853 232 -529 -69
3205 -69 -117 -833 163 165 -294 134 -849 -45 625 -562 100 29 -746 109 178 -854 4 -134 7 650 369
3226 369 410 -93 359 697 -230 -120 -158 -506 525 598 -462 460 100 -24 718 7 -39 90 -624 -158 -180
3247 -180 -956 -280 -458 350 946 -198 436 258 -113 509 -284 -594 -34 -335 454 559 -230 424 417 443 1312
3268 1312 536 89 537 319 523 102 -467 262 143 808 849 -8 522 497 84 394 -116 -566 123 -56
$$ packed form
3125d26k52L54n4O67M45p32M77m38j6R96j055n31Q15n44K4N58j095P65N90j17
3145D31M06n52k62l2m97J9P8n12O54k24L62M59q83K89K94m64P50o22m03Q23o92
3166e78L99K33j045Q45M00l72N41l18l29K37j09K62m58l71Q75k82lK95j020P11
3186h7P00j118Q93j20j001R00m89k17L10n52M30L30k37M94q35k54J085p61M60
3205f9m8p16R96Km59M28r83Q04O70j187O62p1p75Q55O9j032Q58j38J41O43k81
3226C69M1n03M52L38r27J10l8l48J031P3j060R22l60j24P42p11m6J29p14M66k2
3247a80p76O76j78Q08N96j144O34j78l71O22p93l10N60l01P89J05p89O54pK6Q69
3268A312p76m47M48k18K04m21n69P29j19O65M1q57N30k5m13L10n10m50O89j79
$$ plain form
3288 -56 111 36 -666 -23 275 -122 437 303 -73 380 -45 135 -289 -755 312 129 -17 513 -196 196
3308 196 560 -14 575 354 -199 500 86 -162 270 -361 -89 306 206 289 -71 135 495 -98 179 -62
3328 -62 -743 202 17 -530 367 -596 -199 453 -576 -396 -240 -473 177 81 -62 -71 -473 -166 369 -198 233
3349 233 -127 -319 561 -188 -342 -200 -727 224 391 -192 440 31 -193 358 -300 -324 35 -545 144 -109
3369 -109 -266 -21 -378 33 369 -612 141 55 -438 121 -425 -628 -207 -624 -165 334 -287 105 -192 -290 274
3390 274 -692 -368 -197 -387 50 -34 -350 20 -306 25 474 -583 3 4 -517 454 -228 -898 200 -302
3410 -302 310 421 -106 -37 58 -180 374 -104 -297 -41 -75 403 210 -463 -6 -270 -228 517 -253 121 887
3431 887 -35 330 178 -409 89 276 -50 345 -238 28 301 148 297 -95 102 411 130 515 363 -806
$$ packed form
3288e6J67p5p02O43K98l97N59j34l76M53m25J80m24m66J067j83j46N30p09L92
3308A96L64n74N89k21n53O99m14k48M32o31K72L95j00Q3l60K06L60n93K77k41
3328f2o81R45j85n47Q97r63L97O52j029J80J56k33O50r6j43rm02L07N35n67M31
3349B33l60j92Q80p49j54J42n27R51J67n83O32m09k24N51o58k4L59n80O89k53
3369a09j57K45l57M11L36r81P53q6m93N59n46k03M21m17M59M99o21L92k97r8N64
3390B74r66L24J71j90M37q4l16L70l26L31M49j057N86Jn21R71o82o70J098n02
3410c02O12J11n27O9R5k38N54m78j93K56l4M78j93o73M57k64M2P45p70L74P66
3431H87r22L65j52n87M98J87l26L95n83K66K73j53J49l92J97L09k81L85j52j169
$$ plain form
3451 -806 67 194 -456 406 -30 -312 724 48 451 279 -290 403 429 160 6 -64 87 262 -40 204
3471 204 -66 -147 670 239 392 513 -113 442 484 -262 512 -156 -149 644 83 -228 183 80 266 542 152
3492 152 111 -238 -58 193 -130 -61 -327 -221 639 3 -61 450 -335 201 306 -510 156 -11 30 426 -17
3513 -17 -247 -82 105 485 316 34 504 -190 141 -27 -575 -221 -274 -463 585 -156 -460 10 -337 -99
3533 -99 189 -595 -182 57 -304 230 -358 -428 -289 -164 285 371 -331 30 -358 -9 199 -430 -185 303 -93
3554 -93 487 108 -441 183 0 -405 0 -357 -175 272 7 -70 -229 -117 149 126 106 43 -516 -33 -58 -232
3576 -232 -137 -608 -370 521 -157 607 51 -479 167 38 -599 155 -644 -251 77 -295 -185 -249 -118 172 169
3597 169 228 371 -107 173 -16 -456 57 -401 -315 570 131 598 543 -187 605 273 17 115 -137 204 -80
$$ packed form
3451h06Q73J27o50Q62m36k82J036o76M03j72n69O93K6k69j54p0J51J75l02K44
3471B04k70q1Q17m31J53J21o26N55M2p46P74o68PP93n61l11M11j03J86K76l90
3492A52m1l49J80K51l23O9k66J06Q60o36o4N11p85N36J05q16O66j67M1L96m43
3513a7k30J65J87L80j69k82M70o94L31j68n48L54n3j89J048p41l04M70l47K38
3533i9K88p84M13K39l61N34n88p0J39J25M49Q6p02L61l88L49K08o29K45M88l96
3554i3N80l79n49O24j83m05M05l57J82M47k65p7j59J12K66k3k0o3n59M83k5j74
3576b32R5m71K38Q91o78P64n56n30O46j29o37P54p99L93L28l72J10o4J31K90l
3597A69N9J43m78K80j89m40N13m58Q6Q85m39M67n5p30P92l32k56R8k52L41k84
$$ plain form
3618 -80 -490 -50 -174 -273 291 231 -3 384 -129 77 94 -703 -381 -181 -320 392 -4 -105 651 -44 248
3639 248 295 -145 467 164 105 311 -176 126 379 50 670 275 314 588 93 244 254 -287 251 305 45 487
3661 487 29 -9 435 -131 41 112 -58 121 -105 -206 379 -411 -57 103 -161 440 29 86 190 -243 -209
3682 -209 -44 -378 126 18 34 548 158 -51 361 -214 15 213 98 380 194 135 174 -168 159 81 -95
3703 -95 51 463 -87 129 -96 -237 -8 -662 -161 49 -375 51 192 -94 218 -163 10 73 -385 -125 -40
3724 -40 -265 -93 -229 -307 55 -110 72 220 47 56 -121 -141 134 -397 -588 -98 -248 162 -150 -116 243 -266
3746 -266 -103 423 -176 119 134 -350 -58 -491 -499 -31 -266 161 196 -231 206 -221 -401 -173 -659 -573 -298 -372
3768 -372 86 197 -201 238 -69 -182 431 21 68 33 -225 -31 -188 -266 145 -35 302 293 40 269 149 -291
$$ packed form
3618h0m10M40j24r9N64o0k34L87n13K06J7p97L22K00j39P12l96j01P56o95K92
3639B48M7m40O12l03n9K06m87L02K53l29O20l95L9K74m95J51J0n41N38N4k60M42
3661D87m58l8M44n66J72P1j70J79k26j01N85p90L54J60k64O01m11N7J04m33L4
3682b09J65l34N04j08J6N14l90k09M12n75K29J98j15K82j86n9L9l42L27p8j76
3703i5J46M12n50K16k25j41K29o54N01K10m24M26J41k86L12l81J73O3m58K60Q5
3724d0k25J72j36p8L62j65J82J48j73Rj77k0K75n31j91M90j50M10l12L4L59n09
3746b66J63N26n99K95J5m84K92m33qM68k35M27L5m27M37m27j80K28m86Q6K75p4
3768c72M58J11l98M39l07j13O13m10M7l5k58J94j57p8M11j80L37rk53K29j20m40
$$ plain form
3790 -291 353 -279 -134 388 7 -115 176 -168 122 201 -197 175 -86 -134 252 -275 115 -100 -327 214 -92
3811 -92 164 100 -225 121 146 -213 158 21 -2 618 73 129 415 -14 33 488 46 85 166 -11 424 -160 -32
3834 -32 84 -72 179 -30 -295 275 -258 208 78 -266 -171 -20 -53 358 -23 34 221 -106 -119 278 62 84
3856 84 92 -203 474 -288 -14 -181 -242 386 289 90 310 229 47 503 -550 31 47 -479 182 -1 -238 235
3878 235 -52 -112 302 -174 238 69 12 116 -120 -316 -24 -332 498 129 -99 267 121 -266 263 -224 -219
3899 -219 -77 -145 184 264 -221 -173 -233 -26 101 26 248 148 -65 59 -347 -75 28 -248 -34 32 -439 161
3921 161 -6 -361 301 -225 -115 323 -59 29 175 -450 -161 -207 -192 -177 -135 -200 197 46 158 -213 -189 67
3943 67 -317 1 17 -598 321 -32 -326 252 -203 -195 127 -146 167 -155 -283 -201 94 110 -25 -174 80 -116
$$ packed form
3790b91O44o32J45N22l81j22K91l44K90P9l98L72k61m8L86n27L90k15k27N41l06
3811i2K56o4l25L46K5l59L71j37k3O20n45N6K86m29M7M55m42L9Q1j77M35n84J28
3834c2J16j56K51k09k65N70n33M66j30l44R5J51l3M11l81N7J87l27j3L97k16K2
3856H4Qk95O77p62K74j67o1O28r7j99K20q1j82M56j053N81J6n26O61j83k37M73
3878B35k87o0M14m76M12j69n7J04k36j96K92l08Q30l69k28L66j46l87N29m87N
3899b19J42o8L29Q0m85M8o0K07J27p5K22j00k13J24m06K72J03k76K14O6m71O00
3921A61j67l55O62n26J10M38l82Q8J46o25K89m6J5J5M2o5L97j51J12l71K4K56
3943F7l84L18J6o15R19l53k94N78m55QL22k73L13l22j28Q2K95J6j35j49K54j96
$$ plain form
3965 -116 -415 185 -25 -414 281 -121 -51 394 -117 95 162 -388 -237 -219 -245 181 19 -119 -170 -99 112 -52
3987 -52 197 146 -236 -48 123 -243 110 -35 -315 309 145 -185 365 -57 -164 317 -232 -119 -220 -400 175
4008 175 -30 -66 -21 -35 24 193 200 19 -72 -171 498 -79 119 23 -280 272 317 -191 334 -76 -76 466 -175 244
4032 244 -30 25 303 -84 -163 116 -501 133 192 19 408 7 -164 664 -332 -53 396 -284 253 167 -320
4053 -320 -59 -339 -199 70 -182 -85 368 105 400 183 -122 -272 -172 67 25 -507 56 96 -192 707 -174
4074 -174 -81 373 -122 107 152 -305 50 -245 -337 88 -267 -128 52 -221 243 72 111 -36 -340 -18 -3 -403
4096 -403 114 75 -320 226 -80 -366 267 -92 -14 199 -308 -16 245 22 -13 -155 -146 244 23 223 -84 -413
4118 -413 -54 -28 -37 167 -404 -74 160 -218 78 -9 -416 371 -91 -73 81 -125 -35 -52 -84 93 -398 111 168
$$ packed form
3965a16k99O00k10l89O95m02P0M45n11K12O7n50J51J8k6M26j62j38n1P1K11j64
3987e2K49n1l82J88J71l66L53j45k80O24j64l30N50m22j07M81n49J13j01j80N75
4008A75k05l6M5j4N9J69Pj81r1r9O69n77J98r6l03N52M5n08N25m10%N42o41M19
4032B44k74N5K78l87p9K79o17O34N9j73L89m01j71Q28r96K79M49o80N37q6m87
4053c20K61k80J40K69k52R7M53k63K95k17l05j50J00K39m2n32N63M0k88Q99q81
4074a74R3M54m95K29M5m57L55k95r2M25l55J39J80k73M64j71L9j47l04L22J5m00
4096d03N17l9l95N46l06k86O33l59P8K13n07K92K61k23l5j42RL90k21K00l07l29
4118d13L59K6rK04n71L30K34l78K96q7m07P87m62J8J54k06R0j7l2J77m91N09N7
$$ plain form
4141 168 -85 21 112 -114 288 -28 -163 -8 -234 104 281 -170 -231 36 -281 347 -4 -11 -30 -266 125 47
4163 47 -21 119 26 205 518 -62 -114 236 -257 195 -235 -387 105 -10 -165 302 -294 -58 144 70 295 -17
4185 -17 -264 -42 -188 -36 162 -253 165 100 27 433 -7 -127 210 23 315 214 -543 30 241 70 199
4206 199 -410 -72 297 23 279 -36 -47 142 148 78 -136 -452 -82 70 -194 306 -7 8 213 25 43 72
4228 72 -248 -28 -35 -93 132 -315 -208 105 -70 214 357 90 196 17 -319 24 -315 41 41 -43 100 50 173
4251 173 429 4 21 133 -131 116 173 -153 72 -210 -177 292 209 259 61 105 268 39 -297 137 -386 -19
4273 -19 117 -255 20 162 -146 419 -62 -6 20 -99 -17 -44 -360 106 -110 -150 250 138 -58 215 -164 4
4295 4 122 -438 -1 -126 97 343 131 -93 303 56 310 -89 -165 145 -60 25 115 -181 -49 200 -145 262
$$ packed form
4141A68k53J06R1k26M02l16j35J55k26L38J77m51o1K67l17O28l51pj9k36L91p8
4163D7o8J40r3J79L13n80n2L50m93M52m30j52M92j15j55M67n96K36K02p4K25l12
4185a7k47K22j46J52J98m15M18o5p3M06m40j20L37j87K92j01p57N73K11j71J29
4206A99o09L38L69k74K56l15j1J89Op0k14l16L70J52k64N00l13J5K05j88J8K9
4228G2l20K20pn8K25m47J07L13j75K84J43k67J06j79l36L43l39L56%q4J43n0J23
4251A73K56m25J7J12k64K47N7l26K25k82L3M69q3N0j98M4J63k29l36M34n23L67
4273a9J36l72K75J42l08N65m81N6K6j19Q2k7l16M66k16m0M00j12j96K73l79J68
4295DJ18n60M37j25K23K46k12k24L96k47K54l99p6L10k05Q5R0k96J32K49l45M07
$$ plain form
4317 262 -15 -82 164 16 -100 -221 -199 -2 -11 148 335 53 205 70 50 56 -7 -53 311 -97 -39 -7 -401 67
4341 67 -15 -38 426 254 37 272 -56 -70 4 -319 -198 40 -198 226 -334 88 342 -90 124 -149 -84 204
4363 204 21 -243 180 -573 -104 35 -126 315 63 -108 132 -13 -57 297 18 60 -21 -169 89 -408 -84
4384 -84 198 -243 42 110 -80 226 -129 -115 144 -137 -161 -45 -341 -103 171 -114 129 -9 -256 -52 -135 129
4406 129 -107 -275 99 -122 -181 499 -371 25 -27 -205 170 63 -166 58 -203 2 143 42 -29 -46 -193
4427 -193 146 39 14 -134 -190 73 194 -159 197 76 -91 55 -190 -41 -11 -231 188 67 -90 162 77
4448 77 -84 298 -129 -49 368 7 227 -216 -241 -91 -252 181 232 -156 103 9 27 67 -210 -171 199 -251 -41
4471 -41 175 -148 6 93 -98 355 75 -166 229 -200 221 -48 -338 177 -29 -41 65 -328 -146 268 -17
$$ packed form
4317B62k77o7K46j48j16j21K2J97rJ59J87k82J52j35k0Oo3m6L64m08N8L2l94M68
4341F7q2k3M64j72k17K35l28j4P4l23J21K38k38M24n60M22K54m32K14k73O5K88
4363B04j83k64M23p53M69J39j61M41k52j71K40j45m4L54k79M2q1j48K58m97L24
4384h4K82m41K85O8j90L06l55J4K59k81k4J16k96K38K74k85K43j38k47K04q3K64
4406A29k36j68L74k21n9O80q70L96n2j78L75j07k29K24k61K05J41j01p1j7j47
4427a93L39j07k5j48n6K63J21l53L56j21j67J46k45J49L0k20M19j21j57K52q5
4448G7j61L82m27Q0M17l61K20m43k5J50j61M33N1l88K59r4J8M0k77L9L70m50K10
4471d1K16l23J54Q7j91M53k80k41L95m29M21k69k90N15k06j2J06l93J82M14k85
$$ plain form
4492 -17 -127 -92 -132 83 -23 -53 72 -183 -149 -53 -261 313 39 11 389 33 7 -3 -192 224 -222 -195 479
4515 479 -347 134 332 -264 185 243 -276 50 -17 -142 162 51 185 185 -46 397 -66 -36 121 -36 261 -217
4537 -217 -141 -46 100 185 68 -128 26 -147 -511 -91 -64 -204 131 51 -117 33 26 54 68 -307 35 -157 22
4560 22 173 -145 -217 5 -136 95 -89 -201 240 -78 93 106 8 -43 -43 -184 26 177 201 75 167 22 103
4583 103 75 121 65 -111 -162 -291 -253 39 -297 42 173 -335 304 -127 -52 306 -208 -156 101 -28 -183 156
4605 156 -46 -37 -61 -68 173 -287 -120 -71 13 277 -98 -213 152 -117 -130 -42 -387 72 -53 -170 54 147 -123
4628 -123 58 16 -15 63 -186 8 -58 88 -59 -260 38 -34 -76 -29 -240 3 123 -66 -100 172 -164 17 180
4651 180 -124 -74 -22 -107 309 -12 278 112 117 159 -85 -151 -25 4 -25 253 15 -181 14 -44 227 -26 -41 262
$$ packed form
4492a7j10L5m0K15j06l0J25k55L4R6k08N74k74k8L78l56k6j0j89M16m46K7O74
4515D79q26M81J98n96M49N8n19L26o7j25L04j11J34%k31M43m63L0J57j57K97m78
4537b17P6R5J46Q5j17j96J54j73l64M20K7j40L35q0j68J50pK8J4l75L42j92J79
4560B2J51l18p2K22j41K31j84j12M41l18J71J3r8n1%j41K10J51K4j26R2j45Q1
4583A03k8M6n6j76n1j29L8K92l36L39J31n08O39m31P5L58n14N2K57j29j55L39
4605A56k02Rk4pK41m60J67M9Q4K64l75j15L65k69j3Q8l45M59j25j17K24R3k70
4628a23J81m2l1P8k49J94o6J46j47k01K98p2m2M7k11K43J20j89l4K72l36J81J63
4651A80l04N0N2q5M16l21K90j66NM2k44o6J26K9k9K78k38j96J95n8K71k53j5L03
$$ plain form
4675 262 -143 -13 -6 60 141 -277 -59 2 -60 -105 -108 -252 -19 -102 142 236 -262 46 224 -28 143 121 -274 -11
4699 -11 -53 -21 237 200 -35 85 -55 171 -95 59 26 9 -248 48 22 -1 -184 115 108 1 -174 242 -36
4722 -36 -43 71 -326 -7 283 -338 122 108 -254 307 101 -99 -146 -142 223 -259 46 235 -3 20 100 0 104
4745 104 108 -35 17 -149 -126 275 -82 -4 74 -110 -34 -232 -16 21 -229 -235 9 -146 -1 41 -59 77 -48 -26
4769 -26 61 -160 -35 214 -89 31 -155 -146 14 -95 -54 239 -157 62 -106 -45 81 -301 -210 13 -214 70
4791 70 131 -33 -98 254 40 195 18 51 21 -10 -104 -196 -251 -77 132 73 0 -340 -85 76 -145 70 -125 -201
4815 -201 54 -261 239 13 26 167 -13 38 -85 -96 -151 6 -177 355 -22 -200 60 -162 -121 58 232 -186
4837 -186 246 -253 67 22 61 -36 146 -136 -106 -69 30 -217 -113 44 -51 -5 -15 66 -28 -32 -19 -34 223 -52 325
$$ packed form
4675B62m05J30PO6Q1m18K18O1o2m5lj44K33q3K44R4m98L08J78k52J71k2l95K63
4699a1m2L2K58l7k35J20j40K26k66J54l3j7k57K96k6k3j83K99pj07j75M16k78
4722c6pJ14l97L19K90o21M60j4l62N61k06k00m7ML65m82L05J89k38K3Q0j00J04
4745A04Mj43N2j66K3M01l57P8P8j84P6j98K16L7k50oK44j55J45M2j00J36j25K2
4769b6Q7k21J25K49l03J20j86RJ60j09M1K93l96K19j68O1J26l82R1K23k27K84
4791G0O1j64o5L52k14J55j77L3l0l1r4r2n5J74K09n9p3l40K55J61k21K15j95p6
4815b01K55l15N00k26J3J41j80N1j23j1n5J57j83N32l77j78K60k22M1J79J74m18
4837a86M32m99L20m5L9r7J82k82L0L7R9k47J04J57r5M6j0Q1r4mJ3j5K57k75L77
$$ plain form
4862 325 -205 34 147 -13 -115 5 -60 153 -252 151 31 -140 -63 244 81 388 -89 231 281 8 8 24
4884 24 -40 163 -2 -257 -82 27 -40 42 45 -60 -49 -352 217 64 -86 86 -91 7 178 -185 -29 -241 -101
4907 -101 37 124 -5 109 -162 308 27 -142 91 -33 41 279 102 97 148 159 101 37 -199 15 -73 -1 182
4930 182 -318 -64 25 -7 300 -50 -320 -117 37 122 -5 -379 187 232 -144 161 -156 -69 106 -13 -131 -8
4952 -8 -204 66 84 139 88 24 11 -78 -165 52 230 -376 126 -22 -2 -170 -103 62 -219 -137 -14 -164 16 174
4976 174 -61 49 34 -180 -78 -98 41 -3 -181 -51 153 -107 86 -23 -201 49 212 -139 -158 -91 -149 212
4998 212 -97 -16 -51 -146 38 55 -217 27 8 -59 -46 -150 -112 126 -74 346 -166 -146 161 265 22 -320 -134
5021 -134 -51 -84 -101 54 15 -79 89 39 -32 -208 -2 -53 -101 119 -12 -316 135 46 -191 78 -20 119 -66 -23
$$ packed form
4862C25n30K39J13j60j02J20o5K13m05M03j20j71P7L07j63L07m77L20N0k73%J6
4884B4o4K03j65k55J75J09o7Q2Lj05J1l03N69j53j50J72j77R8J71l63J56k12J40
4907a01J38Q7j29J14k71M70k81j69K33j24P4K38j77nN1J1n8o4k36K14q8P2J83
4930A82n00K54Q9l2L07l50k70K03J54Q5j27l74N66M5l76L05l17Q7J75j19j18J23
4952hj96K70J8N5n1o4j3q9q7K17J78o06N02j48K0j68O7J65k81Q2J23j50J80J58
4976A74k35J10j5k14J02k0J39m4j78J30K04k60J93j09j78K50J63l51j9O7n8L61
4998B12l09Q1l5r5J84J7k72K44j9o7J3j04L8K38k00M20n12K0L07J04k43l42J86
5021a34Q3l3j7J55l9r4J68n0p1j76K06n1m8K20j31l04M51q9k37K69r8J39j85M3
$$ plain form
5045 -23 63 4 -194 -134 -78 21 88 -89 55 68 -73 -50 204 -53 -3 -16 23 69 51 -45 -161 -64 98 -124 38
5070 38 90 -31 -82 203 100 -57 163 -23 47 18 -98 287 -14 86 144 -33 216 -128 113 128 -29 -177
5092 -177 -26 -123 201 -34 -153 292 95 -22 46 -22 -128 88 24 72 -36 -91 138 -78 103 -167 -171 131 -8
5115 -8 15 79 -102 52 -27 -166 -40 164 70 17 -60 -104 265 -55 -24 31 27 65 24 8 36 -89 -28 -33 45 27 -191
5142 -191 -68 -242 -371 -87 -9 -93 -187 -236 -105 232 -15 -87 -22 -374 -4 136 -271 -41 -303 55 71 -16 -119
$$ packed form
5045b3Q6n9j98O0N6R9O7j77J44J3j41K3K54k57N0j3L9M6j8r6j16R7J62k22J62
5070C8N2j21n1K85j03j57K20j86P0k9j16L85l01J00N8j77K49l44K41J5j57j48
5092a77J51r7L24k35j19M45j97j17O8o8j06K16o4M8j08n5K29k16J81k70mL02j39
5115hK3O4j81J54p9j39J26K04r4n3p7m4L69l20L1N5mL8m1j6K8j25O1nP8j8k18
5142a91J23j74j29K84P8q4r4m9J31L37k47p2O5l52L70J40m07K30k62L58J6q7j03
$$ [...]
8191A24
##END NTUPLES=NMR FID
##END=
