##TITLE=1H_53-2021
 CDCl3, 8 sc, 
 7.07.2021
##JCAMPDX= 6.0         $$ Bruker NMR JCAMP-DX V2.0
##DATA TYPE= NMR FID
##DATA CLASS= NTUPLES
##ORIGIN= UXNMR, Bruker Analytische Messtechnik GmbH
##OWNER= root
$$ XWIN-NMR		Version 3.5
$$ Wed Jul  7 10:53:38 2021 Russian Standard Time (UT+4h)  she@DPX200
##.OBSERVE FREQUENCY= 200.131506
##.OBSERVE NUCLEUS= ^1H
##.DELAY= (6, 6)
##.ACQUISITION MODE= SIMULTANEOUS
##.ACQUISITION SCHEME= undefined
##.AVERAGES= 8
##.DIGITISER RES= 18
##SPECTROMETER/DATA SYSTEM= spect
##.PULSE SEQUENCE= zg30
##.SOLVENT NAME= DMSO
##.SHIFT REFERENCE= (INTERNAL, DMSO, 0, 15.7039)
##AUDIT TRAIL= $$ (NUMBER, WHEN, WHO, WHERE, WHAT)
$$ ##TITLE= Audit trail, XWIN-NMR		Version 3.5
$$ ##JCAMPDX= 5.01
$$ ##ORIGIN= Bruker BioSpin GmbH
$$ ##OWNER= she
$$ F:/spectra/data/she/nmr/H-F/1/audita.txt
$$ ##AUDIT TRAIL=  $$ (NUMBER, WHEN, WHO, WHERE, WHAT)
(   1,<2021-07-07 10:52:29.43 +0400>,<she>,<DPX200>,
      <created by zg, POWCHK disabled, PULCHK disabled
       configuration hash MD5:
       00 E9 B6 7A A2 85 ED C7 34 08 36 98 17 FE 4E 26
       data hash MD5: 16K
       C9 6C 16 AA AA 77 9D FC C8 8C 84 B4 EF 50 DB 07>)
$$ ##END=
$$ 
$$ hash MD5
$$ AC D9 51 13 F3 93 33 1F A6 DE 1B 4D 3B E2 63 E7
##$RELAX= 
##$RELAX= 
##$RELAX= 
##$RELAX= 
##$RELAX= 
##$RELAX= 
$$ Bruker specific parameters
$$ --------------------------
##$DU= <F:/spectra>
##$EXPNO= 1
##$NAME= <H-F>
##$PROCNO= 1
##$TYPE= <nmr>
##$USER= <she>
##$AMP= (0..31)
100 100 100 100 100 100 100 100 100 100 100 100 100 100 100 100 100 100 
100 100 100 100 100 100 100 100 100 100 100 100 100 100 
##$AQSEQ= 0
##$AQ_mod= 1
##$AUNM= <au_zg>
##$AUTOPOS= <>
##$BF1= 200.13
##$BF2= 200.13
##$BF3= 200.13
##$BF4= 200.13
##$BF5= 200.13
##$BF6= 200.13
##$BF7= 200.13
##$BF8= 200.13
##$BYTORDA= 1
##$CFDGTYP= 0
##$CFRGTYP= 5
##$CHEMSTR= <none>
##$CNST= (0..31)
1 1 145 1 1 1 1 1 1 1 1 1 1 1 1 1 1 1 1 1 1 1 1 1 1 1 1 1 1 1 1 1 
##$CPDPRG= <>
##$CPDPRG1= <>
##$CPDPRG2= <>
##$CPDPRG3= <>
##$CPDPRG4= <mlev>
##$CPDPRG5= <mlev>
##$CPDPRG6= <mlev>
##$CPDPRG7= <mlev>
##$CPDPRG8= <mlev>
##$CPDPRGB= <>
##$CPDPRGT= <>
##$D= (0..31)
0 1.2 0 0 0 0 0 0 0 0.06 0 0.03 0 0 0 0 0.0002 0 0 0 0 0 0 0 0 0 0 0 0 
0 0 0 
##$DATE= 1625640748
##$DBL= (0..7)
120 120 120 120 120 120 120 120 
##$DBP= (0..7)
150 150 150 150 150 150 150 150 
##$DBP07= 0
##$DBPNAM0= <>
##$DBPNAM1= <>
##$DBPNAM2= <>
##$DBPNAM3= <>
##$DBPNAM4= <>
##$DBPNAM5= <>
##$DBPNAM6= <>
##$DBPNAM7= <>
##$DBPOAL= (0..7)
0.5 0.5 0.5 0.5 0.5 0.5 0.5 0.5 
##$DBPOFFS= (0..7)
0 0 0 0 0 0 0 0 
##$DE= 6
##$DECBNUC= <off>
##$DECIM= 32
##$DECNUC= <off>
##$DECSTAT= 4
##$DIGMOD= 1
##$DIGTYP= 9
##$DL= (0..7)
0 120 120 120 120 120 120 120 
##$DP= (0..7)
150 150 150 150 150 150 150 150 
##$DP07= 0
##$DPNAME0= <>
##$DPNAME1= <>
##$DPNAME2= <>
##$DPNAME3= <>
##$DPNAME4= <>
##$DPNAME5= <>
##$DPNAME6= <>
##$DPNAME7= <>
##$DPOAL= (0..7)
0.5 0.5 0.5 0.5 0.5 0.5 0.5 0.5 
##$DPOFFS= (0..7)
0 0 0 0 0 0 0 0 
##$DQDMODE= 0
##$DR= 18
##$DS= 0
##$DSLIST= <SSSSSSSSSSSSSSS>
$$ [...]
##$SUBNAM2= <"">
##$SUBNAM3= <"">
##$SUBNAM4= <"">
##$SUBNAM5= <"">
##$SUBNAM6= <"">
##$SUBNAM7= <"">
##$SUBNAM8= <"">
##$SUBNAM9= <"">
##$SW= 20.0188882624521
##$SWIBOX= (0..15)
0 0 2 0 0 0 0 0 0 0 0 0 0 0 0 0 
##$SW_h= 4006.41025641026
##$TD= 16384
##$TD0= 1
##$TE= 0
##$TE2= 300
##$TE3= 300
##$TEG= 300
##$TL= (0..7)
0 120 120 120 120 120 120 120 
##$TP= (0..7)
150 150 150 150 150 150 150 150 
##$TP07= 0
##$TPNAME0= <>
##$TPNAME1= <>
##$TPNAME2= <>
##$TPNAME3= <>
##$TPNAME4= <>
##$TPNAME5= <>
##$TPNAME6= <>
##$TPNAME7= <>
##$TPOAL= (0..7)
0.5 0.5 0.5 0.5 0.5 0.5 0.5 0.5 
##$TPOFFS= (0..7)
0 0 0 0 0 0 0 0 
##$TUNHIN= 0
##$TUNHOUT= 0
##$TUNXOUT= 0
##$USERA1= <user>
##$USERA2= <user>
##$USERA3= <user>
##$USERA4= <user>
##$USERA5= <user>
##$V9= 5
##$VALIST= <valist>
##$VCLIST= <CCCCCCCCCCCCCCC>
##$VD= 0
##$VDLIST= <DDDDDDDDDDDDDDD>
##$VPLIST= <PPPPPPPPPPPPPPP>
##$VTLIST= <TTTTTTTTTTTTTTT>
##$WBST= 1024
##$WBSW= 4
##$XGAIN= (0..3)
0 0 0 0 
##$XL= 0
##$YL= 0
##$YMAX_a= 205023
##$YMIN_a= -251231
##$ZGOPTNS= <>
##$ZL1= 120
##$ZL2= 120
##$ZL3= 120
##$ZL4= 120
##$ABSF1= 10
##$ABSF2= 0
##$ABSG= 5
##$ABSL= 3
##$ALPHA= 0
##$AQORDER= 0
##$ASSFAC= 0
##$ASSFACI= 0
##$ASSFACX= 0
##$ASSWID= 0
##$AUNMP= <proc_1d>
##$AZFE= 0.1
##$AZFW= 0.1
##$BCFW= 1
##$BC_mod= 2
##$BYTORDP= 1
##$COROFFS= 0
##$CY= 11.3945322036743
##$DATMOD= 1
##$DC= 2
##$DFILT= <>
##$DTYPP= 0
##$F1P= 15.9154993809931
##$F2P= -4.1035820241983
##$FCOR= 0.5
##$FTSIZE= 0
##$FT_mod= 4
##$GAMMA= 1
##$GB= 0.15
##$INTBC= 1
##$INTSCL= 1
##$ISEN= 128
##$LB= 0.24
##$LEV0= 0
##$LPBIN= 0
##$MAXI= 10000
##$MC2= 0
##$MEAN= 0
##$ME_mod= 0
##$MI= 1.114404
##$NCOEF= 0
##$NC_proc= 0
##$NLEV= 6
##$NOISF1= 3.799351
##$NOISF2= 2.8
##$NSP= 1
##$NTH_PI= 0
##$NZP= 0
##$OFFSET= 15.70392
##$PC= 1
##$PHC0= -11919.81
##$PHC1= 16.20099
##$PH_mod= 1
##$PKNL= yes
##$PPARMOD= 0
##$PSCAL= 0
##$PSIGN= 0
##$REVERSE= no
##$SF= 200.130013532006
##$SI= 16384
##$SIGF1= 3
##$SIGF2= 2
##$SINO= 400
##$SIOLD= 16384
##$SREGLST= <1H.CDCl3>
##$SSB= 0
##$STSI= 0
##$STSR= 0
##$SW_p= 3612.71676300578
##$SYMM= 0
##$S_DEV= 0
##$TDeff= 0
##$TDoff= 0
##$TI= <>
##$TILT= no
##$TM1= 0
##$TM2= 0
##$TOPLEV= 0
##$USERP1= <user>
##$USERP2= <user>
##$USERP3= <user>
##$USERP4= <user>
##$USERP5= <user>
##$WDW= 1
##$XDIM= 8192
##$YMAX_p= 0
##$YMIN_p= 0
$$ End of Bruker specific parameters
$$ ---------------------------------
##NTUPLES= NMR FID
##VAR_NAME=  TIME,          FID/REAL,        FID/IMAG
##SYMBOL=    X,             R,               I
##VAR_TYPE=  INDEPENDENT,   DEPENDENT,       DEPENDENT
##VAR_FORM=  AFFN,          ASDF,            ASDF
##VAR_DIM=   8192,          8192,            8192
##UNITS=     SECONDS,       ARBITRARY UNITS, ARBITRARY UNITS
##FACTOR=    0.0002496,     1,               1
##FIRST=     0,             0,               0
##LAST=      2.0444736,     0,               0
##MIN=       0,             -251231,         0
##MAX=       2.0444736,     205023,          0
$$ Real data points
##PAGE= N=1
##DATA TABLE= (X++(R..R)), XYDATA
$$ [...]
$$ plain form
1822 -176 -329 -20 613 213 128 -244 -202 178 333 202 -295 -312 214 345 -287 -168 -471 19 145 272 -75
1843 -75 -447 112 64 459 -22 -339 65 399 459 103 -405 -299 258 379 -13 -170 -308 114 512 -25 -309
1864 -309 -389 69 224 137 -195 -577 -125 330 201 -235 -207 -491 368 282 98 -232 -326 300 577 84 -165 -492
1886 -492 -89 248 384 -166 -511 -80 22 268 -180 -645 66 234 399 261 -200 -283 148 338 184 -301
1906 -301 -18 91 451 313 -280 -278 -357 210 531 -86 -395 -199 222 636 -32 -269 -283 -85 265 335 -334 -166
1928 -166 118 409 251 -124 -243 19 355 122 -38 -276 -197 376 -4 -327 -377 50 107 -87 174 -384 -461
1949 -461 89 68 70 -359 -297 205 168 -68 -99 -140 16 517 237 263 -345 87 316 301 116 -532 -77 -143 411
1972 411 48 -370 -493 -321 218 179 -209 -445 -12 526 164 -158 -441 -16 486 269 -219 -238 -429 210 162
$$ packed form
1822a76j53L09O33m00q5l72M2L80J55j31m97j7N26J31o32J19l03M90J26J27l47
1843g5l72N59m8L95m81l17M04L34O0l56n08J06N57J21l92j57j38M22L98n37k84
1864c09q0M58J55q7l32l82M52M55j29m36K8k84Q59q6j84l30r4O26K77m93k49l27
1886d92M03L37J36n50l45M31J02K46m48m65P11J68J65j38m61q3M31J90j54m85
1906c01K83J09L60j38n93Kp9N67L21o17l09J96M21M14o68k37j4J98L50P0o69J68
1928a66K84K91j58l75j19K62L36k33j60k38P9N73l80l23n0M27N7j94K61n58p7
1949d61N50k1Km29O2N02l7k36l1m1J56N01k80K6o08M32K29j5j85o48M55o6N54
1972D11l63m18j23J72N39l9l88k36M33N38l62l22k83M25N02k17m88j9j91O39m8
$$ plain form
1993 162 -91 -232 -83 -5 233 -19 -241 -59 -90 314 490 -323 -174 42 122 46 -143 -263 -281 178 111 -108
2015 -108 -107 -295 85 359 112 -331 -209 267 316 138 -207 -94 -191 55 340 -336 -229 -176 417 120 -257 -299
2037 -299 6 136 206 270 -287 44 82 261 44 -28 -126 19 307 121 -199 -440 -98 122 178 -127 -402 -364
2059 -364 214 341 51 -444 -172 52 350 372 -247 -227 15 124 121 -136 -282 81 -12 61 381 -200 -182 113
2081 113 123 8 -118 -170 208 42 -77 -107 -353 -26 63 295 -69 -262 202 120 209 175 -458 41 150 4
2103 4 6 -145 -67 73 234 145 -20 -100 -11 76 243 21 -72 24 359 225 56 -285 67 106 164 -52 -57 -144 30
2128 30 87 17 62 -245 -137 25 -353 -122 44 -105 -6 -42 98 -173 4 33 42 -2 -145 -58 157 -114 -152 157
2152 157 -265 30 68 2 -400 -402 40 262 153 -125 -66 45 145 181 -244 -143 -182 -41 198 3 -62 9 78
$$ packed form
1993A62k53j41J49P8K38k52k22J82l1M04J76q13J49K16Q0p6j89j20j8M59o7k19
2015a08Jj88L80K74k47m43J22M76M9j78l45J13r7K46K85o76J07N3N93k97l77m2
2037b99L05J30P0O4n57L31L8J79k17p2r8J45K88j86l20k41L42K20N6l05k75L8
2059c64N78J27k90m95K72K24K98K2o19K0K42J09lk57j46L63r3P3L20n81J8K95
2081A13J0j15j26n2L78j66j19l0k46L27Q9K32l64j93M64q2Q9l4o33M99J09j46
2103DKj51P8J40J61q9j65q0Q9Q7J67k22r3R6L35j34j69l41L52L9N8k16nq7J74
2128C0N7p0M5l07J08J62l78K31J66j49R9l6J40k71J77K9Rm4j43Q7K15k71l8L09
2152A57m22K95L8o6m02kM42K22j09k78N9J11J00L6m25J01l9J41K39j95o5P1O9
$$ plain form
2175 78 261 111 -176 25 131 123 9 64 -13 -199 -54 -127 -23 -149 183 -70 101 -171 80 -250 69 100
2197 100 150 52 -114 -126 180 -232 -38 -160 150 47 161 160 -229 -54 85 360 158 64 89 98 -14 69 345
2220 345 -158 -7 154 213 -113 11 54 -37 188 -72 -28 -109 177 -55 -35 -285 -66 7 64 98 -223 -54 277
2243 277 160 -220 -186 -138 -263 50 -61 84 -247 -42 195 43 -37 -152 89 213 -13 108 -170 -13 -14 354
2265 354 -44 -291 -136 164 197 162 15 -77 127 -2 -10 -80 -103 -39 63 -43 -49 -168 39 -129 97 -9 -197
2288 -197 -32 227 337 139 -67 -70 158 -112 58 -141 -114 -180 -121 -53 -228 108 -325 -58 41 -339 7 -65 -2
2311 -2 -51 161 -137 -42 86 -80 -233 135 -44 68 52 -57 32 -214 -260 235 168 185 -143 -34 162 -70 -6
2334 -6 76 23 12 200 280 -47 -73 194 16 -126 -181 -133 -154 41 -17 343 -34 30 -219 -18 -157 -42 -115 -82 69
$$ packed form
2175G8J83j50k87K01J06qj14N5p7j86J45p3J04j26L32k53J71k72K51l30L19L1
2197A00N0r8j66j2L06m12J94j22L10j03J14jl89J75J39K75k02r4K5Rj12Q3K76
2220C45n03J51J61N9l26J24M3r1K25k60M4q1K86k32K0k50K19P3N7L4l21J69L31
2243B77j17l80L4M8j25L13j11J45l31K05K37j52q0j15K41J24k26J21k78J57jL68
2265C54l98k47J55L00L3l5j47r2K04j29qp0k3O4J02j06oj19K07j68K26j06j88
2288a97J65K59J10j98k06lK28k70J70j99K7o6N9O8j75L36m33K67R9l80L46p2O3
2311bm9K12k98R5J28j66j53L68j79J12j6j09Q9k46m6M95o7J7l28J09J96k32O4
2334fQ2n3j1J88Q0l27k6K67j78j42n5M8k1J95n8L60l77O4k49K01j39J15p3L3J51
$$ plain form
2359 69 7 54 -78 83 56 -98 312 -28 -31 -19 110 252 -134 -132 -73 71 6 223 -18 -106 -70 171 317 115
2383 115 -51 -28 -29 -152 -103 -63 59 39 165 -46 22 -7 269 177 62 21 -126 -35 52 72 -134 -189 -151 -76 -208
2408 -208 -178 -136 -128 99 -44 2 -202 -101 6 111 119 66 -134 148 144 -152 -210 -78 63 84 137 -111 -76 -154 -24
2433 -24 96 -20 -253 154 370 -22 96 -160 -171 215 -164 -150 -181 16 94 -62 136 242 -72 33 -79 53
2455 53 141 -75 151 -128 -86 84 49 229 93 -43 37 135 -31 -15 -48 -152 -107 -53 -6 -97 -37 -60 -210 141 -170
2480 -170 -78 -20 63 6 190 20 -55 -56 -170 198 30 -287 -128 -76 -230 36 -53 128 -94 57 40 -229 21
2503 21 -78 -158 58 321 258 -232 174 -230 147 50 -202 28 83 -84 -62 -75 120 59 120 -16 111 181 58 -15
2527 -15 270 34 60 -26 152 26 72 -48 -65 128 -27 -78 -300 -66 199 -141 99 77 55 -133 -99 261 29
$$ packed form
2359F9o2M7j32J61k7j54M10l40lJ2J29J42l86KN9J44o5K17k41q8L6K41J46k02
2383A15j66K3jj23M9M0J22k0J26k11O8k9K76r2j15m1j47R1Q7K0k06n5L8P5j32
2408b08L0M2QK27j43M6k04J01J07J05Qn3k00K82mk96n8J32J41K1N3k48L5p8J30
2433b4J20j16k33M07K16l92J18k56j1L86l79J4l1J97P8j56J98J06l14J05j12J32
2455E3Q8k16K26k79M2J70l5J80j36j36Q0R8j66J6l3j04M5N4M7r1O0k3j50L51l11
2480a70R2N8Q3n7J84j70p5jj14L68j68l17J59N2j54K66q9J81k22J51j7k69K50
2503B1r9q0K16K63o3m90M06m04L77r7k52K30N5j67K2j3J95o1O1j36J27P0j23p3
2527a5K85k36K6q6J78j26M6j20j7J93j55n1k22K34K65l40K40k2k2j88L4L60k32
$$ plain form
2550 29 -246 15 -121 118 180 -354 -214 2 108 96 -96 -81 234 -87 174 -8 -54 271 -125 386 -65 22
2572 22 -96 101 -308 60 -95 -191 187 171 82 -181 -1 -1 23 168 190 -7 -130 1 -28 -90 -206 -19 239
2595 239 15 62 -234 -245 67 94 -199 -151 107 50 -28 -214 88 -157 -134 -115 -25 90 -183 -25 123 -122 -85
2618 -85 -179 167 183 -141 277 125 -46 -50 275 37 72 -109 -96 14 34 -12 -323 250 -14 61 64 84 229 -8
2642 -8 33 108 26 -363 0 -175 -193 93 -226 33 -53 220 17 25 -181 90 -48 -134 -141 -165 147 156 57 -271 -128
2667 -128 72 138 -12 -62 123 17 -237 -321 -159 43 108 -90 -111 -51 -47 -104 -244 116 119 182 -45 -93 -117 213 75
2692 75 86 140 109 249 -181 -356 165 66 140 174 -226 68 121 -114 111 -104 137 54 236 322 -141 -89 24 23
2716 23 119 -40 -28 -90 196 160 -337 25 361 -155 72 -130 -189 98 119 98 63 -84 216 109 381 -160 -203
$$ packed form
2550B9k75K61j36K39O2n34J40K16J06j2j92J5L15l21K61j82m6L25l96N11m51Q7
2572B2j18J97m09L68j55r6L78j6q9k63J80%K4J45K2j97j23J31k9o2j16J87K58
2595B39k24M7k96j1L12K7k93M8K58n7p8j86L02k45K3J9R0J15k73J58J48k45L7
2618h5r4L46J6l24M18j52j71mL25k38L5j81J3J10K0m6l11N73k64P5LK0J45k37
2642hM1P5q2l89L63j75j8K86l19K59q6K73k03Qk06K71j38q6pk4L12Rr9l28J43
2667a28K00O6j50n0J85j06k54q4J62K02O5j98k1O0Mn7j40L60LO3k27m8k4L30j38
2692G5J1N4l1J40m30j75N21r9P4L4m00K94N3k35K25k15K41q3J82Q6m63N2J13j
2716B3R6j59J2o2K86l6m97L62L36n16K27k02n9K87K1k1l5j47L00j07K72n41m3
$$ plain form
2739 -203 86 -99 -65 -59 -116 130 -31 96 220 42 149 129 253 36 -77 -182 66 -46 34 -62 240 -146
2761 -146 -328 -64 156 -18 -114 -125 -351 -22 199 -98 88 60 -28 -177 76 -76 185 141 -88 -163 86 142
2783 142 376 287 -113 57 75 -63 132 -163 -74 -22 54 -81 51 -85 170 213 256 159 -35 10 -16 4 -3 15 -238
2808 -238 -21 198 156 -48 -106 -384 13 88 -220 -12 -134 206 -47 -10 -169 -55 -281 -36 45 -169 -35 234
2830 234 -80 -45 -35 -262 147 25 -133 37 -89 -129 111 -193 -71 -8 -235 36 -101 -116 -78 45 80 63 -123
2853 -123 -231 173 170 243 92 -50 22 -93 77 27 -124 176 81 49 41 73 -147 47 232 72 35 -32 182 116
2877 116 96 -200 -392 -232 -206 29 108 -134 -63 -136 -44 208 -4 -19 59 -77 -93 69 108 139 37 -134 50 26
2901 26 31 -7 -166 184 -6 -117 81 -113 48 27 180 88 -75 63 -97 74 -268 -99 -65 11 -119 146 25
$$ packed form
2739b03K89j85L4On7K46j61J27J24j78J07k0J24k17j13j05K48j12Q0r6L02l86
2761a46j82K64K20j74r6j1k26L29K21k97J86k8q8j49K53j52K61m4k29p5K49N6
2783A42K34q9m00J70J8j38J95k95Q9N2P6j35J32j36K55M3M3r7j94M5k6K0pJ8k53
2808b38K17K19m2k04n8k78L97P5l08K08j22L40k53L7j59J14k26K45Q1k14J34K69
2830B34l14L5J0k27M09j22j58J70j26m0K40l04J22O3k27K71j37j5L8J23L5j7j86
2853a23j08M04lP3j51j42P2j15J70n0j51L00r5l2qL2k20J94J85j60l7o7K14o6
2877A16k0k96j92J60K6K35P9k42P1p3R2K52k12j5P8j36j6J62L9L1j02j71J84k4
2901B6Nl8j59L50j90j11J98j94J61k1J53r2j63J38j60J71l42J69L4P6j30K65j21
$$ plain form
2924 25 -155 -153 -127 13 -72 -52 117 118 87 -193 239 170 92 -117 3 -232 247 132 -264 41 -180 115 -21 -1
2948 -1 -284 24 205 55 -10 -69 -231 230 56 287 -80 -3 -197 -110 48 98 2 11 98 238 82 -231 112 -97
2972 -97 -226 -109 9 93 257 145 -121 31 178 146 147 -67 241 229 -220 -177 41 68 73 168 -165 8 -160 45
2996 45 156 57 80 -112 -33 103 -3 -20 166 -101 -111 -173 62 -58 -16 123 -5 262 -99 -175 12 102 -70
3019 -70 59 142 358 -150 91 -63 158 -207 -43 10 35 -140 23 -111 239 0 267 -104 207 -75 81
3040 81 328 124 -129 102 1 209 24 -322 140 59 -42 -173 22 -99 -76 -455 231 159 98 -327 122 -388
3062 -388 -66 -88 235 64 186 -60 -41 208 38 89 -164 53 -86 98 428 34 191 -142 238 165 145 164
3084 164 -245 -148 -23 -118 21 95 -15 105 53 -52 -223 350 -127 204 114 237 -12 70 -236 51 117 19 28
$$ packed form
2924B5j80KK6J40q5K0J69Jl1k80M32o9p8k09J20k35M79j15l96L05k21K95j36K0
2948ak83L08J81j50o5n9j62M61j74K31l67P7j94Q7J58N0r6RQ7J40j56l13L43k09
2972i7j29J17J18Q4J64j12k66J52J47l2Jk14L08j2m49M3K18K7NR5l33J73j68K05
2996D5J11r9K3j92P9J36j06j7J86k67j0o2K35j20M2J39j28K67l61p6J87R0j72
3019g0J29Q3K16n08K41j54K21l65J64N3K5j75J63j34L50k39K67l71L11k82J56
3040H1K47k04k53K31j01K08j85l46M62q1j01j31J95j21K3l79O86p2o1m25M49n10
3062c88L22k2L23j71J22k46J9K49j70N1k53K17j39J84L30l94J57l33L80p3k0J9
3084A64m09R7J25r5J39P4j10J20n2j05j71N73m77L31r0J23k49Q2l06K87O6r8R
$$ plain form
3107 28 -244 147 37 1 308 114 96 -41 -180 -127 -76 63 30 -131 -56 180 -139 119 -36 -296 -65 351
3129 351 -117 41 -56 109 208 17 41 -45 -100 -58 -110 360 47 -68 70 -85 35 -74 102 -66 73 117 19
3152 19 -239 192 -66 99 -134 326 -22 -139 -10 -151 -91 -52 -23 -90 490 33 -121 -148 -131 178 -61 -172
3174 -172 62 74 -67 94 -2 -78 74 -65 -72 -110 57 71 48 -101 279 64 347 12 -81 -152 18 -91 157
3197 157 117 34 115 -108 83 -257 63 -4 -32 59 -144 88 57 -37 9 173 106 -47 98 196 174 279 -115 53
3221 53 -69 38 177 -131 -112 89 109 234 -52 -127 -148 -185 160 52 -14 171 74 114 207 -3 -161 -253 -223 90
3245 90 -37 -210 -227 57 60 210 174 75 111 95 268 -143 -216 45 -81 135 182 -192 216 21 54 -85 93 433
3269 433 -4 -141 -51 320 48 -123 64 35 -166 -19 161 -195 77 -36 165 92 -95 45 -24 219 228 29
$$ packed form
3107B8k72L91j10l6L07j94j8j37j39N3N1J39l3j61P5K36l19K58j55k60K31M16
3129C51m68J58r7J65R9j91K4q6n5M2n2M70l13j15J38j55J20j09J76j68J39M4r8
3152A9k58M31k58J65k33M60l48j17J29j41O0L9K9o7N80m57j54k7J7L09k39j11
3174a72K34J2j41J61r6p6J52j39pl8J67J4k3j49L80k15K83l35r3p1J70j09K48
3197A57m0q3Q1k23J91l40L20o7k8R1k03K32l1r4M6J64o7j53J45R8k2J05l94J68
3221E3j22J07J39l08J9K01K0J25k86p5k1l7L45j08o6J85r7M0R3k10j58r2L0L13
3245I0j27j73j7K84LJ50l6r9L6j6J73m11p3K61j26K16M7l74M08j95L3j39J78L40
3269D33m37j37R0L71k72j71J87k9k01J47J80l56K72j13K01p3j87J40o9K43Rj99
$$ plain form
3291 29 -1 -111 123 16 -59 -9 388 -54 -93 216 30 -4 64 -268 -39 55 228 -83 -161 -9 -2 9 53 -107
3315 -107 18 -147 -189 72 1 162 -28 -46 -226 175 368 104 -91 136 -234 -9 -121 -124 301 -160 74 -44
3337 -44 -101 -163 -236 -58 -57 196 -287 -47 -36 58 -78 33 -28 12 38 391 124 -172 364 -18 268 -175 -216 -179
3361 -179 -10 -98 62 -31 -110 48 -52 -100 -135 78 -25 -7 -322 170 -184 84 85 -250 -123 -104 -26 130 -207
3384 -207 -5 -180 281 -173 -77 13 -95 96 86 -159 -76 74 -224 112 -358 -288 -275 -256 27 44 155 20 -38
3407 -38 190 -118 -61 -57 -126 -101 -389 76 92 7 45 211 -193 -63 222 10 -181 -118 -259 -35 104 329 -59
3430 -59 -255 -53 -168 -163 51 -114 173 92 75 43 -31 51 37 198 -90 -88 -288 94 89 62 102 1 45 296 -120
3455 -120 123 304 -11 165 72 110 90 10 -80 94 -78 255 175 47 -105 -22 -36 108 -248 207 34 -20 -140
$$ packed form
3291B9l0j10K34j07p5N0L97m42l9L09j86l4O8l32K29R4J73l11p8J52PJ1M4j60
3315a07J25j65m2K61p1J61j90j8j80M01J93k64j95K27l70K25j12lM25m61K34j18
3337d4n7o2p3J78JK53m83K40J1R4j36J11o1M0K6L53k67k96N36l82K86m43m1L7
3361a79J69q8J60r3p9J58j00m8l5K13j03J8l15M92l54K68Jl35J27J9P8J56l37
3384b07K02j75M61m54R6R0j08J91j0k45Q3J50k98L36m70P0J3J9K83J7J11j35n8
3407c8K28l08N7Mo9K5k88M65J6q5L8J66m04J30K85k12j91O3j41K24J39K25l88
3430e9j96K02j15NK14j65K87q1j7l2p4Q2j4J61k88Kk00L82nk7M0j01M4K51m16
3455a20K43J81l15J76r3L8k0q0r0J74j72L33q0j28j52Q3j4J44l56M55j73n4j20
$$ plain form
3478 -140 -80 532 -377 -145 -362 -86 73 -368 -105 39 -21 -96 -134 116 -4 -111 -107 -13 53 88 -267 181 140
3501 140 -215 287 150 189 -177 27 -54 150 -192 -165 -46 -66 -118 106 227 -209 102 256 -87 151 125 140
3523 140 103 -103 113 -24 38 154 -92 -93 47 51 132 95 22 16 219 -65 6 -41 192 -99 -91 40 -191 189 -38
3548 -38 32 187 184 0 92 206 12 -37 225 -147 16 48 -70 -303 -80 24 75 -120 -33 39 166 107 -47 181
3572 181 -163 -160 -94 107 -35 60 36 -54 -117 -280 80 197 -45 244 -141 -51 332 127 123 -34 -210 -69 266
3595 266 299 52 108 44 -20 162 13 118 -113 -86 65 -20 95 76 -10 234 50 49 71 -66 -6 128 17 341
3619 341 -245 137 93 -204 -146 204 -210 -80 -24 215 -28 -44 -29 208 -71 177 153 -35 201 14 -129 105
3641 105 -218 -71 78 -95 137 133 20 -61 99 -16 252 -57 140 -110 207 -76 -170 74 -27 -125 -281 33
$$ packed form
3478a40O0O12r09K32k17K76J59m41K63J44o0p5l8K50j20j07MR4O6L5l55M48m1
3501A40l55N02j37L9l66K04q1K04l42K7J19k0n2K24J21m36L11J54l43K38k6J5
3523A40l7k06K16j37O2J16k46jJ40MQ1l7p3oK03k84P1m7K33k91QJ31k31L80k27
3548c8P0J55lj84R2J14j94m9K62l72J63L2j18k33K23J04N1j95Q7P2J27n9j54K28
3572A81l44LO6K01j42R5k4r0o3j63L60J17k42K89l85R0L83k05mj57j76J41L35
3595B66L3k47N6o4o4J82j49J05k31K7J51q5J15j9q6K44j84jK2j37O0J34j11L24
3619C41n86L82m4k97N8L50m14J30N6K39k43j6J5K37k79K48k4j88K36j87j43K34
3641A05l23J47J49j73K32mj13q1J60j15K68l09J97k50L17k83r4K44j01r8j56L14
$$ plain form
3663 33 81 -117 -8 212 61 -46 49 180 -57 -75 -9 -36 -59 155 80 5 12 -159 55 -230 -132 181 -113 -165
3687 -165 -37 -4 252 -148 12 64 109 19 152 -161 -252 164 15 -126 -41 -249 210 35 89 42 -244 75 67
3710 67 225 79 -91 -66 -185 -57 -98 188 -107 102 59 85 72 67 -329 33 202 -219 -1 3 210 15 -18 -166
3734 -166 -67 230 -132 328 -124 -135 7 -151 -188 -140 1 -6 -57 -244 -19 -69 -225 30 24 24 221 26 -113 -60
3758 -60 -45 -74 -62 -190 -164 -191 24 -252 135 -106 -3 -47 3 -94 361 213 31 113 148 341 16 -184 124 87
3782 87 -208 -77 -253 62 236 30 7 100 -186 125 -177 -20 7 -8 13 -50 72 82 154 48 -42 -66 -164 -78
3806 -78 166 -262 -79 262 267 263 -91 -220 69 87 -238 22 0 -161 -4 179 16 71 30 -171 19 -41 -15 15
3830 15 -66 -37 189 49 10 -81 133 63 -5 -35 141 24 -2 -13 23 23 71 -164 34 239 202 -29 -46 55 141 -91
$$ packed form
3663C3M8j98J09K20j51j07R5J31k37j8O6k7k3K14p5p5Pj71K14k85R8L13k94n2
3687a65J28L3K56m00J60N2M5r0J33l13r1M16j49j41Q5k08M59j75N4m7k86L19q
3710F7J58j46j70K5j19J28m1K86k95K09m3K6j3nl96L62J69m21K18MK07j95l3j48
3734a66R9K97l62M60m52j1J42j58l7M8J41pn1j87K25n0j56K55o%J97j95j39N3
3758f0J5k9J2j28K6k7K15k76L87k41J03m4N0r7M55j48j82Q2L5J93l25k00L08l7
3782H7k95J31j76L15J74k06k3R3k86L11l02J57K7j5K1o3J22J0P2j06r0k4r8Q6
3806g8K44m28J83L41Nml54j29K89J8l25K60k2j61J57J83j63N5m1k01J90o0K6L0
3830A5q1K9K26j40l9r1K14p0o8l0J76j17k6j1L6%M8k35J98K05l7k31j7J01Q6k32
$$ plain form
3856 -91 153 -104 105 -55 -118 15 -147 11 -273 -70 50 50 38 294 -351 164 -164 255 -122 330 57 78
3878 78 -156 189 -65 -27 170 -88 278 -106 106 180 89 65 78 -4 83 -9 -33 -135 173 -20 -63 -357 6 96
3902 96 306 226 6 -33 135 -90 -96 37 157 15 -120 -56 32 -9 126 -134 323 41 -256 98 194 -163 -131
3925 -131 -178 219 -208 -96 -139 -19 132 0 -8 -229 25 19 381 206 41 83 168 33 25 33 138 -224 143 184
3949 184 76 -240 -212 75 -104 37 124 -190 -106 -55 113 -374 -293 -171 -23 188 -266 -103 -206 -23 -163 -55
3971 -55 218 -15 16 64 -173 59 -52 -44 95 64 62 38 -146 67 -50 -147 -3 152 -6 161 83 -151 -124 48
3995 48 -236 -228 -80 -190 60 22 -197 89 -122 -141 25 -224 272 -141 -80 -50 310 -40 94 103 28 72 -143 -126
4019 -126 -77 -76 -98 -34 -80 -133 -63 136 -44 -100 54 -21 215 179 -26 73 -204 -14 -53 28 26 -231 80 88 -197 -179
$$ packed form
3856i1K44k57K09j60o3J33j62J58k84K03J20%j2K56o45N15l28M19l77M52k73K1
3878G8k34L45k54L8J97k58L66l84K12P4r1k4J3q2Q7r2k4j02L08j93m3k94L63R0
3902I6K10q0k20l9J68k25oJ33J20j42j35O4Q8m1J35k60M57k82k97L54R6l57L2
3925a31m7L97m27J12m3J20J51j32qk21K54oL62j75j65M2Q5j35qQJ05l62L67M1
3949A84j08l16K8K87j79J41Q7l14Q4N1J68m87Q1J22J48K11m54J63j03J83j40J08
3971e5K73k33L1M8k37K32j11QJ39l1kk4j84K13j17r7J44J55j58J67p8k34K7J72
3995D8k84QJ48j10K50l8k19K86k11j9J66k49M96m13O1L0L60l50J34Rp5M4k15J7
4019a26M9Jk2O4m6n3P0J99j80n6J54p5K36l6k05R9k77J90l9Q1kk57L11Qk85J8
$$ plain form
4045 -179 -261 83 280 213 -96 -48 147 124 81 124 28 -52 -310 -21 288 217 -79 29 52 -108 33 -51 225 125
4069 125 -206 196 50 -25 85 329 59 -121 173 -131 -5 101 -35 -61 -5 -219 -136 -6 -399 -73 -22 97
4091 97 51 120 396 372 -120 182 -61 3 102 -15 -94 -136 -121 -83 92 122 -21 -224 200 246 -15 46 -109 25
4115 25 -107 -84 192 -126 -123 120 176 -88 14 138 60 311 -152 31 -155 119 160 -186 193 -110 25 45 63
4138 63 -257 140 -87 -62 -41 -158 165 -227 -207 -72 310 -162 -125 -32 -207 -217 -52 124 49 64 190 -105 -39
4161 -39 -98 279 31 92 -29 -234 162 44 -97 183 232 150 -81 -155 321 -61 -48 294 -152 255 -33 88
4183 88 -43 134 37 -115 -135 -30 74 224 81 -23 47 48 259 -194 77 -173 -73 94 204 -3 140 -269
4205 -269 -45 -158 -26 -186 -99 7 146 159 -16 -253 85 132 -115 -185 156 -245 -120 144 67 55 -218 120
$$ packed form
4045a79q2L44J97o7l09M8J95k3m3M3r6q0k58K89L09p1k96J08K3j60J41q4K76j00
4069A25l31M02j46p5J10K44k70j80K94l04J26J06j36k6N6k14Q3J30l93L26N1J19
4091I7m6O9K76k4m92L02k43O4R9j17p9m2J5L8J75L0j43k03M24M6k61O1j55J34
4115B5j32K3K76l18LK43N6k64J02J24p8K51m63J83j86K74M1l46L79l03J35K0J8
4138F3l20L97k27K5K1j17L23l92K0J35L82m72L7R3j75j0J65J76p5J5J26k95O6
4161c9n9L77k48O1j21k05L96j18j41K80M9q2k31p4M76l82J3L42m46M07k88J21
4183H8j31J77r7j52k0J05J04J50j43j04P0JK11m53K71k50J00J67J10k07J43m09
4205b69K24j13J32j60Q7J06J39J3j75k37L38M7k47p0L41m01J25K64p7j2k73L38
$$ plain form
4227 120 93 -152 -45 -40 -189 18 -40 16 -147 129 -65 121 -201 132 -354 209 199 174 -232 -54 44 -197 64
4250 64 152 110 -72 -41 33 -202 118 230 152 189 146 -281 -72 57 -523 112 150 -19 129 74 -246 -214 -241 252
4274 252 -44 19 111 270 -275 167 11 -348 101 17 176 106 -151 164 -26 -25 7 -147 -256 -10 216 -118
4296 -118 -201 372 58 265 -132 -65 -18 -68 6 -16 -76 121 45 66 252 143 -71 -117 197 -183 -166 -165 94 37 11
4321 11 31 92 -30 130 85 -75 -122 -44 -180 -51 -58 45 -35 -210 30 -31 160 -109 86 -219 -7 46 -34 145
4345 145 -91 -20 74 133 -43 114 74 -15 24 -173 178 150 45 47 -110 -7 134 83 23 -115 -371 47 -72 -71
4369 -71 86 52 -14 36 -28 -175 -65 32 69 173 57 141 127 -66 95 164 -34 -11 102 -105 226 -203 116 81
4393 81 33 -253 85 83 101 286 96 1 146 -123 24 -11 90 7 88 -168 -125 -86 -175 -32 74 -41 -165 -370
$$ packed form
4227A20k7k45J07Nj49K07n8N6j63K76j94J86l22L33m86N63j0k5m06J78R8k41K61
4250F4Q8m2j82L1P4k35L20J12p8L7m3m27K09J29n80O35L8j69J48n5l20L2k7M93
4274B52k96O3R2J59n45M42j56l59M49q4J59p0k57L15j90JL2j54j09K46K26l34
4296a18q3N73l14K07l97O7M7n0P4k2o0J97p6K1J86j09k14m6L14l80J7JK59n7k6
4321A1K0O1j22J60m5j60m7P8j36J29pJ03q0j75K40o1J91k69J95l05K12N3q0J79
4345A45k36P1R4N9j76J57m0q9L9j97L51k8j05Kj57J03J41n1o0j38k56M18j19J
4369g1J57l4o6N0o4j47J10R7L7J04j16Q4j4j93J61O9j98K3J13k07L31m29L19l5
4393H1m8k86L38kJ8J85j90r5J45k69J47l5J01q3Q1k56M3L9q9J43J06j15j24k05
$$ plain form
4417 -370 181 -332 -133 63 -154 -129 -50 44 -130 44 -331 93 246 51 5 -51 134 -244 96 67 -19 152
4439 152 274 33 215 -167 29 -109 -137 225 54 86 -188 -300 48 -48 -164 -266 -76 -482 -56 25 -136
4460 -136 67 -63 110 -88 -11 94 -267 273 -53 107 192 -13 -49 231 51 71 -42 41 -183 -32 -68 60
4482 60 86 -17 -125 -168 85 72 -96 31 -258 214 22 -88 168 -57 155 14 -138 -8 -12 112 -180 -11
4504 -11 138 -134 -24 -46 7 -162 -13 -49 -98 -180 56 49 -191 -68 -82 127 196 -189 -36 -200 -178 35 -13 249
4528 249 -11 216 -160 -128 51 100 115 -33 22 16 -207 29 -204 316 -42 -123 -91 -143 -141 167 128 -78 128 171
4552 171 170 1 -15 87 -111 -73 339 265 -5 -48 -189 -73 -62 -70 90 -103 -81 169 -30 112 31 -129 80 -245
4576 -245 -154 -12 -80 -67 -53 120 53 -187 52 177 131 144 75 -65 59 -25 -23 -64 -248 186 29 31 105 -123 -131 -83
$$ packed form
4417c70N51n13J99J96k17K5P9R4j74J74l75M24J53j95m6n6J85l78L40k9q6J71
4439A52J22k41J82l82J96j38k8L62j71L2k74j12L48r6j16j02J90m06M26Q1j61
4460a36K03j30J73j98P7J05l61N40l26J60Q5k05l6K80j80K0j13Q3k24J51l6J28
4482F0K6j03j08m3K53j3j68J27k89M72j92j10K56k25K12j41j52J30mJ24k92J69
4504a1J49k72J10k2N3j69J49l6m9q2K36pk40J23j4K09O9l85J53j64K2K13m8K62
4528B49k60K27l76L2J79M9J5j48N5ok23K36k33N20l58q1L2n2KL08l9k06K06M3
4552A71jj69j6J02j98L8M12p4k70m3j41J16J1qJ60j93K2K50j99J42q1j60K09l25
4576b45R1J42o8J3J4J73o7k40K39J25m6J3o9j40J24q4Km1j84M34j57KP4k28qM8
$$ plain form
4602 -83 94 67 213 -105 -171 154 -148 7 142 122 -62 39 110 17 144 70 -192 -54 -109 -33 310 94 58
4625 58 145 -25 154 22 -241 50 27 -315 62 225 -144 65 -288 -32 -147 -151 -140 -50 48 -239 50 -93 -105
4648 -105 -91 -135 15 22 24 -119 9 152 -17 -56 37 222 -179 -44 110 -36 -102 1 189 -43 -133 148 49 372
4672 372 -143 103 -375 21 4 34 68 -59 -342 -150 89 127 -24 163 -56 -81 -85 38 23 -14 285 19 -32
4695 -32 277 22 -125 39 21 207 241 188 37 99 -137 -6 152 -274 -123 31 123 -181 52 261 18 213
4717 213 114 -208 -96 250 33 171 34 -118 -58 86 -88 104 -44 -93 -18 -57 208 7 70 -48 289 273
4739 273 -14 -373 -65 -48 164 -243 4 -228 36 -85 200 55 17 -84 -23 128 -164 -96 -352 -12 61 -217
4761 -217 -141 175 -144 51 -18 -234 -64 -151 -125 -113 -187 -79 -240 -1 87 -43 -66 -113 15 102 140 -73 165 42
$$ packed form
4602h3J77k7J46l18o6L25l02J55J35k0j84J01P1r3J27p4k62J38n5P6L43k16l6
4625E8Q7j70J79j32k63K91k3l42L77J63l69K09l53K56j15mJ1R0R8k87K89j43j2
4648a05J4m4J50PKj43J28J43j69l9R3J85m01J35J54j46o6J03J88k32r0K81r9L23
4672C72n15K46m78L96j7L0L4j27k83J92K39L8j51J87k19k5mJ23j5l7K99k66n1
4695c2L09k55j47J64j8J86L4n3j51O2k36J31J58m26J51J54R2l04K33K09k43J95
4717B13r9l22J12L46k17J38j37j52O0J44j74J92j48m9P5l9K65k01O3j18L37j6
4739B73k87l59L08J7K12m07K47k32K64j21K85j45l8j01O1J51k92O8k56L40P3k78
4761b17P6L16l19J95o9k16J70q7K6J2p4J08j61K39Q8j30k3m7J28Q7L8k13K38j23
$$ plain form
4785 42 0 -96 -9 -204 74 -38 -12 -204 126 -63 19 85 -45 -51 -83 -38 -197 72 -270 23 -72 -21 -4 41 -129
4810 -129 304 -113 63 -130 -149 42 11 50 60 26 28 40 -68 -157 0 52 76 75 11 40 7 173 -32 76 -141
4835 -141 -86 76 37 20 -245 -19 -201 -48 -74 110 122 112 1 117 -28 76 56 13 -40 142 -1 -87 -150 32
4859 32 -247 196 -107 -53 63 -117 150 -51 29 -73 100 -70 -180 -419 -60 59 127 -132 -234 17 102 -99
4881 -99 99 -312 49 175 -28 35 -5 16 85 -58 -5 -169 -237 47 -94 -53 -2 -44 156 -87 -45 -85 64 -308
4905 -308 -37 79 65 23 189 337 12 287 -187 93 203 265 -18 75 100 -98 49 57 105 103 -58 -56 -93 -149 58
4930 58 57 142 -128 202 16 -255 71 41 138 -192 -340 -218 160 -192 -155 73 -72 -312 15 372 4 63 -90
4953 -90 35 -31 271 -160 -230 165 -32 -112 -334 -247 263 -28 -18 -187 246 144 -138 -249 -138 168 -190 164
$$ packed form
4785D2m2r6Q7j95K78j12K6j92L30j89Q2O6j30ol2M5j59K69l42K93r5N1J7M5j70
4810a29M33m17J76j93j9J91l1L9J0l4KJ2j08q9J57N2K4jo4K9l3J66k05J08k17
4835a41N5J62l9j7k65K26j82J53k6J84J2j0j11J16j45J04k0m3n3J82j43q6o3J82
4859C2k79M43l03N4J16j80K67k01Q0j02J73j70j10k39L59J19O8k59j02K51Q5k01
4881i9J98m11L61J26k03O3m0K1O9j43N3j64o8K84j41M1N1m2K00k43M2m0J49l72
4905c08K71J16j4m2J66J48l25K75m74K80J10O2k83R3K5j98J47QM8kj61Kl7n6K07
4930E8jQ5k70L30j86k71L26l0R7l30j48J22L78l52L7K28j45k40L27L57l68N9j53
4953i0J25o6L02m31p0L95j97q0k22Q7N10k91J0j69M33j02k82j11J11L06l58L54
$$ plain form
4975 164 126 56 148 48 -143 36 196 93 67 34 -229 -14 36 5 -224 -142 144 -47 -212 77 168 43 67
4998 67 -220 24 144 135 -31 156 203 160 262 22 -68 234 12 177 -99 -252 161 -49 -12 102 104 21 -137
5021 -137 17 -105 -227 150 -139 17 -53 113 -211 112 310 203 54 -147 -146 -506 -59 74 -72 50 -125
5042 -125 -148 -189 -99 -20 40 191 -81 267 108 154 29 -4 258 140 -92 294 88 -87 -120 353 -183 189 63
5065 63 -59 -115 140 -32 -121 -63 108 -139 -35 -272 290 193 -25 253 91 -116 -53 11 0 35 -6 -147 -360
5088 -360 -119 0 65 -126 158 -157 -158 140 -83 -48 -123 -93 24 -169 37 28 3 246 402 359 -22 114 201 -84
5112 -84 -31 76 105 171 -239 -2 -218 -169 -140 74 87 -10 -79 5 73 101 174 -35 18 -67 -92 -107 -32 -9 17 330 -103
5139 -103 18 241 -115 144 51 -7 -71 200 90 -424 102 7 30 -11 -9 -11 -123 144 92 79 203 139 157 121 -3
$$ packed form
4975A64l8p0R2j00j91J79J60j03k6l3k63K15N0l1k29Q2K86j91j65K89R1j25K4
4998F7k87K44J20rj66J87M7m3J02k40r0L02k22J65k76j53M13k10L7J14Kq3j58
5021a37J54j22j22L77k89J56p0J66l24L23J98j07j49k01Jl60M47J33j46J22j75
5042a25k3m1R0P9O0J51k72L48j59M6j25l3K62j18k32L86k06j75l3M73n36L72j26
5065F3j22n6K55j72q9N8J71k47J04k37N62r7k18K78j62k07O3O4j1L5m1j41k13
5088c60K41J19O5j91K84l15jK98k23L5p5L0J17j93K06rk5K43J56m3l81J36Q7k85
5112h4N3J07K9O6m10K37k16M9K9K14J3r7o9Q4O8K8P3k09N3q5k5j5P5K3K6L13m33
5139a03J21K23l56K59r3n8o4K71j10n14N26r5K3m1Kkj12K67n2j3J24o4J8l6j24
$$ plain form
5164 -3 -138 55 198 191 -109 25 -312 43 -115 60 67 -64 43 -118 261 95 -79 -34 76 65 76 23 -40 6
5188 6 -102 -81 23 90 51 -93 53 98 111 171 -68 -40 -57 1 222 -74 189 36 19 50 238 21 1 -180 -6
5213 -6 -265 -74 7 -108 -126 39 -101 -155 143 -32 -97 -158 -131 -80 -144 76 170 -94 -191 85 134 144 24 217 139
5238 139 -70 37 -100 56 140 -113 -255 0 -6 -127 -195 174 -63 -54 -180 139 -99 -45 -155 -328 -45 -278
5260 -278 14 251 -73 -92 -63 46 251 -137 -155 -91 -79 -31 -173 79 -17 -62 -188 -159 38 27 -25 97 -190 -74
5284 -74 -249 -334 158 -112 94 155 51 -34 146 -87 144 -11 38 97 -70 197 87 -155 177 21 -208 6
5306 6 251 251 51 255 -74 -107 -59 19 20 321 68 35 83 141 188 254 -49 246 -57 1 82 -92 -30 -185 -73 57
5332 57 31 -103 78 59 26 264 -29 -159 -123 41 49 -105 156 -214 -82 156 35 -417 137 48 -51 203 -97
$$ packed form
5164cj35J93J43pl00J34l37L55j58J75Pj31J07j61L79j66j74M5J10j1J1n3o3M6
5188Fj08K1J04O7l9j44J46M5J3O0k39K8j7N8K21k96K63j53j7L1J88k17k0j81J74
5213fk59J91Q1j15j8J65j40n4K98j75o5o1K7N1o4K20R4k64r7K76M9J0j20J93p8
5238A39k09J07j37J56Q4k53j42K55oj21o8L69k37Rj26L19k38N4j10j73K83k33
5260b78K92K37l24j9K9J09K05l88j8O4J2M8j42K52r6m5j26K9J97j1n2J22k87J16
5284g4j75q5M92k70K06O1j04q5J80k33K31j55M9N9j67K67j10k42L32j56k29K14
5306FK45%k00K04l29l3M8P8JL01k53l3M8N8M7O6l03K95l03N8Q1j74O2j55J12J30
5332E7k6j34J81j9l3K38k93j30L6J64Qj54K61l70J32K38j21m52N54q9r9K54l00
$$ plain form
5355 -97 -205 -373 60 -9 -28 -82 195 -10 -23 80 122 -109 179 179 0 99 164 -286 226 185 -53 164 408 -36
5379 -36 -400 -193 -153 -2 184 -72 177 -305 84 32 35 150 -129 -65 -46 -172 8 -218 39 -80 109 69 195
5402 195 47 -70 120 -19 121 -213 0 -229 -106 -60 54 104 -46 -26 -179 42 180 -171 -5 290 -43
5423 -43 120 160 -131 -283 187 104 -234 87 -138 -62 -79 22 208 62 33 89 78 -110 152 -131 -131 -42 6 -118
5447 -118 -95 31 -80 19 -64 -250 190 -56 2 37 37 109 -85 -163 -140 -23 -197 21 38 114 -4 -111 -124 -154 -90
5472 -90 -38 52 135 -181 136 -152 113 -53 188 -194 -53 -55 -325 -45 -215 -27 -59 -109 135 132 70 -40 -111 9
5496 9 68 108 258 -84 -378 92 43 270 -144 26 81 -125 182 26 72 30 -18 -87 -243 -458 -29 62 -87 -74
5520 -74 94 111 -255 -26 -182 20 41 -112 -62 -180 39 228 -261 3 -189 153 221 -18 -60 -37 -86 -69 -23
$$ packed form
5355i7j08j68M33o9j9n4K77k05j3J03M2k31K88%j79R9O5m50N12m1k38K17K44m44
5379c6l64K07M0J51J86k56K49m82L89n2LJ15k79O4J9j26J80k26K57j19J89m0J26
5402A95j48j17J90j39J40l34K13k29J23M6J14N0j50K0j53K21J38l51J66K95l33
5423d3J63M0k91j52M70q3l38L21k25P6j7J01J86j46k9N6j1j88K62k83%Q9M8j24
5447a18K3J26j11R9q3j86M40k46N8L5%P2j94p8K3J17j74K18J7P6j18j07j3l0O4
5472i0N2R0Q3l16L17k88K65j66K41l82J41kk70K80j70J88l2n0K44lo2j10p1J20
5496IN9M0J50l42k94M70m9K27m14J70N5k06L07j56M6m2m8o9j56k15M29R1j49J3
5520g4J68J7l66K29j56K02K1j53N0j18K19J89m89K64j92L42O8k39m2K3m9J7M6
$$ plain form
5543 -23 -106 -167 64 -195 335 -246 42 -227 106 33 15 47 15 73 -131 49 -205 -191 210 -145 -85 83 42 111
5567 111 73 -106 -156 -1 -130 -109 -41 -106 -3 125 -352 7 165 -95 97 103 7 -47 -220 31 -88 33 286
5590 286 414 71 -174 25 -115 -73 -175 -34 189 -131 -49 -18 243 -250 -76 -109 -7 -151 -155 -55 255 -31
5612 -31 -126 243 188 -221 350 62 424 163 -9 -63 -57 187 6 134 -198 -112 -142 143 152 -115 -250 119 216 -122
5636 -122 -252 23 115 21 -19 44 -185 176 159 -200 60 -6 95 -25 -20 32 -25 -129 -110 -98 254 17 -75 -101 -158
5661 -158 245 238 65 -229 205 -320 24 125 -73 22 -324 -110 55 -141 -245 89 132 -157 -235 -39 45 -17
5683 -17 -92 -80 -12 -61 96 72 95 245 -283 133 -65 -260 -139 86 67 -25 24 -150 85 261 -96 95 281
5706 281 -9 -145 72 166 2 -53 -84 14 -49 114 -180 116 -172 -245 -50 -184 -97 33 227 101 262 -53
$$ packed form
5543b3q3o1K31k59N30n81K88k69L33p3j8L2l2N8k04J80k54J4M01l55O0J68m1O9
5567A11l8j79n0J55j29K1O8o5J03J28m77L59J58k60J92Or6n4j73K51j19J21K53
5590B86J28l43k45J99j40M2j02J41K23l20Q2L1K61m93J74l3J02j44mJ00L10k86
5612c1r5L69n5m09N71k88L62k61j72n4OK44j81J28l32Q6l0K85Rk67j35L69R7l38
5636a22j30K75R2r4m0O3k29L61j7l59K60o6J01j20NN2n7j04J9J2L52k37r2k6n7
5661a58M03pj73k94M34n25L44J01j98R5l46K14J65j96j04L34M3k89p8J96Q4o2
5683a7p5J2O8m9J57k4K3J50n28M16j98j95J21K25j9r2M9j74K35J76l57J91J86
5706B81k90j36K17R4j64n5l1R8o3J63k94K96k88p3J95j34Q7J30J94j26J61l15
$$ plain form
5728 -53 72 162 109 -6 87 -115 96 201 -146 46 20 -117 136 -118 38 -85 -159 -6 2 -61 -57 274 -44 33
5752 33 159 15 -17 284 -16 85 25 67 130 1 28 197 69 -167 199 -162 -74 -59 -106 81 -11 -127 83
5775 83 -43 68 52 138 171 353 4 -204 -81 61 -98 -32 -83 50 61 48 246 -23 85 -178 115 151 -17
5798 -17 -24 -254 141 -205 71 181 299 84 -25 -41 -38 41 -140 -73 92 -73 -84 -155 -26 -67 42 -357 -76 246
5822 246 -12 80 196 126 24 77 150 -316 110 110 -35 267 41 -203 190 -78 119 -174 -139 107 -80 -32 153
5845 153 215 -383 -40 -126 -429 61 113 -91 -7 398 50 -197 -210 -37 132 -218 -352 133 -103 32 273 292
5867 292 -173 41 10 46 -117 42 7 94 -68 74 -196 -178 -37 27 74 213 -94 -247 -5 62 -46 37 133
5890 133 83 -78 -124 -82 124 -249 -221 316 267 281 -18 33 79 52 -1 2 279 203 51 -37 -30 153 -62 -97 -4 -187
$$ packed form
5728e3J25R0n3j15R3k02K11J05l47J92k6j37K53k54J56j23p4J53Qo3ML31l18P7
5752C3J26j44l2L01l00J01o0M2O3j29K7J69j28k36L66l61Q8J5m7J87r2j16K10
5775H3j26J11j6Q6L3J82l49k08J23J42j59O6n1J33J1j3J98k69J08k63K93L6j68
5798a7pk30L95l46K76J10J18k15j09j6LP9j81O7J65j65j1p1J29m1J09l99K81L22
5822B46k58R2J16p0j02N3P3m66M26%j45L02k26k44L93k68J97k93L5K46j87M8J85
5845A53O2n98L43q6l03M90N2k04Q4M05l48k47j3J73J69l50j34M85k36J35K41J9
5867B92m65K14l1L6j63J59l5Q7j62J42k70J8J41O4M7J39l07j53K42O7j08Q3R6
5890A33n0j61m6M2K06l73K8N37m9J4k99N1M6k7n3LK77p6j52q8PJ83k15l5R3j83
$$ plain form
5916 -187 45 -25 -59 -18 74 132 -39 -68 -130 131 -41 -24 -107 79 -173 257 -101 -258 -137 20 -25 -42 -215 22
5940 22 -62 -124 212 -68 248 126 -68 53 368 -79 301 47 -173 -60 -15 -175 -47 180 -30 -193 29
5961 29 129 -185 -147 -1 49 -36 -93 5 53 70 -168 8 109 84 -12 93 -73 -105 -28 -60 117 -123 -104 -313 -174
5986 -174 485 -21 -49 -1 26 -124 166 224 -32 2 -237 -76 207 72 -147 -258 170 -100 -113 -103 -170 -127 -67
6009 -67 114 -285 -45 -26 96 41 -25 99 -67 48 44 -113 -264 24 84 105 -152 -227 76 -77 168 9 67
6032 67 13 -6 -5 126 4 -65 93 159 -131 14 138 -188 81 -114 -25 151 8 19 -134 -226 -130 -135 31 234
6056 234 -101 -55 110 -90 -102 54 -136 -26 122 286 -107 -98 -237 -166 -153 103 -160 7 100 21 236 -177 -127
6079 -127 145 146 -96 12 -23 -145 -189 -32 74 417 -192 139 69 179 41 18 59 -100 -110 207 -29 -67 -91
$$ packed form
5916a87K32p0l4M1R2N8j71k9o2K61j72J7q3J86k52M30l58j57J21J57m5j7j73K37
5940B2q4o2L36k80L16j22j94J21L15m47L80k54k20J13M5j60J28K27k10j63K22
5961B9J00l14L8J46N0q5n7R8M8J7k38J76J01k5r6J05j66l2P7l2J77k40J9k09J39
5986a74O59n06k8M8K7j50K90N8k56L4k39J61K83j35k19j11M28k70j3J0o7M3O0
6009f7J81l99K40J9J22n5o6J24j66J15mj57j51K88O0K1k57p5L03j53K45j59N8
6032F7n4j9JJ31j22o9J58O6k90J45J24l26K69j95Q9J76j43J1j53r2R6nJ66K03
6056B34l35M6J65k00j2J56j90J10J48J64l93Rj39P1J3K56k63J67R3p9K15m13N0
6079a27K72Jk42J08l5j22m4J57J06L43o09L31p0J10j38k3M1j59j0L17k36l8k4
$$ plain form
6102 -91 157 164 81 49 71 -170 -41 298 -78 -27 -186 275 -102 185 150 170 62 -72 32 -40 -87 -141 59 -40
6126 -40 -64 -197 102 102 153 -68 17 -87 -195 -108 73 134 -74 125 -23 55 75 -320 -115 92 -389 -55 11 -188
6150 -188 -156 -154 -21 -67 110 92 293 -15 182 -103 -78 -112 24 251 -21 -233 -66 -138 -30 140 -16 -148 15
6173 15 -23 56 115 -233 27 9 -26 139 107 163 -193 4 170 -199 89 29 -140 -220 -240 -172 -181 118 260 -165 64
6198 64 179 -246 129 88 -67 -45 111 -34 -63 -174 136 -26 110 173 51 -243 204 233 -101 57 -140 57
6220 57 74 -62 124 242 -38 -12 -288 232 -85 -204 196 -176 -78 -55 75 59 -38 -199 -43 0 4 110 -154
6243 -154 -17 91 -339 -219 46 -266 179 9 -28 153 -51 -213 -145 -113 -155 205 -26 122 33 166 -43 -118
6265 -118 284 -48 -108 -10 177 -65 -89 -114 85 73 121 -202 107 76 188 -54 134 -163 -300 168 2 -240
$$ packed form
6102i1K48Pq3l2K2k41J29L39l76N1j59M61l77K87l5K0j08j34J04p2m7n4K00r9
6126d0k4j33K99%N1k21Q5j04j08Q7J81O1k08J99j48P8K0l95K05K07m81L34O6j99
6150a88L2KJ33m6J77j8K01l08J97k85K5l4J36K27k72k12J67p2J08J70j56j32J63
6173A5l8P9N9l48K60j8l5J65l2N6l56J97J66l69K88o0j69q0k0O8rK99J42m25K29
6198F4J15m25L75m1j55K2J56j45k9j11L10j62J36O3j22k94M47K9l34J58j97J97
6220E7J7j36J86J18k80K6k76N20l17j19M00l72R8K3J30j6r7j61J56M3MJ06k64
6243a54J37J08m30J20K65l12M45j70l7J81k04j62O8L2m2L60k31J48q9J33k09p5
6265a18M02l32o0R8J87k42k4k5J99j2M8l23L09l1J12k42J88k97j37M68j66k42
$$ plain form
6287 -240 -60 -237 -303 218 -38 -56 121 -82 45 -45 -47 -138 2 -116 235 93 226 -3 -231 73 32 -303
6309 -303 -94 42 -46 5 -308 -66 131 -154 -46 -150 52 192 85 225 66 -53 -52 -358 71 259 158
6330 158 9 45 -278 -106 73 127 92 -116 267 -70 -80 355 -225 -22 -67 -228 99 25 252 -20 -17 -127 9
6353 9 52 39 108 -122 122 115 297 222 187 -113 297 77 -56 115 -137 84 148 -85 12 170 -15 -170 58 -201
6377 -201 -161 -62 -3 156 39 -155 117 28 -195 66 9 42 217 13 48 96 -119 36 17 -187 1 63 -49
6400 -49 6 -165 233 1 224 60 243 27 101 40 233 172 -109 -280 -54 192 -175 -1 -105 -209 -169 148
6422 148 116 21 65 117 33 -127 -206 -173 71 -107 85 -223 67 102 -56 3 72 56 -276 35 215 -103 -142 -67
6446 -67 42 202 -63 -66 87 25 79 130 -56 267 -48 19 155 -131 -22 -83 -57 3 -14 163 14 269 94 -104
$$ packed form
6287b40J80j77o6N21k56j8J77k03J27r0kr1J40j18L51j42J33k29k28L04m1l35
6309c03K09J36q8N1l13K42J97k85J08j04K02J40j07J40j59j19Jl06M29J88j01
6330A58j49L6l23J72J79N4l5k08L83l37j0M35n80K03m5j61L27p4K27k72Lj10J36
6353IM3j3O9k30K44pJ82p5l5l00M10k20j33J71k52K21O4k33R7J58j85j55K28k59
6377b01M0R9N9J59j17j94K72q9k23K61n7L3J75k04L5M8k15J55j9k04J88O2j12
6400d9N5j71L98k32K23j64J83k16P4o1J93o1k81j71K26K46l67J74j04j04M0L17
6422A48l2r5M4N2q4j60p9L3K44j78J92l08K90L5j58N9O9j6l32L11J80l18l9P5
6446f7J09J60k65lJ53o2N4N1j86L23l15O7J36k86J09o1K6O0j7J77j49K55j75j98
$$ plain form
6470 -104 190 -212 91 -32 -180 -142 -87 -107 -481 64 163 -97 -51 38 -25 -224 233 30 35 -132 -110 -236 -64
6493 -64 471 166 -186 121 166 -58 94 -102 139 2 62 114 186 -21 -140 71 -314 -186 195 -127 -290 198
6515 198 160 -77 35 8 -12 83 -62 10 5 -20 -139 -66 -113 -55 169 -245 -1 5 64 -108 -175 -201 -272 -110 -170 -103
6541 -103 -70 10 79 -6 -148 82 29 -6 -71 260 131 43 26 211 -16 -118 -21 -116 -133 161 191 -85 -54 -239 -15
6566 -15 224 -93 -121 -64 185 -136 -199 -31 -47 -123 2 87 -68 -167 -239 -26 -3 -186 -263 -18 316 -148 112 357
6590 357 110 62 -33 -9 109 -102 -19 -119 10 -23 96 46 62 244 -81 344 59 -67 -35 65 40 77 -51
6613 -51 -33 104 45 105 -97 15 154 87 -388 88 -45 122 76 60 -48 28 82 -115 106 -87 -94 -40 -23 -107 -9
6638 -9 150 -55 0 43 -72 56 -186 188 155 28 178 73 57 -234 259 -43 -102 -83 -137 51 -116 204 -12
$$ packed form
6470a04K94m02L03j23j48L8N5k0l74N45R9k60M6Q9o3j99M57k03Nj67K2j26J72
6493f4N35l05l52L07M5k24J52j96K41j37O0N2P2k07j19K11l85J28L81l22j63M88
6515A98l8k37J12k7k0R5j45P2nk5j19P3m7N8K24m14K44ON9j72o7k6p1J62o0O7
6541a03L3Q0O9q5j42K30n3l5o5L31j29q8j7J85k27j02R7r5j7K94L0k76L1j85K24
6566a5K39l17k8N7K49l21o3J68j6p6J25Q5j55r9p2K13K3j83p7K45L34m64K60K45
6590C57k47m8r5K4J18k11Q3j00J29l3J19n0J6J82l25M25k85j26L2J00k5L7j28
6613e1J8J37n9O0k02J12J39o7m75M76j33J67m6j6j08P6N4j97K21j93pN4J7q4R8
6638iJ59k05N5M3j15J28k42L74l3j27J50j05j6k91M93l02n9J9n4J88j67L20k16
$$ plain form
6661 -12 -105 127 -101 231 -71 179 106 -113 155 52 -92 -205 -92 75 80 39 -74 55 -227 -284 -219 -80 68
6684 68 -15 -46 4 147 -24 -260 96 54 120 9 90 -116 -113 -155 291 99 166 3 -109 -84 -69 -37 -108 -19 -231
6709 -231 111 -3 -23 -111 61 -234 174 96 -174 24 25 31 102 -53 38 -224 -64 -137 -142 248 -139 -222 -207 11 69
6734 69 36 -189 242 158 -83 -20 -29 40 -25 255 -33 54 -107 -232 -100 -49 -343 -20 18 -265 18 132 -362 15
6758 15 29 94 -216 -350 34 178 -347 -231 30 100 1 -156 55 54 -25 -199 -59 -92 26 -24 64 -217 150 102
6782 102 43 -128 -61 -175 -27 -178 -34 -10 18 108 7 -161 -191 168 98 -294 117 54 3 34 -167 154 379
6805 379 -105 24 69 4 93 -272 158 286 70 210 36 98 106 -80 -167 41 64 -106 -260 -75 -55 134 -220
6828 -220 152 -238 -176 104 -76 -4 87 -74 205 -134 -146 16 -113 -45 25 160 146 23 -22 70 12 111 73 140
$$ packed form
6661a2r3K32k28L32l02K50p3k19K68j03j44j13J13J67Nm1j13J29k82n7O5J39J48
6684F8q3l1N0J43j71k36L56m2O6j11Q1k06Lm2M46j92O7j63j12K5J5L2p1Q9k12
6709b31L42j14k0q8J72k95M08p8k70J98JOP1j55R1k62J60p3nL90l87q3J5K18N8
6734F9l3k25M31q4k41O3rO9o5K80k88Q7j61j25J32N1k94L23L8k83K83J14m94L77
6758A5J4O5l10j34L84J44n25J16K61P0r9j57K11jp9j74J40l3J18n0Q8k81L67m8
6782A02n9j71O7j14J48j51J44K4K8R0j01j68l0L59p0l92M11o3n1L1k01L21K25
6805C79m84J29M5o5Q9l65M30J28k16J40j74O2Qj86q7K08K3j70j54J85K0J89l54
6828b20L72l90O2K80j80P2R1j61K79l39j2J62j29O8P0J35j4j23m5R2n8R9l8O7
$$ plain form
6852 140 97 -158 -62 29 -167 176 -148 114 -116 -189 110 -67 335 -34 -103 221 122 -161 -1 117 -12 102
6874 102 -5 95 229 140 319 -45 87 -22 8 -237 -36 -69 65 86 -4 263 -5 -22 -85 86 -47 -225
6896 -225 -32 174 -110 157 -109 -71 -91 49 -95 -254 28 -296 -57 -146 57 139 -135 150 354 119 -83
6917 -83 -296 116 -12 77 -167 -99 39 278 -293 72 -32 -59 125 -204 43 -39 -152 -116 49 36 118 -10 -293
6940 -293 49 82 -124 149 -15 105 -189 142 46 -81 -178 -3 35 56 57 -129 0 204 66 15 15 -29 280 66
6964 66 9 206 16 49 -142 87 203 -186 -58 -6 211 -188 187 292 171 183 -315 -71 -144 -127 226 154 -63
6987 -63 101 -218 -64 -129 190 -208 67 39 51 93 -81 -57 -85 -92 73 -62 -290 -27 33 58 -19 -198 -124 -164 -156
7012 -156 138 -80 3 166 303 -27 -40 -74 -213 -210 -45 41 35 27 130 -133 -7 140 -36 287 198 -200 21 -47
$$ packed form
6852A40m3k55R6R1j96L43l24K62k30p3K99j77M02l69o9L24r9k83J60J18j29J14
6874A02j07J00J34q9J79l64J32j09L0k45K01l3J34K1r0K67k68j7o3J71j33j78
6896b25J93K06k84K67k66L8k0J40j44j59K82l24K39q9K03Q2k74K85K04k35k02
6917h3k13M12j28Q9k44O8J38K39n71L65j04k7J84l29K47q2j13L6J65j3Q2j28k83
6940b93L42L3k06K73j64J20k94L31r6j27r7J75L8K1Jj86J29K04j38n1%m4L09k14
6964F6n7J97j90L3j91K29J16l89J28N2K17l99L75J05j21J2m98K44p3J7L53p2k17
6987f3J64l19J54o5L19l98K75k8J2M2j74K4k8pJ65j35k28K63O0K5p7j79P4m0Q
7012a56K94k18Q3J63J37l30j3l4j39LJ65Q6oqJ03k63J26J47j76L23q9l98K21o8
$$ plain form
7036 -47 147 161 104 222 94 131 77 -94 17 8 -76 -100 79 150 -166 -347 -62 208 -47 -13 136 -146 87 -364
7060 -364 63 167 -56 17 254 -53 93 -32 -222 40 47 -183 178 -49 -126 101 31 -40 164 101 -29 111
7082 111 -122 -32 -192 -91 76 330 -238 -29 -136 -74 -108 7 -42 14 -90 -244 309 143 -16 51 7 -191
7104 -191 61 -422 181 152 -185 -149 -33 -93 -139 -62 98 -2 -46 210 -170 145 303 80 129 167 -186 11 45
7127 45 -131 28 -66 146 -313 -108 55 -404 -91 -35 -103 -279 68 -24 39 -150 31 397 18 217 45 -120
7149 -120 32 -95 55 185 26 150 58 73 -173 -146 140 127 -360 73 -87 -139 -201 85 -33 85 -158 -246
7171 -246 132 319 -169 -133 -164 -246 69 53 317 -170 114 23 -218 52 271 -392 -48 147 -51 -116 -10 33
7193 33 16 107 -159 -23 252 -23 -214 140 103 644 245 -79 -59 79 -36 81 -249 -9 131 86 83 -31 -158
$$ packed form
7036d7J94J4n7J18j28L7n4j71J11rq4k4J79P1l16j81K85K70k55L4J49k82K33m51
7060c64M27J04k23P3K37l07J46j25j90K62Pk30L61k27p7K27p0p1K04o3j30J40
7082A11k33R0j60J01J67K54n68K09j07O2l4J15m9N6j04j54N53j66j59O7m4j98
7104a91K52m83O03k9l37L6J16o0m6P7J60j00m4K56l80L15J58k23M9L8l53J97L4
7127D5j76J59r4K12m59K05J63m59L13N6o8j76L47r2O3j89J81L66l79J99j72j65
7149a20J52j27J50J30j59J24r2J5k46K7K86j3m87M33j60n2o2K86j18J18k43q8
7171b46L78J87m88L6l1q2L15j6K64m87K84r1k41K70K19o63L44J95j98o5J06M3
7193C3j7R1k66J36K75k75j91L54l7N41l99l24K0J38j15J17l30K40J40m5lj14j27
$$ plain form
7216 -158 -173 -43 129 -33 -218 95 -39 -115 334 74 -152 270 -129 43 52 -90 -82 -74 -66 -283 158 4 123
7239 123 195 -77 -112 -61 62 -184 79 38 -227 80 -164 -5 61 -84 -106 -2 -171 -82 -266 -18 -12 10 91 -133
7263 -133 -137 100 -126 149 155 -70 110 -429 -7 -70 43 -120 126 -211 64 269 -58 -28 167 42 82 81 -92
7286 -92 -43 51 289 -33 233 -23 -213 -68 -148 -316 -172 -33 -80 -205 -119 185 95 146 49 30 245 -73 -96 -90
7310 -90 -127 104 57 84 64 -129 259 112 -281 24 -172 -187 -51 -37 -46 -41 98 112 35 -206 59 72 209 51 -168
7335 -168 84 229 199 -98 -190 22 58 26 44 -198 -12 -79 -3 198 -97 93 155 58 -28 -125 -20 -6 169 69
7359 69 54 109 50 -140 -49 -149 104 75 30 110 -98 351 -58 141 77 -3 -75 49 98 -50 30 -179 -289 -26
7383 -26 -113 -26 20 -198 -169 -141 70 -52 -83 -139 -92 -224 180 -207 -104 126 107 3 -4 21 -82 92 166 -414 -20
$$ packed form
7216a58j5J30J72j62j85L13j34p6M49k60k26M22l99J72Rj42QQQk17M41j54J19
7239A23P2k72l5N1J23k46K63m1k65L07k44J59O6j45k2J04j69Q9j84K48OK2Q1k24
7263a33mK37k26K75Ok25J80n39M22o3J13j63K46l37K75K05l27L0J95j25M0jj73
7286i2M9R4K38l22K66k56j90J45q0j68J44J39m7j25Q6L04r0N1r7j9K15l18k3O
7310i0l7K31m7K7k0j93L88j47l93L05j96j5J36J4rNJ39J4p7k41K65J3J37j58k19
7335a68K52J45l0k97r2K12L6l2J8k42J86o7P6K01k95J90O2r7q6r7J05J4J75j00
7359F9j5N5n9j90R1j00K53k9m5Q0k08M49m09J99o4q0p2J24M9j48Q0k09j10K63
7383b6q7Q7M6k18K9K8K11j22l1n6M7j32M04l87J03K30j9j04pK5j03J74P4n80L94
$$ plain form
7408 -20 -2 -168 -58 -35 101 -126 -30 180 61 134 -118 24 155 484 -89 276 -151 -176 16 -91 -6 -55 162
7431 162 -159 27 320 111 18 -221 -248 273 -197 60 -77 -102 5 8 -34 -130 -119 -51 -142 -74 254 83 -25 -8
7455 -8 -48 91 -27 -11 127 182 48 224 64 -98 152 127 -7 243 -75 -78 119 -56 10 80 103 -182 -377 154
7479 154 -1 199 -38 23 160 -186 -6 -40 172 -197 -150 -7 -16 -25 345 87 -34 13 -225 -54 211 128 -58
7502 -58 -117 -121 45 215 -137 -47 87 -60 364 186 198 69 116 -114 -262 98 -157 190 36 34 -181 289 229
7525 229 237 186 38 266 -138 -174 -83 -171 77 150 255 -247 -316 15 -178 -155 18 -169 -144 -245 -221 92 255 16
7549 16 -91 -7 32 -82 116 54 -16 78 -508 -178 133 -39 7 -86 54 -293 357 15 -58 -40 -261 84 181 18
7573 18 -21 182 -75 15 -29 6 44 -78 26 -41 -192 -239 -62 77 212 58 -49 -129 27 95 -30 69 12 -125
$$ packed form
7408b0J8j66J10K3J36k27R6K10j19P3k52J42J31L29n73L65m27k5J92j07Q5m9K17
7431A62l21J86K93k09r3k39k7N21m70K57j37k5J07Lm2r6J1O8r1O8L28j71j08J7
7455hm0J39j18J6J38N5j34J76j60j62K50k5j34K50l18lJ97j75O6P0K3k85j95N31
7479A54j55K00k37O1J37l46J80l4K12l69M7J43rrL70k58j21M7k38J71K65q3j86
7502e8n9mJ66J70l52R0J34j47M24j78J2j29M7k30j48L60k55L47j54kk15M70o0
7525B29Qn1j48K28m04l6R1q8K48P3J05n02o9L31j93K3J73j87K5j01K4L13J63k39
7549A6j07Q4L9j14J98o2p0R4n86L30L11j72M6r3J40l47O50l42p3J8k21L45R7j63
7573A8l9K03k57R0m4L5L8j22J04o7j51m7J77J39J35j54j07q0J56O8j25R9n7j37
$$ plain form
7597 -125 161 78 -154 -99 92 -24 -10 6 84 103 -139 0 -299 9 130 15 -166 -111 60 -78 115 76 2
7620 2 -97 -15 72 63 -204 -53 104 2 74 -116 -44 4 87 143 56 117 -95 -49 0 -23 185 -30 -18 -63 45 198
7646 198 -98 -109 92 102 -119 -187 139 -180 154 16 -288 98 56 -229 263 222 18 23 -28 188 12 -18 13
7669 13 -255 -128 -170 64 -102 212 57 81 -151 111 21 -91 -94 -199 -221 -255 -80 252 28 89 263 97 -124
7692 -124 -349 208 285 -193 -13 -250 -293 -125 28 -33 -94 -182 105 171 -15 209 -98 -19 -243 129 -130 28
7714 28 119 120 -61 39 176 -109 66 -255 -150 -246 64 -49 60 148 106 -101 129 58 1 91 -113 -405 42
7737 42 -258 109 27 265 135 -34 156 -31 17 -82 176 170 -101 -99 345 -16 188 -103 -386 -83 -193 116 136
7760 136 -1 -155 2 3 196 -132 -10 104 -84 3 -191 51 75 -154 -124 -33 10 85 25 19 -218 -378 129 223
$$ packed form
7597a25K86q3k32N5J91j16J4J6P8J9k42J39k99L08J21j15j81N5J71j38J93l9p4
7620Br9Q2Q7rk67J51J57j02P2j90P2M8Q3N6q7O1k12M6M9k3K08k15J2m5J08J53
7646A98k96j1K01J0k21o8L26l19L34j38l04L86m2k85M92m1k04Nn1K16j76l0L1
7669A3k68J27m2K34j66L14j55K4k32K62r0j12lj05k2l4J75L32k24O1J74j66k21
7692a24k25N57P7m78J80k37m3J68J53o1o1q8K87O6j86K24l07P9k24L72k59J58
7714B8R1Jj81J00J37k85J75l21J05r6L10j13J09Q8m2k07K30p1n7R0k04k92M47
7737D2l00L67q2K38j30j69J90j87M8r9K58ok71KM44l61K04k91k83L03j10L09K0
7760A36j37j54J57JJ93l28J22J14j88Q7j94K42K4k29L0R1M3P5o0ok37j60N07R4
$$ plain form
7784 223 -1 -22 -60 -61 -155 149 17 -28 171 38 -15 338 -53 129 2 -77 -85 179 -100 -106 -46 243 -133 249
7808 249 90 255 70 -175 -181 -105 162 -39 -77 37 -75 18 146 -104 -295 -62 3 -93 205 -75 -106 -196 -399
7831 -399 80 -226 -108 -205 -195 -82 72 25 -36 152 214 -121 -75 69 -88 59 -9 69 -52 120 -189 70 90
7854 90 -61 85 -45 42 -312 51 -35 160 9 260 -29 202 84 166 82 186 -243 -13 -79 45 -65 102
7876 102 -51 126 -37 -129 -15 113 80 -46 143 -12 126 24 161 94 -241 48 181 -146 -5 71 -78
7897 -78 -75 203 -117 -273 -85 -30 -140 -34 -64 135 69 124 245 -80 -155 -50 -68 409 281 -16 38 187 165 -62
7921 -62 -159 -22 12 -80 92 -181 64 64 197 -45 24 91 -88 252 64 -264 50 -229 287 89 49 -305 -108
7944 -108 4 255 49 -151 -184 11 -42 78 -61 -97 -97 -182 -184 47 156 -83 -96 232 95 -273 292 55 -106
$$ packed form
7784B23k24k1l8jr4L04j32m5J99j33n3L53l91J82j27p9qK64k79oO0K89l76L82
7808B49j59J65j85k45oP6K67k01l8J14j12R3J28k50j91K33O5r6K98k80l1r0k03
7831c99M79l06J18r7J0J13J54m7o1J88O2l35M6J44j57J47o8P8j21J72l09K59K0
7854I0j51J46j30Q7l54L63q6J95j51K51k89K31j18Q2q4J04m29K30o6J24j10J67
7876A02j53J77j63r2J14J28l3j26J89j55J38j02J37o7l35K89J33l27J41P6j49
7897g8LK78l20j56J88N5j10J06l0J99o6N5J21l25p5J05j8M77j28k97N4J49k2k27
7921f2r7J37L4r2J72k73K45%J33k42O9O7j79L40j88l28L14k79N16j98m0l54J97
7944a08J12K51k06k00l3J95n3J20j39l6%q5kK31J09k39j3L28j37l68N65k37j61
$$ plain form
7967 -106 -63 23 26 -17 157 -152 5 -174 -12 -38 41 -48 45 -145 -14 148 40 4 -119 131 -125 -215 -137 62
7991 62 13 -216 86 -127 -54 -23 -257 -28 -212 3 -36 282 41 6 -81 208 99 -115 -27 -44 -74 145 106 35
8015 35 251 -32 -119 -31 16 -65 -176 44 -5 -20 -34 132 -237 -72 -31 -226 -75 224 -28 91 -150 -80 -284
8038 -284 20 -68 -166 -54 115 -70 -56 8 -99 -93 46 -136 -53 28 144 -68 -165 -75 -131 148 275 12 153 216
8062 216 144 179 -38 122 82 162 -10 289 -5 -10 -255 -387 -82 163 17 57 317 -264 140 -213 -6 -125
8084 -125 -71 -276 293 139 -4 129 -109 10 274 75 213 -79 114 39 -79 -60 13 30 -126 -65 -267 211
8106 211 -22 -110 203 103 187 -61 110 16 -44 -166 26 129 122 34 -105 122 -166 242 -15 150 207 351 132
8129 132 -52 -180 66 121 32 86 86 -89 221 234 -137 129 -39 56 -23 18 34 24 140 -200 -160 69 35 246
$$ packed form
7967a06M3Q6Lm3J74l09J57j79J62k6P9q9R3j90J31J62j08l6j23K50k56r0P8J99
7991F2m9k29L02k13P3L1k34K29j84K15l9L18k41l5q7K89j09k14Q8j7l0K19l9p1
8015C5K16k83q7Q8M7q1j11K20m9j5j4J66l69J65M1j95J51K99k52J19k41P0k04
8038b84L04q8r8J12J69j85J4O4j07OJ39j82Q3Q1J16k12r7R0n6K79J27k63J41O3
8062B16p2L5k17J60m0Q0j72K99k94nk45j32L05K45j46M0K60n81M04l53K07j19
8084a25N4k05N69j54j43J33k38J19K64j99J38k92J93p5j18J9P3J7j56O1k02M78
8106B11k33q8L13j00Q4k48J71r4o0j22J92J03pq8j39K27k88M08k57J65N7J44k19
8129A32j84j28K46N5q9N4%j75L10J3l71K66j68R5p9M1J6j0J16l40M0K29l4K11
$$ plain form
8153 246 219 -11 25 -74 -200 139 80 -207 -50 -275 -69 -85 203 194 -156 -47 146 71 174 -49 -31 -92 -190 -94
8177 -94 64 -28 69 150 -78 -57 -153 -168 117 30 -111 30 -44 193
$$ packed form
8153B46k7k30L6r9j26L39n9k87J57k25K06j6K88rl50J09J93p5J03k23J8o1r8R6
8177i4J58r2R7Q1k28K1r6j5K85q7j41J41p4K37
8191A93
$$ Imaginary data points
##PAGE= N=2
##DATA TABLE= (X++(I..I)), XYDATA
$$ plain form
0 0 0 0 0 0 0 0 0 0 0 0 0 0 0 0 8 -8 8 -8 9 -16 16 -19 24 -28 32 -40 45 -51 57 -67 77 -88 99 -113 127 -144
36 -144 161 -179 202 -225 249 -277 307 -338 377 -416 457 -504 556 -611 674 -745 821 -904 1002
55 1002 -1107 1232 -1374 1540 -1736 1975 -2268 2639 -3132 3814 -4828 6492 -9718 18326 -92222
70 -92222 -251231 -140105 -69805 -71526 -158138 -197753 -147833 -56852 -23814 -55222 -115242 -96492
82 -96492 -9668 76513 56832 -40049 -46988 63338 129417 97112 12205 -13985 53463 107810
94 107810 85260 21516 -31258 -16667 41540 69260 7554 -87363 -77426 14021 42356 -16315
106 -16315 -92719 -87205 -3486 33252 -4738 -53079 -67655 -23532 35691 43309 -14876 -70861
118 -70861 -30044 55645 64484 -2309 -60592 -28436 54796 62132 4661 -33628 -26644 23193 60412
$$ packed form
0@%%%%%%%%%%%%%%Qj6J6j6J7k5L2l5M3n2O0p2Q5r6J08j24J44j65J87k12K40k71
36a44L05l40L81m27M74n26N84o45P15p93Q73r61J060j167J285j419J566j725J906
55A002k109K339k606K914l276L711m243M907n771O946q642J1320j6210K8044j10548
70i2222j59009J11126P0300j721q6612l9615M9920R0981L3038l1408o0020J8750
82i6492Q6824Q6181j9681r6881o939J10326O6079l2305q4907k6190O7448N4347
94A07810k2550o3744n2774J4591N8207K7720o1706r4917R937R1447K8335n8671
106a6315p6404N514Q3719L6738l7990m8341j4576M4123N9223P618n8185n5985
118g0861M0817Q5689Q839o6793n8283L2156Q3232P336n7471l8289O984M9837L7219
$$ plain form
131 60412 39659 -16078 -43439 7538 71678 55866 -14410 -52417 -3489 65388 43932 -23047
143 -23047 -47800 -23444 21073 29465 -12276 -55871 -59626 -9783 31770 -421 -61763 -71087 -7190
156 -7190 46785 12215 -43196 -41206 3721 48084 41482 -1195 -20504 584 48098 68343 24451
169 24451 -25131 -16735 41919 69424 13996 -41375 -28784 16483 38701 5745 -40770 -44696
181 -44696 -16848 17178 17798 -29109 -60302 -31408 24300 35734 -19421 -54040 -20282 29350
193 29350 40263 284 -33720 -16072 18823 38629 24153 -17833 -30663 3769 44605 36536
205 36536 -19723 -41302 572 40521 32170 -14098 -36041 -5877 26265 30003 4539 -29321
217 -29321 -25082 12758 37056 15375 -33562 -39650 6837 36156 12774 -34196 -41790 -1396 22920
$$ packed form
131F0412k0753n5737k7361N0977O4140j5812p0276l8007M8928O8877k1456o6979
143b3047k4753K4356M4517Q392m1741m3595l755M9843M1553l2191o1342r324O3897
156g190N3975l4570n5411J990M4927M4363o602m2677j9309K1088M7514K0245m3892
169B4451m9582Q396N8654K7505n5428n5371J2591M5267K2218l2956m6515l926
181d4696K7848L4026O20m6907l1193K8894N5708J1434n5155l4619L3758M9632
193B9350J0913l9979l4004J7648L4895J9806j4476m1986j2830L4432M0836q069
205C6536n6259k1579M1874L9949q351m6268k1943L0164L2142L738k5464l3860
217b9321M239L7840K4298k1681m8937o088M6487K9319k3382m6970p594M0394K4316
$$ plain form
230 22920 11714 -18195 -38281 -18717 17725 28070 546 -36403 -24134 25601 42638 10579
242 10579 -27199 -17754 26816 41502 17858 -11105 -18028 8954 33845 25368 -6790 -32447 -13798
255 -13798 25886 25095 -14390 -44165 -24174 17365 16820 -15404 -36182 -27885 3542 19155 2741
268 2741 -22352 -29738 -150 33570 23254 -12561 -25566 5269 41720 30673 -4908 -17155
280 -17155 2240 30717 30587 3507 -17550 -15768 12056 30000 5522 -29316 -32225 489 24926
293 24926 1554 -33213 -34281 -7142 16511 6219 -21245 -28616 -12618 14823 23577 -1728 -24074
306 -24074 -12548 22430 37852 8959 -18713 -7267 22343 35262 14518 -11756 -10995 7447
318 7447 24752 18444 -11726 -26248 -9642 16362 17108 -16239 -36837 -17405 10256 13688 -12935
$$ packed form
230B2920j1206k9909k0086J9564L6442J0345k7524l6949J2269M9735J7037l2059
242A0579l7778R445M4570J4686k3644k8963o923K6982K4891q477l2158k5657J8649
255a3798L9684p91l9485k9775J9991M1539n45l2224k0778Q297L1427J5613j6414
268B741k5093p386K9588L3720j0316l5815j3005L0835L6451j1047l5581j2247
280a7155J9395K8477j30k7080k1057J782K7824J7944k4478l4838k909L2714K4437
293B4926k3372l4767j068K7139K3653j0292k7464p371J5998K7441Q754k5305k2346
306b4074J1526L4978J5422k8893k7672J1446K9610J2919k0744k6274P61J8442
318G447J7305o308l0170j4522J6606K6004P46l3347k0598J9432K7661L432k6623
$$ plain form
331 -12935 -32607 -18692 5001 15492 3363 -19879 -19946 4709 26540 20163 -10820 -19044 9147
344 9147 32263 24549 -4201 -15571 4744 24274 22951 2217 -17616 -10197 12123 20352 3451
357 3451 -24892 -24629 3213 17164 884 -26590 -28262 -2095 12792 2998 -16765 -25137 -7979
370 -7979 13075 14711 -3035 -20768 -9195 19595 26006 5416 -15159 -6938 20471 27611 10334
383 10334 -8317 -9029 10384 23469 13847 -6926 -18691 -3708 18269 12941 -12018 -26741 -12754
396 -12754 11784 10133 -11979 -25319 -16828 5013 11764 -2942 -18219 -18523 2579 20232 9332
409 9332 -11236 -16116 3902 25412 16741 -6190 -12414 2683 21256 18483 -420 -11712 -5747
422 -5747 12605 20111 1947 -16570 -14582 5766 18527 2886 -18255 -17082 743 14523 5231
$$ packed form
331a2935j9672J3915K3693J0491j2129k3242o7K4655K1831o377l0983q224K8191
344I147K3116p714k8750j1370K0315J9530j323k0734j9833P419K2320Q229j6901
357C451k8343K63K7842J3951j6280k7474j672K6167J4887r794j9763q372J7158
370g979K1054J636j7746j7733J1573K8790O411k0590k0575Q221K7409P140j7277
383A0334j8651p12J9413J3085r622k0773j1765J4983K1977n328k4959j4723J3987
396a2754K4538j651k2112j3340Q491K1841O751j4706j5277l04K1102J7653j0900
409I332k0568m880K0018K1510q671k2931o224J5097J8573k773j8903j1292N965
422e747J8352P506j8164j8517J988K0348J2761j5641k1141J173J7825J3780r292
$$ plain form
435 5231 -14054 -17993 -5077 11247 11056 -7853 -18950 -9494 10293 16056 -3292 -19210 -10365
448 -10365 9451 16704 2396 -13850 -9984 6540 17916 11245 -7158 -11102 3236 19282 17458
461 17458 -3430 -13670 192 16651 16522 -2808 -15692 -6625 8153 11508 -1966 -18229 -16351
474 -16351 -809 8818 880 -18492 -21162 -2525 10296 4866 -11820 -16585 -1080 13408 12546
487 12546 -1039 -10176 -445 14977 18840 7387 -8483 -4649 13085 19278 7278 -9488 -10679
500 -10679 5916 13807 4272 -10942 -15878 -3640 8220 5310 -8641 -18921 -8909 8232 8889
513 8889 -4768 -16464 -9871 8335 12666 228 -11617 -9082 6008 13770 5604 -7231 -11259
526 -11259 1792 14761 9428 -5285 -12217 -1737 14361 12204 -2819 -10307 -3475 11196 13941
$$ packed form
435E231j9285l939J2916J6324j91j8909j1097R456J9787N763j9348j5918Q845
448a0365J9816P253j4308j6246L866J6524J1376o671j8403l944J4338J6046j824
461A7458k0888j0240J3862J6459j29j9330j2884R067J4778L355j3474j6263J878
474a6351J5542R627p938j9372k670J8637J2821n430j6686m765J5505J4488q62
487A2546j3585r137R731J5422L863j1453j5870L834J7734O193j2000j6766j191
500a0679J6595P891r535j5214m936J2238J1860k910j3951j0280J0012J7141O57
513H889j3657j1696O593J8206M331j2438j1845K535J5090P762q166j2835m028
526a1259J3051J2969n333j4713o932J0480J6098k157j5023p488O832J4671K745
$$ plain form
539 13941 1780 -9155 -7457 6901 13917 3489 -9853 -12173 322 11533 2886 -12310 -15599
552 -15599 -5253 6622 3962 -9883 -16001 -8099 6189 9077 -3020 -11472 -6695 8342 16589
565 16589 5583 -6522 -2964 9912 18288 11386 -2820 -5285 5019 14397 9948 -4272 -11483
578 -11483 -4956 6807 7610 -7733 -17239 -10731 1225 4637 -5164 -16137 -12082 731 7996 2160
592 2160 -8824 -8998 2488 13488 10234 -2644 -6007 3499 13529 13358 1064 -7827 -405 10220
606 10220 10642 1034 -9829 -7390 3442 8441 650 -11846 -11361 74 7174 2904 -9535 -12451
620 -12451 -706 7937 5920 -4033 -10212 -2792 8426 9118 -833 -9111 -4574 6326 9983 2109
634 2109 -9065 -7530 4625 9400 3138 -6191 -8464 1311 10039 6144 -3986 -8148 -626 9121
$$ packed form
539A3941j2161j0935J698J4358P016j0428j3342k320J2495J1211q647j5196l289
552a5599J0346J1875k660j3845o118P902J4288K888j2097q452M777J5037Q247
565A6589j1006j2105L558J2876Q376o902j4206k465J0304R378m449j4220p211
578a1483O527J1763Q03j5343r506O508J1956L412r801j0973M055J2813P265n836
592B160j0984j74J1486J1000l254j2878l363R506J0030j71j2294q891P422J0625
606A0220M22r608j0863K439J0832M999p791j2496M85J1435P100m270j2439k916
620a2451J1745Q643k017r953o179P420J1218O92r951q278M537J0900L657p874
634B109j1174J535J2155M775o262r329k273R775Q728l895j0130m162P522R747
$$ plain form
648 9121 8298 -1092 -8670 -3247 7648 8063 -512 -8299 -7140 3354 7560 -215 -9151 -9667 -643
663 -643 6783 2128 -7377 -10463 -1744 8073 5375 -3044 -7380 -1928 8758 9611 508 -5586 -2270
678 -2270 6995 11078 3369 -5492 -4953 3865 9567 3128 -6431 -8341 -1039 6850 3010 -7070 -10031
693 -10031 -4223 4259 4947 -4221 -9945 -4829 4734 7136 -474 -6912 -4635 4223 9593 3661 -5255
708 -5255 -4372 2954 9449 6165 -3401 -6160 249 7643 6617 -2613 -7957 -2778 4979 6393 -1821
723 -1821 -8505 -5050 2801 6059 313 -7693 -6376 1690 6602 2934 -5772 -7160 91 6756 5093
738 5093 -3511 -7274 -790 5903 6471 -921 -7005 -2715 5071 6489 1097 -6004 -4786 3446 6718
753 6718 2720 -5097 -6137 1282 6029 3760 -3620 -7001 -756 5871 4643 -2251 -7080 -2960 4500
$$ packed form
648I121q23r390p578N423J0895M15q575p787J159J0494M206p775q936n16R024
663f43P426m655r505l086Q719R817k698q419m336N452J0686Q53r103o094L316
678b270R265M083p709q861N39Q818N702o439r559j910P302P889l840j0080k961
693a0031N808Q482O88r168n724N116R563K402p610o438K277Q858N370n932q916
708e255Q83P326O495l284r566k759O409P394j026r230n344N179P757J414q214
723a821o684L455P851L258n746q006J317Q066M912l668q706j388P251O665j663
738E093q604l763O484O693N68p392o084M290P786J418n392p101J218Q232L272
753F718l998p817j040P419M747k269p380l381O245O627j228o894m829M120P460
$$ plain form
768 4500 5545 -520 -6925 -4848 3214 5762 747 -5470 -6025 1683 6282 2679 -3954 -6295 144
783 144 6556 4497 -2166 -5870 -1392 5874 5874 -897 -5310 -2912 4848 6564 369 -4966 -4270 2307
799 2307 6438 1609 -4783 -6029 -379 5287 2248 -4349 -6802 -1901 4238 3788 -2757 -6157 -2929
814 -2929 3820 5537 -46 -4994 -2918 3369 6657 2005 -3511 -3475 2297 6631 3487 -3013 -4604 -39
830 -39 5264 4011 -2757 -5849 -2285 3583 4248 -1696 -5846 -3830 2463 4784 62 -5148 -4016 1720
846 1720 5510 2105 -3715 -4347 927 5283 3978 -2703 -4709 -387 4610 4684 -1272 -5141 -1988 3169
862 3169 4708 204 -5038 -3324 2279 4694 1764 -4184 -4062 1273 4966 2883 -2827 -4860 63
877 63 4299 3549 -1798 -5274 -1957 3077 3769 -659 -5593 -3570 2447 3697 569 -4412 -3808 1633
$$ packed form
768D500J045o065o405K077Q062K548n015o217n55P708M599l603o633k341O439
783A44O412k059o663l704M478P266%o771m413K398P760J716o195n335O96O577
799B307M131m829o392j246N650N666l039o597k453M901O139m50o545l400L228
814b929O749J717n583m948K076O287L288m652n516L6N772M334l144o500j591M565
830c9N303j253o768l092L564N868O65n944m150K016O293K321m722n210J132N736
846A720L790l405n820o32N274M356j305o681k006M322M997P4n956l869L153N157
862C169J539m504n242J714N603K415k930n948J22N335L693k083n710k033M923
877F3M236p50n347l476L317N034O92m428m934K023O017J250l128m981O04N441
$$ plain form
893 1633 4732 2388 -2515 -3506 1222 5206 3740 -1173 -3846 -450 4479 3827 -801 -4473 -2300 2931
909 2931 3485 -805 -4718 -4240 896 3440 164 -4108 -4683 8 3992 1755 -2535 -4156 -229 4420
925 4420 3836 -632 -3423 -703 4321 4879 135 -3203 -2256 2688 4433 603 -3508 -3860 532 3697
941 3697 661 -3424 -4358 -913 3144 2004 -2607 -4311 -1565 2985 3134 -1220 -3497 -1763 2776 4640
957 4640 375 -3358 -1981 1849 4670 1642 -2838 -3143 577 4088 2450 -2506 -3632 -632 3100
972 3100 3241 -1424 -4065 -1336 2298 3552 -547 -3964 -2590 1195 3080 480 -3670 -3242 638 3457
988 3457 1663 -2875 -3341 248 3356 2689 -1284 -3228 -354 2910 3774 -54 -3183 -979 2786 4002
1004 4002 1311 -3040 -2293 1378 3347 1264 -2977 -3770 74 2322 1175 -2766 -4502 -1078 2506
$$ packed form
893A633L099k344m903r91M728L984j466m913k673L396M929o52m628l672K173N231
909B931N54m290l913M78N136K544l276m272n75M691L984k237m290j621L927M649
925D420n84m468k791K720N024N58m744l338R47M944J745l830m111l52M392L165
941C697l036m085r34L445M057j140m611j704K746M550J49m354k277J734M539J864
957D640m265l733J377L830K821l028m480l05L720L511j638m956j126L000L732
972C100J41m665k641K729L634J254m099l417J374L785J885k600m150M28L880K819
988C457j794m538m66L589L108o67l973j944K874L264Q64l828l129K204L765J216
1004D002k691m351P47L671J969k083m241p93L844K248j147l941j736L424L584
$$ plain form
1019 2506 2360 -1350 -3952 -1547 2274 3104 317 -2866 -1786 2214 3634 1496 -2076 -2334 1500 3757
1035 3757 2086 -1908 -2995 -140 3024 2066 -1523 -3714 -1561 2379 2089 -866 -3206 -2465 1659 2848
1051 2848 342 -2694 -2550 1070 3353 1262 -1873 -2703 275 3371 1810 -1800 -3164 -1003 2583
1066 2583 2367 -1216 -3074 -1703 1882 2647 -339 -2914 -2200 1613 3303 1151 -1816 -2307 1006 3337
1082 3337 2142 -1429 -2401 -119 2940 2560 -1022 -2971 -1035 1844 2658 -905 -3059 -2303 628 2315
1098 2315 -21 -3161 -2742 343 2498 1183 -2058 -2477 458 2887 2501 -1110 -2355 12 2763 2925
1114 2925 -171 -2588 -849 2050 2716 456 -2522 -1947 1079 2656 742 -2353 -2390 51 2368 1375
1130 1375 -2052 -2862 -495 2040 1662 -1063 -2829 -1121 1605 2289 -273 -2810 -1738 1317 2337 662
$$ packed form
1019B506j46l710k602K405L821Q30k787l183J080M000J420k138l572k58L834K257
1035C757j671l994j087K855L164r58l589k191K153L940k90k955k340P41M124J189
1051B848k506l036J44L620K283k091l135q30K978L096j561l610j364K161L586
1066B583k16l583j858J371L585P65k986k575P14L813J690k152k967m91L313K331
1082C337j195l571r72K282L059l80l582j949J936K879Q14l563k154P56K931J687
1098B315k336l140M19L085K155j315l241m19K935K429l86l611j245K367K751J62
1114B925l096k417J739K899O66k260k978N75L026J577j914l095l7K441K317r93
1130A375l427q10K367K535l78k725j766J708K726O84k562k537J072L055J020j675
$$ plain form
1146 662 -1985 -1685 1066 2558 1458 -996 -1961 549 2853 2168 -277 -1985 -336 2378 2149 0
1162 0 -2433 -1472 1251 1789 -242 -2526 -2631 600 1792 130 -2247 -2562 -224 1788 874 -1654 -2432
1179 -2432 -435 2210 1714 -259 -1748 -591 2442 2583 201 -1447 -913 1832 3129 765 -1546 -1660
1195 -1660 856 2398 926 -1550 -2307 -604 1992 924 -1588 -2475 -1390 973 1556 -962 -2559 -1410
1211 -1410 780 1873 171 -1758 -1425 731 2404 1215 -1031 -1147 531 2416 1643 -937 -1641 -413
1227 -413 1639 1783 -584 -2232 -1050 1496 1878 -97 -2318 -1477 413 1990 383 -2068 -1687 249
1243 249 1676 1112 -1137 -2030 -145 1709 1559 -691 -2011 -381 1413 2012 -16 -1732 -1130 1047
1259 1047 1889 309 -1796 -1682 412 1407 856 -1657 -1968 -56 1528 1330 -985 -1888 -173 1502 1876
$$ packed form
1146F62k647L00K751J492j100k454r65K510K304o85k445j708J649K714k29k149
1162@k433R61K723N38k031k284j05L231J192j662k377l15K338K012r14k528p78
1179b432J997K645m96j973j489J157L033J41k382j648N34K745J297k364k311j14
1195a660K516J542j472k476p57J703K596j068k512q87J085K363N83k518j597J149
1211a410K190J093j702j929L33K156J673j189k246j16J678J885p73k580p04J228
1227d13K052J44k367j648J182K546L82j975k221Q41J890J577j607k451L81J936
1243B49J427n64k249q93J885J854j50k250j320J630J794N99k028j716O02K177
1259A047Q42j580k105J14K094R95n51k513l11J912J584j98k315r03J715J675L74
$$ plain form
1276 1876 -57 -1636 -540 1593 2019 291 -1437 -1297 1067 1848 379 -1459 -1661 291 1426 606
1292 606 -1139 -1924 -678 1168 789 -522 -2020 -891 1310 1424 -22 -1385 -1004 1316 2179 711
1308 711 -774 -661 917 1748 836 -852 -1690 105 1297 1073 -1061 -1885 -1076 917 1122 -1052 -1777
1325 -1777 -1251 890 1356 -9 -1387 -1341 668 1786 657 -1087 -891 401 1876 1037 -499 -1298 -45
1342 -45 1653 1130 -517 -1338 -436 1037 1371 -224 -1604 -962 684 1740 432 -1393 -859 290 1647
1359 1647 1007 -1006 -1110 78 1476 1248 -945 -1422 -689 1105 950 -234 -1539 -947 775 1530 -87
1376 -87 -1705 -1017 579 1147 727 -821 -1122 347 1493 1123 -644 -1373 -25 1023 1060 -361 -1356 -654
1394 -654 749 906 -395 -1591 -1066 621 1076 273 -1166 -997 410 1357 692 -827 -1107 152 1310
$$ packed form
1276A876j933j579J096K133M26j728j728J40K364P81j469j838k02J952J135q20
1292F06j745p85J246J846l79j311j498J129K201J14j446j363L81K320Q63j468
1308G11j485J13J578Q31r12j688q38J795J192k24k134q24Q09J993K05k174p25
1325a777N26K141M66j365j378M6K009J118j129j744J96J292J475q39j536p99J253
1342d5J698n23j647q21R02J473L34j595j380O42J646J056j308j825N34J149J357
1359A647o40k013j04J188J398k28k193m77P33J794j55j184j305N92J722P55j617
1376h7j618O88J596N68m20j548l01J469J146l70j767p29J348J048L7j421r95P02
1394f54J403J57j301j196N25J687M55q03j439J69J407R47o65j519k80J259J158
$$ plain form
1411 1310 1012 -165 -846 34 1166 1033 -101 -1276 -955 794 776 -381 -1411 -1564 426 1102 82
1428 82 -1231 -1320 -17 1477 496 -447 -1010 -425 1536 1280 -251 -960 -343 1218 1398 385 -791 -622
1446 -622 452 1396 82 -1290 -1463 -148 884 148 -1033 -1492 -598 846 574 -634 -1019 -498 960
1463 960 1131 -107 -868 -549 851 1483 529 -976 -460 283 1642 259 -637 -795 -231 1024 811 -605
1481 -605 -1102 -505 583 515 -382 -1230 -740 835 914 171 -1216 -719 258 1072 400 -720 -1100 138 886
1500 886 555 -520 -1112 14 1112 1013 -461 -732 -535 869 920 -216 -846 -558 578 1109 257 -863
1518 -863 -810 41 849 346 -731 -911 -51 682 653 -262 -1068 -515 530 651 -265 -1116 -583 435 600 309
1538 309 -755 -756 238 1263 307 -554 -847 277 911 712 -338 -1221 -128 657 664 -381 -1294 -342 538
$$ packed form
1411A310k98j177o81Q80J132j33j134j175L21J749j8j157j030j53J990O76j020
1428H2j313q9J303J494r81r43n63N85J961k56j531p09O17J561J80j013j176J69
1446f22J074R44j314j372j73J315J032p36j181m59Q94J444k72j208l85N21J458
1463I60J71j238p61L19J400O32r54j505N16P43J359j383q96j58N64J255k13j416
1481f05m97N97J088o8q97q48M90J575P9p43j387M97R77Q14o72j120l80J238P48
1500H86l31j075n92J126J098r9j474k71J97J404N1j136o30K88J136N31q52j120
1518h63N3Q51Q08n03j077j80Q60P33k9r15q06N53J045J21r16q51N33J018J65k91
1538C09j064jR94J025r56q61k93J124O34j99j050q83J093P85Pj045r13R52Q80
$$ plain form
1557 538 670 35 -913 -649 560 1189 7 -709 -596 301 853 499 -410 -990 -103 590 716 -358 -962
1576 -962 -224 550 623 -241 -973 -410 398 753 324 -599 -497 486 777 291 -478 -609 29 973 576 -286
1596 -286 -620 -257 876 510 -58 -605 -233 243 703 -101 -1075 -400 324 856 154 -858 -573 -55 680
1615 680 257 -673 -750 29 818 677 -64 -898 -175 868 878 -97 -749 -387 457 684 330 -705 -492 379
1635 379 764 575 -397 -627 -63 239 488 -562 -953 -443 445 688 -213 -1182 -350 553 445 -41 -581 -513
1655 -513 148 578 278 -463 -424 300 561 445 -247 -383 170 638 769 -155 -666 -307 438 423 -86 -743 -493
1676 -493 466 300 76 -618 -434 -67 408 117 -270 -450 15 518 467 -330 -883 145 548 453 -142 -557
1696 -557 -177 389 698 76 -247 -389 143 587 185 -474 -620 -200 562 451 -307 -621 -133 441 39 63
$$ packed form
1557E38J32o35r48K64J209O29j182p16J13Q97N52l54r09n80Q87O93J26j074o04
1576i62P38P74P3q64p32N63Q08L55m29r23J02R83K91m86p69j31O38R44l97q62
1596b86l34L63J133l66n68n47L72M76M60q04r74O75P24N32p02j012K85N18P35
1615F80m23r30p7P79P89j41p41q34P23J043J0r75o52L62Q44K27l54j035K13Q71
1635C79L85j89r72k30N64L02K49j050l91N10Q88K43r01r69Q32R03j08m86n40O8
1655e13O61M30l00p41L9P24K61j16o92j36N53M68J31r24n11L59P45j5n09o57K50
1676d93R59j66k24o94J84L67M75k91l87j80M65N03n1p97n53J028M03r5n95m15
1696e57L80N66L09o22l23j42N32M44m02o59j46M20P62j11p58l14M88N74m02K4
$$ plain form
1716 63 -504 -430 364 795 10 -457 -601 202 558 80 -363 -492 151 718 357 -229 -469 17 690 381 -344
1737 -344 -456 -189 213 513 -80 -670 -299 217 580 -57 -372 -402 127 303 252 -443 -772 -145 861 375
1757 375 -42 -545 -249 455 234 96 -451 43 517 395 -153 -683 -292 505 157 225 -609 -607 -445 189 317
1778 317 -680 -582 15 248 345 -342 -719 -271 231 627 66 -559 -315 271 515 446 44 -63 -80 507 -74
1799 -74 -332 -323 48 321 218 -156 -429 -185 334 366 154 -493 -220 586 610 -111 -274 -259 126 370 301 -439
1821 -439 -240 169 442 472 -121 -612 -37 149 384 -154 -470 -45 202 341 -110 -606 -408 -9 441 274
1841 274 -210 -369 80 471 378 -80 -387 -7 481 160 -279 -502 -295 163 160 76 -266 -263 51 402 -108 -296
1863 -296 -223 -123 378 159 -205 -485 -224 248 243 -40 -285 -167 469 418 -24 -468 -124 266 271 -90 -509 -355
$$ packed form
1716F3n67P4P94M31p85m67j44Q03L56m78m43j29O43N67l61n86k40M86O73l09p25
1737c44j12K67M02L00n93n90L71N16L63o37l15l0N29J76n1o95l29O27J006m86
1757C75m17n03K96P04k21j38n47M94M74j22n48n30L91P97l48O8q34KJ62O34J28
1778C17r97R8N97K33R7o87l77M48N02L96n61o25K44N86K44o9m02j07j7N87n81
1799g4k58RL71K73j03l74k73K44N19L2k12o47K73Q06K4p21j63J5L85K44o9p40
1821d39J99M09K73L0n93m91N75J86K35n38l16M25K47J39m51m96J98L99M50j67
1841B74m84j59M49L91r3m58l07L80M88l21m39k23K07M58lq4l42LL14L51n10j88
1863b96P3J00N01k19l64k80K61M72nk83k45J18O36n1m42m44L44L90Nl61m19J54
$$ plain form
1885 -355 166 394 -88 -236 -448 -25 245 264 -43 -178 -25 404 314 -295 -578 -125 513 431 254 -608 -442
1906 -442 151 301 191 -455 -171 396 290 90 -191 -588 363 319 46 -138 -41 90 530 168 -185 -177 -160 268
1928 268 264 -19 -337 -375 -84 322 -150 -317 -318 -149 247 18 -96 -512 -144 428 235 -48 -198 113 219 517
1950 517 6 -192 -147 276 431 78 -309 -146 88 130 91 -25 -328 -189 182 22 -134 -253 -53 223 226 188
1972 188 -36 -275 338 209 -79 -381 -83 -89 152 27 16 -275 151 176 84 154 -183 -238 320 145 47 -183 35
1995 35 -43 294 41 -206 -164 125 101 -164 -222 -58 234 454 272 -197 -243 -164 26 113 -273 -333 -55 33 203
2018 203 -135 -307 -79 179 7 162 176 -135 -23 255 201 -25 -27 -36 513 326 -175 -429 -128 -117 331 -154
2040 -154 -223 21 26 140 -17 -154 -242 -82 206 236 -133 -500 251 59 93 -247 -130 -20 203 351 109 -143
$$ packed form
1885c55N21K28m82j48k12M23K70J9l07j35J53M29r0o09k83M53O38q2j77q62J66
1906d42N93J50j10o46K84N67j06k00k81l97R51m4k73j84R7J31M40l62l53QJ7M28
1928B68mk83l18l8K91M06m72j67jJ69L96k29j14m16L68N72j93k83j50L11J06K98
1950E17n11j98M5M23J55l53l87J63K34M2l9j16l03J39L71j60j56j19K00K76Ll8
1972A88k24k39O13j29k88l02K98oK41j25j1k91M26K5r2P0l37n5N58j75r8k30K18
1995C5p8L37k53k47M2K89k4k65n8J64K92K20j82m69m6P9J90Q7l86o0K78Q8J70
2018B03l38j72K28K58j72J55J4l11J12K78n4k26krN49j87n01k54L01J1M48m85
2040a54o9K44NJ14j57j37q8J60K88L0l69l67P51j92L4l40J17J10K23J48k42k52
$$ plain form
2062 -143 -153 200 32 -127 -276 -231 103 104 73 -355 -312 -146 224 -181 219 -275 3 -77 82 -266 -235 -417 123
2085 123 107 181 -140 -86 302 216 -155 -21 -155 67 89 164 65 -238 181 129 152 259 -334 -128 57 192 -144
2108 -144 -234 -119 161 79 113 -404 -160 167 310 378 -221 -293 135 89 149 -333 -153 33 323 340 230 -49 38
2131 38 193 152 -61 -284 -7 143 315 -131 -125 172 119 153 27 -104 -123 34 60 -25 -143 -6 -6 -59 114 -64
2155 -64 -201 -18 306 129 -39 -144 -178 -236 104 16 47 -112 4 130 -112 32 30 -247 18 49 -99 -10 -102
2178 -102 -224 44 -58 -132 -170 212 -86 116 -367 29 149 188 408 -284 -242 -129 111 154 -91 -145 68 -186
2200 -186 32 -92 -90 -447 272 39 243 -151 -228 31 369 -68 263 -85 52 185 -57 -304 -230 -130 -128 113
2222 113 -88 -117 -357 140 -7 129 -90 177 -174 64 -54 -442 -35 -66 89 143 118 -246 29 189 52
$$ packed form
2062a43j0L53j68j59j49M5L34Jl1m28M3J66L70m05M00m94K78q0J59l48L1j82N40
2085A23j6P4l21N4L88q6l71J34j34K22K2P5r9l03M19n2K3J07n93K06J85J35l36
2108a44r0J15K80q2L4n17K44L27J43O8n99p2M28m6O0m82J80J86K90J7j10k79Q7
2131C8J55m1k13k23K77J50J72m46OK97n3L4j26j31j9J57K6q5j18J37%n3J73j78
2155f4j37J83L24j77j68j05l4n8L40q8L1j59J16J26k42J44kk77K65L1j48Q9r2
2178a02j22K68j02p4l8L82k98K02m83L96J20L9K20o92M2J13K40M3k45n4K13k54
2200a86K18j24Kl57P19k33K04l94p7K59L38m37L31l48J37J33k42k47P4J00KK41
2222A13k01k9k40M97j47J36k19K67l51K38j18l88M07l1J55N4k5l64K75J60j37
$$ plain form
2243 52 119 -178 -46 17 265 -258 -110 31 -166 19 -139 59 -32 -58 -116 31 -6 -290 83 -262 -385 75
2265 75 -163 -125 -46 32 -78 -240 -148 22 12 -91 204 -58 -6 415 -170 105 249 -154 130 28 181 -339
2287 -339 20 -131 240 -100 49 -29 -81 115 -61 43 1 26 160 263 127 -153 -145 47 -41 -206 110 -255
2309 -255 -33 126 -164 -15 104 54 -7 -4 195 -355 114 161 229 -94 -297 342 -230 309 120 178 131 -137 -79
2332 -79 -363 -94 280 -2 105 -117 97 -10 78 -42 -36 -15 -35 122 -150 -182 -33 -147 59 197 33 -263
2354 -263 -34 -167 370 5 -113 -191 -106 -166 2 -2 -22 82 -120 132 -215 163 -20 -55 -34 116 -167 53 91
2377 91 -32 -236 -30 166 84 260 10 389 203 69 -10 -38 -38 -143 224 -150 234 -2 -257 68 73 64 -225
2400 -225 106 112 -259 56 -182 -46 208 -42 148 32 81 -109 122 194 -210 108 128 79 -130 -131 -40 -66 8 -187
$$ packed form
2243E2O7k97J32O3K48n23J48J41j97J85j58J98r1k6n8J47l7k84L73l45j23M60
2265G5k38L8P9P8j10j62R2J70j0j03K95k62N2M21n85K75J44m03K84j02J53n20
2287c39L59j51L71l40J49p8n2J96j76J04m2K5J34J03j36k80QJ92q8j65L16l65
2309b55K22J59k90J49J19n0o1LJ99n50M69M7O8l23k03O39n72N39j89N8m7k68N8
2332g9k84K69L74k82J07k22K14j07Q8j20OK1k0J57k72l2J49j14K06J38j64k96
2354b63K29j33N37l65j18p8Q5o0J68mk0J04k02K52l47L78j83l5K1J50k83K20L8
2377I1j23k04K06J96q2J76k50L79j86j34p9k8%j05L67l74L84k36k55L25Nrk89
2400b25L31Ol71L15k38J36K54k50J90j16M9j90K31P2m04L18K0m9k09jR1k6P4j95
$$ plain form
2424 -187 124 11 191 -193 79 -107 396 114 -46 -11 9 -97 29 -4 30 97 -27 -11 -14 172 42 10 30
2447 30 250 -16 -40 218 32 5 -35 -31 15 4 132 -99 -144 0 51 -35 205 -199 199 129 367 -116 -204 -84
2471 -84 98 52 -58 -84 31 -240 -180 158 -214 -64 43 44 186 -118 5 74 -72 34 -47 157 109 75 -88
2494 -88 70 -222 -164 41 -45 295 241 -225 214 60 116 -237 -98 35 -306 -24 210 17 -40 60 -272 26
2516 26 -170 50 287 148 -170 -22 106 -31 -197 -126 -235 -258 -141 307 180 -29 27 -173 62 40 221 -43
2538 -43 7 -141 80 -11 66 -141 -135 0 -108 199 -6 7 23 11 -219 -160 -287 157 184 -295 48 -102 -110 -51 -211
2563 -211 -181 -118 119 154 -49 275 20 -49 14 148 165 -90 62 299 -56 125 183 -310 36 128 326 17 -55
2586 -55 -14 59 51 211 19 -46 -491 -41 -18 -139 71 199 122 -25 -36 -31 116 -4 -65 -48 130 161 -152 178 162
$$ packed form
2424a87L11j13J80l84K72j86N03k82j60L5K0j06J26l3L4O7j24J6lJ86j30l2K0
2447C0K20k66k4K58j86k7m0MM6j1J28k31m5J44N1q6K40m04L98p0K38m83q8J20
2471h4J82m6j10k6J15k71O0L38l72J50J07JJ42l04J23O9j46J06q1K04m8l4j63
2494h8J58k92N8K05q6L40n4m66M39j54N6l53J39J33l41K82K34j93n7J00l32K98
2516B6j96K20K37j39l18J48J28j37j66P1j09k3J17M48j27k09N6k00K35k2J81k64
2538d3N0j48K21r1P7k07OJ35j08L07k05J3J6j2k30N9j27M44K7m79L43j50qN9j60
2563b11L0O3K37L5k03L24k55o9O3J34J7k55J52K37l55J81N8m93L46R2J98l09p2
2586e5M1P3qJ60j92o5m45M50K3j21K10J28p7j47j1NJ47j20o1J7J78L1l13L30j6
$$ plain form
2611 162 98 -334 63 91 -44 36 242 225 -218 -279 138 -241 135 306 111 -333 158 21 -49 146 -189 142
2633 142 72 -102 191 146 -202 13 -162 269 -4 167 14 -205 99 89 144 235 -174 -134 110 49 40 -93 52
2656 52 389 -89 46 -17 -71 208 -128 25 -24 75 250 96 71 -77 -104 -29 156 4 -109 -123 147 123 3
2679 3 -68 -114 -129 154 -202 127 -70 -211 -90 19 146 -49 -36 77 96 -84 -90 -229 -172 -264 199 -55 -195 -174
2703 -174 12 -194 -165 -76 -32 232 11 -78 73 32 118 -20 -92 -54 69 134 -171 -63 -320 -180 -123 37 204
2726 204 -127 -3 28 111 179 -190 -10 188 79 -290 191 -47 -277 32 350 -71 -46 -79 46 127 -233 -141
2748 -141 111 -58 425 158 -141 176 -73 9 147 175 80 149 361 16 75 -25 297 64 89 200 50 -47
2770 -47 78 -22 129 -140 9 -96 172 -229 -213 -141 -95 -32 -61 7 -258 -162 79 36 -75 176 -49 204 -185
$$ packed form
2611A62o4m32L97K8j35Q0K06j7m43o1M17l79L76J71j95m44M91j37p0J95l35L31
2633A42p0j74K93m5l48K15j75M31k73J71j53k19L04j0N5R1m09M0K44o1rj33J45
2656E2L37m78J35o3n4K79l36J53m9R9J75j54k5j48k7P5J85j52j13j4K70k4j20
2679Cp1m6j5K83l56L29j97j41J21J09J27j95J3J13J9j80oj39N7r2M63k54j40K1
2703a74J86k06K9Q9M4K64k21q9J51m1Q6j38p2L8J23O5l05J08k57J40N7J60J67
2726B04l31J24L1Q3O8l69J80J98j09l69M81k38k30L09L18m21K5l3J25Q1l60R2
2748a41K52j69M83k67k99L17k49Q2J38K8r5O9K12l45N9j00L22k33K5J11j50r7
2770d7J25j00J51k69J49j05K68m01J6P2M6O3k9O8k65R6K41m3j11K51k25K53l89
$$ plain form
2793 -185 -62 -52 -69 182 243 163 46 -125 -25 133 163 39 -167 206 177 29 -250 12 26 -81 -77 21 -182
2816 -182 167 42 87 100 45 -48 165 63 -40 181 47 -58 99 57 -159 50 98 -13 132 -312 -202 182
2838 182 -27 40 69 -167 33 96 -4 -21 -240 -72 -191 80 171 -11 100 -230 332 139 -52 57 -60 -71
2860 -71 -13 200 235 87 -15 -5 310 -84 7 53 -71 4 65 57 89 123 -33 -25 -99 -63 -221 0 16 -140 52 119
2886 119 -179 101 -80 -208 -285 -13 -154 -187 181 108 117 174 100 -124 -320 53 -29 -118 -294 -44 43 162 321
2909 321 -101 -179 -150 97 289 -129 177 66 113 273 -10 279 -169 -49 -78 226 133 187 -11 127 123 -29 -159
2932 -159 -292 178 118 0 -31 72 -120 -53 -215 11 38 -96 54 -212 272 -149 538 -103 36 181 -66
2953 -66 -126 -87 -161 -6 -212 -1 -70 234 -90 -214 -200 54 296 132 -149 86 -286 -53 -150 -105 -179 -256 -77
$$ packed form
2793a85J23J0j7K51O1q0j17j71J00J58L0j24k06L73k9j48k79K62J4j07MR8k03
2816a82L49j25M5J3n5r3K13j02j03K21j34j05J57m2k16K09M8j11J45m44J10L84
2838A82k09O7K9k36K00O3j00j7k19J68j19K71R1j82J11l30N62j93j91J09j17j1
2860g1N8K13L5j48j02J0L15l94R1M6j24P5O1qL2L4j56Qp4L6j58K21J6j56J92O7
2886A19k98K80j81j28p7K72j41l3L68p3RN7p4k24j96L73q2q9j76K50Q7J19J59
2909C21m22p8K9K47J92m18L06j11M7J60k83K89m48J20k9L04r3N4j98J38mj52j30
2932a59j33M70o0j18l1J03j92O7j62K26K7j34J50k66M84m21O87o41J39J45k47
2953f6o0L9p4J55k06K11o9L04l24j24J4K54K42j64k81K35l72K33r7M5p4p7J79
$$ plain form
2976 -77 138 -26 -225 -49 -69 -72 -209 -129 -146 -80 -112 155 -103 51 42 -196 -39 -63 -54 -27 198 -28 -59 -51 -228 -192
3002 -192 106 115 47 -138 -11 53 -231 77 -126 -82 109 17 -32 124 -33 -179 -148 -146 -43 -227 100 -266 -36
3025 -36 -157 8 -97 140 77 -219 -29 78 -293 115 77 -11 -112 -347 -16 -81 38 41 31 -85 -169 35 57
3048 57 -200 -6 -72 -139 278 58 -33 -141 7 -111 -168 235 -48 182 -47 39 89 227 310 -46 147 -105 -74
3071 -74 -24 7 -61 41 102 -172 121 38 162 91 -113 246 -237 -217 223 103 -5 178 -77 109 384 116 155
3094 155 -2 91 201 -119 -314 209 17 145 105 174 -254 115 156 45 -166 -267 387 281 271 16 -244 -28
3116 -28 41 160 -54 -25 211 101 41 -113 157 328 283 -10 256 33 94 2 96 65 -218 169 -82 -194 -87
3139 -87 18 119 -55 -86 -170 -177 -141 -188 -98 70 46 18 186 132 220 -27 27 -78 -17 34 -37 -220 -234 -173 217 -153
$$ packed form
2976g7K15j64j99J76k0lj37Q0j7O6l2K67k58J54rk38J57k4RK7K25k26l1Qj77L6
3002a92K98Ro8j85J27O4k84L08k03M4J91r2m9J56j57j46L1KJ03j84L27l66K30
3025c6j21J65j05K37o3k96J90J07l71M08l8q8j01k35L31o5J19Lj0j16q4K04K2
3048E7k57J94o6o7M17k20r1j08J48j18n7M03k83K30k29Q6N0J38Q3l56J93k52L1
3071g4N0L1o8J02O1k74K93q3J24p1k04L59m83K0M40j20j08J83k55J86K75k68L9
3094A55j57R3J10l20j95N23j92J28m0O9m28L69M1j11k11j01O54j06j0k55k60K16
3116b8O9J19k14K9K36j10o0j54K70J71m5k93K66k23O1r2R4l1k83L87k51j12J07
3139h7J05J01j74l1q4pL6m7R0J68k4k8J68n4Q8k47N4j05O1N1p1j83j4O1L90l70
$$ plain form
3165 -153 38 -72 -28 -79 -79 244 166 20 -134 9 115 9 -121 -119 179 281 -291 -34 208 20 -13 -12 -18 165
3189 165 -196 85 -44 -182 41 175 102 28 134 -241 -239 9 266 37 -28 90 69 12 -421 67 -53 -99 387
3212 387 74 -425 -103 68 -109 -126 -34 -182 165 -141 123 164 41 -77 6 -108 -17 82 209 325 70 -107
3234 -107 -58 81 140 -17 -69 -44 -30 236 -118 -105 99 -109 -7 -252 -131 -171 75 189 -80 281 -105 -164 46
3257 46 48 -189 -45 -121 -150 260 -105 -30 -150 -139 -144 18 -194 59 -411 141 26 82 261 145 238 -124 50 155
3281 155 -50 -176 17 218 12 -124 -112 142 222 55 -419 52 -100 97 231 105 -147 -120 18 -82 281
3302 281 70 -206 -212 115 45 52 327 -76 21 162 -156 -39 67 -53 -23 -254 -35 -56 -31 -81 15 -377 -60 -203
3326 -203 -90 56 55 60 78 52 -162 3 -114 180 13 -87 90 193 179 98 -37 -41 23 -61 207 -75 174 51
$$ packed form
3165a53J91j10M4n1%L23p8j46j54J43J06j06j30KK98J02n72K57K42j88l3JoJ83
3189A65l61K81j29j38K23J34p3p4J06l75KK48K57k29o5J18k1n7m33M88j20m6M86
3212C87l13m99L22J71j77j7R2j48L47l06K64M1j23j18Q3j14R1R9J27J16k55j77
3234a07M9J39N9j57n2K5J4K66l54J3K04k08J02k45J21m0K46J14k69L61l86n9K10
3257D6Kk37J44p6k9M10l65P5j20J1nJ62k12K53m70N52j15N6J79j16R3l62J74J05
3281A55k05j26J93K01k06j36J2K54Q0j67m74M71j52J97J34j26k52K7J38j00L63
3302B81k11k76oL27p0PK75m03R7J41l18J17J06j20L0k31K19k1K5n0R6l92L17j43
3326b03J13J46jNJ8k6k14J65j17K94j67j00J77J03j4q1j35mO4q4K68k82K49j23
$$ plain form
3350 51 82 57 -47 -68 146 -293 25 224 77 -20 232 -148 50 14 396 -14 32 171 152 -177 -77 110 309
3373 309 7 177 -67 55 83 233 -155 -105 -640 48 348 -204 -68 -4 274 -239 65 72 107 87 -44 -46 127
3396 127 138 -73 53 234 -112 -162 62 -145 -11 67 -87 -90 -343 187 241 66 -33 -71 -98 76 -64 -192 -28
3419 -28 -137 -23 22 -284 241 -225 -14 175 42 -24 189 28 -79 -158 -4 135 -2 -129 -15 -103 80 -3
3441 -3 10 -32 -369 28 51 78 81 219 -118 50 -30 92 -45 97 -16 107 -50 -127 257 -234 -154 -17 -40 -173
3465 -173 98 -1 48 -336 323 -184 -140 -130 -84 -262 81 -20 72 134 164 171 6 -99 27 188 110 82 420 -8
3489 -8 -249 -84 89 -121 -78 -191 -89 87 -242 -68 214 -41 -108 72 -197 395 164 -52 -165 -236 -119 239
3511 239 29 -51 149 -19 20 74 81 110 5 292 -118 -48 -59 46 104 108 125 -224 -454 -59 67 -131 111 120 180
$$ packed form
3350E1L1k5j04k1K14m39L18J99j47r7K52l80J98l6L82m10M6J39j9l29J00J87J99
3373C09l02J70k44J22K8J50l88N0n35O88L00n52J36O4K78n13L04PL5k0j31kJ73
3396A27J1k11J26J81l46n0K24k07J34P8j54lk53N30N4j75r9l8k7J74j40j28J64
3419b8j09J14M5l06N25m66K11J89j33o6K13j61j07p9J54J39j37j27J14q8J83q3
3441cJ3m2l37L97K3K7LJ38l37J68q0J22j37J42j13J23j57p7L84m91Q0J37k3j33
3465a73K71r9M9l84O59n07M4J0M6j78L43j01R2O2L0Pj65j05J26J61p8k8L38m28
3489hk41J65J73k10M3j13J02J76l29J74K82k55o7J80k69N92k31k16j13p1J17L58
3511B39k10q0K00j68L9N4PK9j05K87m10P0j1J05N8MJ7l49k30L95J26j98K42RO0
$$ plain form
3536 180 -76 112 -72 -10 29 -24 -202 4 -36 0 298 63 -37 170 248 -83 29 -371 -128 170 80 38 41
3559 41 135 50 3 -271 -45 -78 -224 193 32 205 168 -100 -20 113 39 82 82 -128 -153 -26 -54 85 -148 65
3583 65 -166 -121 70 -165 106 85 190 136 213 -145 146 -36 53 -123 116 21 39 59 -26 24 -123 -52 -322 137
3607 137 -66 1 79 42 -10 -182 164 176 -82 109 -76 87 -82 -53 -110 -48 9 143 178 -46 -220 201 102 -73
3631 -73 -138 211 43 -61 63 37 -391 -160 -207 -120 -134 -128 189 134 21 -69 -148 -159 -19 160 -34 98 4 -185
3655 -185 50 46 294 -32 -4 -41 -17 -247 -22 -207 -143 30 100 -26 202 219 -115 201 66 28 -88 407 -63
3678 -63 115 -138 -226 -52 12 -115 -138 116 -68 -345 154 121 87 -88 -85 -13 -74 93 -169 155 158 229 -24 -28 -151
3703 -151 86 -148 91 52 -175 83 84 -332 -279 -146 257 12 85 197 138 -170 -150 77 -121 -46 96 -121 60
$$ packed form
3536A80k56J88j84O2L9n3j78K06m0L6K98k35j00K07P8l31J12m00K43K98r0m2L
3559D1R4q5m7k74K26l3j46M17j61J73l7k68Q0J33p4M3%k10k5J27k8J39k33K13
3583F5k31M5J91k35K71k1J05n4P7l58K91j82Q9j76K39r5J8K0q5N0j47P1k70M59
3607A37k03O7P8l7n2j72L46J2k58J91j85J63j69K9n7O2N7J34L5k24j74M21r9j75
3631g3o5L49j68j04J24k6m28K31m7Q7j4OL17n5j13r0p9j1J40J79j94J32r4j89
3655a85K35mK48l26K8l7K4k30K25j85O4J73P0j26K28J7l34L16j35l8j16M95m70
3678f3J78k53q8J74O4j27k3K54j84k77M99l3l4j75LP2o1J67k62L24LP1k53mj23
3703a51K37k34K39l9k27K58Jm16N3J33M03k45P3J12n9l08K0K27j98P5J42k17J81
$$ plain form
3726 60 10 -180 114 -320 -73 82 27 188 101 -156 1 61 -17 39 -110 106 -123 78 142 -270 146 -292 124
3749 124 33 -73 80 29 106 -78 -57 90 -82 -104 140 71 26 -328 -48 12 214 -56 -178 208 101 -45 -47
3772 -47 -149 -35 -33 268 78 -48 -45 6 -158 94 -76 -26 -69 -129 30 -143 117 -110 -30 23 121 31 18 -121 113
3797 113 39 -376 155 -166 -161 49 21 83 -80 -48 -149 -71 253 -70 84 153 -222 -68 -97 215 -43 -245 -234
3820 -234 -105 100 41 -66 -193 137 -166 -33 -214 -281 -125 -78 -157 85 -162 -41 47 -281 73 55 -37 -7 191
3843 191 308 -314 137 -176 89 245 -101 -55 40 172 39 -140 -276 -77 -35 178 -83 -190 126 -56 -237
3864 -237 187 -141 -9 -66 22 147 -59 -158 -109 -297 109 -5 77 -202 -23 -212 74 -71 66 16 310 -62
3886 -62 83 246 -71 -45 92 64 -290 11 130 259 105 -99 -159 -39 2 -125 -281 162 -42 224 271 -24
$$ packed form
3726F0n0j90K94m34K47J55n5J61q7k57J57O0p8N6j49K16k29K01O4m12M16m38M16
3749A24r1j06J53n1P7j84K1J47j72k2K44o9m5l54K80O0K02k70j22L86j07j46k
3772d7j02J14KL01j90j26LN1j64K52j70N0m3o0J59j73K60k27Q0N3R8r0j3j39K34
3797A13p4m15N31l21NK10k8O2j63L2j01P8L24l23J54O9l75J54k9L12k58k02J1
3820b34J29K05n9j07j27L30l03J33j81o7J56M7p9K42k47J21Q8l28L54j8r2L0J98
3843A91J17o22M51l13K65J56l46M6R5J32j33j79j36J99M2K13k61j07L16j82j81
3864b37M24l28J32n7Q8J25k06r9M9j88M06j14Q2k79J79j89K86j45J37n0K94l72
3886f2J45J63l17K6J37k8l54L01J19J29j54k04o0J20M1j27j56M43k04K66M7k95
$$ plain form
3908 -24 -22 111 -138 226 64 204 -86 -176 137 -141 72 149 -38 106 144 28 3 -79 -42 30 -193 86 -10 -85
3932 -85 -201 42 -50 -85 -49 -158 59 -110 98 144 96 -158 -57 87 77 -84 -58 -50 -239 -137 109 0 236
3955 236 -191 -85 -203 139 -36 -71 -5 -15 174 95 169 -304 -114 24 -12 -164 169 54 -66 -326 -372 -98
3977 -98 -94 -273 -80 -80 -1 84 115 13 12 0 -30 30 -118 -130 -124 10 182 11 51 25 186 -9 -18 21 -30 107 201 -216
4005 -216 129 -144 -176 -116 104 -51 -61 -367 18 383 12 -63 126 284 -107 -74 -49 29 -131 46 -207 15
4027 15 -96 -241 234 -71 52 149 -10 -14 120 -1 26 -85 53 140 129 56 -44 30 77 -8 -138 -86 -118 62
4051 62 -33 29 -118 -26 299 -28 201 31 -39 -55 -217 136 15 98 -200 -123 -181 95 -45 121 139 -236 -322 -24
4075 -24 81 -246 -318 117 -22 -20 -152 -83 138 -43 155 139 -72 -214 69 0 -144 -86 -74 335 58 79 48 211
$$ packed form
3908b4KJ33k49L64j62J40k90r0L13k78K13P7j87J44L8j16k5q2L7P2k23K79r6p5
3932h5j16K43r2l5L6j09K17j69K08M6m8k54J01J44j0j61K6Qj89J02K46j09K36
3955B36m27J06j18L42j75l5O6j0J89p9P4m73J90J38l6j52L33j15j20k60m6K74
3977i8Mj79J93%P9Q5L1j02jj2l0O0j48j2OJ34J72j71M0k6J61j95rL9n1J37R4m17
4005b16L45k73l2O0K20j55j0l06L85L65l71p5J89J58l91L3K5P8j60J77k53K22
4027A5j11j45M75l05J23R7j59mJ34j21K7j11J38Q7j1p3j00P4M7q5j30N2l2J80
4051F2r5O2j47R2L25l27K29j70p0j6j62L53j21Q3k98P7n8K76j40J66J8l75q6K98
4075b4J05l27p2M35j39Kj32O9K21j81J98j6k11j42K83o9j44N8J2M09k77K1l1J63
$$ plain form
4099 211 -50 6 -171 148 -116 118 -128 -47 -70 -96 -24 3 -54 63 31 -95 -187 -133 288 19 130 113 122 199 235
4124 235 37 -83 -206 -85 150 162 246 51 68 201 -104 174 -30 -94 232 153 -182 -117 258 -60 38 -142
4146 -142 -28 67 -151 24 -5 -44 -88 12 -52 -246 -17 -94 88 137 25 -143 89 -163 63 -147 -88 2 66
4169 66 244 -171 -80 79 -42 -147 485 26 17 53 -25 136 -78 261 -132 36 250 220 110 12 -77 23 -189
4192 -189 66 18 -207 -166 -64 -236 107 231 241 262 52 -153 -242 222 -50 -134 -156 2 161 -3 193 202 64
4215 64 -168 -182 25 -150 -41 32 -74 -86 140 150 31 46 46 253 -91 208 220 185 198 257 257 -28 -98 375 -106
4240 -106 -172 -137 -62 -143 -107 -35 -222 -102 -165 124 -72 -52 -79 -5 43 145 -69 -159 -53 262 -15 137 39 -242
4264 -242 83 85 -30 160 218 -118 170 132 110 -92 -238 6 -165 77 -84 -118 -149 -67 24 -136 -56 -153 131 -24
$$ packed form
4099B11k61N6j77L19k64K34k46Q1k3k6P2K7n7J17l2j26r2N4M21k69J11j7RP7L6
4124B35j98j20j23J21K35J2Q4j95J7J33l05K78k04o4L26p9l35O5L75l18R8j80
4146a42J14R5k18J75k9l9m4J00o4j94K29p7J82M9j12j68K32k52K26k10N9R0O4
4169F6J78m15R1J59j21j05O32m59rL6p8J61k14L39l93J68K14l0j10r8q9J00k12
4192a89K55m8k25M1J02j72L43J24J0K1k10k05q9M64k72q4k2J58J59j64J96Rj38
4215F4k32j4K07j75J09P3j06j2K26J0j19J5%K07l44K99J2l5J3N9%k85p0M73m81
4240a06o6L5P5q1L6P2j87J20o3K89j96K0k7P4M8J02k14r0J06L15k77J52r8k81
4264b42L25Kj15J90N8l36K88l8k2k02j46K44j71K42j61l4l1Q2R1j60Q0r7K84j55
$$ plain form
4288 -24 -65 57 215 -189 121 195 117 59 42 54 -46 -250 -77 -131 183 139 175 126 15 -202 -267 -100 52 166
4312 166 -81 61 -220 -192 65 9 -183 65 -54 -162 104 209 -10 -192 -128 -106 3 118 -129 3 38 232
4334 232 -90 1 200 76 195 -36 -50 -37 -131 -289 103 -12 242 -4 174 82 -66 -17 -123 176 5 53
4356 53 160 -60 70 91 156 22 373 78 322 165 -63 118 103 20 -79 -383 172 -273 -4 293 173 106
4378 106 137 234 -15 203 126 170 89 -88 -199 398 171 -304 -84 7 -86 15 19 18 276 39 -49 18 -333 -22
4402 -22 78 58 136 205 98 87 81 -28 67 -38 -47 -98 182 -151 205 62 195 -85 -76 14 26 -1 4 -134 147 275
4428 275 -199 -99 -100 -71 -167 -29 72 108 -64 5 42 -128 -4 280 -161 137 109 83 -200 -138 -198 -232 34 -281
4452 -281 -184 -77 30 313 -161 140 -8 294 -85 -283 -31 -78 114 226 253 120 117 158 89 138 -90 152 102
$$ packed form
4288b4m1J22J58m04L10P4p8n8j7J2j00k04J73n4L14m4L6m9j11k17o5J67J52J14
4312A66k47J42k81K8K57n6j92K48j19j08K66J05k19j82O4K2J09J15k47J32L5J94
4334B32l22R1J99j24J19k31j4J3r4j58L92j15K54k46J78r2j48M9j06K99j71M8
4356E3J07k20J30K1O5j34L51k95K44j57k28J81j5q3r9l04N55m45K69K97j20o7
4378A06L1R7k49K18p7M4q1j77j11N97k27m75K20R1r3J01MjK58k37q8O7l51L11
4402b2J00k0P8O9j07j1oj09R5j05rn1K80l33L56j43J33k80RR0J2k7Nj38K81J28
4428B75m74J00jK9r6J38J01L6j72O9L7j70J24K84m41K98k8k6k83O2o0l4K66l15
4452b81R7J07J07K83m74L01j48L02l79j98K52m7J92J12K7j33lM1o9M9k28K42n0
$$ plain form
4475 102 -145 167 -301 169 -11 0 -52 169 -64 -195 30 185 -24 -153 209 18 20 -4 183 -204 130 -79
4497 -79 143 -16 53 72 -94 23 -29 -167 -99 210 11 -365 -295 -60 -71 -114 -20 -134 -89 0 -52 147 -233 246
4521 246 -456 95 176 -67 61 -87 58 106 170 67 -13 -14 -83 -76 -82 -9 -116 311 8 -112 171 190 233 -180 -271
4546 -271 -125 -134 -153 80 132 -243 106 -83 5 -87 109 77 -170 231 -109 9 43 -142 -197 187 341 -149 199
4569 199 42 -173 38 -73 -131 -10 30 -253 -228 94 -178 -62 264 -189 -249 10 30 115 71 171 84 -174 -45
4592 -45 -25 -90 95 117 87 73 32 61 -1 -177 -17 1 -37 -108 -39 -215 -50 -30 -78 -87 48 -97 186 -43 96 -169
4618 -169 -73 -230 -160 121 -118 191 17 327 -68 -30 25 -117 20 80 -2 10 23 275 -239 -185 -86 98 126 -9
4642 -9 -123 -34 38 33 -60 -117 -337 -195 83 -171 -327 95 -88 -86 -303 226 2 -46 -151 21 156 -34 -120 8
$$ packed form
4475A02k47L12m68M70j80J1n2K21k33j31K25J55k09j29L62j91Kk4J87l87L34k09
4497g9K22j59O9J9j66J17n2j38O8L09j99l76P0K35j1m3R4j14M5Q9n2J99l80M79
4521B46p02N51Q1k43J28j48J45M8O4j03q0jo9PoP3j07M27l03j20K83J9M3m13r1
4546b71J46rj9K33N2l75L49j89Q8r2J96l2k47M01l40J18L4j85n5L84J54m90L48
4569A99j57k15K11j11n8J21M0k83K5L22k72J16L26m53o0K59K0Q5m4J00q7k58J29
4592d5K0o5J85K2l0j4m1K9o2j76J60J8l8p1O9j76J65K0m8rJ35j45K83k29J39k65
4618a69R6j57P0K81k39L09j74L10l95L8N5j42J37O0q2J2J3K52n14N4R9J84K8j35
4642ij14Q9P2nr3n7k20J42K78k54j56M22j83Kk17N29k24m8j05J72J35j90q6J28
$$ plain form
4666 8 23 -6 -3 -216 -103 -26 -142 -219 171 -175 -100 -132 8 -2 -66 -11 -54 -114 -117 108 -45 85 8 -249 -9 241
4692 241 290 -214 -17 125 122 65 142 151 56 -55 27 -85 -50 0 -105 -178 -114 227 237 -68 237 -74 19 -31 18 -94
4718 -94 58 -205 22 182 48 152 -387 -20 -109 74 136 -154 -72 -117 -47 -2 60 -138 -249 -39 29 -23 27 -45
4742 -45 114 241 -118 166 45 -103 176 -131 -16 44 49 -245 -62 -49 -149 126 -43 -36 -149 121 -112 31
4764 31 -243 259 35 33 -73 -16 -22 -98 9 141 115 -92 104 -44 224 257 -175 187 148 -126 85 57 157 -142
4788 -142 -120 193 -110 -2 66 120 27 -41 82 -133 -93 -74 111 77 -178 143 -69 193 35 -120 -15 -311 -17
4811 -17 -228 -83 -161 -56 120 240 -31 99 68 28 121 -195 96 0 28 -84 130 112 -45 -146 7 295 10
4834 10 155 215 64 406 105 -55 -51 287 -34 136 272 38 84 -153 -135 43 -116 31 304 -215 59 221
$$ packed form
4666HJ5k9Lk13J13P7j16p7L90l46P5l2J40j0o4N5m3o0lK25j53J30p7k57K40K50
4692B41M9n04J97J42ln7P7Rr5j11Q2j12L5N0j05p3O4L41J0l05L05l11R3n0M9j12
4718i4J52k63K27J60j34J04n39L67q9J83O2k90Q2m5P0M5O2j98j11K10O8n2N0p2
4742d5J59J27l59K84j21j48K79l07J15O0Nk94J83J3j00K75j69Pj13K70k33J43
4764C1k74N02k24kj06N7op6J07J32k6k07J96j48K68L3m32L62l9k74K11k8J00k99
4788a42K2L13l03J08O8N4r3o8J23k15M0J9J85l4k55L21k12K62j58j55J05k96K94
4811a7k11J45p8J05J76J20k71J30l1m0R3l16K91r6K8j12K14j8j57j01J53K88k85
4834A0J45O0j51L42l01j60ML38l21J70J36k34M6k37J8J78j59J47K73n19K74J62
$$ plain form
4856 221 248 19 86 -212 -58 -30 27 -154 40 197 -179 125 -31 56 -73 -132 -23 78 76 -94 165 143 40
4879 40 -160 102 279 -178 -103 -77 33 39 166 2 -63 10 192 16 230 -151 134 -58 -113 219 145 149 -257 -1
4903 -1 -203 76 93 93 212 -196 -25 -115 -193 -304 -42 -135 93 -131 179 120 -158 -123 177 171 -295 -188 157 -131
4927 -131 142 193 22 251 -72 -42 186 -49 -212 95 -260 17 54 89 10 -126 -129 -82 86 75 49 -70 115
4950 115 83 -98 113 86 46 -59 -230 6 90 -196 -299 22 -117 298 17 105 -112 -147 282 -132 -293 116
4972 116 -104 -39 170 165 -84 -54 170 122 -3 67 -154 -185 -117 -95 -23 -266 63 -74 -92 -26 101 -53 122 132
4996 132 -34 -175 -158 155 4 109 -14 -13 28 104 9 -135 59 -8 -85 -104 -57 66 82 -345 15 -200 -171 82
5020 82 229 66 -135 60 -56 75 73 -101 16 -257 -151 -106 4 -150 262 -146 158 200 -69 -116 42 -78
$$ packed form
4856B21K7k29O7k98J54K8N7j81J94J57l76L04j56Q7j29n9J09J01kj70K59k2j03
4879D0k00K62J77m57P5K6J10OJ27j64o5P3J82j76K14l81K85j92n5L32p4Mm06K56
4903ak02K79J7%J19m08J71r0p8j11K62r3K28k24L10n9k78L5L00om66J07L45k88
4927a31K73N1j71K29l23L0K28k35j63L07l55K77L7L5p9j36lM7J68j1k6j19J85
4950A15l2j81K11k7m0j05j71K36Q4k86j03L21j39M15k81Q8k17l5M29m14j61M09
4972A16k20O5K09nk49L0K24m8j25P0k21l1O8K2P2k43L29j37j8O6J27j54J75J0
4996A32j66j41J7L13j51J05j23JM1P6r5j44J94o7p7j9M7J23J6m27L60k15K9K53
5020H2J47j63k01J95j16J31kj74J17k73J06M5J10j54M12m08L04M2k69m7J58j20
$$ plain form
5042 -78 -171 -259 -13 -81 344 78 208 283 188 187 96 13 -21 3 -16 265 -41 149 -73 278 53 144 -199 2 217
5067 217 -135 -61 -3 10 -114 -105 -136 151 -130 -217 101 70 181 25 5 19 -234 115 45 -40 206 -58 -58 62 349
5092 349 21 -194 -80 -163 152 217 -49 -227 30 -69 105 -61 38 -113 279 128 116 -24 -33 -214 66 19 55
5115 55 101 273 108 -70 78 -69 -47 -87 -2 109 -4 20 -66 22 87 24 27 82 148 -178 -100 83 64 -123 -93 159
5141 159 192 57 343 -57 226 97 -113 -7 -52 111 104 168 -312 117 -16 74 83 -11 -87 65 -97 -89 139 -77
5165 -77 -48 35 92 -239 -7 36 -109 59 113 241 262 9 87 -115 11 236 26 81 -104 -403 -157 381 254
5188 254 105 -12 107 188 13 -253 169 161 311 -199 31 74 -124 -124 95 197 -175 -221 67 -135 -11 42 176
5211 176 86 134 -167 -148 -169 -25 -14 18 -169 77 169 157 1 -100 -98 154 -25 -95 35 -263 -70 -107 -127 -46 39
$$ packed form
5042g8r3q8K46o8M25k66J30P5r5jr1q3l4K4j9K81l06J90k22L51k25R1l43K01K15
5067B17l52P4N8J3j24Rl1K87k81q7L18l1J11j56k0J4k53L49p0q5K46k64%J20K87
5092C49l28k15J14q3L15O5k66j78K57r9J74j66R9j51L92j51j2j40rj81K80m7L6
5115E5M6J72j65j78J48j47K2m0Q5J11j13K4q6Q8O5o3LN5O6l26P8J83j9j87L0K52
5141A59L3j35K86m00K83j29k10J06m5J63pO4m80M29j33R0Rr4p6J52j62QK28k16
5165g7K9Q3N7l31K32M3j45J68N4J28K1k53P8k02J26K25k10N5j85k99K46N38j27
5188B54j49j17J19Q1j75k66M22qJ50n10K30M3j98%K19J02l72m6K88k02J24N3J34
5211A76r0M8l01J9k1J44J1L2j87K46R2j2j56j01KK52j79p0J30k98J93l7k0Q1Q5
$$ plain form
5236 39 -11 73 -190 -19 -14 -140 67 253 124 30 86 -172 70 2 3 122 135 79 -155 -44 -160 294 116 102
5260 102 -57 -18 -9 91 65 -49 120 -57 -360 -36 246 74 161 -319 68 47 -46 -213 99 42 -5 118 -182
5283 -182 2 36 -27 -136 243 185 45 -21 -109 -152 91 151 67 75 30 1 172 -200 130 0 -18 151 32 -112
5307 -112 108 90 72 61 166 17 122 -131 -326 187 -208 -130 146 -83 -94 -56 126 -49 48 -318 -142 95
5329 95 -103 -92 88 188 157 194 -81 254 5 7 -78 -18 -79 -30 142 43 57 113 15 119 19 49 -93 -71 -68 280
5355 280 -93 144 -53 86 -123 75 120 7 -29 -167 94 97 -46 -111 -14 122 27 -5 -290 -60 67 53 30
5378 30 -174 -38 119 -9 -19 121 77 -286 14 -38 4 102 -165 -7 332 -237 21 49 -152 248 -289 160
5400 160 -48 -218 175 11 -172 7 11 -61 249 -60 88 10 107 212 140 -281 -9 -156 33 -114 60 34
$$ packed form
5236C9n0Q4k63J71Nj26K07J86j29r4N6k58K42o8JJ19J3n6k34J11j16M54j78j4
5260A02j59L9RJ00k6j14J69j77l03L24K82j72Q7m80L87k1r3j67L12n7m7J23l00
5283a82J84L4o3j09L79n8j40o6q8m3K43O0q4Qm5k9J71l72L30j30j8J69j19j44
5307a12K20j8j8j1J05j49J05k53j95N13l95P8K76k29j1L8J82j75R7l66J76K37
5329I5j98J1J80J00l1L7k75L35k49Kq5O0o1M9J72r9J4N6r8J04j00L0j42K2LL48
5355B80l73K37j97J39k09J98M5j13l6j38K61Lj43o5R7J36r5l2k85K30J27j4k3
5378C0k04J36J57j28j0J40m4l63L00n2M2R8k67J58L39n69K58K8k01M00n37M49
5400A60k08j70L93j64j83J79Mp2L10l09J48p8R7J05p2m21K72j47J89j47J74k6
$$ plain form
5422 34 238 -151 -17 -202 -120 -28 -44 -115 -84 -103 -22 246 -26 -261 -28 125 7 29 -40 83 167 -151 -6 127
5446 127 23 -85 44 -112 -176 -32 66 -19 -145 347 376 -92 159 19 16 63 100 -46 112 -151 -115 -154 154
5469 154 152 -112 37 -71 172 -41 262 129 -16 34 -142 143 -53 -243 -108 -8 83 -259 84 78 34 -41 -141
5492 -141 -194 32 -345 -78 223 255 149 68 -65 126 116 226 242 -92 -27 134 -40 -80 158 165 128 33 -285 110
5516 110 -44 -203 178 259 -65 -15 -18 188 24 139 -100 -106 -19 0 62 70 -164 66 -126 -127 50 222 274 -87 262
5541 262 -42 290 49 -387 -67 9 1 -118 56 -63 -165 198 -140 47 128 -181 6 70 -90 224 6 72
5563 72 -183 -23 158 42 2 -81 -61 -22 50 213 140 70 -19 114 58 106 198 42 -42 51 106 82 106 246 -61 -349
5589 -349 243 166 211 -49 -155 244 104 134 37 -68 99 61 -67 71 -257 -175 -58 77 -167 122 -7 -108
$$ packed form
5422C4K04l89J34j85Q2R2j6p1L1j9Q1K68k72k35K33J53j18K2o9J23Q4l18J45J33
5446A27j04j08J29j56o4J44R8q5j26M92K9m68K51j40lM7L7j46J58k63L6l9L08
5469A54kk64J49j08K43k13L03j33j45N0j76K85j96j90J35J00R1l42L43om4p5j00
5492a41n3K26l77K67L01L2j06q1j33J91j0J10J6l34O5J61j74m0K38Pl7r5l18L95
5516A10j54j59L81Q1l24N0lK06j64J15k39oQ7J9O2Qk34K30j92jJ77J72N2l61L49
5541B62l04L32k41m36L20P6qj19J74j19j02L63l38J87Q1l09J87O4j60L14k18O6
5563G2k55J60J81j16m0q3K0L9P2J63p3p0q9J33n6M8R2j56q4R3N5k4K4J40l07k88
5589c49N92p7M5k60j06L99j40L0r7j05J67l8j28J38l28Q2J17J35k44K89j29j01
$$ plain form
5611 -108 -160 -84 69 -56 279 105 -22 33 -265 -124 -53 -156 -244 -225 -161 -78 68 237 -188 -237 -53 62 128
5634 128 75 211 -119 190 42 183 -130 33 -54 284 -60 -292 97 -43 -128 218 -8 -59 -99 191 78 -16
5656 -16 80 -176 -2 -158 -238 130 54 -164 -58 183 121 -150 -72 -25 -104 24 18 45 -56 -127 -375 35 204 87
5680 87 161 -30 -65 -66 -119 -234 50 -192 -36 30 -204 42 83 87 -68 -150 -4 -44 84 -188 81 -38 -61 148
5704 148 -20 -87 -57 43 114 220 -296 -168 -148 122 253 150 128 -161 -29 -110 222 -69 93 31 -17 -108 32
5727 32 -120 288 -137 -172 136 -166 208 39 12 -43 -221 -144 -93 -132 -49 -211 98 -231 -92 158 62 5 21 -92
5751 -92 141 -84 109 56 -230 197 -162 -37 -130 -170 82 133 106 -84 -99 23 -158 -109 -49 134 -15 -171 152
5774 152 -2 183 320 -269 21 41 -119 185 -105 58 -94 12 -102 -176 53 -61 121 258 100 96 -2 -113
$$ packed form
5611a08n2P6J53j25L35j74j27N5k98J41P1j03q8J9O4Q3J46J69m25m9J84J15O6
5634A28n3J36l30L09j48J41l13J63q7L38l44k32L89j40q5L46k26n1m0K90j13r4
5656a6R6k56J74j56q0L68p6k18J06K41o2k71P8M7p9J28oK7j01p1k48M10J69j17
5680H7P4j91l5jn3j15K84k42J56O6k34K46M1Mj55q2J46m0J28k72K69j19k3K09
5704A48j68o7L0J00P1J06n16J28K0K70J31j03k2k89J32q1L32k91J62o2m8r1J40
5727C2j52M08m25l5L08l02L74j69k7n5j78P7N1l9Q3j62L09l29J39K50r6n7J6j13
5751i2K33k25J93n3k86M27l59J25r3m0K52N1k7j90j5J22j81M9O0J83j49j56L23
5774A52j54J85J37n89K90K0j60L04k90J63j52J06j14p4K29j14J82J37j58mr8j11
$$ plain form
5796 -113 158 47 -84 -81 -38 46 0 51 51 -161 50 144 -236 132 -49 141 -181 -269 42 17 176 -6 238 -32
$$ packed form
5796a13K71j11j31LM3Q4m6N1%k12K11R4l80L68j81J90l22q8L11k5J59j82K44k70
$$ [...]
8191a0
##END NTUPLES=NMR FID
##END=
