##TITLE=1H_52-2022
 CDCl3
 8 sc, 
 29.07.2022
##JCAMPDX= 6.0         $$ Bruker NMR JCAMP-DX V2.0
##DATA TYPE= NMR SPECTRUM
##DATA CLASS= NTUPLES
##ORIGIN= UXNMR, Bruker Analytische Messtechnik GmbH
##OWNER= root
$$ XWIN-NMR		Version 3.5
$$ Fri Jul 29 10:12:42 2022 Russian Standard Time (UT+4h)  she@DPX200
##.OBSERVE FREQUENCY= 200.1313499994
##.OBSERVE NUCLEUS= ^1H
##.ACQUISITION MODE= SIMULTANEOUS
##.ACQUISITION SCHEME= undefined
##.AVERAGES= 8
##.DIGITISER RES= 18
##SPECTROMETER/DATA SYSTEM= spect
##.PULSE SEQUENCE= zg30
##.SOLVENT NAME= CDCl3
##.SHIFT REFERENCE= (INTERNAL, CDCl3, 0, 15.7436)
##AUDIT TRAIL= $$ (NUMBER, WHEN, WHO, WHERE, WHAT)
$$ ##TITLE= Audit trail, XWIN-NMR		Version 3.5
$$ ##JCAMPDX= 5.01
$$ ##ORIGIN= Bruker BioSpin GmbH
$$ ##OWNER= she
$$ F:/spectra/data/she/nmr/H-F/1/pdata/1/auditp.txt
$$ ##AUDIT TRAIL=  $$ (NUMBER, WHEN, WHO, WHERE, WHAT)
(   1,<2022-07-29 10:10:50.07 +0400>,<she>,<DPX200>,
      <created by zg, POWCHK disabled, PULCHK disabled
       configuration hash MD5:
       00 E9 B6 7A A2 85 ED C7 34 08 36 98 17 FE 4E 26
       data hash MD5: 16K
       76 F9 03 6D A3 3E 2B 14 E8 85 70 37 8E 58 4C 0C>)
(   2,<2022-07-29 10:11:30.37 +0400>,<she>,<DPX200>,
      <Start of raw data processing
       efp BC_mod = 2 LB = 0.24 FT_mod = 6 PKNL = 1 PHC0 = -18040.76 PHC1 = 13.80068 SI = 16K 
       data hash MD5: 16K
       BF C6 C7 B6 31 D9 F2 2D 67 AA E6 1E 58 8A C0 8F>)
(   3,<2022-07-29 10:11:53.51 +0400>,<she>,<DPX200>,
      <pk PHC0 = 5.250113 PHC1 = -4.8 
       data hash MD5: 16K
       81 89 36 93 52 AF 60 C2 45 78 08 48 2F 99 B3 B7>)
(   4,<2022-07-29 10:11:56.79 +0400>,<she>,<DPX200>,
      <abs ABSG = 5 
       data hash MD5: 16K
       C6 4B 4D B8 87 16 A1 D5 E2 04 E3 EE 2C 26 85 83>)
$$ ##END=
$$ 
$$ hash MD5
$$ 09 46 38 A0 91 3E 63 27 E3 0A DC B6 80 DF 55 80
##$RELAX= 
##$RELAX= 
##$RELAX= 
##$RELAX= 
##$RELAX= 
##$RELAX= 
$$ Bruker specific parameters
$$ --------------------------
##$DU= <F:/spectra>
##$EXPNO= 1
##$NAME= <H-F>
##$PROCNO= 1
##$TYPE= <nmr>
##$USER= <she>
##$AMP= (0..31)
100 100 100 100 100 100 100 100 100 100 100 100 100 100 100 100 100 100 
100 100 100 100 100 100 100 100 100 100 100 100 100 100 
##$AQSEQ= 0
##$AQ_mod= 1
##$AUNM= <au_zg>
##$AUTOPOS= <>
##$BF1= 200.13
##$BF2= 200.13
##$BF3= 200.13
##$BF4= 200.13
##$BF5= 200.13
##$BF6= 200.13
##$BF7= 200.13
##$BF8= 200.13
##$BYTORDA= 1
##$CFDGTYP= 0
##$CFRGTYP= 5
##$CHEMSTR= <none>
##$CNST= (0..31)
1 1 145 1 1 1 1 1 1 1 1 1 1 1 1 1 1 1 1 1 1 1 1 1 1 1 1 1 1 1 1 1 
##$CPDPRG= <>
##$CPDPRG1= <>
##$CPDPRG2= <>
##$CPDPRG3= <>
##$CPDPRG4= <mlev>
##$CPDPRG5= <mlev>
##$CPDPRG6= <mlev>
##$CPDPRG7= <mlev>
##$CPDPRG8= <mlev>
##$CPDPRGB= <>
##$CPDPRGT= <>
##$D= (0..31)
0 1.2 0 0 0 0 0 0 0 0.06 0 0.03 0 0 0 0 0.0002 0 0 0 0 0 0 0 0 0 0 0 0 
0 0 0 
##$DATE= 1659075049
##$DBL= (0..7)
120 120 120 120 120 120 120 120 
##$DBP= (0..7)
150 150 150 150 150 150 150 150 
##$DBP07= 0
##$DBPNAM0= <>
##$DBPNAM1= <>
##$DBPNAM2= <>
##$DBPNAM3= <>
##$DBPNAM4= <>
$$ [...]
##$SUBNAM2= <"">
##$SUBNAM3= <"">
##$SUBNAM4= <"">
##$SUBNAM5= <"">
##$SUBNAM6= <"">
##$SUBNAM7= <"">
##$SUBNAM8= <"">
##$SUBNAM9= <"">
##$SW= 18.0517283424941
##$SWIBOX= (0..15)
0 0 2 0 0 0 0 0 0 0 0 0 0 0 0 0 
##$SW_h= 3612.71676300578
##$TD= 16384
##$TD0= 1
##$TE= 0
##$TE2= 300
##$TE3= 300
##$TEG= 300
##$TL= (0..7)
0 120 120 120 120 120 120 120 
##$TP= (0..7)
150 150 150 150 150 150 150 150 
##$TP07= 0
##$TPNAME0= <>
##$TPNAME1= <>
##$TPNAME2= <>
##$TPNAME3= <>
##$TPNAME4= <>
##$TPNAME5= <>
##$TPNAME6= <>
##$TPNAME7= <>
##$TPOAL= (0..7)
0.5 0.5 0.5 0.5 0.5 0.5 0.5 0.5 
##$TPOFFS= (0..7)
0 0 0 0 0 0 0 0 
##$TUNHIN= 0
##$TUNHOUT= 0
##$TUNXOUT= 0
##$USERA1= <user>
##$USERA2= <user>
##$USERA3= <user>
##$USERA4= <user>
##$USERA5= <user>
##$V9= 5
##$VALIST= <valist>
##$VCLIST= <CCCCCCCCCCCCCCC>
##$VD= 0
##$VDLIST= <DDDDDDDDDDDDDDD>
##$VPLIST= <PPPPPPPPPPPPPPP>
##$VTLIST= <TTTTTTTTTTTTTTT>
##$WBST= 1024
##$WBSW= 4
##$XGAIN= (0..3)
0 0 0 0 
##$XL= 0
##$YL= 0
##$YMAX_a= 558146
##$YMIN_a= -524420
##$ZGOPTNS= <>
##$ZL1= 120
##$ZL2= 120
##$ZL3= 120
##$ZL4= 120
##$ABSF1= 15.76672
##$ABSF2= -2.28513
##$ABSG= 5
##$ABSL= 3
##$ALPHA= 0
##$AQORDER= 0
##$ASSFAC= 0
##$ASSFACI= 0
##$ASSFACX= 0
##$ASSWID= 0
##$AUNMP= <proc_1d>
##$AZFE= 0.1
##$AZFW= 0.1
##$BCFW= 0
##$BC_mod= 2
##$BYTORDP= 0
##$COROFFS= 0
##$CY= -3
##$DATMOD= 1
##$DC= 0
##$DFILT= <>
##$DTYPP= 0
##$F1P= 0
##$F2P= 0
##$FCOR= 1
##$FTSIZE= 16384
##$FT_mod= 6
##$GAMMA= 0
##$GB= 0
##$INTBC= 1
##$INTSCL= 0
##$ISEN= 128
##$LB= 0.24
##$LEV0= 0
##$LPBIN= 0
##$MAXI= 10000
##$MC2= 0
##$MEAN= 0
##$ME_mod= 0
##$MI= 1.114404
##$NCOEF= 0
##$NC_proc= -6
##$NLEV= 6
##$NOISF1= 3.799351
##$NOISF2= 2.8
##$NSP= 0
##$NTH_PI= 0
##$NZP= 0
##$OFFSET= 15.74358
##$PC= 1
##$PHC0= -18035.51
##$PHC1= 9.00068
##$PH_mod= 1
##$PKNL= yes
##$PPARMOD= 0
##$PSCAL= 0
##$PSIGN= 0
##$REVERSE= no
##$SF= 200.13000559407
##$SI= 16384
##$SIGF1= 3
##$SIGF2= 2
##$SINO= 5.538805
##$SIOLD= 16384
##$SREGLST= <1H.CDCl3>
##$SSB= 0
##$STSI= 16384
##$STSR= 0
##$SW_p= 3612.71676300578
##$SYMM= 0
##$S_DEV= 0
##$TDeff= 16384
##$TDoff= 0
##$TI= <>
##$TILT= no
##$TM1= 0
##$TM2= 0
##$TOPLEV= 0
##$USERP1= <user>
##$USERP2= <user>
##$USERP3= <user>
##$USERP4= <user>
##$USERP5= <user>
##$WDW= 1
##$XDIM= 16384
##$YMAX_p= 489473760
##$YMIN_p= -1828356
$$ End of Bruker specific parameters
$$ ---------------------------------
##NTUPLES= NMR SPECTRUM
##VAR_NAME=  FREQUENCY,     SPECTRUM/REAL,   SPECTRUM/IMAG
##SYMBOL=    X,             R,               I
##VAR_TYPE=  INDEPENDENT,   DEPENDENT,       DEPENDENT
##VAR_FORM=  AFFN,          ASDF,            ASDF
##VAR_DIM=   16384,         16384,           16384
##UNITS=     HZ,            ARBITRARY UNITS, ARBITRARY UNITS
##FACTOR=    0.220516191357247, 1,           1
##FIRST=     3150.76272635346, 0,            0
##LAST=      -461.954036652317, 0,           0
##MIN=       -461.954036652317, -1828356,    0
##MAX=       3150.76272635346, 489473760,    0
$$ Real data points
##PAGE= N=1
##DATA TABLE= (X++(R..R)), XYDATA
$$ [...]
6286c1396N2340j60390N8907K6127K7364P6412M615o5758o9917J11605j4739j1806
6274C364r3362n3429K95471o0357q4913o1139j1992m6577j13055l3735K87008
6263B7284l5552J9816j11387N1684J05547j00255M875m7038R3026R9810j32847
6252b5037J97743q8774l8882r485j51142n2875J09565J75597J2525p2779k0833
6241C5623K5723o6473j18506K4188N1307N0089p7517R4048j9640j58226m5564
6230b04948k3659K05278J21778Q4614j81689l4975O6707l3570N2352k1490j54327
6219a23929J48056J78396m5080M4630j07041j76857o9830P6921O7400L0983K9420
6208E3069L6285o7219j31882m9417J83430l5122k2867J70324q413J1611Q8623
$$ plain form
6286 -31396 20944 -139446 -80539 -54412 -27048 49364 53979 -11779 -81696 29909 15170 3364
6274 3364 -89998 -143427 152044 91687 6774 -54365 -66357 -112934 -225989 -259724 27284
6263 27284 -8268 11548 -99839 -48155 57392 -42863 -37988 -85026 8000 107810 -25037
6252 -25037 172706 83932 45050 35565 -115577 -168452 -58887 116710 129235 56456 35623
6241 35623 61346 -5127 -123633 -99445 -48138 1951 -75566 18482 -1158 -159384 -204948
6230 -204948 -228607 -23329 98449 183063 1374 -33601 33106 -464 51888 30398 -123929
6219 -123929 24127 202523 157443 202073 95032 -81825 -151655 -74734 -7334 23649 53069
6208 53069 89354 22135 -109747 -159164 24266 -10856 -33723 136601 128188 139799 228422
6197B28422l2587j31687p5921R3236J8547j06691M7282j12393p6089J03341P1523
6186B6983j26977Q1139n5508p6708Q2981j430J5802J55928q5902J21065k0567
6175A16806m1814M295j06243K7820K6596P8719J1291n6303l2538j53889L9732
6164h5528K7334J18749N798j42575J37528K1570R3991l3342j4315M2871n0389
6153A21692J10292n2965j37127n5931k8756J63354p8266j0171m2220K8474p1920
6142e3544R3525J7904J16621j29662J3627P0303k0661q6050j51214N4355j00911
6131a75707p350J09370l9976Q6911J79441k3381k9254m8187l9889L6305m0389
6120G894j63797L4764J19390K21978o3350o4855q992J02428k19134k19287R1939
$$ plain form
6197 228422 195835 64148 -11773 81463 100010 -6681 40601 -71792 -147881 -44540 26983
6186 26983 -99994 -18855 -74363 -151071 -68090 -69520 -53718 102210 16308 137373 116806
6175 116806 74992 79287 -26956 864 27460 106179 117470 61167 28629 -125260 -85528
6164 -85528 -58194 60555 66353 -76222 61306 82876 176867 143525 129210 172081 121692
6153 121692 231984 179019 41892 -14039 -42795 120559 42293 32122 -10098 18376 -53544
6142 -53544 39981 57885 174506 44844 58471 128774 108113 22063 -129151 -74796 -175707
6131 -175707 -183057 -73687 -113663 -26752 152689 129308 100054 51867 11978 48283 7894
6120 7894 -155903 -121139 -1749 220229 156879 92024 83032 185460 -33674 -252961 -161022
6109a61022J42219R335q0415J1189Q3809K7240k9942K0203J6971j47189J12105
6098D503M9524j25129k2461O330J52273J42155q6958l0306k674N2105l7927k59603
6086a58168r3206J13407J60209L8388Q2596l9306j5196q5666q165j0771m7037
6075f2915k057J63526j28774o8116J6264j0524L4989Q070J30249r5486k2496J88445
6063A51175j21439m3722N7921m4416l1166L5090m1890l0405K948R9973l4273L3606
6051C3402k2249l4247R0175j61372J787j26293J60561Q4017r0523o740L1435R2866
6039E2819P0325Q9562R505r1147p3738o5868m2746J02259l4398k2907L9364J0617
6027D3647K5966m3908J63496o8039k2446R7885j54370J074n0817q0256R9104l7507
$$ plain form
6109 -161022 -18803 -9468 -89883 -78694 5115 32355 2413 22616 39587 -107602 4503
6098 4503 54027 -71102 -93563 -87233 65040 207195 120237 89931 87257 139362 101435 -158168
6086 -158168 -251374 -137967 22242 60630 143226 103920 88724 3058 -5107 -15878 -62915
6075 -62915 -64972 98554 -30220 -98336 -82072 -92596 -57607 -49537 80712 -14774 -37270 151175
6063 151175 29736 -13986 43935 -481 -31647 3443 -38447 -68852 -65904 34069 -204 33402
6051 33402 11153 -23094 67081 -94291 -92504 -218797 -58236 25781 -64742 -71482 -40047 52819
6039 52819 123144 212706 222211 131064 57326 -8542 -51288 50971 16573 -6334 33030 43647
6027 43647 69613 25705 189201 121162 98716 196601 42231 43305 -7512 -87768 11336 -26171
6015b6171J32999j3836p9838P5004L1575n0167J67817j3790j55640r3225m8284
6004g3556k232J2840P0046n7836o2504q1629J93613K9703N4606J1964q3994q0073
5992f9052J00953J06647j7985j1552j9108J78009j11695j42810l3651l2891J36134
5981H2999K5392j12460O5984J7671M6852r5085m2002R121q8908L1776J64092j90598
5969h5166r9824J02649O0821r3423K970N2208K7426k4404M1805Q0246r8292o668
5957c9652M9989L6766j54168K6928l6644o748m2500K86936J986p5024l0166p4817
5945e7114k2401n0670l9584n9951J97191Q7689L1478m1459m2417M025l1118J11712
5933H7381O8218j20704O8293J53607m5832j2468j23746j37998l7129J17690n6450
$$ plain form
6015 -26171 106828 92992 13154 88158 119733 69566 237383 223593 67953 -25272 -73556
6004 -73556 -75788 -62948 7098 -50738 -113242 -194871 -1258 28445 83051 95015 11021 -69052
5992 -69052 31901 138548 120563 109011 89903 267912 156217 13407 -20244 -53135 82999
5981 82999 108391 -4069 61915 79586 126438 31353 -10649 -1528 -90436 -58660 105432 -85166
5969 -85166 -184990 -82341 -21520 -114943 -111973 -59765 -32339 -56743 -14938 65308 -32984 -39652
5957 -39652 10337 47103 -107065 -80137 -116781 -123529 -166029 120907 122893 47869 17703 -57114
5945 -57114 -79515 -130185 -169769 -229720 -32529 55160 86638 45179 2762 6787 -24331 87381
5933 87381 155599 34895 103188 256795 210963 198495 74749 -63249 -100378 17312 -39138
5922c9138L1291M1161j12345M877o6728L5443o6168J3175J40219J84250R9688
5911B65725j10359j62571M1969l150j04764M9210l5195j8478J94926J9328j3062
5900A23579J12474m8407p635q1036j4596j42008R3613N5967r0175J95920N6467
5889B54163j02855l2460J32776q3423j32806O3413j66050k4287L14488J61477
5879C84436l04780L5843n8279j13098M2133J29711j9489J31935L018j38384l8276
5868E4770j88215P6097r0444J22531K10147M9670J01162j10715m0101j34600m9231
5857A071J64101l1492n8670n8265J53269j1935o2601j2439R8834j4175m4599J37366
5845B60465m2216j90287m0734O6664R3298k5403p3609R8177o0724j0956J92257
$$ plain form
5922 -39138 -7847 33314 -79031 -74154 -140882 -105439 -171607 -158432 -18213 166037 265725
5911 265725 155366 -7205 34764 31614 -73150 -23940 -59135 -77613 117313 136641 123579
5900 123579 236053 187646 180011 98975 84379 -57629 35984 91951 1776 197696 254163
5889 254163 151308 118848 251624 168201 35395 98808 -67242 -91529 222959 384436
5879 384436 79656 115499 57220 -55878 -13745 115966 96477 228412 231430 93046 54770
5868 54770 -133445 -57348 -147792 -25261 184886 234556 335718 225003 184902 50302 1071
5857 1071 165172 133680 75010 16745 170014 158079 95478 83039 181873 167698 123099 260465
5845 260465 218249 27962 -12772 53892 147190 121787 48178 146355 85631 74675 266932
5834B66932j59374j59169J39610J6642J9844J03560j09120J7883m0489k21275
5824a24956L0326K45499p6689q6981Q4268j45338J32308J37493j21733M3097j55486
5813c8192J10193L785k647L2841q056l3759M7742r7825q2791O2618k8647K23045
5801A88307J03666j53246j16720N7016J2663j49088n5803j07024L02033L2142
5791A13946r8351M8996J73353r2303r8691m1152J36527m5374j19262J7950M4395
5780D0034Q8925n6226M8607L3736j12297J26065P3940l9779j07288j37308J64677
5769A23086j75960P3784k0424O2893k161j8232J3419P2806J01j36086P1245j61933
5757i7462N9167J83126M142M9043j32181L5565P5194L7887k47942J17344M5372
$$ plain form
5834 266932 107558 -51611 87999 104641 124485 228045 118925 136808 96319 -124956
5824 -124956 -94630 150869 74180 -12801 71467 -73871 58437 195930 74197 117294 -38192
5813 -38192 72001 75786 73139 105980 97924 64165 111907 14082 -68709 -6091 -34738 188307
5801 188307 291973 138727 22007 79023 91686 -57402 -113205 -220229 81804 113946
5791 113946 15595 64591 237944 145641 46950 5798 142325 96951 -22311 -4361 40034
5780 40034 128959 72733 121340 155076 42779 168844 242784 203005 95717 -41591 123086
5769 123086 -52874 20910 486 63379 61218 42986 56405 129211 129312 -6774 64471 -97462
5757 -97462 -38295 144831 148973 198016 65835 101400 176594 214481 -33461 83883 129255
5746A29255o2111J2727K5929k2034L2725j963N5940J2278N4309J77597q0830j20435
5734B13387k3501o7990m1205k14622J52302R2330j20331J24216l6825O1127o256
5723A32632q7142m8522m666N4496J22998J9630k3097k49P167O4482j71918j82318
5711a16507K28474J59631K0612k5011q3196r9512M381L1631J70322r7098L6366
5700B30093L6256O09l4851k02461R4687L0474K3429k50784K6720M9287R0323L7248
5688A31030K7945o5772P0764r0921P3506n5204O1263J77539q6081K00612j09974
5677C34707k63975K13549K0390l8827L620l9668j6359J85810R4596j42470m9367
5666C02006J37704q0523l0478J5380k6493P3884L2220o2736k9332Q1476n263J19835
$$ plain form
5746 129255 67144 79871 105800 83766 116491 114528 170468 182746 237055 414652 333822 213387
5734 213387 189886 121896 80691 -133931 18371 110701 -9630 114586 77761 138888 132632
5723 132632 45490 -3032 -7698 46798 169796 189426 166329 166080 173247 237729 65811 -116507
5711 -116507 111967 271598 292210 267199 184003 84491 88872 120503 290825 193727 230093
5700 230093 266349 266958 232107 29646 124333 154807 178236 -72548 -45828 3459 93782 131030
5688 131030 158975 93203 163967 73046 146552 91348 152611 330150 244069 444681 334707
5677 334707 70732 284281 304671 265844 269464 229796 213437 399247 493843 351373 302006
5666 302006 439710 359187 328709 344089 317596 391480 423700 360964 331632 413108 407845 527680
5654E27680o1486m1019M852O8439Q1880K6465l49492K4830N7383Q8125K5354J2381
5642D65392k50688K8425J48536l1645J71717N8728l9265j71073j82744N5840n860
5631B47363J48139N8063K437l6897p0500j15378J73374j7588L8400l8696r6758
5620B91959k9021J07642j3035k8282l0202o7321L7880J01056j02307p7725P7951
5609B68595J3837K71412r1259n355J09169n9566p6715k9322J3369L1498q2861
5598C62802m2432R2700J76730p6830m2631J8955j30113n6168N7961J74445K8291
5587E63710N2002j04342J5808R0320J56970K3742j90508J5166P0661k27275q3888
5576C82366K28515J71307j49293k3650p1744p9370P5494P2158R0828q1940N1691
$$ plain form
5654 527680 466194 425175 430027 498466 580346 606811 257319 282149 339532 427657 453011 465392
5642 465392 214704 243129 391665 360020 531737 590465 551200 380127 197383 253223 247363
5631 247363 395502 453565 456002 419105 348605 233227 406601 389013 427413 388717 291959
5620 291959 262938 370580 357545 329263 299061 231740 269620 370676 268369 190644 268595
5609 268595 282432 553844 462585 457230 566399 506833 430118 400796 414165 445663 362802
5598 362802 320370 413070 589800 512970 470339 489294 359181 303013 360974 535419 563710
5587 563710 615712 511370 527178 617498 774468 798210 607702 622868 693529 466254 382366
5576 382366 610881 782188 632895 609245 537501 458131 533625 605783 696611 614671 666362
5565F66362l1492j13727O2516r6087r199K9064Q92p9950K5344J20542j3786J18821
5553F79300o3107k13364p6736J30533J73444M3547j53924P9300p9253j23660O2449
5542D58529L4312J14253O782p9991k53j02395N7829q4652P7545O4268m0842k6439
5530D78946J06219J5914O1851l3869J48513j14219L7806k46786j9975J65241K3516
5519F23157N1626Q6693j09363l0393R2240l7988R9855j35966O5546J62491j18257
5508G49641k0748p3812N2024P4597m9746m6485Q334j4954J34750K74322N1894
5497A139817l54795m6522K1798k6506J39752n0879N0588L8529n9431O0752j02071
5486H11032p0426J02885J97102n7169j8374J40460k6866m7095K4754m1450n4875
$$ plain form
5565 666362 634870 521143 583659 487572 478373 507437 508329 428379 453723 574265 560479 679300
5553 679300 616193 402829 326093 456626 630070 673617 519693 598993 519740 396080 458529
5542 458529 492841 607094 613876 533885 533632 431237 489066 404414 481959 546227 505385 478946
5530 478946 585165 601079 662930 629061 777574 663355 701161 454375 434400 599641 623157
5519 623157 674783 761476 652113 621720 713960 675972 775827 639861 705407 867898 749641
5508 749641 728893 655081 707105 781702 731956 685471 693805 678851 813601 1087923 1139817
5497 1139817 785022 738500 760298 733792 873544 822665 873253 911782 852351 913103 811032
5486 811032 740606 843491 1040593 983424 965050 1105510 1078644 1031549 1056303 1014853 959978
5475I59978J22399j21986Q1146Q7230p1451J2154J52095l3837L55m1902J23786
5464A269967j17900J14113J13301l8934p0613P6533J1888r1060J29041q0911J45461
5453A460886K97092p8283l9120J0456J16801k9361J36380j8661j16251J41204
5443A881143O7146J07377O2305j08426K7937L20339J84110o7492J51638J38072
5433B764149l1279k4784J37833j1056M3815l8979J6556J22740O5105K6621J62524
5422C233245L8785N5360J27259K16843K11984L3100o697J12917K33398K83420
5412D539614J94146J37641k3643M4590K53599L6013K9557L79066L03914j1832
5402E882665L84879K75571K09126L08595L21684K60542J67989K79447K80708M84782
$$ plain form
5475 959978 1082377 960391 1041537 1128767 1057316 1069470 1221565 1187728 1188083 1146181 1269967
5464 1269967 1152067 1266180 1379481 1340547 1269934 1346467 1358355 1267295 1396336 1315425 1460886
5453 1460886 1757978 1679695 1640575 1651031 1767832 1738471 1874851 1856190 1739939 1881143
5443 1881143 1948289 2055666 2117971 2009545 2037482 2357821 2541931 2474439 2626077 2764149
5433 2764149 2732870 2708086 2845919 2834863 2878678 2839699 2856255 2978995 3044100 3070721 3233245
5422 3233245 3272030 3327390 3454649 3671492 3883476 3916576 3909879 4022796 4256194 4539614
5412 4539614 4733760 4871401 4847758 4892348 5145947 5181960 5211517 5590583 5894497 5882665
5402 5882665 6267544 6543115 6752241 7060836 7382520 7643062 7811051 8090498 8371206 8855988
5392H855988L57480L44137L55993M67000N56689O82396N07632N37824J048301
5383A3713440R55795Q58954J037239R90906J212963J213765J516007J694266J762967
5374B4956302K330130K727582K888261L358477M048649M609509N216954N806265
5366E5942129O274866N692366M256709J447444k214866n248213p014646p399102
5358E1736687o467447n722262m733376l759489l053144k541893k084666j549882
5350B1824528j422866j458051j252745j003115q59290p74673n27505o59577l99157
5341A3467549m46139k22445m19406m50441j73756N1496l78704j12038o6962J589
5331A1250743N4532L5103J23377r0633O6792J06913K21190J08700J82086Q4229
$$ plain form
5392 8855988 9213468 9557605 9913598 10380598 10937287 11619683 12127315 12665139 13713440
5383 13713440 14669235 15528189 16565428 17556334 18769297 19983062 21499069 23193335 24956302
5374 24956302 27286432 30014014 32902275 36260752 40309401 44918910 50135864 55942129
5366 55942129 62216995 67909361 72166070 73613514 71398648 66150435 59135789 51736687
5358 51736687 45269240 39546978 34813602 31054113 28000969 25459076 23374410 21824528
5350 21824528 20401662 18943611 17690866 16687751 15828461 15053788 14526283 13866706 13467549
5341 13467549 13021410 12798965 12379559 11929118 11755362 11806858 11428154 11316116 11249154 11250743
5331 11250743 11305275 11340378 11463755 11373122 11439914 11546827 11768017 11876717 12058803 12143032
5321A2143032K86679L22611J16907L42207K91241M34641M32482O59310O99417
5312A5728527N76843R19311Q70114R25773Q84182J197016J436730J547140J687323
5303B5772959J881267K289945K559822K969099L411534M191583M868393N175131
5295E3119733N732935N994424N196030L161603J16364l355034o247268p367269
5287E6351518p154827o240866n336072m484580l523629k941307k233858k165401
5279B2270978j691272j652825j366462j147567j098488j063251p96420o97025
5271A2757668p42216n27110m73587n37448l55438m01246m29882m51026l17129
5262H522586m12199l39742j73976k59659k62175j83659J0833j31252j07472k32469
$$ plain form
5321 12143032 12429711 12752322 12869229 13211436 13502677 13937318 14369800 15029110 15728527
5312 15728527 16305370 17224681 18094795 19020568 19904750 21101766 22538496 24085636 25772959
5303 25772959 27654226 29944171 32503993 35473092 38884626 43076209 47944602 53119733
5295 53119733 58852668 64847092 70043122 73204725 73321089 69966055 63718787 56351518
5287 56351518 49196691 42955825 37619753 33135173 29611544 26670237 24436379 22270978
5279 22270978 20579706 18926881 17560419 16412852 15314364 14251113 13454693 12757668
5271 12757668 12015452 11488342 11014755 10477307 10121869 9720623 9290741 8839715 8522586
5262 8522586 8110387 7770645 7596669 7337010 7074835 6891176 6902009 6770757 6663285 6430816
5252F430816j90881j67558o7549j1368j75703r6103q6525q6878n5700o4370k825
5241E425356j90335k15167O5570j53255j11254r2821q8544L6016o0688j72525
5231D442353j07009K03637r2413k15422j02707j3786q0585P2511r5431J31002
5221D142150K7789m4151q6701m6286o0972K7444k2818J2305p9607k17063J10019
5210C762109R984M3294R3617j1812j16736k8692K319J60041j28513R1228P2865
5199C949704L6238J59564p8765j15701J86112K8323n7966L0541m9573J09632J00894
5188D299003J02884J47737J15239J35327n4531L1784J15633J14461J60787P3231
5178E241555J09628J23075J26888O7148K22254J32812J45360L23466K66246K03136
$$ plain form
5252 6430816 6239935 6072377 6004828 5993460 5817757 5721654 5635129 5548251 5492551 5428181 5425356
5241 5425356 5235021 5019854 5085424 4932169 4820915 4728094 4639550 4675566 4614878 4442353
5231 4442353 4335344 4538981 4446568 4231146 4128439 4114653 4034068 4106579 4011148 4142150
5221 4142150 4169939 4125788 4039087 3992801 3931829 3959273 3936455 3948760 3869153 3652090 3762109
5210 3762109 3772093 3815387 3909004 3897192 3780456 3751764 3754083 3914124 3785611 3876839 3949704
5199 3949704 3985942 4145506 4066741 3951040 4137152 4165475 4107509 4138050 4088477 4198109 4299003
5188 4299003 4401887 4549624 4664863 4800190 4745659 4777443 4893076 5007537 5168324 5241555
5178 5241555 5351183 5474258 5601146 5668294 5890548 6023360 6168720 6492186 6758432 6961568
5168F961568J42328K76970R1428J91919J55617K85857L61717L07487K54027K29186
5158I258104N53828P44659M11438M62713M30177O07115Q36551O92500P77621Q11268
5148A5585974J022573J086701J180540J232455J387450J598189J691252J586444
5140B6371578J997716J811821J621680J502442J132786N99057J45097m43677r23213
5131C3815287r74600j093611j107754j025773p35817n81709l62286j90167J53784
5122B7897354J18375K09645M15593P05793R31738Q70366J022655J168240J336124
5113C4675883J543905J576193J495498J806113J796920J772610J671984J593388
5105D7932494J196135O25881M79480P4333l8000l49171q39342r31745j172571
$$ plain form
5168 6961568 7103896 7380866 7472294 7664213 7819830 8105687 8467404 8774891 9028918 9258104
5158 9258104 9811932 10556591 10968029 11430742 11860919 12468034 13304585 13997085 14774706 15585974
5148 15585974 16608547 17695248 18875788 20108243 21495693 23093882 24785134 26371578
5140 26371578 28369294 30181115 31802795 33305237 34438023 35037080 35182177 34738500 33815287
5131 33815287 32840687 31747076 30639322 29613549 28877732 28296023 27933737 27743570 27897354
5122 27897354 28015729 28225374 28640967 29346760 30278498 31148864 32171519 33339759 34675883
5113 34675883 36219788 37795981 39291479 41097592 42894512 44667122 46339106 47932494
5105 47932494 49128629 49754510 50233990 50308323 50270323 49921152 49081810 48150065 46977494
5096D6977494j490286j197065j341472j406170j480333j433597j446405j485943
5088C5696223j338117j248802q41194r69989q19217o59030o51027n56869j19656
5079B8492322j32080J57883K00912N83482N93765O99185Q21321J266170J257341
5070C3940301J032414J328479Q47265M87428K37924m95142j164562j669053j905861
5061C2639193k148883k356019j987954j838893j790532j528400j139155j121952
5053A8727405j032085q54508r56901p23571n29774o14828l74712m87677l48540
5044A2804809l72922k93614k60547j15878k18604l37923k9672j05902j36527m1261
5034A0891959l9727r3699K032M4998M1600M9553K07753Q2952R867J27544L07533
$$ plain form
5096 46977494 45487208 44290143 42948671 41542501 40062168 38628571 37182166 35696223
5088 35696223 34358106 33109304 32268110 31298121 30478904 29819874 29168847 28611978 28492322
5079 28492322 28360242 28518125 28719037 29302519 29896284 30595469 31416790 32682960 33940301
5070 33940301 34972715 36301194 37148459 37635887 37873811 37378669 36214107 34545054 32639193
5061 32639193 30490310 28134291 26146337 24307444 22516912 20988512 19849357 18727405
5053 18727405 17695320 16840812 15883911 15160340 14630566 14015738 13641026 13153349 12804809
5044 12804809 12431887 12138273 11877726 11761848 11543244 11205321 11175649 11069747 10933220 10891959
5034 10891959 10852232 10758533 10760565 10805563 10847163 10896716 11104469 11187421 11197288 11324832 11632365
5023A1632365P0329M4649K47580L05590J67691K40082L20534L62558M43460M74015
5013A4308853N32709N04503N88787N29149Q20827Q32850Q38419R54357J100743
5004B1011197J161386J275363J309867J444507J348150J312090J318567J225276
4996C1406403R80015P46195N46813K35953j22471r3338r7270l28351j92275j89181
4986C2892493j81165N7591L6572N9504K54916N25264N14987N92723O66547P79021
4976C6198453J085228J302671J067880J118380J163697J396929J260221J048354
4968D5641813Q11223P56567O31555L71808K26309K1105l05817n57998p23522p52232
4958D6120811q80716j170199r91455r49965j102390j281325j136284j246997j237416
$$ plain form
5023 11632365 11702694 11747343 11994923 12300513 12468204 12708286 13028820 13391378 13834838 14308853
5013 14308853 14841562 15346065 15934852 16464001 17284828 18117678 18956097 19910454 21011197
5004 21011197 22172583 23447946 24757813 26202320 27550470 28862560 30181127 31406403
4996 31406403 32386418 33132613 33679426 33915379 33792908 33699570 33602300 33273949 33081674 32892493
4986 32892493 32711328 32768919 32805491 32864995 33119911 33645175 34160162 34752885 35419432 36198453
4976 36198453 37283681 38586352 39654232 40772612 41936309 43333238 44593459 45641813
4968 45641813 46453036 47209603 47841158 48212966 48439275 48460380 48154563 47596565 46873043 46120811
4958 46120811 45240095 44069896 43078441 42128476 41026086 39744761 38608477 37361480 36124064
4949C6124064j165424j105932j200922r45024p90656o52564m49397l99760k09533
4940B9204852p2822P373K32816L94868M62108P43702Q09998Q11272Q52378Q17716
4930C4264261N64534K89699k58084o11822r08695j376863j666688j857734k000104
4921B6438504k109147j893802j658501j520181j279992j293136j155785q81541
4913A4646419r05900p29918m71805p36998q92090l80200n54208l73077m79567
4904I122656l88275n01766k10910k66987k89624l26770k18886J0016k71101k84602
4894F373751k14673j47468k09207p9495l39594p2355j7201j89387k70535N5325
4884D889161k10207j50838p9201j79313r5025r9646P407j88846J8449k06251j87043
$$ plain form
4949 36124064 34958640 33852708 32651786 31706762 30916106 30263542 29814145 29414385 29204852
4940 29204852 29132030 29139403 29372219 29767087 30229195 30972897 31782895 32594167 33446545 34264261
4930 34264261 34828795 35118494 34860410 34248588 33339893 31963030 30296342 28438608 26438504
4921 26438504 24329357 22435555 20777054 19256873 17976881 16683745 15527960 14646419
4913 14646419 13740519 13010601 12538796 11801798 10909708 10529508 9975300 9602223 9122656
4904 9122656 8734381 8232615 8021705 7754718 7465094 7138324 6919438 6929454 6658353 6373751
4894 6373751 6159078 6011610 5802403 5722908 5383314 5310959 5293758 5104371 4833836 4889161
4884 4889161 4678954 4528116 4448915 4269602 4174577 4074931 4082338 3893492 3911941 3705690 3518647
4873C518647m5797K6606m4705j68199j69674O5753O230q1313r8077N5092j01154
4862B963409l17986K3095m7183J17589k5573j67502K9831p7489j35596J1991o7789
4851B306797K6403k1811p5043q9018j53934J02892M5319k1698k11088L523K08
4840A912550L7064j6478k11494P7125K6325M4020M2115l7948o4415j70576P137
4829A645425j891p8723L3769L9766j12918J8504L487q7730r570M6317j83957r0768
4817A221711r409j5629n7906l7701r419m2505p1646r307K17173r3733o7661J29348
4805A153316k5936J43473k8498j0049p7886q9362J06963Q8079j2693j66028J11561
4794A192940j4197o7458N860J30453j55913o7917J49233j5525j00955M6287j53529
$$ plain form
4873 3518647 3472850 3499456 3454751 3286552 3116878 3182631 3188861 3107548 3009471 3064563 2963409
4862 2963409 2645423 2668518 2621335 2738924 2713351 2545849 2575680 2498191 2362595 2374586 2306797
4851 2306797 2333200 2311389 2236346 2147328 1993394 2096286 2141605 2119907 1908819 1912342 1912550
4840 1912550 1949614 1933136 1721642 1798767 1825092 1869112 1911227 1873279 1808864 1638288 1645425
4829 1645425 1643534 1564811 1598580 1638346 1525428 1543932 1547419 1459689 1450119 1496436 1312479 1221711
4817 1221711 1212302 1196673 1138767 1101066 1091647 1049142 977496 968189 1185362 1091629 1023968 1153316
4805 1153316 1127380 1270853 1242355 1232306 1154420 1065058 1172021 1260100 1247407 1081379 1192940
4794 1192940 1178743 1111285 1117145 1247598 1091685 1023768 1173001 1157476 1056521 1102808 949279
4783I49279p1531j2679j11835l4053O5736k2993O1317j6690P2920P1128J3073
4772I63672o3070R3488j35577q2564p8782N471R062M0867j4494R0784j00633j6846
4760G11378Q7461k9059n0083k855l3089M5616o7915J5400L2746N6491K7521j69889
4748F23723J2614o1822j5469J82798J1277j70245q7086l7406J68552L0092r8106
4737E58922j38247M7654j00396J01443k1073k2056j9902p1329J65246R5548l4615
4726E61195q8762J50835p5384j14021J19665l0507J50689R3724j33807j85902
4716D47725K1987N784N6725j36572m3322R3088K07907r8375J09186L1486l1838
4705F63781j86928j0031J25528l16855r1403J81982n1217P2714j52147J37050
$$ plain form
4783 949279 877748 865069 753234 719181 784917 761924 823241 806551 879471 950599 963672
4772 963672 900602 994090 858513 775949 697167 702638 711700 752567 738073 828857 728224 711378
4760 711378 798839 769780 719697 716842 683753 729369 661454 676854 709600 766091 793612 623723
4748 623723 636337 574515 559046 741844 753121 582876 495790 458384 626936 657028 558922
4737 558922 420675 468329 367933 469376 448303 426247 406345 335016 500262 595810 561195
4726 561195 472433 623268 547884 433863 553528 523021 673710 767434 633627 447725
4716 447725 469712 475496 532221 395649 352327 445415 653322 554947 664133 695619 663781
4705 663781 476853 466822 592350 275495 184092 366074 314857 387571 235424 372474
4695C72474M3792j6715r221p7217J21711K5470m992J40395O3490Q4998j03685
4684F40500q9846J9651j13897L3982p5084O0156J7021L2826J8630k7913j15220
4673D00806N9856L5669J73477o3090j50888K0669J7599j45775q340K2759k9585
4662C33157J28289O9368j34593J08454L3264j42111J49197l2741j21978J17496
4652E07802M378j38448J4741J2969M3382m0495J0716j823p0201L4548K7234j61911
4640B42892J30618K3402J5045R4414j3998K4157j7851J7792k27576q1245R4321
4629C01971J54581n4030o7276r4765J24115q4998j05612J50259Q9640j6871R8476
4618D95490k2302j00547K5709L3459m3182J69588j38959j76833J77184O3892K777
$$ plain form
4695 372474 416266 399551 390330 313113 434824 460294 455302 595697 659187 744185 640500
4684 640500 550654 570305 456408 490390 415306 475462 492483 525309 543939 516026 400806
4673 400806 460662 496331 669808 606718 455830 476499 494098 348323 339983 362742 333157
4662 333157 461446 530814 396221 504675 537939 395828 545025 512284 390306 507802
4652 507802 512180 373732 388473 401442 444824 404329 415045 413222 343021 377569 404803 242892
4640 242892 373510 396912 411957 506371 492373 516530 498679 516471 288895 207650 301971
4629 301971 456552 402522 335246 240481 364596 279598 173986 324245 413885 397014 495490
4618 495490 473188 372641 398350 431809 388627 558215 419256 242423 419607 483499 486276
4607D86276O9441m339j45663k39317O3246R8741r3595l2604P3291J01587l8585
4596C38479R2581m1687K271k2614m3311R5430j37186m9982N9878l6873q5821M714
4584A75879j4006J1896K0435Q5960m7645l5153l3750N5737M0770n4764P1741j77841
4572I9259K9336O6267o3922q5500K41849m6645n8949j6276O4616j85910R8179
4561A42304p502J49936p1903p3243J45334p5272R4077o9338J23722l003p1266
4550B83846j07083M2331j356J00142O2909r786N731J8507j9072J53203Q1470j17621
4538D93221j92032Q7316J0238N1732r5270L9050R5107p2000K02723O357j44996
4527D81446O5415J14816J38415M4943n0724K4619m8760p4797l359j25698L5911
$$ plain form
4607 486276 555717 551378 405715 166398 229644 328385 234790 202186 275477 377064 338479
4596 338479 431060 389373 391644 369030 325719 421149 283963 233981 293859 256986 171165 175879
4584 175879 161873 173769 194204 280164 232519 197366 163616 219353 260123 205359 277100 99259
4572 99259 128595 194862 130940 45440 287289 240644 181695 165419 230035 44125 142304
4561 142304 134802 284738 212835 139592 284926 209654 303731 234393 358115 355112 283846
4550 283846 176763 219094 217738 317880 380789 371003 376734 395241 376169 529372 610842 493221
4538 493221 301189 388505 398743 450475 355205 394255 489362 417362 620085 626442 481446
4527 481446 546861 661677 800092 845035 794311 818930 770170 695373 692014 566316 602227
4516F02227J29467p2468j19722n2839l1283j52934J77466q069n9169l7162J88769
4505E64283J6288n5627j38827J15227J38073K04978J7645j9045o713p9196J81183
4494I38269J48903l4983K6492J02764k42174k4149M3878J13150j19051j55392
4484G97707J271L8897j43582P1913q6964l3594R2397j37233Q000Q4751k8544P6870
4472G41889K7580q5892j62497n2858K18290r5169r7881M61J24132O6466j04433
4461E80088J17649J35684R145r5341l7280m1289k6421j81558j2624j52133l3543
4450B62377K66676J20414r7722j17814k0000j29278O8560n528K5010j79572M9941
4439B43064Q4338J61065q8680j28571L0829P5420O9675m445r4884j24106k23004
$$ plain form
4516 602227 731694 659226 539504 486665 455382 302448 479914 471845 412676 375514 564283
4505 564283 580571 524944 386117 501344 639417 844395 862040 842995 836282 757086 938269
4494 938269 1087172 1052189 1078681 1181445 939271 915122 959000 1072150 953099 797707
4484 797707 798978 837875 694293 766206 679242 645648 738045 600812 608812 693563 665019 741889
4472 741889 769469 683577 521080 468222 686512 591343 493462 493923 618055 684521 580088
4461 580088 697737 833421 842566 747225 709945 668656 642235 460677 448053 295920 262377
4450 262377 529053 649467 551745 433931 413931 284653 353213 347685 372695 193123 243064
4439 243064 327402 488467 399787 271216 302045 377465 447140 442695 347811 223705 701
4428G01n1161J93219Q1353L09770k57905l7380o75j07004L8879M6948j30617J07998
4416A94126j44427J739J65913j06437j8419P5686J94259o1259j22582J222l2591
4405A47230o2133J965l890J23305j16792J02463r5661K3971O7998p2006l2357
4394H4093Q4078K6950R9668L8892p32L1782j55836P7258l0258n561j18090j09360
4382B2884J87716J89175L8407q8047m4261M068r1822O111j14516k04786O1588
4371c3483n6960J58746J81062l5332N1876j21796k4980J26412p6178j11207p67
4360E7393O9520o2107m3158J09459M2469l5202O4933K5636L3477P4154o5117n1791
4348B19666M8290m2991m1515n0219J1842M4354j19943J08921M3216l5648M219
$$ plain form
4428 701 -50460 142759 224112 533882 275977 238597 237922 130918 169797 216745 86128 194126
4416 194126 49699 51438 217351 110914 92495 168181 362440 301181 178599 179821 147230
4405 147230 85097 87062 83172 206477 89685 192148 96487 120458 188456 116450 84093
4394 84093 168171 195121 294789 333681 332949 364731 208895 286153 255895 250334 132244 22884
4382 22884 210600 399775 438182 350135 305874 309942 218120 224231 109715 -95071 -33483
4371 -33483 -90443 68303 249365 214033 265909 144113 119133 245545 169367 58160 57393
4360 57393 126913 64806 21648 131107 173576 138374 203307 228943 262420 336574 271457 219666
4348 219666 267956 224965 183450 133231 145073 189427 69484 178405 221621 185973 190192
4337A90192Q7068K5273P3212j35430r8376r2301p4353J16969J21892O3297J5970
4326B93413r9208m5841M5231k28462P2172K12322k7595p9807K06683J34490k37711
4315B45687j74426n8933J85252J76320L531r0414j73941j65876O2618J81681M1244
4304B32743K03913J5757j60387q1110K82435j20478j38469J93995j50188K6493
4294C04704N1264j42503J4283j20519M7132l2984k18748O6051J05574J60462j1329
4283B23387j53374M5807J25043l2590q8318m7823Q4580K5226O2660k03675N9094
4272A00017O6147K44107r4993o7950k0092r0989J6097l037J38026Q9200M7116
4261D23649r8915q0915M6044N9535q0191l0959q9720j07861K18959J05289l486
$$ plain form
4337 190192 277260 302533 375745 240315 141939 49638 -24715 92254 214146 277443 293413
4326 293413 194205 148364 193595 -34867 37305 249627 222032 142225 348908 483398 245687
4315 245687 71261 12328 197580 373900 377431 287017 113076 -52800 9818 191499 232743
4304 232743 436656 452413 292026 210916 493351 372873 234404 428399 278211 304704
4294 304704 355968 213465 227748 107229 154361 121377 -97371 -31320 74254 234716 223387
4283 223387 70013 115820 240863 208273 119955 72132 156712 181938 244598 40923 100017
4272 100017 166164 410271 315278 247328 227236 136247 152344 149307 287333 376533 423649
4261 423649 324734 243819 289863 349398 269207 238248 148528 40667 259626 364915 361429
4250C61429Q137O2464m220J1863J25020j59380L1687K1711k2562j94748J12480
4239C53881J34349K26433j05155r1401M7397j5429O5240j07l1485k0571J51341
4228G14493j12717k06172p5341l5972J85574n5950j05991L6319Q1435r7175j03458
4217B25045J65868J73830j05171o1936J2366j99648P8163J10645o919M3602N2578
4206D88423o8403k0703m4280l5570n6887k4657J36585j10610J44430o2725j39289
4195B06314l1772K85661P9674j83130o216K5530m8292j07338P5776K6373O6971
4184C89551J8359L4068j03476K8114R6659o4890m8720l2010O5944J35246l428
4173E15417r0459P177J734J24337J28920j70146L3101j82189j27943j9457O8681
$$ plain form
4250 361429 369566 432030 427810 439673 564693 405313 437000 458711 436149 241401 353881
4239 353881 488230 714663 609508 518107 565504 550075 615315 615208 583723 563152 714493
4228 714493 601776 395604 320263 284291 469865 413915 307924 344243 425678 328503 225045
4217 225045 390913 564743 459572 397636 410002 210354 288517 399162 392243 435845 488423
4206 488423 420020 399317 355037 319467 262580 237923 374508 263898 408328 345603 206314
4195 206314 174542 460203 539877 356747 350531 376061 327769 220431 296207 322580 389551
4184 389551 407910 441978 338502 366616 463275 398385 349665 317655 383599 518845 515417
4173 515417 424958 432135 433869 558206 687126 516980 550081 367892 239949 220492 289173
4162B89173n5858L631J77893J3971j25004j7037P9631l2513q6067j592O3906p2122
4150B38012J43082J46413r1943J93815K826m0950k1714j58251n6411J27229J13465
4139E95573k4112m3669j4901k3552J9139K0193N2398k14287l2401K02059M6854
4128E83294K6844o5775J8761l4853p851J59936l3419M2853M1364k74878j42200
4117C14076K22346Q442J4608m3345L4689N7987k22755J12411J03514j48997O5564
4106E18540M7675o7005J64947J9446q0385l7183P5206j22574M7098Q5056O1620
4095G12441j19503j08170J15358J15854Q7932J20163j91766J26975n0431q8192
4085G20661N5935Q782J51663J11217j20383q624J44170j31485J5326P1591O6123
$$ plain form
4162 289173 233315 236946 414839 428810 303806 286769 366400 333887 247820 246228 310134 238012
4150 238012 381094 527507 435564 629379 632205 591255 569541 411290 354879 482108 595573
4139 595573 571461 527792 512891 489339 508478 528671 581069 366782 334381 536440 583294
4128 583294 610138 544363 563124 528271 520420 680356 646937 689790 731154 456276 314076
4117 314076 536422 544864 559472 516127 550816 608803 386048 498459 601973 452976 518540
4106 518540 566215 499210 664157 683603 603218 566035 641241 518667 565765 650821 712441
4095 712441 592938 484768 600126 715980 803912 924075 732309 859284 808853 720661
4085 720661 776596 785378 937041 1048258 927875 919251 1063421 931936 947262 1018853 1084976
4074A084976N0468j17413O168n0190j0650J2891Q9591N6960M6826j0151j83166
4063I76310J76089J34570J01130k9800R215j46233L277J25230P2211M653k5972
4052A400680L753o3665K01104P3066k3338j3771j16566M2119J30002J10623L2740
4041A776747q4608P0215J47677q6957K0636J54836N3903J98747M6841m7655m9248
4030B201134R5035N1668r3210J74940L5246R2608L1036N1924J41964J22013R8344
4019C002702j9086L1781J57292Q0774O8579n8090J71406O6638L1837M5408j6829
4008C562412K22290J21251J33190R1756K1110K76647Q0848R6073R9352J60859
3998D865788L05129J50103P1015K74303J89873J0717K53054K06094K85622L71884
$$ plain form
4074 1084976 1135444 1018031 1024199 974009 963359 976250 1065841 1122801 1169627 1159476 976310
4063 976310 1152399 1286969 1388099 1358299 1367514 1221281 1224558 1349788 1421999 1426652 1400680
4052 1400680 1404433 1340768 1541872 1614938 1591600 1577829 1461263 1503382 1633384 1744007 1776747
4041 1776747 1692139 1762354 1910031 1823074 1843710 1998546 2052449 2251196 2298037 2250382 2201134
4030 2201134 2296169 2347837 2254627 2429567 2464813 2557421 2588457 2640381 2782345 2904358 3002702
4019 3002702 2983616 3015397 3172689 3253463 3322042 3263952 3435358 3501996 3533833 3579241 3562412
4008 3562412 3784702 3905953 4039143 4130899 4152009 4428656 4509504 4605577 4704929 4865788
3998 4865788 5170917 5321020 5392035 5666338 5856211 5866928 6119982 6326076 6611698 6983582
3988F983582J43010R029J45041L33212M41374J70798L31466M70244J55192K78542
3978I461490L37881L29796K86053J56552K92682K20973K94691L38643K34953K25256
3968A2178970L16251J66021J99806K40715J36168N4661k0291L1932o1091j5765
3958A3227377k71643j05534j20913k37519n7734j99780l15007k45389k99999l48226
3948A1025633j55665m44715l31529m15081k39168k41150k79923k08170m12415
3939H297817j86648j84193m08509k89493j99335j96470k94194k18171j96902j29410
3929E994492k82082r4048k06244j58389L0225p5473n6997j46751k24551j85322
3919D594860l13241k1665j59055k42922R8804L692j20602n0114p5209m3727j59631
$$ plain form
3988 6983582 7126592 7135621 7280662 7613874 8055248 8226046 8557512 9027756 9182948 9461490
3978 9461490 9799371 10129167 10415220 10571772 10864454 11085427 11380118 11718761 11953714 12178970
3968 12178970 12495221 12661242 12861048 13101763 13237931 13292592 13272301 13304233 13243142 13227377
3958 13227377 12955734 12850200 12729287 12491768 12434034 12234254 11919247 11673858 11373859 11025633
3948 11025633 10869968 10425253 10093724 9678643 9439475 9198325 8918402 8710232 8297817
3939 8297817 8111169 7926976 7518467 7228974 7029639 6833169 6538975 6320804 6123902 5994492
3929 5994492 5712410 5618362 5412118 5253729 5283954 5208481 5151484 5004733 4780182 4594860
3919 4594860 4281619 4259954 4100899 3857977 3956781 3960473 3839871 3789757 3714548 3670821 3511190
3908C511190k83878p1301q6486p932j08872O0820j26656J5705o5426m780L5251
3897B867635j66118m8081L3402q3584p3023j27619n4707R6867K0675k02033j12367
3886B151047k9566r1174P1054J86043l38420j03495M7055M7095m6279k5115J2046
3875A880291o4350K0589j29314n9447K1487J16344q7451K129j24390j02926P5739
3864A548701P6440p5127l4483M7025n7545m8083k08402j11261j1455J58202O9895
3853A353907o6998K1430j5976O3788m1844m2637j715K9057K7273J9167k2798l4036
3841A288618M075j77532n5175n2146J19573l1146j30219J20749J49110m0019p1263
3830A124625p9323O1370P9606j49661l8528r2537J21194J5690j26453J40784M6486
$$ plain form
3908 3511190 3227312 3156011 3069525 3061593 2952721 3013541 2886885 2902590 2837164 2832384 2867635
3897 2867635 2701517 2653436 2686838 2603254 2530231 2402612 2347905 2444772 2465447 2263414 2151047
3886 2151047 2121481 2030307 2101361 2287404 1948984 1845489 1892544 1939639 1893360 1868245 1880291
3875 1880291 1815941 1836530 1707216 1647769 1669256 1785600 1698149 1700278 1575888 1472962 1548701
3864 1548701 1625141 1550014 1515531 1562556 1505011 1456928 1248526 1137265 1125810 1284012 1353907
3853 1353907 1286909 1308339 1292363 1356151 1314307 1271670 1269955 1299012 1326285 1345452 1322654 1288618
3841 1288618 1292693 1115161 1059986 1007840 1127413 1096267 966048 1086797 1235907 1195888 1124625
3830 1124625 1045302 1106672 1186278 1036617 998089 905552 1026746 1042436 915983 1056767 1103253
3819A103253l5198o5945m9113n7007R150J09297j18382M70J39072n1129j62373
3808H22095K20071k8271O6389O6234j8728p7335j60428N9376n4140m2989N6927
3797I09201Q70k1082l5332M5009J13068m3810M7133P1686j8921q6448l9827K6058
3785I67605o4962k6991n224J02150r723k23971O9388J66089P8377j29264j88135
3774G35339J66392M9677O1962o8016p4306K30724J434k97951n7857J94334J8618
3763I60350k5403n7830j5636j42349L9434P3864O2694q018K2705j0943O4138P6418
3751A039424k4844r5398k2613J41511j65226K8756Q4355P5169J7015j16450n4238
3740I07461l8779J6933J39125L466k876j00895j68094J13535l7906M8185J12641
$$ plain form
3819 1103253 1068055 1002110 952997 895990 905140 1014437 896055 896525 1035597 984468 822095
3808 822095 1042166 1013895 1080284 1146518 1127790 1050455 890027 949403 895263 852274 909201
3797 909201 910071 888989 853657 898666 1011734 967924 1015057 1086743 1067822 981374 941547 967605
3785 967605 902643 875652 870428 972578 962855 738884 808272 974361 1052738 923474 735339
3774 735339 901731 951408 1013370 945354 871048 1101772 1103206 805255 747398 941732 960350
3763 960350 934947 877117 861481 719132 758566 832430 895124 887106 909811 898868 963006 1039424
3751 1039424 1014580 919182 896569 1038080 872854 901610 985965 1061134 1078149 961699 907461
3740 907461 868682 885615 1024740 1028206 1025330 924435 756341 869876 831970 880155 992796
3729I92796m4487l9000n8189N3097o634j33326Q311J96323q524o300J03590M3407
3717A101064j73610l2624K9238m8747M1751K64194J8617j39842j9314O4841j13692
3706I91876j51381K1102K7452O9078L6770j44518j23994n5226K17270N8048m3366
3695I03111j36452K8992O8011O7241J17797k69451n0556Q6874P1515j68336J65164
3684H83910J14951q1493j51319J12392J17813o3439m3165j8982J6677L3242k02325
3673G18262j2795K30959J06189m8525r480n0700j26076O1086N2033O8102m7207
3662I41848M2013k321l9665M2251l5507K4122O1316L2547j51668l9098N0533J97377
3650A123748p3961J2362j41616l3057J07386l4725K0781J60909o5658q0890J15493
$$ plain form
3729 992796 948309 909309 851120 904217 897583 764257 772568 968891 960367 954067 1057657 1101064
3717 1101064 927454 894830 924068 875321 917072 1181266 1199883 1060041 1040727 1105568 991876
3706 991876 840495 861597 889049 958127 994897 850379 726385 671159 888429 946477 903111
3695 903111 766659 795651 863662 930903 1048700 779249 728693 815567 887082 718746 883910
3684 883910 998861 917368 766049 878441 996254 932815 889650 870668 887345 920587 718262
3673 718262 705467 936426 1042615 994090 984610 933910 807834 868920 920953 989055 941848
3662 941848 983861 981540 941875 984126 948619 972741 1034057 1066604 914936 875838 926371 1123748
3650 1123748 1049787 1062149 920533 887476 994862 960137 980918 1141827 1076169 995279 1110772
3639A110772j62567L2203n6006R1730P1025o8137M361l1543O2696j10781M7528
3628I91281K62295j3643j05432J10167Q5485r5679m9771R5622M5035n629n3585
3617A266146J09054j7526j9499L9385r3826m8217J53221N5239P5678l6807J11040
3606A593888M3556j39621l802R4903P1888k00300J23035L0066L32Q3531k0912
3595A676564J38723J07268j40183K27093J01942j16562J08630j8689o2166L8428
3585B061048J8858J32967K4157J43267O7820J40197r4877m9818P7709q403k2468
3574B490457K2290J46151J39359Q4503R4823m4528P371m5680K09672J31815j8848
3563C217385J55479M1304n8139J58620M8362J12878J59940m171k45984K41491
$$ plain form
3639 1110772 948205 980408 924402 1016132 1087157 1019020 1023381 991838 1054534 943753 991281
3628 991281 1253576 1239933 1134501 1244668 1330153 1234474 1184703 1280325 1325360 1319731 1266146
3617 1266146 1375200 1357674 1338175 1377560 1283734 1235517 1388738 1443977 1519655 1482848 1593888
3606 1593888 1637444 1497823 1494021 1588924 1660812 1460512 1583547 1613613 1613945 1697476 1676564
3595 1676564 1815287 1922555 1782372 2009465 2111407 1994845 2103475 2084786 2022620 2061048
3585 2061048 2079906 2212873 2237030 2380297 2448117 2588314 2493437 2443619 2521328 2512925 2490457
3574 2490457 2512747 2658898 2798257 2882760 2977583 2933055 2940426 2894746 3104418 3236233 3217385
3563 3217385 3372864 3414168 3356029 3514649 3563011 3675889 3835829 3831658 3585674 3827165
3553C827165K45142J43298m7780j69279J479O4426J91249J81651J61815L7068
3543D636234Q5005J41002O3264K40843J52753m7108K21710J05717L00754M5694
3533E945868R7430L24084J42329J72801r151K84314K35592J51169L34364J55988
3523G834788J80372J97201K98957J26525L28743J16171J75819M18418K57523K20341
3513A0154858L05435M04639L15762K73369L06227M36552M64792K74620K90081
3504A3226335L53567L13707L60452K86911K24403J68352L22117M04282L17827
3495A5977953K03839K65069L78103M36827N34372K77803O79601L90069L84231
3486A9527867N40045M99061N06896Q12461O03976N92227P25689O54206N54124
$$ plain form
3553 3827165 4072307 4215605 4167825 3998546 4000025 4064451 4255700 4437351 4599166 4636234
3543 4636234 4721239 4862241 4925505 5166348 5319101 5271993 5493703 5599420 5900174 5945868
3533 5945868 6043298 6367382 6509711 6682512 6673361 6957675 7193267 7344436 7678800 7834788
3523 7834788 8015160 8212361 8511318 8637843 8966586 9082757 9258576 9676994 9934517 10154858
3513 10154858 10460293 10864932 11180694 11454063 11760290 12196842 12661634 12936254 13226335
3504 13226335 13579902 13893609 14254061 14540972 14765375 14933727 15255844 15660126 15977953
3495 15977953 16181792 16446861 16824964 17261791 17796163 18073966 18753567 19143636 19527867
3486 19527867 20067912 20566973 21073869 21886330 22490306 23082533 23808222 24462428 25016552
3477B5016552O01340O03773N52095N08001N98572J59177M13101M08071K20863
3468B9081545L62951L77529J59500J64039J37237J23131L00448L40420J89007
3459C1235807K77404K51905K54907L42900K93316M74742L65418K01241L77316
3450C4074956M41092J85803N65838M02562K74869L93923K81529J51731J42508
3441C6914811K43235K97098K34019J64341j3413j9599j31032q7214k02539k37861
3431C7161846j61240j85562k22075j92575j51022p4619m07559l43013j25029p4851
3421C5224301k86887l90927r4011j00176l61362j93831r2527j85838k66632o3058
3411C3189052j80597j93971m12319j68200j51398j19309k68132l86040m54556
$$ plain form
3477 25016552 25617892 26221665 26773760 27281761 27880333 28039510 28452611 28860682 29081545
3468 29081545 29444496 29822025 29981525 30145564 30282801 30405932 30706380 31046800 31235807
3459 31235807 31513211 31765116 32020023 32362923 32656239 33130981 33496399 33697640 34074956
3450 34074956 34516048 34701851 35267689 35670251 35945120 36339043 36620572 36772303 36914811
3441 36914811 37158046 37455144 37689163 37853504 37840091 37820492 37689460 37602246 37399707 37161846
3431 37161846 37000606 36815044 36592969 36400394 36249372 36174753 35767194 35424181 35299152 35224301
3421 35224301 34937414 34546487 34452476 34352300 33990938 33797107 33704580 33518742 33252110 33189052
3411 33189052 33008455 32814484 32402165 32233965 32082567 31963258 31695126 31309086 30854530
3402C0854530k26408k70400m64630m81884m51169m45503n54988m33451l70994
3393B7155103j79886n09594m40583l27909l72753k94389l93352m74710l20621
3384B3841306k85783k09323J1137k77357l25508l28844q2939j87361k2436q3212
3374B2049680k78761k10277k22524j64468k10433l04789j7537j711j55797j71976
3364B0311407k68446j50222O4969J89059p1861j73998J74416J80083J28692N9066
3354B0443165Q3835J08117J37913K07908P9531J95313L05071K63412L52688M22024
3344B2598977L07913N96617L76421L97601K79697L78305M43087N43327M86563
3335B6408508N53426M35005O47356M83808P59934O51240O07811Q15354O33165
$$ plain form
3402 30854530 30628122 30357722 29893092 29411208 28960039 28514536 27959548 27526097 27155103
3393 27155103 26975217 26465623 26025040 25697131 25324378 25029989 24636637 24161927 23841306
3384 23841306 23555523 23346200 23357337 23079980 22754472 22425628 22342689 22155328 22132892 22049680
3374 22049680 21770919 21560642 21338118 21173650 20963217 20658428 20640891 20639180 20483383 20311407
3364 20311407 20042961 19892739 19957708 20146767 20074906 19900908 20075324 20255407 20384099 20443165
3354 20443165 20527000 20635117 20773030 20980938 21060469 21255782 21560853 21824265 22176953 22598977
3344 22598977 22906890 23503507 23879928 24277529 24557226 24935531 25378618 25921945 26408508
3335 26408508 26961934 27396939 28044295 28528103 29288037 29939277 30547088 31362442 31995607
3326C1995607P18288R10241R23137Q93299J071867J009693J057625J280360J243502
3317D1103619J252997J337766J370563J431689J485874J453767J391091J300712
3309E2128078J496885J342876J197398J491335J337401J285823J497802J367447
3301F3145045J335137J398767J358304J459502J632989J810510J807832J775123
3293G5723209K168970K277172K342183K464515K640381K828689K995994K957928
3285I6399041L045532L346285L160494L414485L826015L552095L677107L840425
3277A24261479L630916L778561L458461L544104L802979L772086M073363M160114
3269A54482063M355582M415223M446416N065513N261879N797897O101691O566833
$$ plain form
3326 31995607 32713895 33624136 34547273 35440572 36512439 37522132 38579757 39860117 41103619
3317 41103619 42356616 43694382 45064945 46496634 47982508 49436275 50827366 52128078
3309 52128078 53624963 54967839 56165237 57656572 58993973 60279796 61777598 63145045
3301 63145045 64480182 65878949 67237253 68696755 70329744 72140254 73948086 75723209
3293 75723209 77892179 80169351 82511534 84976049 87616430 90445119 93441113 96399041
3285 96399041 99444573 102790858 105951352 109365837 113191852 116743947 120421054 124261479
3277 124261479 127892395 131670956 135129417 138673521 142476500 146248586 150321949 154482063
3269 154482063 158837645 163252868 167699284 172764797 178026676 183824573 189926264 196493097
3261A96493097O934443P259982P609843Q085937Q117480Q718244R408485R646217
3253B62273728J0126471J0473164J0910532J1588482J2214708J2717071J3417273
3246C43721429J4043244J4732993J5333184J5853468J5827725J5797278J5139585
3239D50448906J3746918J1541886Q601543M766968L67539l993221q445675j2214144
3231D64820720j4653660j5755690j5530325j5095488j3691155j2642358j1616174
3224C65835870j0164255r234447q346997p386721o665461n929254n359867m605928
3216C08142940m082356l803992l269639l007471k435659j996459j208292p94751
3208B87544321l30138J29210L80246L59688N06549K37090j00838o03812q74074
$$ plain form
3261 196493097 203427540 210687522 218297365 226383302 234500782 243219026 252627511 262273728
3253 262273728 272400199 282873363 293783895 305372377 317587085 330304156 343721429
3246 343721429 357764673 372497666 387830850 403684318 419512043 435309321 450448906
3239 450448906 464195824 475737710 484339253 489106221 489473760 485480539 477034864 464820720
3231 464820720 450167060 434411370 418881045 403785557 390094402 377452044 365835870
3224 365835870 355671615 346437168 338090171 330703450 324037989 318108735 312748868 308142940
3216 308142940 304060584 300256592 296986953 293979482 291543823 289547364 288339072 287544321
3208 287544321 287214183 287343393 287723639 288083327 288589876 288826966 288726128 288122316 287248242
3199B87248242j367476j812211j973365k135075k205345k435624k888335l143784
3191B69287027l317289l735756m137739m255057m574931m267871m216984m316018
3183B36465382m093970l974807l767777l597896l391606l390629l485551l428135
3175B07335011l467904l716476l715535l798634l844107m029827m181481m127714
3167A76453333m208976m219702l909632l887527l946554l702479l422260l230678
3159A45925525l457435l276386l222473l228439l049176k985654l113092l069276
3151A20523594l176509l011139k878385l012675k766037k974899k742202k506840
3143I7454908k590197k446246k404569k426668k159137k020318j828581j967531
$$ plain form
3199 287248242 285880766 284068555 282095190 279960115 277754770 275319146 272430811 269287027
3191 269287027 265969738 262233982 258096243 253841186 249266255 244998384 240781400 236465382
3183 236465382 232371412 228396605 224628828 221030932 217639326 214248697 210763146 207335011
3175 207335011 203867107 200150631 196435096 192636462 188792355 184762528 180581047 176453333
3167 176453333 172244357 168024655 164115023 160227496 156280942 152578463 149156203 145925525
3159 145925525 142468090 139191704 135969231 132740792 129691616 126705962 123592870 120523594
3151 120523594 117347085 114335946 111457561 108444886 105678849 102703950 99961748 97454908
3143 97454908 94864711 92418465 90013896 87587228 85428091 83407773 81579192 79611661
3135G9611661j818045j671963j647068j568282j476451j471858j358477j141147
3127F7458370j261254j350790j430013j345727j188774j203406j329893j164577
3119E7183936j120301r90713r43798r94255j060886j071564j112180j055826q36997
3110D7997416q32830p72567r67269q89363r98555q05637p27789q71061p92382
3101D0339963p95804r88346n58499p27586q09509q42970o96231q23411p05523
3092C3392084o06056p05733o56471o13430o46959o01394n15412o59114n73133
3083B7814382o00558n18113n16803m96168n71579p22190m73954m51920n74278
3074B2888819n84082m75957k44194m74547l50928l46601n05193k90715m12854
$$ plain form
3135 79611661 77793616 76121653 74474585 72906303 71429852 69957994 68599517 67458370
3127 67458370 66197116 64846326 63416313 62070586 60881812 59678406 58348513 57183936
3119 57183936 56063635 55072922 54129124 53134869 52073983 51002419 49890239 48834413 47997416
3110 47997416 47164586 46392019 45424750 44535387 43536832 42731195 42003406 41132345 40339963
3101 40339963 39544159 38555813 37997314 37269728 36460219 35617249 34921018 34097607 33392084
3092 33392084 32786028 32080295 31423824 30810394 30163435 29562041 29046629 28387515 27814382
3083 27814382 27213824 26695711 26178908 25682740 25111161 24388971 23915017 23463097 22888819
3074 22888819 22304737 21828780 21584586 21110039 20759111 20412510 19907317 19616602 19203748
3065A9203748m66394n75587m09743l71134m13428l49464j08727k50656l38336
3056A5920279l59448l02069l57787k86418k14628l30359k14174j35823l02805
3047A3416768j53850j37399l74696k06473k38636k03923l30112k24699j0966j20013
3037A1416001k40884q0713j15233J3852l09491j81217k3040o9940j32539o21k14934
3026A0061241J05427j01363j21177m8945P0628j18249j33318q5800J642q9693
3016I540393r8873M2019j11395M0755k4369K0929K04245M2325N9125n5427j31173
3005I528554n6156J28992L06723J3415P911j1490M9337K42962J39646O6816J05438
2994A0522148J64601R6794R4834J33863K01472J73034j9205K21443J49877K14449
$$ plain form
3065 19203748 18737354 18161767 17752024 17380890 16967462 16617998 16509271 16258615 15920279
3056 15920279 15560831 15258762 14900975 14614557 14399929 14069570 13855396 13719573 13416768
3047 13416768 13262918 13125519 12750823 12544350 12305714 12101791 11771679 11546980 11536014 11416001
3037 11416001 11175117 11094404 10979171 10993023 10683532 10502315 10479275 10409335 10276796 10276175 10061241
3026 10061241 10166668 10065305 9944128 9895183 9965811 9847562 9714244 9628444 9630086 9540393
3016 9540393 9441520 9483539 9372144 9412899 9388530 9409459 9613704 9656029 9715154 9659727 9528554
3005 9528554 9472398 9601390 9908113 9921528 9929439 9917949 9967286 10210248 10349894 10416710 10522148
2994 10522148 10686749 10783543 10878377 11012240 11213712 11386746 11367541 11588984 11738861 11953310
2984A1953310L21838O7044J02511K92984K03626K39363K50704J22594J57621M29929
2974A4141524M56198L98005L36602M23300L21764L18011N26033M01841K56107
2965A7579385M32854N90652N14331L27354O24274O33191N20993N12984N41529
2956B2277547Q02444O64370M97330N36943P98125O47100P80211Q56140R71121
2947B8831331J124844J100630J042741J195785J604253J616528J716586J647293
2939C9879991J761977J972529K217846K318610K541544K850388K898262L139341
2931E9580488L468890L910526M143980M487678M725293N059122N233440N328305
2923I5937722N457953M951138M214566L383474K453830J113338L13980n80298
$$ plain form
2984 11953310 12275148 12342192 12444703 12737687 12941313 13180676 13431380 13553974 13711595 14141524
2974 14141524 14597722 14995727 15332329 15755629 16077393 16395404 16921437 17323278 17579385
2965 17579385 18012239 18602891 19117222 19444576 20068850 20702041 21223034 21736018 22277547
2956 22277547 23079991 23744361 24241691 24778634 25576759 26223859 27004070 27860210 28831331
2947 28831331 29956175 31056805 32099546 33295331 34899584 36516112 38232698 39879991
2939 39879991 41641968 43614497 45832343 48150953 50692497 53542885 56441147 59580488
2931 59580488 63049378 66959904 71103884 75591562 80316855 85375977 90609417 95937722
2923 95937722 101395675 106346813 110561379 113944853 116398683 117512021 117826001 117245703
2915A17245703p01034o56820o38154k06688k18698r8573L32418N51688Q46630
2906A16456472J229764J438171K139077K866233L617307M320092N186826O375688
2898A43629630P652795R303665J0405881J0995370R919984O796900K592383j128206
2890B00168402m826971r064986j2754897j4507141j3759949j1738881r644115
2883A23871462q004952o805115n385232m556938m025302l346444k831207k424094
2875H6492178j866873j232338r89826m37605j38070M14854O01153J089036J370090
2866H5302599J621292J590118J487003J122095N02511q8970j100658k291455l636740
2857H4507795m343351n008453n406286n220454m861561m594408l937363l483656
$$ plain form
2915 117245703 116544669 115887849 115249695 115043007 114824309 114725736 115058154 115609842 116456472
2906 116456472 117686236 119124407 121263484 124129717 127747024 132067116 137253942 143629630
2898 143629630 151282425 160586090 170991971 181987341 191907325 198704225 201296608 200168402
2890 200168402 195341431 186276445 173521548 159014407 145254458 133515577 123871462
2883 123871462 115866510 109061395 103676163 99119225 95093923 91747479 88916272 86492178
2875 86492178 84625305 83392967 82403141 81965536 81827466 82242320 82843473 83932509 85302599
2866 85302599 86923891 88514009 90001012 91123107 91625618 91536648 90435990 88144535 84507795
2857 84507795 80164444 75155991 69749705 64529251 59667690 55073282 51135919 47652263
2849D7652263l060907k666334k320659k187379k154260j759095j663828j765669
2841C0074132j278942j299988j298557j245256j095590q98173p04434o98508j040313
2832B0514371p10887o56437p64428m97525o86673o65720n82506m30492l84676
2823A5135027o63795m78120l76087k60355k50499m98411m59110k10269k50788
2814A1687593n19029l86962n6785j61491l64369k69021m17742q1952k25945l45514
2804H858783k29886k53125q1338k98261j51845j58859m0280k53810k45577k14480
2794F931322j94280k07684o9937j87153k204j20774j49975j68534q2264j72628
2784E575889j98845j18168j26339n1506q1831j13456Q222p5892j37908j32889
$$ plain form
2849 47652263 44591356 41925022 39604363 37416984 35262724 33503629 31839801 30074132
2841 30074132 28795190 27495202 26196645 24951389 23855799 22957626 22253192 21554684 20514371
2832 20514371 19803484 19147047 18382619 17885094 17198421 16532701 15950195 15519703 15135027
2823 15135027 14471232 13993112 13617025 13356670 13106171 12607760 12148650 11938381 11687593
2814 11687593 11168564 10781602 10724817 10563326 10198957 9929936 9512194 9430242 9204297 8858783
2804 8858783 8628897 8375772 8294434 7996173 7844328 7685469 7645189 7391379 7145802 6931322
2794 6931322 6737042 6529358 6459421 6272268 6270064 6149290 5999315 5830781 5748517 5575889
2784 5575889 5377044 5258876 5132537 5081031 4999200 4885744 4893966 4818074 4680166 4547277
2774D547277j08034r1102j18176j32579r2471k9797r9232j53275j5185j41270
2764C566156O601q3000R234l5707k82619m2857R9222n5523o3756l0404m5133K2908
2752C065122r7263o500N5710j06745p1225j11691K8559o2781m2065k303l8251
2741B610567j22493j78823L8394n2530K2692m9150l8532N9333r8681j45983N0181
2730B094975j88787J8173P0998J49126j27741j89415l9958R203j10336J61674
2720A847912q1915k5017J4099r76j78336O2659N4620n8834l7907k14683n0222
2709A331400k3422K89278o7033j02218J57428r4575o6324j45685j3289J50993
2699A416553L2975q3333k6599j25060j38101r9863j12248J29847J02695p2115
$$ plain form
2774 4547277 4439243 4348141 4229965 4097386 4004915 3975118 3875886 3722611 3707426 3566156
2764 3566156 3572757 3489757 3498991 3463284 3180665 3137808 3237030 3181507 3117751 3087347 3042214 3065122
2752 3065122 2967859 2961359 3017069 2910324 2839099 2727408 2755967 2693186 2651121 2648818 2610567
2741 2610567 2488074 2309251 2347645 2295115 2317807 2268657 2230125 2289458 2190777 2044794 2094975
2730 2094975 1906188 1924361 1995359 2144485 2016744 1827329 1787371 1796574 1686238 1847912
2720 1847912 1765997 1740980 1755079 1754103 1575767 1638426 1693046 1634212 1596305 1381622 1331400
2709 1331400 1307978 1597256 1530223 1428005 1585433 1490858 1424534 1278849 1265560 1416553
2699 1416553 1449528 1366195 1339596 1214536 1076435 976572 864324 994171 1096866 1024751
2689A024751o7948Q3546K6965O7375l1940r4004J6001j44550L3787K559K732o8823
2677H50451J31355J6430p6485J9663N903N9633j02462p3609J02155p1804K689
2666H63919j16638j0147J01452j01603n0054M3680k2577r3862k7377R7268J61027
2655H45088n4740Q0831Q740R3111j51699n1243K00383k5422n8534J3482J1741
2644I11738k1318R4496m5540Q5429J01259o0090J30446j47505Q7948k05373K1227
2633I52717N7682J36113j5524p9882j26792n3453O4967l3310n769m5518J27244
2622I78475R2621O8537P3415o3413L1227o7700j77759M3583P2132O2038Q6789
2611A199945O3393k8872P2197j08825K41899m0837l4582J6778r4428j91228p9013
$$ plain form
2689 1024751 956803 1040349 1067314 1134689 1102749 1008745 1024746 880196 913983 916542 919274 850451
2677 850451 981806 998236 921751 941414 947317 1006950 904488 830879 933034 861230 863919
2666 863919 747281 737134 838586 736983 686929 730609 708032 614170 586793 684061 845088
2655 845088 790348 871179 879919 973030 821331 770088 970471 945049 886515 899997 911738
2644 911738 890420 984916 939376 1024805 1126064 1065974 1196420 1048915 1136863 931490 952717
2633 952717 1010399 1146512 1130988 1051106 924314 870861 935828 902518 896749 851231 978475
2622 978475 1071096 1139633 1213048 1149635 1180862 1113162 935403 978986 1051118 1113156 1199945
2611 1199945 1263338 1234466 1306663 1197838 1439737 1398900 1364318 1381096 1286668 1095440 1016427
2600A016427O8062q7748j24749j61284N3874L5525P28K1185m8163j23601j2209
2589F38047P1137N5207j00114J39336q6424N125j7955J8035L8746J34052k626
2578H92566o5943J13431J67505j68385j97600O1122n7194q6729Q0718j45087r9321
2567D95083J25915j27003K9104k631O5897j9541q8625L3115P8329J06703j08598
2556E87748j36176J01105K7689J7457n8210j19588j06240o284Q5851p6071j25141
2545A92140M1870M560J79446M3516r3915r3877n4870m540J40631j50214Q3203
2534B87950J65311j46228m8559L7518M3225q5396j36588n2278N7029K8289M6845
2523A97118J23401l7763j04379j9249q949m7646k6637N9406K4574j02975K19206
$$ plain form
2600 1016427 1084489 996741 871992 710708 764582 800107 800835 822020 773857 650256 638047
2589 638047 709184 764391 664277 803613 717189 722314 704359 722394 761140 895192 892566
2578 892566 826623 940054 1107559 939174 741574 802696 745502 658773 739491 594404 495083
2567 495083 620998 493995 523099 520468 586365 566824 478199 511314 589643 696346 587748
2556 587748 451572 552677 580366 597823 539613 420025 313785 307501 393352 317281 192140
2545 192140 234010 238570 418016 461532 367617 273740 218870 214330 354961 204747 287950
2534 287950 453261 307033 258474 295992 339217 253821 117233 64955 121984 150273 197118
2523 197118 320519 282756 178377 159128 150179 102533 75896 135302 159876 56901 276107
2512B76107L1143m2237R8343n5359l3224q0341j7458p4251k7887L6917J00920
2501B12673n4744n2167M8983q1873l5496J09882O4122M4965r1026L0132j5835
2490A79616q4631j23318N3334J01277j78180J5429N3810l8343J2027o8320L1624
2479d5675J32964J26750k0629j8628m5734o3251O748j38145R058m1313K59019
2468A61164k7766Q2681J71462j06505k25129O8587L3570k36536J43137l208J75732
2457B37189K8437j35273p5558m7145J19679j27425j563J95111j13711o4154J24470
2446A40057m2526j12988m0584Q606J90430j16761J36634m7433k34584N7754R5428
2435C4033k5471q131l3504J28658r03o7832P3547J3456o888J3506k01721J0754
$$ plain form
2512 276107 307250 265013 363356 307997 274773 194432 176974 102723 74836 111753 212673
2501 212673 157929 105762 154745 72872 37376 147258 211380 256345 165319 195451 179616
2490 179616 94985 -28333 25001 126278 -51902 -36473 17337 -21006 -8979 -77299 -45675
2479 -45675 87289 214039 193410 174782 129048 65797 72545 -65600 -56542 -97855 161164
2468 161164 133398 216079 387541 281036 55907 124494 158064 -78472 64665 61457 237189
2457 237189 265626 130353 54795 7650 127329 -96 -1659 193452 79741 15587 140057
2446 140057 97531 -15457 -56041 -47435 142995 26234 162868 115435 -119149 -61395 34033
2435 34033 8562 431 -33073 95585 94682 26850 100397 113853 106965 120471 -81250 -70496
2423g0496Q6796l6717k4510j85742J45603M519Q7583n4911J01972j22771n688
2412g4362J3437p8911Q9616R5139K8817j07967J42150R5767p4992J460p6628l3623
2400A9903k8358r7817k5965R1962J51356o6059o6585O7947r112k4784j9192Q2116
2388G5412j10252q3094L3955J09447J2365k763j7871l1512M3212L6013O5493L4904
2376A65309L306j83654K9104m1344O8576N5049j0599M5414O9884k1839J26470
2365C05676j29526M0632Q5207j16543J44953j16779j31351J67785l2501J6196
2355B33749l3585r030l9268N7852M0588p9335j32242P2440j15618R1121J50158
2344B36830k11041Q5916k1518N5098P5740l5215j05735o2613l6584J10188M1308
$$ plain form
2423 -70496 16300 -20417 -44927 -230669 -85066 -80547 7036 -47875 54097 -68674 -74362
2412 -74362 -60925 -139836 -50220 44919 73736 -34231 107919 203686 128694 130154 53526 19903
2400 19903 -8455 -106272 -132237 -40275 111081 45022 -21563 46384 37272 12488 -6704 75412
2388 75412 -34840 -117934 -83979 25468 37833 35070 17199 -14313 28899 64912 130405 165309
2376 165309 168615 -15039 14065 -27279 41297 96346 85747 131161 201045 179206 305676
2365 305676 176150 216782 301989 185446 330399 213620 82269 250054 217553 233749
2355 233749 200164 191134 151866 209718 250306 170971 38729 111169 -4449 86672 236830
2344 236830 25789 111705 90187 145285 221025 185810 80075 17462 -19122 91066 132374
2333A32374p9357N8494j9489j41969N9967o9645K8303M8146P0645K3980p4845
2322C6604j09788R0074P8114r8218J04220j01363K6393J99441j31919j25971j22963
2311a55376J11818l8413m3165l558J05596J44328P9584J6504K0481J2249j45140
2300A04908J14851j4496p6128K4881k8308j98518J45028L4397j07184j60504j8987
2289a80060P8028J42448j8084j9556J33305J16974j13053J00082J7243j22569
2279A34758n4668Q3881N8221j80042J48668J02052r5488j12013P9124P097J69567
2268C41157r6239j26493r9721K8476P9133P7117k3888j21961o0124J2250j574
2257H133Q3760L874Q9994l6699q616l6827J1992O3957N3279K0797j30877J5378
$$ plain form
2333 132374 53017 111511 92022 -49947 10020 -59625 -31322 16824 87469 111449 36604
2322 36604 -73184 16890 95004 -3214 101006 -357 26036 225477 93558 -32413 -155376
2311 -155376 -43558 -81971 -125136 -128694 -23098 121230 200814 217318 237799 250048 104908
2300 104908 219759 205263 129135 154016 125708 -72810 72218 106615 -569 -161073 -180060
2289 -180060 -102032 40416 22332 2776 136081 253055 140002 240084 257327 134758
2279 134758 80090 163971 222192 42150 190818 292870 197382 85369 164493 171590 341157
2268 341157 244918 118425 18704 47180 126313 203430 179542 57581 -2543 9707 8133
2257 8133 91893 95767 185761 149062 140446 103619 115611 179568 232847 253644 122767 138145
2245A38145r6742j0199n7839R2542J17045Q0889j15309q5198j6735K430K9573
2234G8602K15461J3963j99172J60504j19987R075R4875m6134O2616j06412k6127
2223A37264J01009J38981n8580r2686L7458o5100O4740R4385q9824j00939l5794
2212A30914K20J06191J3645j05258Q5660J96661l9330n1987L5439o6624J470J31186
2200D38187O6262j0420j5697k01949l862K39200l6634k36625J27081n063K4512
2189C84992J2982r1602J02348M7788K43078j20712m0575P5759p644K7953n7465
2178E76902q4411j7264J39517K11970Q7307Q9919o4512R565Q8284j35873q1848
2167H19556K04999R8366Q1462O1332j40100Q7853p5814Q0624J6398j12287K28169
$$ plain form
2245 138145 41403 31204 -26635 65907 182952 263841 148532 63334 46599 49029 78602
2234 78602 294063 308026 108854 269358 149371 158446 253321 207187 269803 163391 137264
2223 137264 238273 377254 318674 225988 263446 198346 263086 357471 267647 166708 130914
2212 130914 131134 237325 250970 145712 231372 428033 388703 336716 372155 305531 307001 438187
2200 438187 504449 494029 478332 276383 272521 511721 475087 238462 365543 360480 384992
2189 384992 397974 306372 408720 456508 699586 578874 538299 614058 606414 634367 576902
2178 576902 492491 475227 614744 826714 914021 1003940 939428 948993 1037277 901404 819556
2167 819556 1024555 1122921 1204383 1265715 1125615 1213468 1137654 1218278 1234676 1122389 1350558
2156A350558J16780p2525k4411N8667J35800q1877K34001K9879P86K2505K00861
2145A971024J81492l2478M9174R9962J74405J68346j5499M4876J25443J20396
2135B887141O3925K82769J71403K46308N1130J14599L34422J62326J73051J55338
2125D642412J82156K24730K97175L95894M77673J83552L05833N01300N43375M61284
2115H215384O67041O97269P47244J000390R76594P86335P09134Q65000J014375
2106A5678766J295387J897881K246186L093895L053057L987936M762264O380882
2098D2396254P676054R742323O551426k57364p460662j1777288r901472p094254
2090B9875017m867317l911622k961870k086845j636479j445917q24163r09873
$$ plain form
2156 1350558 1467338 1394813 1370402 1429069 1564869 1482992 1716993 1746872 1747658 1770163 1971024
2145 1971024 2152516 2120038 2169212 2269174 2443579 2611925 2596426 2641302 2766745 2887141
2135 2887141 2951066 3233835 3405238 3651546 3702676 3817275 4151697 4314023 4487074 4642412
2125 4642412 4824568 5049298 5346473 5742367 6220040 6403592 6709425 7210725 7754100 8215384
2115 8215384 8882425 9579694 10326938 11327328 12303922 13090257 13799391 14664391 15678766
2106 15678766 16974153 18872034 21118220 24212115 27265172 31253108 36015372 42396254
2098 42396254 50072308 59814631 66366057 66108693 58648031 46870743 36969271 29875017
2090 29875017 25007700 21096078 18134208 16047363 14410884 12964967 12140804 11230931
2082A1230931m79516o41542n93839q43223p60844r43751o52601k91386j36061
2073E888168k33103m42605l43617q3799l41817k79028k46224j54803j94253j45124
2063C423795j37934j03929j78797q8053k0963j91671k0982Q6165M5396k49253
2053B563774o4925n967j10918O2158k0420j21377j01660j42162j4745j57044j71449
2042A715265k20749m4450J30994P8040n007J754L2603j59577j02709R9921r6216
2031A429869n0552J38968j81525k25646j18476j26397m6795M3511J37505l097
2021I97365j30709P0326J50754N9841j55387j36975Q7822o9318o0366P5623j00646
2010G88330j64215J00335j63968l9960O2263J73405n8451j51055m6372r626L0787
$$ plain form
2082 11230931 10751415 10109873 9516034 8672811 7911967 6968216 6315615 6024229 5888168
2073 5888168 5655065 5212460 4868843 4785044 4443227 4164199 3917975 3763172 3568919 3423795
2063 3423795 3285861 3181932 3003135 2915082 2894119 2702448 2681466 2767631 2813027 2563774
2053 2563774 2498849 2492882 2381964 2444122 2423702 2302325 2200665 2058503 2043758 1886714 1715265
2042 1715265 1494516 1450066 1581060 1659100 1654093 1655847 1688450 1528873 1426164 1526085 1429869
2031 1429869 1379317 1518285 1336760 1111114 992638 866241 819446 862957 1000462 997365
2021 997365 866656 936982 1087736 1147577 992190 855215 943037 873719 813353 888976 788330
2010 788330 624115 724450 560482 520522 582785 756190 697739 546684 500312 490686 521473
1999E21473j35692n980J54862o7389J03855m403j03164j47856N7157P8203l0563
1988D20503k1957J1799m1974j2398N9814j71141l3950P2159n3737M0627J22703
1977C92448Q154J29426q5966m7014j15402j69408R4691P4576m8727k5111O4060
1966B71727j07244M3203J25910p7777k07361N9219o5732K9065L2716R4359P8857
1955B76942r8640n7282q5633m6016j6636J80928m4228Q8322k75830Q5331Q6592
1944I3850K0129J20428j77142k54767J40926J17708P2034L8377n5428L2380q7732
1933F0763K1279p3899n285J48484o740j0903J3237k0166J0240N7407L4716j26372
1921A02761j3573Q5973P7678K7471j05744k26766Q2671R8703N7711L4661n7406
$$ plain form
1999 521473 385781 379801 534663 467274 571129 566726 463562 315706 372863 451066 420503
1988 420503 398546 410345 368371 355973 415787 244646 210696 282855 229118 269745 392448
1977 392448 400602 530028 444062 397048 281646 112238 206929 281505 232778 207667 271727
1966 271727 164483 207686 333596 255819 48458 107677 41945 71010 103726 198085 276942
1955 276942 178302 121020 35387 -10629 -27265 153663 109435 197757 -78073 7258 93850
1944 93850 113979 234407 57265 -197502 -56576 61132 133166 171543 116115 148495 60763
1933 60763 82042 8143 2858 151342 144602 133699 146936 126770 137010 194417 229133 102761
1921 102761 89188 175161 252839 280310 174566 -52200 30471 129174 186885 221546 164140
1910A64140L1330j16196N2559o8698R212j29014o6148L12940r0531J5576j09897
1899E273M0199j7200j10555l0137N2484K16669J37j11556j5143J02592m8581p5076
1887I106o5539M486q0099N2732r457N9542R0190k7166M6041p9537k2119Q0144
1875E8324J34053j21735q9994M6157j4255P8542P996Q6898k9409l1796K3347j41573
1863F555n8551R6417l2747j2854N6751j39993o4926J24706O374L6167p1263j0881
1851f4245j24740R8762j7990l0385J23708r9523J24974n3020J60848L7121k8374
1840A27136k881l3377k0427m8719j41588L3829J05041R9461K4161q9716J8695
1829G1615J24697J63094k0816j74005M1641P3653j78835r1595j7756J86644K2122
$$ plain form
1910 164140 195470 79274 131833 63135 72347 -56667 -122815 190125 99594 115170 5273
1899 5273 45472 28272 -82283 -112420 -59936 156733 156870 45314 30171 132763 84182 9106
1887 9106 -56433 -51947 -132046 -79314 -88771 -29229 60961 33795 79836 299 -21820 58324
1875 58324 192377 70642 -19352 26805 12550 91092 99088 185986 156577 124781 148128 6555
1863 6555 -51996 44421 11674 -1180 55571 -84422 -149348 -24642 -18268 17899 -53364 -64245
1851 -64245 -188985 -90223 -108213 -138598 -14890 -114413 10561 -42459 118389 155510 127136
1840 127136 124255 90878 70451 21732 -119856 -86027 19014 118475 142636 52920 71615
1829 71615 196312 359406 338590 164585 206226 279879 101044 9449 -8307 178337 200459
1818B00459j06374o6615j7894L652p1825l0558j09473l6665M8715J89853n753
1807b478r3863K068O3574R6000j41586N1145O2717j65076O9979K08020k8070l9790
1795H2640j56095l004J81399j1355N3741k7270p7799j00983r3197J016k0806J38650
1783c3063P1014j24474l1744L6670K2805j7136l4392J76229n344r7800r0474n6629
1771a84338M2887N9752R8853J3759j34248j1749R5606l1293q5565n5980M1210
1760a51106n9868P191O293R3312p2919m062M2035J8778j43202P9730k4017J26901
1748h0934Q1516J14471m1868M690j1139o8055p6010J2338o8554j00031R2641k635
1736a43570N7956j0598Q9337j47689J28890L2704j71681O341J98890n9963j16211
$$ plain form
1818 200459 94085 27470 9576 13228 -58597 -89155 -198628 -235293 -186578 3275 -2478
1807 -2478 -96341 -94273 -30699 65301 -76285 -25140 37577 -127499 -57520 150500 122430 82640
1795 82640 -73455 -76459 104940 93585 147326 120056 42257 -58726 -151923 -150907 -171713 -33063
1783 -33063 37951 -86523 -118267 -81597 -58792 -75928 -110320 65909 60565 -37235 -127709 -184338
1771 -184338 -141451 -81699 17154 30913 -103335 -115084 -19478 -50771 -136336 -192316 -151106
1760 -151106 -210974 -203783 -197490 -104178 -177097 -181159 -139124 -120346 -263548 -183818 -207835 -80934
1748 -80934 582 115053 73185 77875 66736 -1319 -77329 -64991 -133545 -233576 -140935 -143570
1736 -143570 -85614 -96212 -6875 -154564 -25674 7030 -164651 -158310 40580 -19383 -135594
1725a35594q455J54819L7384j79555k2577L8446r9833N9571J70352K5156k6850
1714A2864P3095j62228K0669l0295P2623m5775l9280J22483J8945j41877k2272
1703a21048J81447l5748k02164k3524M2126n3371N0170J16687j46054N3488O8892
1692f9099m1130j2563l077J17656j31045J01755o0092k9521J51468k8827r6528
1681a01003j27020J03274O3814J64505r0941j51358M1549o5998J6057O7666q5845
1670a65300J35980j9311r8077J14015P632j51912L686P3171J450O9146P062J11667
1658H9209o4634J5481p6326j23999j66400l1286J11920K47817q5109j7862P9688
1647b1501R4470m4353N7138j36748p9967J02523o0802j53902M6838L3843R2421
$$ plain form
1725 -135594 -144049 10770 48154 -131401 -153978 -115532 -215365 -155794 14558 39714 12864
1714 12864 85959 -76269 -55600 -85895 -13272 -59047 -98327 24156 43101 -98776 -121048
1703 -121048 60399 24651 -177513 -201037 -158911 -212282 -162112 -45425 -191479 -137991 -69099
1692 -69099 -110229 -122792 -125869 -8213 -139258 -37503 -97595 -127116 24352 -4475 -101003
1681 -101003 -228023 -124749 -60935 103570 12629 -138729 -97180 -163178 -147121 -79455 -165300
1670 -165300 -29320 -48631 -146708 -32693 -25061 -176973 -173287 -100116 -98666 -29520 -22458 89209
1658 89209 24575 40056 -36270 -160269 -326669 -357955 -246035 1782 -83327 -101189 -21501
1647 -21501 72969 28616 85754 -50994 -130961 -28438 -89240 -243142 -196304 -162461 -70040
1636g0040L6631N092P3112n80j69408m3857J01657Q8763p0055q6523J4494o9397
1624a90111J29496q6886n375O850L3577J65322M8422p0297j79185J67698Q9654
1613A09165q8717p3189q8154M611o0969N328n4945O4083m7551J3422j04641P4645
1601b46912M6520R2110P1928m5063l4392n5726J21186l9975o7290J00435n2330
1590a09509Q7515o6387o3723q640J50895r2350O8669J2978o5851k3618j47115
1579b57136r803N2592Q1756Q491o1513l0341k9314K0643R0362L4012K13905j29134
1567a5480j28245J67713k3914o4769o5515K8517J1463j14780p1805J25857p5784
1556b26742J05992J27369j06119O7868n9478l5428K4483J8831J88777q4575j30209
$$ plain form
1636 -70040 -33409 -28317 44795 44215 -125193 -169050 -67393 21370 -48685 -135208 -120714 -190111
1624 -190111 -60615 -147501 -152876 -146026 -112449 52873 101295 30998 -148187 19511 109165
1613 109165 20448 -52741 -140895 -136284 -197253 -191925 -246870 -182787 -230338 -216916 -321557 -246912
1601 -246912 -200392 -108282 -36354 -81417 -115809 -171535 -50349 -90324 -157614 -57179 -109509
1590 -109509 -21994 -88381 -152104 -160744 -9849 -102199 -33530 -20552 -86403 -110021 -257136
1579 -257136 -266939 -214347 -132591 -124100 -185613 -215954 -245268 -224625 -134263 -100251 113654 -15480
1567 -15480 -143725 23988 74 -64695 -130210 -101693 -90230 -205010 -276815 -150958 -226742
1556 -226742 -120750 6619 -99500 -31632 -91110 -126538 -102055 -83224 105553 20978 -109231
1545a09231m5028J1605k2694j65280P7081M6786L9147O9260M3871J6655n731j40190
1533a83749J25334m859m5901j5888J59340j64281R4759k5902j1590l3189P9608
1522b6318K2134j55130J61855P5540j73175N942j11422K0157L142J21985K5529
1511b9761K4861N8074Q134M6370k66366o934p5084J11362J20837j8352N3148l9875
1499a3586J08842j80549L9593J86224j16580p1832m319J54044o7078k20914r6778
1488b82933J64250q905m0970Q0152P6601q9628Q2496n3081n9781N3626J63535
1477H5362r7439j93451J0250R4759L4279J19931L874j21155l1291k254M7848P5218
1465B5931J31061q5157J293r84k23930k1359K9490n1162J22066J27533l716l1215
$$ plain form
1545 -109231 -154259 -142654 -165348 -330628 -253547 -206761 -167614 -98354 -54483 -37828 -43559 -183749
1533 -183749 -58415 -63274 -109175 -125063 34277 -130004 -35245 -61147 -72737 -105926 -26318
1522 -26318 -4184 -159314 2541 78081 -95094 -89152 -200574 -180417 -177275 -55290 -29761
1511 -29761 -4900 53174 61308 107678 -158688 -165622 -240706 -129344 -8507 -26859 26289 -13586
1499 -13586 95256 -85293 -45700 140524 23944 -47888 -52207 101837 34759 -186155 -282933
1488 -282933 -118683 -127588 -168558 -88406 -11805 -101433 -18937 -72018 -131799 -78173 85362
1477 85362 -12077 -205528 -195278 -100519 -66240 53691 57565 -63590 -94881 -97135 -49287 25931
1465 25931 156992 71835 73128 72144 -151786 -173145 -143655 -194817 -72751 54782 51066 19851
1453A9851J3189J7965l6549Q3070j1217P122j63720j55813Q8940o7457l1107J29299
1441a06427Q2217J7608J55266M8040p6572n0631j31650L5533j24546J4570j23630
1430b60222J84753J16590k3547m2593P8427k4277M0954k0116j75214M5986Q6704
1419G445l2148j64371K3121J89314Q677r3999p5117k3994J29390j11685r5408
1408b38775P6552N8225K101P6468Q130P0560k45977j30858R1469J18097O523k3198
1396a30683j38940L3911K8105Q195K8804J09378r6094Q954J17512K2021k2229
1385c1066p3073P4786p6856L3011q4036k2060R3662Q0900K6050J283o8369q3002
1373a28770J89889Q8610n1527j54614J17362n8926o9544K2003k28444M7853K30587
$$ plain form
1453 19851 33040 51005 14456 97526 86309 93431 -70289 -226102 -137162 -204619 -235726 -106427
1441 -106427 -24210 -6602 148664 196704 120132 69501 -62149 -26616 -151162 -136592 -260222
1430 -260222 -75469 41121 17574 -25019 53408 29131 70085 49969 -125245 -79259 7445
1419 7445 -24703 -189074 -165953 23361 32038 -61961 -137078 -161072 -31682 -143367 -238775
1408 -238775 -162223 -103998 -101897 -25429 -17299 53261 -192716 -323574 -232105 -114008 -107485 -130683
1396 -130683 -269623 -235712 -207607 -199412 -170608 -61230 -157324 -148370 -30858 -8837 -31066
1385 -31066 -104139 -29353 -106209 -73198 -157234 -179294 -85632 -4732 21318 22601 -45768 -128770
1373 -128770 61119 149729 98202 -56412 60950 2024 -67520 -45517 -273961 -226108 4479
1362D479j09140j16852N0256N1857O3405Q7254J2588n418o5905q4053M890J74727
1350F8088O5014j56741J26425j23419m7089K7276p6032J90378k9670k7986J25184
1339A41428p6033j55442J25475j61852j08407O8764Q1454r826K3414J36278j06030
1328d0777j43410n0300J69646n728l645K8688N4044O612M9952j16015k0619R442
1316f2110J5383J55603r3258n4393r1738j06121K7801K05165m8080n8553K20574
1305A10273O1156k45759j28364J81719j8013R2247p0291n5967P6797J4052l7520
1294a9670m3607o2011J27653q6714j945R2859J11284N0323j60678J49540j03733
1283E3301o9425q085M0879k5133J15696j9100j4957j00820J9098j43711m7975
$$ plain form
1362 4479 -104661 -221513 -171257 -119400 -55995 31259 43847 38429 -27476 -111529 -106639 68088
1350 68088 133102 -23639 102786 -20633 -67722 -40446 -116478 73900 44230 16244 141428
1339 141428 65395 -90047 35428 -126424 -234831 -166067 -84613 -94439 -71025 65253 -40777
1328 -40777 -184187 -234487 -64841 -70569 -74214 -45526 8518 15130 65082 -50933 -71552 -62110
1316 -62110 -46727 108876 15618 -38775 -130513 -236634 -208833 -3668 -51748 -110301 110273
1305 110273 171429 -74330 -202694 -20975 -38988 53259 -17032 -72999 3798 17850 -19670
1294 -19670 -63277 -125288 2365 -84349 -86294 6565 117849 168172 7494 157034 53301
1283 53301 -16124 -24209 16670 -8463 107233 88133 73176 -27644 -8546 -152257 -200232
1272b00232K3388N5891J06987m4516k9009n917J8990n1872J10144K9420M5022
1261E8296j46243j15978J1035N4589l444M119M9376J4304N2839K45p3429J03585
1249I294N0504j03926r7740o7324P1779K72656P7699j1176o0629j85813L4887
1238i789J95417J109j95348o6986L275K7844R4237L5385p7910q2462J72081j54958
1226e8105j14475J37933L5897l548J28993p7162k24036j09530J51182P7185k2758
1215g8424j67996N5347J72707j6980k4959L7449K0004k0689p3346J316l7875J55035
1203B1589J63546j48414K2278J6240M3092j08594Q461N7998m7657Q0547J07693
1192B16779j07151m1836j0754M1970R387r3615M9420n7474j15553M7787n9790
$$ plain form
1272 -200232 -176844 -120953 -13966 -58482 -87491 -93408 -74418 -126290 -16146 13274 58296
1261 58296 -87947 -203925 -192890 -138301 -141745 -137626 -88250 -73946 -21107 -20862 -94291 9294
1249 9294 59798 -44128 -141868 -209192 -137413 135243 212942 201766 141137 -44676 -9789
1238 -9789 185628 186737 -8611 -75597 -72322 -44478 49759 85144 7234 -75228 96853 -58105
1226 -58105 -172580 -34647 1250 -2298 126695 49533 -174503 -284033 -132851 -55666 -78424
1215 -78424 -246420 -191073 -18366 -35346 -60305 -22856 -2852 -23541 -96887 -95571 -133446 21589
1203 21589 185135 36721 58999 75239 118331 9737 18198 76196 28539 109086 216779
1192 216779 109628 67792 57038 99008 108395 14780 64200 6726 -108827 -61040 -120830
1181a20830J33818m2936m0677O7713J07324o3935j15093J44465K0275k1277M0408
1170A09255j33031j12076J58588k9686J01249o8436N539p1446o4705Q8385r1942
1159a08306O7504n1426N6740O1653m3546M8820j61755j48156N1138J9456J58788
1148d9090J0431p5441o2311M9405R1039j11904j87P8407K2502O9495P9208J8792
1136A20346M0024l3086j00047r3518j17242J20063j3845N5658j48777j52993J82516
1125a40901J20560O7664p5575n9182r985j13280p4111K1025R0171J37645k4811
1114f0780Q2254K7431j12927M8116o5094K3908k7401l7196J39366O011j3465J63782
1102A74005q2567q1060j7728k7913J4582K7814m8298L4577J6591l6582l6865P8026
$$ plain form
1181 -120830 12988 -29948 -70625 -2912 104412 40477 -74616 69849 90124 68847 109255
1170 109255 -23776 -135852 22736 -6950 94299 25863 31402 -40044 -104749 -16364 -108306
1159 -108306 -40802 -92228 -35488 26165 -17381 31439 -130316 -278472 -227334 -207878 -49090
1148 -49090 -38659 -114100 -176411 -127006 -35967 -147871 -148058 -69651 -47149 22346 101554 120346
1136 120346 160370 127284 27237 -66281 -183523 -63460 -77305 -21647 -170424 -323417 -140901
1125 -140901 -20341 47323 -28252 -87434 -97419 -210699 -284810 -263785 -173614 -35969 -60780
1114 -60780 21474 48905 -64022 -15906 -81000 -57092 -84493 -121689 17677 23688 10223 174005
1102 174005 91438 10378 -7350 -35263 -20681 7133 -41165 -6588 10003 -26579 -63444 14582
1090A4582p238j12621J49201j90863p2775J71595K9553J04619j00593j11497M7232
1079g8805j14542r204q135Q9211l0916p5635j29335N1013J57177K6445n9962P473
1067a75215J02939P3023L0242l944j18774m0207N8018J14683J32529P263l152
1056A77405p8112j25496j9437l0695P2843p586l9958K9246j29675l2300k1751
1045b05516J58259n7823M6817k039J39844m360P5735j79501j81674L6444J03561
1034g0253J49471j03041J1020j56M7184j54707Q0462J57186N3296j04677q0900
1023a5115n5207k7905K6019Q9904j35358R6260L8544J4673m3847R3295j1719K5812
1011I5356k8891k4984j03909L0627n0004J53699o925j22070J34549k9655m1895
$$ plain form
1090 14582 7344 -105277 43924 -146939 -219714 -48119 -18566 86053 -14540 -126037 -78805
1079 -78805 -193347 -202551 -210686 -121475 -152391 -228026 -357361 -306348 -149171 -122726 -182688 -175215
1067 -175215 -72276 747 30989 27045 -91729 -131936 -73918 40765 173294 180557 177405
1056 177405 99293 -26203 -45640 -76335 -3492 -11078 -51036 -21790 -151465 -183765 -205516
1045 -205516 -47257 -105080 -58263 -60302 79542 75182 150917 -28584 -210258 -173814 -70253
1034 -70253 79218 -23823 -12803 -12959 34225 -120482 -40020 117166 170462 65785 -15115
1023 -15115 -70322 -98227 -72208 17696 -117662 -21402 17142 31815 -12032 81263 69544 95356
1011 95356 66465 41481 -62428 -31801 -81805 71894 64969 -57101 77448 47793 5898
1000E898l6973J04569j43754J4639N1728Q9527L1118l9017j6276m9855L0296m9009
988g109o0735j42003J0158J37284k3975J20879j9773Q9590L8606l7882q9797N1477
976F6720o1582q1587k4534m1621J19544j0425k5458n3946j27374P7149P7737K14579
964A29202Q1843p7967K6538p0746j8747j84855j4705m0756L1429J54187o0217
953d4794J80969m5921k05367P3005K7445m9286J33717J0555j5073m5142K1624
942D1732j37630n3845K699J90355J25692j28556k72070J24543J34996o1402K27872
931A94386N147k08248o489J52884p9031P265n1536K3658N1809k9229j33098O8448
919d034l891M8410j43457j01263J12887J00734J04573p3032J75L6712l4031J35868
$$ plain form
1000 5898 -31075 73494 -70260 -55621 -3893 85634 116752 77735 61459 11604 41900 -7109
988 -7109 -67844 -209847 -199689 -62405 -86380 34499 14726 104316 142922 105040 15243 66720
976 66720 5138 -76449 -100983 -142604 -23060 -33485 -58943 -112889 -240263 -163114 -85377 129202
964 129202 211045 133078 159616 88870 70123 -114732 -129437 -170193 -138764 15423 -44794
953 -44794 136175 90254 -115113 -42108 -14663 -63949 69768 80323 65250 20108 41732
942 41732 -95898 -149743 -147044 43311 169003 40447 -231623 -107080 27916 -33486 194386
931 194386 199533 -8715 -15204 137680 58649 65914 14378 38036 89845 60616 -72482 -4034
919 -4034 -7925 40485 -102972 -204235 -91348 9386 113959 40927 41102 77814 43783 179651
907A79651Q165r1285N9858K101n6593q9235l631r5066J19454l645r9145K623k0648
894h7396j34862J12250o1252J0502K15311J4494j36872J09655O4602R556r5640
883B0348o3113r7110j47009J31990P1781M7884j0832k4951N2207P373k109q2263
871i5804J22607J97420j09009j46844l6399L606j0184j4977O890N2486J22135
860I1927N325j75103M2740p1888M7742J20382n0208l7121O9289l7612k1883j19573
848a35983J33996M8043K9043r127k7438k05102k760K25072J31819n945J05665
837B87283j70225k29152N5686J43874j18323P8753n6810o8172K63243K8136p4199
826A40094j01379j75587O5170J16659N2357J60198j66512j12686n3235o9953n7320
$$ plain form
907 179651 187816 96531 156389 158490 101897 12662 9031 -86035 33419 29774 -69371 -66748 -87396
894 -87396 -222258 -110008 -171260 -160758 54553 69047 -67825 41830 106432 115988 20348
883 20348 -42765 -139875 -286884 -154894 -83113 -35229 -46061 -71012 -18805 -11432 -13541 -95804
871 -95804 26803 224223 115214 -31630 -68029 -64423 -74607 -89584 -82694 -30208 91927
860 91927 97252 -77851 -35111 -106999 -59257 61125 10917 -26204 43085 5473 -16410 -135983
848 -135983 -1987 46056 75099 65972 38534 -166568 -169328 55744 187563 181618 287283
837 287283 117058 -112094 -56408 87466 -30857 47896 -8914 -77086 186157 214293 140094
826 140094 38715 -136872 -71702 44957 97314 257512 91000 -21686 -74921 -144874 -202194
815b02194P4736M7069P0960M0369Q4606J4348k0337K4602n6686n2370L484k8695
803a08K6879Q9390Q8643o8324l0050o8790m6717j18093J02230J34045q3811J51145
791A76439j39256j24539J00985n3596L9501K8109L2563o220N1000K4734k59107
780a29387j91927J32324K46349j18258j04101J48891o3304J07533J11267J1232
770A50619O5050r453j51474J12550J15116j04442N9563o1577j74209P6008O6086
759A43837p4904j16404J58323J2030P7391j99163j6698R4204j59687M7734J36017
748A02680m2643l8286J3297n9023m0445N9567J79473Q554P5671n1025p3570j23192
736A1058k3036J31383K2004j31969q1806J24725M2615m172m572j32097O0007q861
$$ plain form
815 -202194 -127458 -80389 -9429 30940 115546 129894 109557 134159 77473 25103 28587 -108
803 -108 26771 116161 204804 136480 106430 37640 -9077 -127170 -24940 109105 25294 176439
791 176439 37183 -87356 13629 -39967 -466 27643 60206 53986 104986 129720 -129387
780 -129387 -321314 -188990 57359 -60899 -165000 -16109 -79413 28120 139387 150619
770 150619 215669 206216 54742 167292 282408 177966 237529 175952 1743 77751 143837
759 143837 68933 -47471 110852 122882 200273 1110 -15588 78616 -81071 -33337 102680
748 102680 60037 21751 35048 -23975 -64420 -4853 174620 183174 258845 207820 134250 11058
736 11058 -11978 119405 141409 9440 -72366 52359 94974 90802 86230 -45867 14140 5279
724E279J3601o1952q501K9758J9734R9913n242j34154N0002l5965J06303N3136
712A31912Q703m2151L8737j94488n0537J92969M633Q2428j41319P0499J7874l5375
700H3885r7627n3234r484M1741P6786O971R6359p2655j0735p7722q8325J5611
688h8429M4069j4744N6170p1609O6946m0142K1256R9348o1586k3546j7041J42211
676A12903q601j63855r467P3197Q3060j364j49807K31592M7312k46109p7533J33898
664B5226J6825r0937p9867L2312J34668p4169J9556J53998J03928j54040j89619
653a02119J00502J4316n1997m6168J00557j55290P3373J02448N9845K3754M9326
642A68547j25724j82757J12339N2575K0678L4195k374N981J41868m2216j77264
$$ plain form
724 5279 18880 -43072 -51573 -21815 -2081 97832 92590 -41564 8438 -27527 78776 131912
712 131912 140615 98464 137201 -57287 -107824 85145 89778 172206 30887 101386 119260 83885
700 83885 -13742 -66976 -76460 -34719 42067 49038 145397 72742 62007 -15715 -104040 -88429
688 -88429 -44360 -59104 -2934 -74543 -7597 -47739 -26483 72865 11279 -12267 -29308 112903
676 112903 104302 -59553 -69020 4177 87237 85873 -63934 167658 214970 -31139 -108672 25226
664 25226 42051 -48886 -128753 -96441 38227 -35942 -16386 137612 241540 87500 -102119
653 -102119 -1617 12699 -39298 -85466 15091 -140199 -66826 35622 95467 119221 168547
642 168547 42823 -139934 -27595 24980 45658 79853 77479 83460 225328 183112 5848
631E848L346o5355L5278l368k9652M6347M2822j13945l9316O1814J5530J01540
619F0889o8238j04616J60264O9012K352j38864n4482K79696p6832K2898N5382
608B07461k08189p6779o5117k9661J76821L3900k639P2082Q102q5612p4995P3345
596B8719J22710N233l5178n8673O35k2058J08120m7016r6142N396n2166J68293
584A27873Q8962n3410J24880j89401N9394P2610j61587q5926N5331n611N4360
573H7475K050q7223L1626k3472m2455O9035Q243j50329Q7400J23702N07j07969
561a410J57279k7217m2603j08155o1491K04756J5259j6107p120K2921k16062J6977
549f2973n4387J07399J4261p3165J92823r9590p2984Q3858L7547k0717j05449
$$ plain form
631 5848 9194 -56161 -20883 -24251 -53903 -7556 35266 -78679 -117995 -56181 -40651 60889
619 60889 -7349 -111965 48299 117311 119663 -19201 -73683 206013 129181 152079 207461
608 207461 -728 -77507 -142624 -172285 4536 38436 35797 107879 115981 30369 -44626 28719
596 28719 151429 156662 121484 62811 63446 41388 149508 102492 6350 11746 -40420 127873
584 127873 216835 163425 288305 98904 158298 230908 69321 -16605 38726 33115 87475
573 87475 89525 2302 33928 10456 -31999 37036 45279 -105050 -17650 106052 106559 -1410
561 -1410 155869 128652 86049 -22106 -83597 121159 136418 120311 113191 136112 -79950 -62973
549 -62973 -117360 -9961 4300 -68865 123958 24368 -48616 35242 72789 52072 -53377
538e3377K2149N0419n3955q7207k1949M599P1609Q6255N0965j43464J64263O8865
526A59172N63N3281N168k8531R0059l9211o9858m1568j20488J24457p7789N6091
514A11346O6343k19430j07098Q3300k01878J22910M7600J57434J00814K4873j05829
503H0385J17017q2973o7617M0660J1871j28943N2657n0632O0259o1015r5693J74995
491E0971n9459J04015O746r1256O23M2645p7017N4754P3653q6261K3813l2394
479A0833o2878O1185j5605j04686N5798m3960R4246o4473J6329l4897o5596p229
467a60933q6162K34871l2808M9869M9233K5253q3658r6188j6206M8709O0169j18275
455a26126q6086J53864j5609l84P8179N0924j649O5181p0598j09957l3476j2455
$$ plain form
538 -53377 -31228 19191 -34764 -121971 -143920 -139321 -67712 18543 69508 -73956 90307 159172
526 159172 159735 213016 218184 189653 279712 240501 170643 129075 8587 133044 55255 111346
514 111346 177689 -41741 -148839 -65539 -267417 -144507 -96907 60527 161341 186214 80385
503 80385 197402 114429 46812 87472 99343 -29600 23057 -27575 32684 -28331 -124024 50971
491 50971 -8488 95527 102273 11017 11640 54285 -22732 32022 105675 19414 43227 10833
479 10833 -52045 9140 -6465 -111151 -55353 -99313 -5067 -69540 -53211 -88108 -153704 -160933
467 -160933 -247095 -12224 -45032 4837 54070 79323 -4335 -100523 -116729 -68020 -7851 -126126
455 -126126 -212212 -58348 -73957 -74341 3838 54762 53113 118294 47696 -62261 -95737 -108192
443a08192N3148K0608K3220J11783j44438o6457O4603j0200P6749L7639L7663
432I6126M0490l5987N7322l2416J28340k44810k9349J13715K1996p6661j52626
421a13860N8253m5743J39501J18744q5173N171j60249N5696O5858j9175J41621
410A60644J20234n7219k43351j3331l1764L7097k0266J16545M7647j14648j02061
399a00473J21762J07331O4168j44932j72270j36806K55374J2171n8442K01973
389A49856N8102m3388o9870Q1520P5509n487j62008K5616P266m0108L1155K1186
377A29349l4545R5292l8580J8253p6366J16457l333o5427L766K0804j80389p4153
365h8872J27021j43484q9852J09685J48254M0748n8650j23453p8759J91398K0444
$$ plain form
443 -108192 -55044 -34436 -11216 100567 -43871 -110328 -45725 -55925 20824 58463 96126
432 96126 136616 100629 157951 125535 253875 9065 -20284 93431 115427 38766 -113860
421 -113860 -55607 -101350 38151 156895 71722 76893 -83356 -27660 38198 19023 160644
410 160644 280878 223659 -19692 -33023 -64787 -27690 -47956 68589 116236 1588 -100473
399 -100473 21289 128620 192788 47856 -124414 -261220 -5846 6325 -52117 149856
389 149856 207958 164570 94700 176220 251729 246242 84234 109850 117116 77008 108163 129349
377 129349 94804 190096 151516 169769 93403 209860 206527 141100 144866 165670 -14719 -88872
365 -88872 38149 -105335 -195187 -85502 62752 103500 44850 -78603 -157362 34036 54480
354E4480m2326N8999l7828K03246j38799o3080n7717J27980l8433M9777l0822
343H5477k4904k6614o5602P1679R2126J7235j11093j09020k8421J26576j5639
332A1800L9733Q9676j7412J2479P223r5037j82501J16131M2058j47283J32289
321I156J22231o5351o2609N6975J63837p9185k0647J44066n1320p7837n4420N256
309I0152k5323P2330k826J6129k16169p111K12570n5248J16796k9617j33912j70097
297a32326J69770o2102k4915pq0496K0040Q4843R601p726Q6211j84008Q2919K56949
284B18753p1957j76049J44363M8008q9222m8118l7224P0825N461K1172R1962j54829
272B3145r7119J932R8105N0530L5850L0642J64025j5572j24043j3341l1550r9489
$$ plain form
354 54480 12154 71153 33325 236571 97772 34692 -23025 104955 66522 116299 85477
343 85477 60573 33959 -31643 40036 132162 149397 38304 -70716 -99137 27439 11800
332 11800 51533 141209 123797 136276 143499 48462 -134039 -17908 24150 -123133 9156
321 9156 131387 66036 3427 60402 224239 145054 124407 268473 217153 139316 84896 90152
309 90152 64829 137159 134333 150462 -65707 -72818 139752 84504 201300 171683 37771 -132326
297 -132326 37444 -24658 -49573 -49580 -130076 -110036 -25193 -15592 -23318 62893 -121115 -38196 218753
284 218753 146796 -29253 115110 163118 73896 25778 -11446 59379 64840 86012 177974 23145
272 23145 -73974 -72042 26063 76593 112443 143085 307110 291538 167495 154154 122604 23115
260B3115j9538O3581j5215L4335J21330j12709l1273k7636O7071k7846j7477J17386
248A75124m4112r8425k2905J9701O9399q9984R8344L6958N4953j20132j6296M4429
236A07054N9077m8789r354O5953q4197Q3623l8039j30076m8906J3464M3970j1088
224B692Q285Q8131J63877j36695k5633J48l1680K6736j02676r4397J15896O0494
212G5178j02139J23401n9588m5554j07596N3535o3441K13117J25228L911k0042
201A96010j07443r6725N4718P5779M2925M2892n697j37839R6344k1011j4121j17385
189H447o167m8216k2426K5003N5025M0627R547K6325k9944p401P1553M6910j06216
176F3067J69554k0707j67938R978M4721p5548m877O6097o2908Q7724p3914q2059
$$ plain form
260 23115 3577 67158 51943 86278 207608 94899 63626 35990 103061 75215 57738 175124
248 175124 131012 32587 9682 29383 98782 8798 107142 144100 199053 78921 62625 107054
236 107054 166131 117342 107988 173941 89744 173367 135328 5252 -43654 -30190 13780 2692
224 2692 10977 99108 262985 126290 100657 100805 69125 95861 -6815 -101212 14684 75178
212 75178 -26961 96440 36852 -8702 -116298 -62763 -126204 86913 212141 216052 196010
201 196010 88567 -8158 46560 122339 165264 208156 202459 64620 160964 139953 125832 8447
189 8447 2280 -45936 -68362 -43359 11666 52293 61840 88165 58221 50820 122373 169283 63067
176 63067 232621 211914 43976 53954 98675 23127 18250 84347 21439 109163 35249 -46810
164d6810M8712N7131r0235j00809j5426J02439K7975N2635n7391o3930M0349P0270
152B4910k846l3189o1959J52032J15207r6318j20243o5455J14613J9455Q3411
141A29618k25475J2990Q9359M8854r8711O6634N2057K1883Q6848L5207j55988
130F3276p8979k2042j6106j1954j3162O3344k2497J14720m4334o5602M4121o596
118D189Q1760j0965m156j7925o2185q100N2429n0407K5732j00768p8331l4527
106b03254M7287l9734o387J4465R1980R0242K557k3574p0427J54421L2723q9336
94I63l8972j8674m2342k367L3955k6687R271m321q8292r569N9247J10282m4145
81f1651l736k685j8413Q8178l2666j11285o700O3280p9140N509O2316K3285J14691
$$ plain form
164 -46810 1902 59033 -31202 -132011 -147437 -44998 -17023 35612 -21779 -85709 -45360 24910
152 24910 22064 -11125 -73084 78948 194155 97837 -22406 -87861 26752 46207 129618
141 129618 -95857 -82867 6492 55346 -43365 23269 75326 97209 184057 219264 63276
130 63276 -15703 -37745 -53851 -65805 -78967 -15623 -38120 76600 32266 -33336 10785 4189
118 4189 85949 74984 70828 52903 -9282 -17382 35047 -15360 10372 -90396 -168727 -203254
106 -203254 -155967 -195701 -202088 -187623 -95643 -5401 -2844 -26418 -96845 57576 90299 963
94 963 -38009 -56683 -99025 -101392 -67437 -94124 -84853 -89174 -177466 -187035 -127788 -17506 -61651
81 -61651 -65387 -68072 -86485 1693 -30973 -142258 -148958 -85678 -164818 -159309 -96993 -73708 40983
68D0983n1760q5273m2721J477P3786k6845P0533p4486r306O175r7568l3604n5444
$$ plain form
68 40983 -10777 -96050 -138771 -137294 -63508 -90353 -19820 -94306 -103612 -97437 -195005 -228609 -284053
$$ [...]
##END NTUPLES=NMR SPECTRUM
##END=
