##TITLE=1H_52-2024
 CDCl3
 8 sc, 
 9.8.2024
##JCAMPDX= 6.0         $$ Bruker NMR JCAMP-DX V2.0
##DATA TYPE= NMR FID
##DATA CLASS= NTUPLES
##ORIGIN= UXNMR, Bruker Analytische Messtechnik GmbH
##OWNER= root
$$ XWIN-NMR		Version 3.5
$$ Fri Aug  9 13:42:04 2024 Russian Standard Time (UT+4h)  she@DPX200
##.OBSERVE FREQUENCY= 200.1313
##.OBSERVE NUCLEUS= ^1H
##.DELAY= (6, 6)
##.ACQUISITION MODE= SIMULTANEOUS
##.ACQUISITION SCHEME= undefined
##.AVERAGES= 8
##.DIGITISER RES= 18
##SPECTROMETER/DATA SYSTEM= spect
##.PULSE SEQUENCE= zg30
##.SOLVENT NAME= Acetone
##.SHIFT REFERENCE= (INTERNAL, Acetone, 0, 15.7039)
##AUDIT TRAIL= $$ (NUMBER, WHEN, WHO, WHERE, WHAT)
$$ ##TITLE= Audit trail, XWIN-NMR		Version 3.5
$$ ##JCAMPDX= 5.01
$$ ##ORIGIN= Bruker BioSpin GmbH
$$ ##OWNER= she
$$ F:/spectra/data/she/nmr/H-F/1/audita.txt
$$ ##AUDIT TRAIL=  $$ (NUMBER, WHEN, WHO, WHERE, WHAT)
(   1,<2024-08-09 13:40:59.43 +0400>,<she>,<DPX200>,
      <created by zg, POWCHK disabled, PULCHK disabled
       configuration hash MD5:
       00 E9 B6 7A A2 85 ED C7 34 08 36 98 17 FE 4E 26
       data hash MD5: 16K
       C0 61 F2 69 2C CE 67 6D A9 E2 A6 2B 01 27 2A B9>)
$$ ##END=
$$ 
$$ hash MD5
$$ BF CC 74 7F 4F 1C 47 69 0E FF 29 F9 57 A0 48 D2
##$RELAX= 
##$RELAX= 
##$RELAX= 
##$RELAX= 
##$RELAX= 
##$RELAX= 
$$ Bruker specific parameters
$$ --------------------------
##$DU= <F:/spectra>
##$EXPNO= 1
##$NAME= <H-F>
##$PROCNO= 1
##$TYPE= <nmr>
##$USER= <she>
##$AMP= (0..31)
100 100 100 100 100 100 100 100 100 100 100 100 100 100 100 100 100 100 
100 100 100 100 100 100 100 100 100 100 100 100 100 100 
##$AQSEQ= 0
##$AQ_mod= 1
##$AUNM= <au_zg>
##$AUTOPOS= <>
##$BF1= 200.13
##$BF2= 200.13
##$BF3= 200.13
##$BF4= 200.13
##$BF5= 200.13
##$BF6= 200.13
##$BF7= 200.13
##$BF8= 200.13
##$BYTORDA= 1
##$CFDGTYP= 0
##$CFRGTYP= 5
##$CHEMSTR= <none>
##$CNST= (0..31)
1 1 145 1 1 1 1 1 1 1 1 1 1 1 1 1 1 1 1 1 1 1 1 1 1 1 1 1 1 1 1 1 
##$CPDPRG= <>
##$CPDPRG1= <>
##$CPDPRG2= <>
##$CPDPRG3= <>
##$CPDPRG4= <mlev>
##$CPDPRG5= <mlev>
##$CPDPRG6= <mlev>
##$CPDPRG7= <mlev>
##$CPDPRG8= <mlev>
##$CPDPRGB= <>
##$CPDPRGT= <>
##$D= (0..31)
0 1.2 0 0 0 0 0 0 0 0.06 0 0.03 0 0 0 0 0.0002 0 0 0 0 0 0 0 0 0 0 0 0 
0 0 0 
##$DATE= 1723196458
##$DBL= (0..7)
120 120 120 120 120 120 120 120 
##$DBP= (0..7)
150 150 150 150 150 150 150 150 
##$DBP07= 0
##$DBPNAM0= <>
##$DBPNAM1= <>
##$DBPNAM2= <>
##$DBPNAM3= <>
##$DBPNAM4= <>
##$DBPNAM5= <>
##$DBPNAM6= <>
##$DBPNAM7= <>
##$DBPOAL= (0..7)
0.5 0.5 0.5 0.5 0.5 0.5 0.5 0.5 
##$DBPOFFS= (0..7)
0 0 0 0 0 0 0 0 
##$DE= 6
##$DECBNUC= <off>
##$DECIM= 24
##$DECNUC= <off>
##$DECSTAT= 4
##$DIGMOD= 1
##$DIGTYP= 9
##$DL= (0..7)
0 120 120 120 120 120 120 120 
##$DP= (0..7)
150 150 150 150 150 150 150 150 
##$DP07= 0
##$DPNAME0= <>
##$DPNAME1= <>
##$DPNAME2= <>
##$DPNAME3= <>
##$DPNAME4= <>
##$DPNAME5= <>
##$DPNAME6= <>
##$DPNAME7= <>
##$DPOAL= (0..7)
0.5 0.5 0.5 0.5 0.5 0.5 0.5 0.5 
##$DPOFFS= (0..7)
0 0 0 0 0 0 0 0 
##$DQDMODE= 0
##$DR= 18
##$DS= 0
##$DSLIST= <SSSSSSSSSSSSSSS>
$$ [...]
##$SUBNAM2= <"">
##$SUBNAM3= <"">
##$SUBNAM4= <"">
##$SUBNAM5= <"">
##$SUBNAM6= <"">
##$SUBNAM7= <"">
##$SUBNAM8= <"">
##$SUBNAM9= <"">
##$SW= 24.0689771365484
##$SWIBOX= (0..15)
0 0 2 0 0 0 0 0 0 0 0 0 0 0 0 0 
##$SW_h= 4816.95568400771
##$TD= 16384
##$TD0= 1
##$TE= 0
##$TE2= 300
##$TE3= 300
##$TEG= 300
##$TL= (0..7)
0 120 120 120 120 120 120 120 
##$TP= (0..7)
150 150 150 150 150 150 150 150 
##$TP07= 0
##$TPNAME0= <>
##$TPNAME1= <>
##$TPNAME2= <>
##$TPNAME3= <>
##$TPNAME4= <>
##$TPNAME5= <>
##$TPNAME6= <>
##$TPNAME7= <>
##$TPOAL= (0..7)
0.5 0.5 0.5 0.5 0.5 0.5 0.5 0.5 
##$TPOFFS= (0..7)
0 0 0 0 0 0 0 0 
##$TUNHIN= 0
##$TUNHOUT= 0
##$TUNXOUT= 0
##$USERA1= <user>
##$USERA2= <user>
##$USERA3= <user>
##$USERA4= <user>
##$USERA5= <user>
##$V9= 5
##$VALIST= <valist>
##$VCLIST= <CCCCCCCCCCCCCCC>
##$VD= 0
##$VDLIST= <DDDDDDDDDDDDDDD>
##$VPLIST= <PPPPPPPPPPPPPPP>
##$VTLIST= <TTTTTTTTTTTTTTT>
##$WBST= 1024
##$WBSW= 4
##$XGAIN= (0..3)
0 0 0 0 
##$XL= 0
##$YL= 0
##$YMAX_a= 350151
##$YMIN_a= -337295
##$ZGOPTNS= <>
##$ZL1= 120
##$ZL2= 120
##$ZL3= 120
##$ZL4= 120
##$ABSF1= 10
##$ABSF2= 0
##$ABSG= 5
##$ABSL= 3
##$ALPHA= 0
##$AQORDER= 0
##$ASSFAC= 0
##$ASSFACI= 0
##$ASSFACX= 0
##$ASSWID= 0
##$AUNMP= <proc_1d>
##$AZFE= 0.1
##$AZFW= 0.1
##$BCFW= 1
##$BC_mod= 2
##$BYTORDP= 1
##$COROFFS= 0
##$CY= 11.3945322036743
##$DATMOD= 1
##$DC= 2
##$DFILT= <>
##$DTYPP= 0
##$F1P= 15.6554695791079
##$F2P= 12.8336369535428
##$FCOR= 0.5
##$FTSIZE= 0
##$FT_mod= 4
##$GAMMA= 1
##$GB= 0.15
##$INTBC= 1
##$INTSCL= 1
##$ISEN= 128
##$LB= 0.24
##$LEV0= 0
##$LPBIN= 0
##$MAXI= 10000
##$MC2= 0
##$MEAN= 0
##$ME_mod= 0
##$MI= 1.114404
##$NCOEF= 0
##$NC_proc= 0
##$NLEV= 6
##$NOISF1= 3.799351
##$NOISF2= 2.8
##$NSP= 1
##$NTH_PI= 0
##$NZP= 0
##$OFFSET= 15.70392
##$PC= 1
##$PHC0= -25637.55
##$PHC1= 11.98749
##$PH_mod= 1
##$PKNL= yes
##$PPARMOD= 0
##$PSCAL= 0
##$PSIGN= 0
##$REVERSE= no
##$SF= 200.130013532006
##$SI= 16384
##$SIGF1= 3
##$SIGF2= 2
##$SINO= 400
##$SIOLD= 16384
##$SREGLST= <1H.CDCl3>
##$SSB= 0
##$STSI= 0
##$STSR= 0
##$SW_p= 3612.71676300578
##$SYMM= 0
##$S_DEV= 0
##$TDeff= 0
##$TDoff= 0
##$TI= <>
##$TILT= no
##$TM1= 0
##$TM2= 0
##$TOPLEV= 0
##$USERP1= <user>
##$USERP2= <user>
##$USERP3= <user>
##$USERP4= <user>
##$USERP5= <user>
##$WDW= 1
##$XDIM= 8192
##$YMAX_p= 0
##$YMIN_p= 0
$$ End of Bruker specific parameters
$$ ---------------------------------
##NTUPLES= NMR FID
##VAR_NAME=  TIME,          FID/REAL,        FID/IMAG
##SYMBOL=    X,             R,               I
##VAR_TYPE=  INDEPENDENT,   DEPENDENT,       DEPENDENT
##VAR_FORM=  AFFN,          ASDF,            ASDF
##VAR_DIM=   8192,          8192,            8192
##UNITS=     SECONDS,       ARBITRARY UNITS, ARBITRARY UNITS
##FACTOR=    0.0002076,     1,               1
##FIRST=     0,             0,               0
##LAST=      1.7004516,     0,               0
##MIN=       0,             -337295,         0
##MAX=       1.7004516,     350151,          0
$$ Real data points
##PAGE= N=1
##DATA TABLE= (X++(R..R)), XYDATA
0 0 0 0 0 0 0 0 -8 8 -8 8 -8 16 -16 23 -24 32 -40 48 -56 67 -80 95 -110 129 -148 170 -195 224 -254 289
30 289 -326 366 -413 463 -518 582 -646 721 -800 885 -982 1087 -1206 1334 -1474 1633 -1810
47 -1810 2008 -2233 2490 -2785 3128 -3538 4034 -4639 5404 -6396 7723 -9525 11731 -18573
61 -18573 345655 -77848 -249656 350151 -11837 -203183 332556 106202 -314085 106237
71 106237 144091 -164554 114327 188191 -188123 468 218936 -39520 -23152 91230 -90554
82 -90554 -47424 57950 -50876 -93183 -71401 -7459 49976 -40993 -21010 1888 -99230 51122
94 51122 137788 -101236 -60996 75630 -88357 -12727 170826 -60048 -74708 226330 49790
105 49790 -106628 160880 -14536 -190621 222253 111970 -237776 94928 76093 -225013
115 -225013 135625 161494 -239588 12680 171492 -155877 -34486 120652 -170366 -81612
125 -81612 194788 -32334 -108644 111573 -14330 -43858 176832 26285 -102816 52819
135 52819 10891 -12421 79110 -9994 -20095 58740 21877 32068 6702 -66926 13602 51983
147 51983 -15547 -9608 -46021 -106624 -10350 52311 -34100 -18054 33405 -43454 10668 77976
159 77976 -80851 -51279 85851 -30871 5307 95660 -89793 -34105 147305 6215 -4257
170 -4257 97595 -50727 -42170 120129 4761 -83289 40808 -2294 -72980 55365 5598
181 5598 -124124 27777 64368 -64201 12392 -12455 -131434 7572 54479 -50000 1160
192 1160 2173 -52705 22484 32214 -33467 -10201 28790 25077 27925 18347 -31116 -27635 36677
205 36677 36245 10928 2769 -32237 -8988 24750 -3773 -3342 -27341 -38053 31214 -2748 -46249
218 -46249 8792 -27587 -26531 57016 -19344 -81088 -1757 -1383 -17460 45547 18970 -59615 -4180
231 -4180 50774 -21915 -10096 45487 -29242 -5952 71494 -35647 -63745 23481 -7266 2545
243 2545 53251 -13566 -45824 1779 13779 -4051 -11186 -8081 -21149 -10628 24137 -11617 -36177
256 -36177 6498 12942 12203 17343 -14410 -20971 3242 29053 28588 -13667 -13359 -2502 -14951 26221
270 26221 21199 -27066 14601 24710 -12239 6568 -12691 -35544 14797 33334 5490 -12070
282 -12070 -16905 -19923 -6204 26587 7365 -23476 14304 12604 -10299 19855 -6049 -24173 30792
295 30792 24742 -2373 2214 -13514 -3909 20797 20742 6489 -19583 -5170 17285 3286 15213
308 15213 10559 -17489 8517 15075 -14727 -13526 -4515 6585 17254 17066 3427 -30244 -11089
321 -11089 26830 2638 12208 22705 -23433 -206 24397 -20099 -10175 12366 51 14979
333 14979 19787 -7602 -19789 958 20739 5422 3446 3054 -24171 377 21095 -11626 -2295
346 -2295 4914 -11927 9576 5991 -12217 1943 5878 14421 13284 -12946 -13241 -11782 -2722 21572
360 21572 6282 -5838 293 -8636 184 4900 -5221 3901 7730 11433 4673 -19269 -12508 -8844
374 -8844 -5633 21631 476 -17771 5995 -7599 -4420 18551 -7612 -10686 8783 -3376 -8209
387 -8209 -5572 -7540 -6394 1681 11839 -11241 -19380 7889 -1212 3156 24473 -11245 -18873 4171
401 4171 -12214 -8622 5431 -3304 2108 4900 1053 -7846 -16672 5328 10709 1551 14105 -5906
415 -5906 -22942 -460 -3817 -7355 4939 -533 -276 457 738 456 -10863 4477 10980 -10040 833
430 833 -4058 -21809 6542 8933 -7545 4662 -4408 -10608 3401 2111 2766 1798 719 1485 -12263
445 -12263 -8836 -4076 -8527 12649 13126 -2891 4466 -7077 -10365 8569 2274 5369 10026 -2185
459 -2185 2784 -1669 -5622 8725 2623 7758 14659 -5845 -1756 2378 -8781 4729 6020 -5233
473 -5233 -1623 -1575 -1594 -2278 2834 8110 -8902 -5190 1797 -22239 -3998 13775 -8872 9808 16544
488 16544 -13228 2122 11018 -3412 10338 17136 4006 -1916 -440 -2701 -7017 11015 19662
501 19662 4729 15174 11225 -9721 4833 419 -11395 4699 -6396 -11267 -701 -14259 -4137
514 -4137 10053 -1714 9009 7035 -11875 -1449 2039 -6590 -868 1291 -6505 -6928 7174 6778
528 6778 904 24372 19958 -776 16717 -2885 -25494 8932 1914 -11588 16148 -3772 -17446
541 -17446 10218 85 -7182 11486 3254 -7594 -243 -6225 -23199 -12074 5016 -6225 5205
554 5205 16731 -11791 2884 21972 -5809 7826 13655 -19338 1148 9224 -14927 5714 10658
567 10658 -4150 12330 6257 -14559 -7196 -1061 -6341 -1579 -418 -21089 -20707 1043 -10899 -4997
581 -4997 18190 -8086 -3117 19849 -18881 -15834 11182 -14041 4991 28961 -7346 -2243 18699
594 18699 1091 9668 22647 -1350 -8631 8173 -3181 -15907 2404 -4893 -15165 14614 1274
607 1274 -21875 5891 -6436 -15893 16521 -14107 -33717 -1307 -17315 -15039 20581 -207 -6228
620 -6228 22607 7942 -6528 11038 4537 -8060 19189 19729 -15853 -877 11000 -12835 18562
633 18562 29175 -13569 5788 13711 -19445 -464 -1731 -28236 -2861 2522 -14454 -3945 -7905
646 -7905 -11892 8155 9682 -5628 -5559 -4189 -10638 6885 16495 -8563 3293 19748 -7954 9758
660 9758 23202 -16244 10622 34082 -11127 -411 9935 -28005 -863 27219 -6363 -6235 9312
673 9312 -13994 -14608 8650 -10825 -24015 9431 4245 -15320 10098 -3410 -18984 22393 15508
686 15508 -6839 11604 -4535 -9007 19588 6981 -1232 9483 1207 7818 15579 2095 431
699 431 6613 3816 -1032 -4094 -18223 -22999 2233 5424 -7315 7822 -7309 -22354 14073 2732
713 2732 -21562 11193 -142 -16236 16781 -600 -23391 10192 18089 5985 19633 14501 -10954
726 -10954 635 21487 -1179 -6779 9481 -10917 -6156 18752 -7788 -11772 10757 -4883 -1932
739 -1932 3698 -21957 -16097 -556 -2453 3136 -4827 -14630 -5202 2072 6009 5105 1622 1484 3410
754 3410 7772 -2103 -9285 5445 6448 12858 22286 -5961 -10148 9438 -4487 1619 10658 -17621
768 -17621 -10913 8531 -6854 -7642 323 -7235 -3601 9370 1499 -18286 -9869 3171 -5901 4210
782 4210 5702 -19039 -3065 15847 4659 11757 9246 -3790 6916 4813 -3724 -4396 -8363 3905
796 3905 12691 2888 -2557 -7873 -6286 5702 8265 3284 -9847 -11494 -397 -8942 -8493 -684 -12655
811 -12655 553 17287 -1266 -3585 1477 -3453 8897 10870 -1757 -7016 -6492 4806 9294 3235
825 3235 3454 -1724 994 9578 217 -2826 -2291 -2382 9544 1451 -13361 -7767 -10264 -1096 14951
840 14951 936 -7634 -2722 -4400 1330 1534 -3312 -1333 1507 10279 5237 -8055 -3109 -579 4574
855 4574 14775 671 -6875 -493 -1516 8739 7645 -7160 -1102 795 -1555 4762 -4033 -8693
869 -8693 196 3701 2371 -7154 -9091 -1704 660 12455 9420 -10666 -4155 970 -4142 6106
883 6106 1702 -6166 5471 5653 2041 -1748 -7998 1531 8515 7684 5785 -7890 -9553 458 1539
898 1539 2990 -2895 -6397 1611 453 2307 1886 -9935 730 8568 -2254 119 -5005 -10006 7113
913 7113 9108 1101 -1531 -7817 -2587 5413 4797 2869 -2919 988 4318 -2434 -1359 -5969 -6439 10690
929 10690 6596 -3409 -1152 -11185 -5401 9781 2119 -417 682 -2819 3419 2499 -2541 -3043 -3116
944 -3116 5400 5219 -3514 -2918 -4870 1102 11248 2464 -1846 -2889 -5655 6718 5021 -4034 518
959 518 -5094 -3547 5199 -5270 -5628 3401 3778 8462 3722 -6194 -6230 -3388 5598 5596 -2604 -1394 -3810
976 -3810 -1993 5938 -2445 -1493 5862 2301 8108 3214 -10513 -2625 -40 -308 6079 -3797 -8311
991 -8311 97 2483 5306 2606 -1212 526 -1076 2960 631 -7998 267 2923 -586 4203 -5317
1006 -5317 -8319 4507 5213 7672 5631 -5657 -2472 -940 -2907 1699 -3302 -1978 5316 1547 0
1021 0 -3422 -5573 3200 4650 4410 1006 -8410 -2485 1198 -1188 4122 -1451 -4371 5794 1114 -321
1037 -321 1757 -4261 2123 4732 -2479 -1898 -5001 -2674 6869 4362 1425 -2624 -5990 -515 -598 -389
1053 -389 1511 -3991 1669 3288 -6182 -1298 -1840 -2748 9188 4475 -3928 -2857 -6738 -2515 3200
1068 3200 -348 1018 -581 822 5197 -329 -531 988 -1474 3688 211 -6201 -2720 -3387 2220
1083 2220 6698 -1015 -18 -753 -2996 5994 1579 -3289 1640 -4152 -3859 -638 -6961 -2571 3313 3752
1099 3752 5969 -10 -4000 -2936 -2644 3694 1237 -3015 844 -3677 -1753 3519 -4102 1418 6398
1114 6398 428 5073 1105 -6427 1545 1892 501 3104 -2808 -2839 656 1985 3900 -272 310 1466
1130 1466 -3039 1205 -606 -4510 4606 2978 -508 1998 -6779 -5066 2678 -150 4298 2562 -4357
1145 -4357 947 -33 -1990 3559 662 1761 4822 45 -2288 -4391 -2032 2095 1341 5070 1378
1160 1378 -4213 5158 2389 -1665 6162 -2564 -4796 3591 -3716 -3719 2651 -928 3026 4900 -102 -622
1176 -622 -812 2425 3414 888 1355 -4845 -5191 1155 -2847 1582 5735 158 5471 3287 -6122 -131
1192 -131 -2383 -3537 5338 -1274 -4437 166 -3323 175 3865 1347 1272 584 358 -1182 -3431 451
1208 451 -1917 -75 5695 -2319 -890 4966 -1649 4516 6514 -5508 -1016 -878 -6722 1811 1887 -1315
1224 -1315 3836 1604 -1254 -1826 -2907 -1683 -1696 1152 -1118 -7432 -2481 -3512 -3650 6757 2223 -104
1240 -104 6596 -2425 -3400 1254 -6970 -2361 2462 -3144 543 2005 -1035 4509 5678 3812 1197
1255 1197 -1610 -2126 -5554 -2205 -629 -5791 759 1344 -4926 3551 1807 -2135 7542 1492 -4682
1270 -4682 -645 -8667 -8017 148 -1789 1199 4223 1537 1468 1429 1664 -367 227 3032 -3361 -3794 -53
1287 -53 -7398 -288 6543 -1989 4352 5411 -5098 1990 2043 -5200 169 -1221 -4619 -1567 -1454 0
1303 0 1877 4233 4899 -283 -44 -1022 -4564 1737 1587 -1070 3821 -1453 -1478 3677 -2105 3282 6653
1320 6653 -2014 1980 454 -8425 -1009 717 -2078 3744 3947 -51 -402 2418 514 -3295 2861
1335 2861 1003 -7056 2206 759 -6529 6699 5980 -2192 7080 2423 -3949 2926 1553 -1099 675
1350 675 -395 -1608 -3045 1107 3569 1396 6333 4482 -2003 104 -3456 -4614 640 -1837 1198
1365 1198 1549 -3300 2442 655 -2479 7075 2723 -1803 4521 -1972 -5346 1166 -199 -1144 2267
1380 2267 3127 -373 -774 5077 857 -2233 5974 -2276 -6326 3254 -4121 -4453 6469 -171 -1710
1395 -1710 3414 -3289 -3149 909 357 1132 422 670 -2012 -3504 818 -525 478 5068 38 -119
1411 -119 499 -4904 116 850 -2066 4785 47 -3245 3405 -2075 -2211 3602 -2146 -2936 30 -3822
1427 -3822 -3741 -798 1331 -515 -455 2737 -3640 -3026 4261 -2835 -1701 4031 -6032 -4119 1546 -4990
1443 -4990 897 5445 880 2620 1185 -2263 -1818 -2128 584 260 -1261 361 -2983 -1987 440 -1216
1459 -1216 3239 2102 -1349 3096 -3257 -4117 2558 -4321 -2117 3717 -5069 -2290 3758 -2233 1301
1474 1301 4355 -437 -1882 -402 -990 -3624 129 3664 -3089 9 2957 -6163 -384 4671 -2297
1489 -2297 3470 4577 -4360 -540 -478 -2972 1828 1399 1429 2137 -436 859 -529 -253 2866 1309 1556
1506 1556 841 -1498 1252 -800 565 4065 -2294 651 2805 -4980 1353 3819 -4084 2564 2325
1521 2325 -5276 274 1364 -1345 2063 3715 682 -2684 10 -322 -3383 3698 4116 -2386 4012
1536 4012 1866 -4294 3624 1934 -406 5897 1228 -1098 1220 -2248 34 2019 368 2927 1305
1551 1305 146 1975 439 1750 492 63 975 -3408 -1198 416 -3399 2525 2503 -3288 2326 50
1567 50 -3883 4023 1387 -1511 2377 -2181 -3903 -1050 -1723 -326 1907 3263 1372 -301 1817 -1013
1583 -1013 -1787 4633 -219 -1575 3099 -3841 -2406 3039 -1715 1452 4065 -498 1468 478 -1452
1598 -1452 995 -833 -489 -683 -3839 -1720 -1738 -1287 1423 -299 359 -752 -3732 251 -2046 -2316 3097
1615 3097 -2534 -2923 832 -5096 -2133 2887 -711 1917 2627 -1654 -498 -906 -777 312 393 2074
1631 2074 -950 -1341 943 -2846 301 2656 -2068 1194 537 -3944 969 -500 -2593 1727 -1658
1646 -1658 -2545 -387 -2717 -462 592 -370 1030 -1843 -2106 -883 -2408 1290 1513 -302 1330 -1747
1662 -1747 -1878 325 -2343 1237 2571 -1538 1583 -917 -3722 1329 -473 -31 3558 -203 -303 724
1678 724 -1406 423 522 609 1079 -1074 1048 452 -538 3811 1504 676 3497 -1966 -1123 2226 -1797
1695 -1797 765 1338 -2981 -565 -1003 -1468 2007 1372 1978 1679 -1486 -664 -2755 -2722 1198 -951 620
1712 620 1593 -1685 1302 1770 1245 5225 2313 1969 2938 -1917 22 1259 -1460 2828 2863 -6 3022
1729 3022 1585 1477 3339 1425 797 -1803 -2749 -1552 -3949 -1064 937 -2137 1529 1073 -3067 1813
1745 1813 1010 -582 3347 -498 -2360 -418 -2630 -290 1909 1609 4299 2551 2196 1964 -995 1416
1761 1416 524 -655 1826 -1756 -2127 800 -1802 1000 2567 -1628 906 -485 -3328 -111 -1798
1776 -1798 -2008 592 -1653 -873 17 -468 2054 1895 1774 1383 -2232 -1051 -1308 -2042 2264 894 -50
1793 -50 3306 -818 -1021 1317 -2392 -89 789 -3367 -2291 -3090 -4246 -1143 -612 567 1201 -30 1000
1810 1000 -1242 -1249 230 -2863 -146 391 -3344 1082 1513 -712 5316 3314 -196 2347 -1321 -2200
1826 -2200 -81 -1522 -1400 -1442 -1561 -1359 -2477 165 569 -671 2496 -853 -4406 -1770 -4956 -3762
1842 -3762 862 -1853 81 1981 -756 1810 1713 293 3132 1208 113 893 -1165 -820 813 1577
1858 1577 2157 407 1501 359 -1730 1933 -645 -3414 1214 -3042 -4590 1222 -2216 -1665 3952
1873 3952 -100 -1065 744 -2166 -2262 200 1291 267 964 3056 168 744 4248 630 1992 4717
1889 4717 -1242 -419 800 -3752 676 1915 -633 2483 661 -1208 1709 -313 -977 -488 -1947 -2389
1905 -2389 -2142 -1220 -914 51 3861 1888 998 3920 -693 -181 5083 -774 10 3493 -3030 -644 3262
1922 3262 -762 2901 4985 1241 1474 1149 -1927 -2955 -770 -410 -2605 51 -121 -3604 1475 1593
1938 1593 -2505 3283 1024 -3248 2222 -1117 -3664 2496 -37 -928 3345 231 -342 3091 2467 1027
1954 1027 1558 889 -2672 -1526 1076 -2460 331 3630 -2573 55 1788 -5105 -357 1688 -3643
1969 -3643 1055 601 -4896 -69 350 -1992 2124 2520 -326 924 1152 -1703 -1402 1710 -739 -1053
1985 -1053 3562 -1576 -1770 4260 -1527 -1000 3915 -3639 -3238 1569 -5143 -2492 2006 -2885 -1538 1553
2001 1553 -2058 -1710 1730 619 -853 1863 -185 -4701 -179 271 -3212 3565 3005 -2024 3890 1104
2017 1104 -2988 3140 196 -2327 2578 -1493 -3227 205 -1815 -1980 1453 327 -1370 205 76
2032 76 -2595 0 1424 -4039 -361 1097 -5361 518 2849 -3697 3254 3987 -3799 1784 2340 -3342
2048 -3342 2435 3330 -1745 440 1437 -2648 -1458 2530 6 -631 3929 -272 -2568 2813 -1616 -2312
2064 -2312 3774 -1161 -1965 2578 -3171 -1296 2973 -1687 738 2521 -1682 494 1750 -858 371
2079 371 1833 -336 -1478 1325 -539 -2233 3367 1423 -2176 3464 -335 -4346 3366 333 -2435
2094 -2435 4565 246 -3271 2345 -516 -1973 2888 2032 -270 1473 1598 -1640 185 2511 -690
2109 -690 1033 3324 -2263 188 2582 -2902 1174 2409 -3098 949 910 -3156 1321 1073 -2123 1704
2125 1704 369 -2520 -396 164 -761 434 1703 -1147 -1838 1501 -999 -471 4602 115 -16 4107
2141 4107 -2039 -1593 2451 -2180 287 3397 -1718 -374 927 -1260 385 2039 298 -540 278 -625
2157 -625 -2346 -121 -342 -2904 888 81 -2895 1662 -162 -1647 3405 -76 -2249 1406 -2522 -2093
2173 -2093 1849 -1090 -712 1137 -864 -1035 489 492 -287 1168 1979 -1661 -1116 131 -3505 -493 2120
2190 2120 -1900 976 1614 -2581 1023 1022 -1540 1467 300 -1380 -183 -1177 -1222 -290 -84 549 -434 -99
2208 -99 -93 -668 1583 242 -893 679 -2178 -1528 506 -2199 145 1882 -1404 391 264 -2418 488
2225 488 858 -484 1387 -236 -1355 -470 -479 62 -155 1360 1406 -803 911 54 -2330 1686 768 -716
2243 -716 2189 -631 -1082 1597 9 534 1256 -827 -131 -301 -890 452 -512 287 481 -726 341
2260 341 -684 -574 1348 76 158 291 -2429 -265 -140 -615 2120 925 392 2343 -254 210 790
2277 790 -419 1510 1070 -550 274 -598 92 1577 817 1512 493 -164 1040 -906 -761 110 -1956
2294 -1956 -334 -128 -2107 -104 -80 61 2312 497 -409 -211 -1239 299 519 -421 743 -206 590
2311 590 1477 -485 1031 1882 932 2116 501 -1516 -708 -1167 17 833 -911 497 -535 -1070 786
2328 786 -1246 -1063 390 -1280 -278 -26 -1917 175 713 439 1427 -255 -442 367 15 1577 781
2345 781 -196 1200 -351 429 1254 -515 1344 1362 -686 143 -2168 -2769 -429 -1215 -32 7 -1818 -135
2363 -135 -363 -953 493 -1139 -696 638 -1140 -596 -428 -867 1294 1689 2023 1922 103 1677 1462 16
2381 16 1033 -926 -1957 485 -1025 -968 801 -649 838 918 -1472 -1159 -2166 -2008 -423 -1496 -1076
2398 -1076 -1220 -2033 222 138 476 2036 560 1456 1625 -833 472 -134 -119 2454 1016 741 1491 -541
2416 -541 977 1775 -868 -393 -1105 -1776 -528 -1273 -1706 -1064 -972 71 -747 -1286 -445 -1341 177 886 -1642
2435 -1642 -293 -343 -843 2652 2010 890 3214 1179 825 1695 -878 -273 625 249 1053 -31 -684 -303
2453 -303 -205 1006 -294 -1409 -488 -2750 -2026 -746 -3138 -1252 187 -1209 1492 1076 -484 1843
2469 1843 1646 840 1478 -591 -389 500 592 1623 1471 1322 1869 1013 1344 28 -864 1197 -731 -1438
2487 -1438 -363 -3921 -2067 319 -1643 605 809 -2010 -93 437 -1699 -515 -582 -724 517 937
2503 937 718 61 1501 2333 1104 2535 1017 -976 1867 524 -712 1585 -1057 -1386 1219 -1021
2519 -1021 -1072 377 -1763 -162 -182 -2641 -2090 -1388 -1200 191 589 191 -662 171 750 -672 1527 1143
2537 1143 -726 2474 1599 -1153 2073 863 -317 3342 798 -1102 717 -1072 -1283 651 -942
2552 -942 -1799 -654 -45 -949 -909 706 -1356 -567 1317 -2072 -1589 432 -1744 838 2561 -1018 902
2569 902 1576 -202 2433 1820 21 1411 607 -284 -92 -421 -808 169 1315 290 -1213 50 -1131
2586 -1131 -1142 1551 -1842 -1938 898 -2122 -979 1554 -1902 -69 2107 -697 307 1048 -891 805
2602 805 2009 848 184 528 566 -279 1690 1271 -1216 929 533 -1959 672 -929 -2186 1715 392
2619 392 -1589 1148 -1997 -2170 824 -824 -918 340 -853 -733 714 794 -108 914 1991 232 996
2636 996 1319 -1588 334 2051 -1198 640 700 -2153 1515 1359 -1169 1316 -18 -1749 260 -1138
2652 -1138 -1887 -332 -231 -228 -395 106 -1104 -681 2141 593 -169 2034 -1380 -794 1954 -1633 -320
2669 -320 2040 -937 950 1670 -1168 489 953 -227 362 61 -1054 -1479 -414 -8 -1072 247 76
2686 76 -1417 1194 19 -1462 1386 35 -1094 1515 -820 -1455 1556 -597 583 1695 -416 74
2702 74 609 -156 204 196 246 -8 153 318 -1406 -438 703 -1224 612 864 -2373 310 242 -1714 1336
2721 1336 381 -1161 1339 310 -531 862 166 162 611 70 -112 -831 625 500 12 1605 -392 -1218
2739 -1218 1138 -883 -153 1077 -1341 -35 478 -1976 -376 -27 -796 1477 853 -378 526 -372 -37
2756 -37 236 211 456 -323 160 109 -1029 1228 636 -384 1936 290 -851 1009 -560 -279 1112 -1055
2774 -1055 -613 -308 -1106 280 168 267 762 87 365 -108 -1065 64 -271 112 1024 -1029 -344 264 -896
2793 -896 1291 817 44 1422 -119 -609 560 -1007 -214 789 -448 192 -304 -555 133 -204 772 420
2811 420 -1053 466 -438 -740 923 -652 -38 726 -996 26 130 -653 963 429 -25 758 -1172
2828 -1172 -351 455 -670 901 188 -886 243 -1094 -457 400 -536 825 344 -655 374 -891 -676
2845 -676 598 -679 -11 142 -1070 181 -192 -731 820 -176 -11 564 -807 270 189 -401 1042 -609
2863 -609 -616 520 -1128 312 771 -156 901 -36 -513 78 -560 -22 360 -311 588 -424 -1426 127
2881 127 -877 -72 1057 -707 97 441 -987 93 -221 -399 787 -47 -58 128 -572 511 180 -190
2899 -190 1120 -432 22 852 -289 817 929 -621 555 -666 -928 322 -1069 -181 693 -1040 -10
2916 -10 -175 -1016 820 451 82 336 -956 -348 -431 -835 318 -247 519 1333 -313 1056 1178 -228 1190
2935 1190 802 -558 816 -540 -1001 591 -166 411 738 -170 602 -23 -94 256 -535 -190 -922 -1678 -197
2954 -197 -692 -403 1611 -36 699 1323 -551 457 736 -409 1030 226 -358 625 -281 212 1290 551
2972 551 1057 364 -200 -66 -829 -378 -122 -1027 347 -70 -901 377 -1139 -553 915 -1046 -523 196
2990 196 -1292 213 769 -144 1331 595 567 696 293 1234 469 154 955 -611 -78 480 -1126 689
3008 689 840 -361 643 -565 -1610 -69 -1413 -1231 -258 -1428 -671 24 -645 641 240 175 820 -155
3026 -155 84 -579 -670 674 96 312 1279 -69 1105 1111 -213 1224 531 -950 279 -1042 -1712 -269
3044 -269 -799 -635 139 -747 -326 -683 -724 18 -615 -343 -511 -991 103 -682 -203 1441 209 1273 1738
3063 1738 -5 566 507 -445 1188 41 -620 746 -238 -278 379 -377 -32 -670 -860 -783 -1618 -897 -870 -1007
3083 -1007 214 -643 -1163 501 -489 -26 1247 -647 144 666 -588 829 785 385 1723 1482 867 1279
3101 1279 2 224 192 -200 187 -858 -581 -158 -763 399 -82 -585 715 -463 -1206 56 -1658 -986
3119 -986 364 -1172 -289 398 -458 1353 1377 1178 1141 304 479 38 -150 733 -266 401 979 -288 549
3138 549 852 -501 801 333 -680 60 -1621 -1507 -315 -1155 -293 376 -455 578 661 -179 611 309
3156 309 387 103 -125 414 -317 752 1326 44 829 1664 -840 544 657 -1037 461 -144 -903 -320
3174 -320 -778 -775 -19 -196 286 -138 -712 -303 -1060 -604 46 -410 521 500 -52 1086 170 711 1519 34
3194 34 885 402 -1286 648 508 -542 1007 272 -451 514 -454 -274 -78 -453 -427 -1139 -913 -1018 -1593
3213 -1593 478 311 -571 884 -160 -629 857 -384 -224 508 -619 119 323 -600 468 251 496
3230 496 1420 207 454 89 -631 -80 -356 -522 -131 -1134 -532 88 -791 686 163 -658 555 -957
3248 -957 -755 555 -747 -79 516 -838 -41 23 -63 404 44 597 312 -66 298 -671 -690 462 -560
3267 -560 -109 413 -917 -285 85 -633 757 24 -592 310 -424 -293 208 -599 459 409 -372 551 -51
3286 -51 51 541 188 750 218 -110 580 -283 -172 608 -552 291 424 -939 43 -110 -792 568 -243
3305 -243 -413 -94 -555 -180 -256 55 771 46 128 422 -406 474 267 -125 1020 400 -278 901 -215 379
3325 379 627 -232 573 133 -602 188 -87 -240 477 -486 328 105 -330 223 -51 151 623 -666 -82 -37
3345 -37 -825 638 210 -348 922 -113 112 748 -67 437 565 -276 133 -350 -807 121 -500 219 375
3364 375 -409 317 88 -195 694 -292 -27 342 -844 45 90 -589 601 118 3 711 -139 113 714 -342
3384 -342 445 221 -706 146 -891 -271 113 -265 351 323 -501 325 -743 -354 382 -398 -19 31 -990 -89
3404 -89 -111 -624 331 -258 162 485 -479 275 155 -349 505 77 -164 -2 -523 77 209 -325 431 -241 -433
3425 -433 24 -357 -221 78 -717 188 -166 -988 -331 -579 -184 545 -302 73 217 -867 145 -174 -170 547
3445 547 -294 -5 -5 -824 88 242 -537 763 -375 -295 366 -649 210 339 -595 101 -203 -400 351 -283
3465 -283 -176 613 -488 161 144 -512 661 -111 160 646 -595 -149 78 -460 313 91 -109 777 -665
3484 -665 -7 574 -456 592 642 42 420 -564 -414 -57 -340 87 213 -570 127 58 -30 636 -200 232
3504 232 349 -607 -56 -468 -366 488 79 174 539 -699 700 768 -178 685 -128 -558 485 30 47 467
3524 467 49 680 597 -74 533 -399 353 601 -529 600 -198 -544 719 -43 -376 716 -745 -39 205
3543 205 -658 -82 -2 -242 715 -4 24 322 -558 639 398 -270 56 -352 -147 529 -463 206 338 -14
3563 -14 993 -33 -257 404 -520 -57 517 -1152 -379 -214 -695 557 166 13 690 226 270 85 -521
3582 -521 -61 -568 -260 199 -690 -149 423 -16 1090 427 -411 433 -201 -616 -54 -945 -670 -113 -578 136
3602 136 -73 -603 330 115 128 90 -1023 -380 -544 -505 212 -360 291 510 -40 469 255 -393 536 382 -626
3623 -626 236 -864 -658 400 165 402 159 17 388 -456 -359 -320 -1218 -464 -334 -979 233 -548 -207 862
3643 862 -56 -212 -185 -745 -295 -21 -383 233 -348 56 667 19 595 567 120 711 -404 -537 -218 -962
3663 -962 298 -38 -190 497 -99 -200 991 -73 -159 101 -721 -157 -250 -1039 -203 -23 376 1190 337 413
3683 413 316 108 789 -121 -92 116 -737 -87 710 -272 743 718 189 993 -74 -647 49 -446 -222 -32
3703 -32 -627 -107 -65 120 826 139 373 607 -296 466 -177 -344 378 -52 235 739 -51 415 810 55 754
3724 754 176 -442 410 -333 -189 81 -365 59 58 -129 12 -420 -164 99 -484 187 -414 -767 319 -202
3744 -202 82 706 -209 506 589 -106 590 -18 -122 709 300 61 360 -257 396 462 -61 53 -340 -332 -56
3765 -56 -653 38 125 -684 400 -171 -515 520 -211 -331 594 -553 -278 -117 -578 167 90 151 309 -91
3785 -91 538 423 -217 492 -93 -266 416 -336 -229 82 -706 322 219 -637 354 -309 -212 437 -395 -110
3805 -110 71 -299 -98 84 -444 52 -364 186 83 -210 90 -9 22 606 -240 111 389 -562 54 113 -616
3826 -616 81 93 -418 165 -468 -154 57 -181 277 208 -249 223 -489 -290 237 -316 0 371 -114 590 -10
3847 -10 -68 576 11 123 259 -346 129 109 -681 393 -230 -252 269 -356 -198 109 -103 393 -571 -372 -53
3868 -53 -731 -2 291 -461 253 184 -503 401 36 -6 748 -94 103 198 -316 205 -119 14 443 87 250
3889 250 326 -378 346 7 -94 700 -317 81 53 -476 305 61 -508 316 -284 -351 491 -240 83 385 71
3910 71 341 -47 -241 290 -41 285 303 -392 371 35 -416 567 -93 -83 438 -424 -182 169 -450 22 -44
3931 -44 -313 487 -230 -54 225 -137 442 69 -387 395 -56 -442 253 -462 -58 268 -460 222 -152 -243 277
3952 277 -210 103 211 -672 -62 -200 -546 351 -336 -174 123 -464 261 -193 -244 548 197 116 512 -326 -340
3973 -340 422 -217 125 -226 -390 246 -345 121 351 -85 162 9 -518 273 -378 -370 475 -203 -131 52 -966
3994 -966 125 353 -338 429 -108 -103 278 -223 -86 232 -554 78 -6 -339 178 -338 163 502 -4 341 -321
4015 -321 -286 451 -327 -349 93 -603 134 193 -374 42 46 176 325 14 -187 70 -134 449 -23 -266 77 -451
4037 -451 108 14 -342 551 452 -91 603 -170 -528 21 -538 190 216 -660 85 -221 -125 268 158 299 169
4058 169 -136 268 -46 -309 171 -73 446 573 -377 121 344 -204 476 -15 -278 458 20 -98 158 -315
4078 -315 33 299 -328 380 -307 -103 422 -99 518 35 -774 283 -76 -135 521 -196 93 498 -424 377
4098 377 -190 -165 668 209 20 211 -304 71 479 100 91 -400 -17 250 -265 206 -239 -591 456 75 -61
4119 -61 417 -105 138 791 -57 47 -106 -646 64 311 -63 24 -218 372 617 119 319 -135 1 272 -352
4140 -352 -346 -480 -846 418 746 -433 593 -93 21 539 -323 -400 -101 -465 143 -157 -317 -21 -62 588
4160 588 423 -4 116 -102 -311 589 -130 -540 20 -437 69 466 -582 440 257 -14 524 -356 -370 -72
4180 -72 -511 22 -78 -488 156 -143 439 504 -322 76 206 -307 180 -66 -508 376 -4 227 296 -758 49
4201 49 100 -154 124 -49 -467 84 -220 147 77 -503 290 60 -106 235 -959 -240 195 -83 324 -23 -485
4222 -485 639 208 279 606 -130 92 378 -357 -159 -159 -212 235 -2 139 176 -349 315 417 -309 72 -857
4243 -857 -460 198 -544 -75 80 -617 380 475 55 -4 -74 226 433 -426 -316 -307 -584 208 313 193 333 -414
4265 -414 442 210 -517 65 -685 -249 492 -518 -433 -53 -321 322 466 -271 103 -233 -74 250 -350 26
4285 26 316 102 706 15 93 330 -99 497 150 -584 26 -277 32 614 -189 103 241 -274 98 33 -603
4306 -603 -40 -351 -247 65 -581 -167 117 137 636 76 5 -68 -377 243 23 -604 112 408 168 817 -54
4327 -54 -104 629 -81 -11 9 -823 65 -247 -170 195 -395 282 395 -124 422 276 -437 98 -244 -426 -75 -434
4349 -434 -85 541 217 405 -100 -125 587 134 229 285 -1019 144 132 -24 -24 -290 108 561 -105 83 -167
4370 -167 -552 251 140 -402 193 -485 251 414 80 320 66 73 394 15 -78 93 -502 396 505 -50 421
4391 421 -116 -74 589 -340 -342 -80 -264 420 -121 -522 -36 -142 355 582 -235 55 -165 -263 498 -166 -345
4412 -345 222 -512 334 414 17 342 253 108 677 -326 -227 42 -365 257 17 -548 24 -195 214 417 -221
4433 -221 191 156 -146 367 -299 -438 188 -193 204 263 -454 197 209 -4 538 -145 -484 100 -60 235 109
4454 109 -402 132 -47 15 248 -271 9 160 -121 187 -151 -465 433 -89 -92 329 -478 -218 444 -36 203
4475 203 -97 -152 236 -182 191 37 -467 311 12 -149 298 -383 -311 332 -270 184 139 -409 360 11 -429
4496 -429 143 -434 -208 302 -274 6 -159 -18 65 42 32 131 -246 6 -64 -229 239 -284 88 509 -424 -182
4518 -182 5 -388 481 226 -72 110 -90 -13 -5 -110 -243 -278 -328 366 -101 -88 28 125 564 255 -273 320
4540 320 -23 -69 646 -398 39 -198 -18 404 271 -627 310 179 33 88 -181 -51 19 -77 118 -267 -231
4561 -231 97 -404 336 191 -176 101 -47 -211 271 -153 -118 301 -203 124 379 -417 228 248 -66 256 -71
4582 -71 -13 101 -148 154 -27 -89 441 -242 31 163 -589 -83 299 -399 356 -133 -239 347 -43 -149 145
4603 145 -35 -45 -78 -57 92 -218 306 302 -151 278 71 -210 378 14 -178 284 -374 -205 259 -251 422 166
4625 166 -206 127 -163 42 -23 -82 66 87 -410 -112 -398 -212 327 -225 322 42 -239 405 -108 -398 188
4646 188 -289 -68 316 -309 -23 -8 -185 158 -38 -243 88 -351 -64 86 -244 157 -183 -96 319 -126 -12
4667 -12 268 -231 266 326 -342 233 -84 -253 43 -280 -40 -41 -200 310 -167 -223 58 -71 -23 -59 -121 343 -139
4690 -139 -125 326 -146 -147 121 -284 296 301 -464 285 109 -16 359 -97 27 109 -513 115 -166 -266 332 -78
4712 -78 86 223 -128 262 169 -439 460 246 -225 93 -320 -35 318 -155 153 167 -254 372 -43 -154 93
4733 93 -170 167 48 -68 31 -403 -81 174 -311 0 386 -16 438 5 -96 517 3 141 354 -241 299
4754 299 337 -292 280 38 -9 292 -257 -47 237 -222 233 37 8 299 -416 -364 10 -549 -69 -104 -558 346
4776 346 84 102 387 -263 36 192 -382 150 136 -221 447 -31 79 242 -210 359 212 58 434 -186 -172
4797 -172 -287 -484 -6 -69 -455 195 136 -75 254 152 92 127 -279 -126 -22 -437 204 -43 121 338 -45
4818 -45 278 177 213 253 2 -228 -23 -349 -124 -265 -289 10 65 -38 -38 -413 -281 -71 -318 -47 117 -320
4840 -320 51 -54 -40 409 128 304 188 -25 248 105 -101 213 -73 74 269 19 209 122 -126 76 -462
4861 -462 -305 62 -566 -239 -168 -474 187 -1 33 247 -365 -120 163 -199 -191 -473 -316 318 34 90 543 175
4883 175 486 501 -42 244 -145 -197 198 -177 -368 -33 -32 33 244 -422 -29 -326 -513 93 -435 -375 -311 -270 402
4906 402 -42 -102 297 86 600 641 -462 284 104 -399 249 -46 -255 478 354 60 282 -123 289 -175
4926 -175 -252 -5 -470 -289 -81 -210 -53 -86 -420 92 -241 25 53 -280 -50 187 -185 380 275 -208 440
4947 440 299 373 394 -143 23 150 7 185 -438 -108 91 33 205 -56 -409 443 60 2 98 -697 -53 373
4969 373 -116 80 -9 -63 405 343 -52 149 -30 158 389 -95 179 -177 -81 427 48 286 287 -495 456 -145
4991 -145 -589 -5 -490 -401 142 -466 -392 -84 -97 117 4 -149 20 80 85 271 -135 238 -219 81 565 160
5013 160 -78 409 -58 256 140 -445 120 -257 -20 229 -185 -179 -179 -259 35 -188 -276 -247 -173 -45 147 -192 172
5036 172 142 -163 561 -71 -164 294 -87 272 162 -313 158 128 81 64 -161 -86 -37 -17 49 -355 -306 -100 -213
5059 -213 64 7 -471 -4 89 -119 291 -164 -236 273 -18 -84 80 -252 243 -58 23 10 52 -65 236 13
5081 13 85 -119 -389 54 -314 7 337 -421 61 365 -273 279 -80 -515 218 54 18 265 -304 0 284
5102 284 43 248 38 -82 327 116 452 36 -106 127 193 -2 91 -389 66 434 -108 47 -3 -323 271
5123 271 37 -184 234 -50 -235 391 -46 194 -152 74 138 28 253 -103 -36 291 74 -206 183 -3 -86
5144 -86 268 -77 -161 -19 -212 169 40 -362 7 -174 -101 198 -241 -154 26 -41 198 -85 -286 250 -222 240
5166 240 -3 -383 65 -9 -10 220 -192 -199 347 -29 110 22 -292 128 51 -102 175 -222 170 183 -14 128 -157
5189 -157 -397 10 -242 121 241 -317 469 -6 19 436 -243 -77 353 -57 74 -59 -254 -16 -241 -254 48
5210 48 -327 -109 301 -86 218 -368 -316 232 29 -263 -27 -527 6 231 -210 285 100 -175 300 -61 -30
5231 -30 -15 -67 84 119 -138 -82 -342 165 328 -263 70 -39 -194 455 -308 -355 -5 -484 136 167 -588 -18
5253 -18 -35 -328 88 -61 -259 -128 -76 39 122 -294 115 -231 -150 169 -348 157 -154 -298 324 136 -287 178
5275 178 -205 -57 179 -316 -97 102 -146 270 5 -56 189 -296 145 139 -695 -87 37 -215 139 -325 189
5296 189 174 -94 317 -90 -132 222 88 -47 325 -302 -54 306 8 61 99 -302 316 -80 -183 -26 -266
5317 -266 142 25 43 200 -90 -86 561 -76 -95 -239 -187 -112 -162 161 256 -56 4 264 18 397 198 -237 195
5340 195 27 71 218 -297 4 245 -83 463 118 149 122 -143 57 -117 -287 249 -3 -212 -10 -101 -169 239
5362 239 -12 190 -130 66 120 -161 -259 -4 -101 242 330 -85 229 55 64 402 -247 -4 -286 -305 49 172
5384 172 -92 66 -35 -218 64 -73 129 -46 -194 53 -453 -208 -125 -128 -60 417 -85 120 259 -45 280
5405 280 60 -41 26 -140 202 126 -145 397 -70 -47 326 -348 43 -233 -311 11 4 -285 -164 -142 -7 60 -283
5428 -283 -225 -283 -375 214 -253 -93 296 24 311 274 29 334 535 82 231 -87 -141 32 -228 -137 11 -251
5450 -251 286 103 -9 -146 -111 -216 -235 -361 -72 -448 -285 99 -301 -31 238 -97 27 148 -219 157 -34
5471 -34 98 278 -43 -53 72 176 368 59 76 215 -303 -253 84 -506 -185 -132 -431 69 -300 -247 123 -56
5493 -56 -38 310 -509 -51 -241 -162 153 0 283 302 -107 200 287 115 307 56 236 211 -45 -6 42 -344 233
5516 233 -4 -358 213 -136 -227 59 -335 137 18 -249 145 -65 51 377 -9 144 291 -156 395 -37
5536 -37 213 377 -90 18 467 -112 270 271 -97 182 -145 -275 -106 -445 -202 31 -226 -86 126 -100 -90
5557 -90 -459 -70 244 -134 7 -132 -70 84 -311 188 422 -6 177 377 -71 265 -114 -207 109 12 133
5578 133 138 -296 -132 -10 -153 -46 -144 -181 -27 -455 -125 -24 -324 131 14 -86 138 -190 66 233 -238
5599 -238 156 97 20 92 210 3 -36 -265 91 -201 32 407 -362 -177 82 -329 -45 -36 -229 226 -235 -192
5621 -192 215 -256 -373 141 -224 108 195 33 -25 -274 28 266 42 132 57 -49 28 -310 -19 144 -82 44
5643 44 58 -72 -78 57 -261 408 -70 -248 14 -267 -246 -72 -208 -111 133 -200 155 -127 251 103 48 351
5665 351 172 -336 277 -54 59 181 -139 80 36 -374 -5 173 2 301 -157 102 -150 -262 -137 182
5685 182 -174 174 -120 -1 235 -8 238 134 -265 192 63 127 284 -275 62 26 -153 140 -156 -174 147
5706 147 108 -49 -8 -158 -219 -286 -132 88 43 -32 23 -528 88 326 52 348 38 -206 411 -41 -57 169 -141
5729 -141 -56 307 -205 46 -131 126 312 -37 135 -151 -127 129 -120 -305 38 -125 160 178 -445 -21 -18 11
5751 11 306 168 -183 195 -18 93 341 -151 -23 133 116 234 -59 51 188 44 485 -42 -257 -7 -134
5772 -134 -46 213 -335 -117 -269 -334 89 -23 -230 59 -35 170 174 -381 180 -26 -189 275 0 -130 125 -131
5794 -131 94 104 -234 255 88 -34 220 -50 -304 246 -277 96 119 -220 -45 -138 -3 -40 -230 109 193 -158
5816 -158 51 -133 -94 414 -240 184 255 -289 27 93 85 250 6 39 212 -189 79 104 -564 48 22 63 110
5839 110 -143 54 -138 -20 34 -158 -28 326 -263 -313 104 -189 346 -92 -18 4 -67 91 251 -119 -4 7
5861 7 -255 -34 171 -138 -224 -289 -105 490 47 -4 -49 -239 83 -167 100 19 -69 30 23 -231 88 82 -77 392
5885 392 -183 104 83 -71 31 217 -335 -36 18 -174 138 -342 -140 93 -177 470 78 -200 9 -245 44
5906 44 34 -337 59 -115 -328 198 -233 14 179 105 67 90 -272 198 -105 -169 240 -161 2 -82 -56 276 31
5929 31 -105 145 231 107 133 -255 7 21 -176 68 -144 12 350 -217 40 173 -149 -98 -6 -194 83 -30
5951 -30 -252 146 -363 115 118 -285 264 -196 -218 313 37 87 313 23 278 49 -173 355 21 -17 136 -442
5973 -442 163 -169 -154 241 181 -46 102 -231 -18 -23 -127 103 24 -105 -8 65 -47 124 -196 188 133 111 398
5996 398 98 100 431 -231 -9 57 -96 131 66 25 196 -94 -127 -27 -310 122 -74 -311 -50 65 -176 107
6018 107 -224 177 229 20 278 -62 -151 103 -139 -66 202 -206 77 83 107 267 65 -9 -154 -337 73 174
6040 174 -191 127 -161 -107 117 -100 91 186 -89 205 -144 -174 114 -179 -42 156 -267 -78 166 -117 102
6061 102 72 54 231 -282 216 -161 -68 101 116 -97 384 -166 -160 227 -490 -42 -134 -298 35 -21 -351 283 -262
6084 -262 303 140 -146 97 -146 91 80 -218 -401 168 -22 235 154 -63 233 69 -47 162 -218 -311 -302 -255
6106 -255 59 36 32 319 16 13 95 -209 221 -50 40 60 -117 -13 81 -76 21 180 -82 123 245 59 230
6129 230 132 57 70 130 52 -2 -28 30 -37 4 -2 -16 -223 49 -249 181 -171 -241 34 -330 16 -84 63 69 -83
6154 -83 152 204 122 -268 187 -39 299 149 -185 454 181 -57 52 -94 67 283 -108 251 -92 -377 269
6175 269 -86 -214 72 58 -72 85 -10 -64 -224 -72 78 -30 -58 414 -220 155 13 -110 385 -183 -2
6196 -2 100 -144 12 87 -113 5 -177 23 62 -281 -119 146 -287 29 -54 -184 303 -32 7 192 -259 6
6218 6 54 251 96 36 -13 225 -82 140 193 -293 33 98 -160 88 123 -99 -55 -275 -9 75 -151 208 -432
6241 -432 -253 -121 48 65 221 -167 175 9 -125 88 -91 118 131 -67 145 176 -239 152 -110 -10 -82
6262 -82 -105 43 50 -40 209 -172 30 127 -306 -139 308 -253 61 115 -49 18 -74 55 158 -174 175 8 -184
6285 -184 -142 -225 -331 61 -230 -148 248 -160 290 144 -115 54 -202 -310 348 -210 81 358 -203 228 -70
6306 -70 65 250 -83 93 164 -81 -63 -207 -285 110 0 46 207 -62 189 -9 -567 35 -59 -109 111 -138
6328 -138 -169 117 -188 -112 -74 31 48 -23 80 64 -215 -19 199 -287 105 -308 -68 141 -56 340 46 -54
6350 -54 127 167 -24 238 -92 -211 -2 78 97 69 -98 257 63 -56 -13 25 -227 271 -153 32 -57 238 251
6373 251 -73 -189 115 -304 -38 48 -108 19 73 -52 137 -88 80 114 -58 83 -251 -307 286 40 62 257
6395 257 -231 5 -18 -122 297 -250 -312 121 -409 85 116 -387 183 -12 74 82 -44 21 237 8 144 171 -132
6418 -132 123 -378 -278 16 -251 14 130 180 213 7 -176 -114 -14 85 176 -119 123 -242 -139 99 7 31
6440 31 99 -180 98 92 -275 35 19 -153 281 -272 -111 144 -153 154 -142 -327 -77 40 69 17 -322 94
6462 94 111 25 165 -201 10 161 -86 -18 122 -153 103 176 -108 196 94 -124 15 -29 72 -226 -319 172
6484 172 -132 271 289 -136 99 198 -138 12 -164 -131 112 130 -130 279 -121 106 -9 -176 323 16 63 47
6506 47 -53 74 6 19 172 29 -230 294 130 56 320 -263 123 56 -123 84 -45 -104 -2 132 31 79
6528 79 -239 57 -8 -129 292 -134 13 229 -179 136 -164 30 314 -263 32 217 -168 294 42 47 211
6549 211 -35 -58 248 -94 75 246 -158 76 5 -97 107 -94 51 184 -145 66 195 -246 101 -155 -14
6570 -14 -58 -179 -22 202 -9 131 148 -49 144 -42 -17 65 -97 -218 24 -140 134 -42 18 58 55 318 191
6593 191 -38 24 -25 84 46 -87 82 201 -311 321 156 -155 53 -153 19 65 -137 102 -117 -416 -23
6614 -23 114 -10 359 -113 80 77 1 145 66 -269 156 77 -52 172 -111 7 -57 -370 -160 -152 -107 135 67 29
6638 29 30 -166 58 311 -275 353 -149 73 311 -208 -195 36 15 100 -264 9 144 -7 152 -49 -348 120
6660 120 -129 -163 65 -51 61 279 -168 -29 74 -82 110 -180 -196 -23 -285 -193 302 56 47 279 -125 277
6682 277 40 -200 -170 12 138 72 -225 131 29 -71 473 -384 -174 155 -248 -68 101 -206 53 82 -20
6703 -20 31 -303 46 25 33 50 -238 -63 206 -189 229 137 -5 114 -61 -33 135 -72 56 222 -93 192 -109
6726 -109 -73 30 -168 245 316 -96 -85 102 -186 171 -114 -50 27 -34 -217 150 -29 177 -59 -31 326 69
6748 69 -82 114 89 -26 262 -297 32 34 240 99 138 -127 -183 -177 -40 -215 -22 138 -476 8 53 -154 121
6771 121 96 0 60 -29 -291 -42 -210 -187 -38 -125 113 -45 -8 -27 -127 -1 126 -31 114 4 -77 -16 -95 -209
6795 -209 268 -130 32 72 83 81 -27 -209 123 -44 -227 -48 -263 100 -57 -91 84 153 171 72 -290 67 255
6818 255 -40 234 -58 -23 135 -18 -60 220 -68 -112 50 -88 59 79 -136 44 -18 173 73 -48 128 131
6840 131 -178 4 22 -132 167 -171 57 178 -194 -249 -109 41 97 -350 77 187 -269 -148 -92 88 158 -246
6862 -246 -224 34 49 27 104 -206 10 47 -295 157 -324 -84 314 -117 206 22 -35 221 -13 152 210 1
6884 1 134 37 -43 -1 -94 24 219 -211 80 281 -44 5 72 -35 -78 -163 52 137 -7 18 -122 -144 30 -157
6908 -157 -57 138 -185 -24 186 -380 422 -21 27 258 -221 90 273 -34 43 268 -333 27 -46 107 141
6929 141 77 -87 36 -12 -23 -212 171 148 -287 246 34 -220 141 -195 -269 77 94 77 274 -125 53 267
6951 267 -290 132 -319 -130 122 -228 13 117 -105 291 -29 -160 120 -273 79 144 -401 74 277 -129
6971 -129 331 -140 -143 196 -196 92 134 38 27 26 -83 209 -64 230 121 -167 66 -302 -111 215 75 -218
6993 -218 148 -117 9 236 -178 -138 73 2 131 -211 -80 -304 -228 177 -155 -79 175 190 -150 9 -130 69
7015 69 96 -249 286 -119 -13 319 -11 -60 256 -318 58 -65 -379 338 3 -54 -94 -159 66 -66 -22 267
7037 267 4 -34 176 -164 74 133 -136 159 87 -274 179 -79 -52 233 62 155 163 13 -72 165 -63 208 -207
7060 -207 32 286 -187 184 78 61 -53 -21 92 180 -128 -59 177 -110 259 -127 -37 75 -164 114 -74 68
7082 68 78 -99 48 180 -281 -9 141 -210 -64 -10 -152 -28 -286 -24 213 -291 -28 43 10 -25 94 -46
7104 -46 60 -126 258 309 -179 106 -238 -135 219 -87 -198 101 -63 62 62 -114 125 -289 -13 168 7
7125 7 -204 -23 -345 83 89 -102 -46 -116 160 150 -276 -4 -99 -174 124 -144 74 191 -51 -40 198 -167 153
7148 153 94 -337 186 -76 -54 131 -263 -53 275 -114 176 118 47 78 -287 181 -26 158 218 -7 -532 188
7170 188 -151 75 124 -313 28 240 -45 103 -2 38 230 -188 12 250 -154 55 -383 -253 173 -97 -199
7191 -199 -52 -217 100 154 -19 407 -274 115 163 90 -87 234 -77 265 -19 -147 257 -116 -187 -5 -206
7212 -206 -55 -72 -465 120 -244 -195 269 -104 43 271 -160 68 82 -204 218 -79 -238 125 -7 139 16
7233 16 -187 205 -337 -58 112 21 180 99 -34 95 -82 -60 62 -121 -95 -95 -54 165 147 70 205 129 -66 101
7257 101 28 332 141 31 -48 16 -102 290 -171 -176 58 -280 -84 -234 -45 29 -89 -272 113 -129 36 8
7279 8 -93 -4 56 131 100 -109 86 181 -371 103 51 -180 249 -285 91 134 -231 46 138 -38 120 200 -169 104
7303 104 -337 -151 -226 -81 -35 29 169 121 -180 -289 209 100 131 -100 -3 49 64 -115 22 -177 287 164 -111
7326 -111 239 -11 -192 88 35 -114 85 -177 -20 18 -116 84 -322 32 225 -42 -199 -78 -200 6 104
7347 104 136 -28 -10 97 96 -406 -42 -20 -60 235 259 -88 132 -178 104 188 -119 83 -4 -213 -12 133 -23
7370 -23 100 -193 -61 -61 -101 48 -54 102 139 44 280 34 -4 115 -98 -200 25 -236 254 159 12 126 282
7393 282 -208 178 -292 -31 201 -153 85 23 13 -17 45 80 18 -229 29 -73 -74 -131 -221 -86 236 -74 -171 193
7417 193 -239 268 144 -173 -13 66 -147 230 -203 206 249 -160 168 13 -101 138 -174 -86 85 -237 -9
7438 -9 -280 -87 -44 -303 -95 209 -74 -66 -6 49 379 266 -351 155 44 -32 38 -276 -63 -55 -156 290 -33 91
7462 91 171 -47 166 -30 -567 35 -25 -304 140 -65 -2 -33 7 167 -104 -131 160 -88 100 -58 -88 221 157
7485 157 62 -69 -92 -53 242 -296 -68 -118 -213 200 -60 -287 -77 -54 -95 270 -167 95 47 -178 -120 65 40
7508 40 -112 -65 300 291 -58 102 -234 -182 341 -189 -9 297 -329 91 114 -188 226 -231 -131 87 -188 5
7530 5 249 -308 98 -59 -193 123 39 -160 219 -153 196 303 15 179 -201 -33 95 -62 -242 173 194
7551 194 -3 -12 33 191 -103 -180 101 -188 -131 149 -319 -36 -49 -21 275 -224 217 291 -51 281 -107 -158 174
7574 174 -188 55 242 -63 81 9 -235 556 -129 -12 51 -224 272 37 -47 94 -164 103 336 -225 161
7595 161 138 -207 1 176 -131 136 -16 -257 186 34 208 192 -111 184 67 -56 380 -95 100 210 -227
7616 -227 143 140 41 281 94 169 145 -15 200 122 21 109 115 -90 209 -305 -22 -3 -58 -9 -247 -160 129 -76
7640 -76 24 226 -19 -13 199 -321 386 -68 -174 113 -156 97 180 112 251 52 -166 290 -162 -212 73 4
7662 4 -28 294 -247 -27 -53 -175 178 -104 30 234 -287 111 34 -125 -58 -61 -42 149 91 -53 156 -184 65
7685 65 -107 -187 262 -377 -74 1 32 88 -181 -13 135 64 -173 37 -140 316 195 -392 302 131 54 182
7707 182 -310 -218 64 -192 72 -108 19 137 139 -121 186 -166 162 66 -85 -18 -174 181 149 -193 106 61
7729 61 -57 104 50 -96 -16 62 -263 84 -199 125 -120 -135 73 -69 25 266 -146 82 -35 -451 -40 159
7751 159 222 -19 -97 -51 -24 -343 -162 -48 -161 -48 -325 148 224 -105 81 165 -178 22 -52 -32 129 -179 -171
7774 -171 190 50 178 133 -88 163 51 -41 169 141 -212 93 -138 240 168 -73 223 -119 -45 11 20 -90 -295
7797 -295 -144 56 -266 -173 373 -91 27 63 75 294 12 -197 5 -260 14 20 -201 336 -109 -165 276 -143
7819 -143 -198 305 -88 -12 -69 -369 202 -155 -34 326 -346 102 79 -201 152 -182 -261 209 81 43 184 -84
7841 -84 112 180 -128 23 42 -21 -75 -259 70 31 -225 20 45 -124 256 -81 123 354 -199 -35 -29 -335 146
7864 146 -90 -217 103 -209 -59 214 -197 117 -87 -52 -101 -358 65 32 145 238 149 11 191 -154 -137 219
7886 219 -127 -11 97 -336 110 -95 -231 -15 -38 -22 306 -261 177 -143 -200 255 -334 -200 17 -267 66
7907 66 23 -88 65 160 -114 207 -21 116 310 -169 277 66 -15 118 -32 109 -122 -130 -4 -80 64 -45
7929 -45 -120 96 255 -107 208 -38 -334 98 -51 -191 162 -24 61 4 -45 221 253 -157 195 -260 68 217
7951 217 -194 -48 253 -165 7 -36 -128 22 58 -131 -38 -172 -72 -322 -323 131 -75 -33 87 -212 204 -214
7973 -214 -214 89 93 -91 78 25 60 4 -32 143 -77 -56 290 -221 -138 11 -149 123 117 -232 -121 -38 45 161 -310
7998 -310 67 -117 -146 38 22 48 377 -40 -161 512 -145 125 -23 99 143 -72 -5 -21 -168 147 134 -92
8020 -92 133 -55 129 227 -333 -191 43 -420 128 10 -107 12 -228 -227 354 -95 181 114 -176 426 165 -47
8042 -47 184 45 13 103 -104 145 -1 -99 222 51 -193 -44 -81 74 -77 -194 -63 -55 -149 131 -196 51 160
8065 160 -308 245 -19 -176 334 -186 -81 249 -14 -57 208 -219 47 137 -36 152 -244 5 113 -324 -119
8086 -119 -118 9 39 -220 -170 -109 -151 136 233 -58 169 226 30 333 -234 88 54 -31 53 -44 151 197 -118 -185 31
8111 31 -219 187 121 -17 -40 -104 -18 175 -178 46 3 -168 127 -301 33 240 -28 -121 86 -91 -44 -161 -90
8134 -90 162 175 -22 -8 71 33 -30 -76 -89 -313 -213 127 -266 20 -56 -234 36 -3 -223 163 -166 -48 291
8157 291 -45 313 53 83 97 -171 -92 -20 -206 34 -18 -33 135 201 -37 284 -133 194 218 -4 -80 162 -332
8180 -332 159 -139 -83 78 37 -96 52 -87 144 -20 -226
8191b26
$$ Imaginary data points
##PAGE= N=2
##DATA TABLE= (X++(I..I)), XYDATA
0 0 0 0 0 -8 8 -8 8 -16 16 -24 32 -40 48 -56 72 -88 105 -123 145 -172 203 -235 273 -315 360 -413 471
27 471 -536 606 -684 772 -866 969 -1084 1210 -1347 1498 -1663 1845 -2045 2265 -2506 2773
43 2773 -3070 3401 -3775 4196 -4675 5225 -5866 6627 -7538 8660 -10078 11929 -14472 18178
57 18178 -24098 35025 -61694 253155 186323 -337295 275796 108121 -272979 219317 219269 -326730
69 -326730 25578 224583 -168280 -30725 201287 -151927 -73992 222937 -47870 -171557
79 -171557 36608 -80042 -89140 74011 -24830 -100935 -23814 28284 85733 18748 -6177 54079
91 54079 -34302 9505 124257 -72030 -75631 149603 34288 -23915 144235 -31893 -137339
102 -137339 171835 108104 -147602 74021 40432 -237339 77940 138812 -260784 5228
112 5228 193805 -177865 14739 182472 -238698 -91695 229453 -85490 -101910 149216
122 149216 -86114 -111776 212273 52264 -132022 107417 59195 -91857 103267 39517
132 39517 -142808 39541 68106 -51457 18594 -30088 -74352 47956 35793 -5099 -12605
143 -12605 -93530 -50763 17536 -45219 -33854 956 -38660 17656 68903 -34608 -51812 47627
155 47627 16173 15677 88106 -46941 -87830 81632 12207 -32084 98968 -30167 -66212 128525
167 128525 9857 -91989 52197 -27888 -86512 70241 -11890 -146962 -5002 34857 -60720
178 -60720 30009 29921 -128587 -23137 80351 -57999 -14033 51337 -72741 3366 81806 -56259
190 -56259 -28954 51044 3248 49568 65908 -34737 -35788 20610 19598 17709 18750 -16413 -27227
203 -27227 20125 13145 -30918 -20337 -20138 -7309 25422 -16575 -37056 -22252 -23725 36697 26576
216 26576 -49965 -7177 -3687 -29251 54845 23498 -57137 19781 37099 -22021 18700 27660
228 27660 -30170 19085 82166 -4769 -49789 14740 -22804 -26001 75405 6141 -63490 28851
240 28851 10449 -31062 28864 -2477 -36441 24820 31945 -12221 -27184 -12282 -770 11339
252 11339 39468 10055 -31687 9275 28875 13433 21497 -27 -14753 5891 15295 9378 -15628
265 -15628 -7485 26800 7975 8470 5531 -46314 -8133 40964 3900 8215 3360 -37846 -4978
278 -4978 21178 -6076 -7135 9375 12418 8667 13609 -4145 -32506 11589 39849 3855 14444
291 14444 2194 -33584 15167 28166 -10277 642 -2108 -7229 12654 6380 -4929 -11428 1488
304 1488 23659 -3061 -16224 -6307 -20400 8010 32238 -5497 -18845 -10020 -7406 5004 11072
317 11072 10511 -5520 -1409 24440 -9808 -27334 5711 -12523 1928 40645 -10457 -29798 2243
330 2243 -8132 914 19336 -2320 -15141 -999 9668 -8935 -16433 931 -10662 -1448 20606
343 20606 -16962 -21164 9055 -582 11971 14637 -18864 -13327 -2929 195 10997 -4161 -5990
356 -5990 52 -8942 -31 -7571 -16623 9723 13609 8458 4522 -19804 -18944 -4487 2912 9518 -6540
371 -6540 -7795 -1181 -12444 3308 45 -17782 13919 12717 -8219 7158 -12450 -22384 11076
384 11076 7084 -6855 -3904 -8762 -6874 3595 15474 4854 -10352 9536 1960 -15413 8840
397 8840 -4153 -13904 20975 6358 -14552 -3188 -10297 -3087 15425 15073 8135 -7161 -3246 1234
411 1234 -14029 786 5528 -8771 11470 8595 -13429 -3592 -374 2202 12091 8533 3368 -9932
425 -9932 -5977 8676 -6538 -607 9806 -12826 1423 12199 -9510 5115 12778 544 8385
438 8385 586 -10429 -5758 -9 11369 7730 3093 5027 -8793 -1166 10303 -1318 11897 14601
452 14601 -1662 6153 -3713 -12510 4126 3648 9727 12682 -2379 919 -4076 -7570 7842 -2331
466 -2331 -3691 7159 -9262 -6170 3216 -5959 1488 6977 486 -3838 -5850 1522 -3828 -600 15956
481 15956 -4018 -5949 14509 -7721 578 27861 3631 5988 17859 -11218 -11671 2669 -3497
494 -3497 649 10074 8315 -4049 -2647 3565 -10038 -1398 10810 -9718 -5899 -4927 -25770 -10216
508 -10216 -2343 -8179 9706 2386 -2975 11415 -2193 -148 10419 -7078 -3359 3292 -10943
521 -10943 -5879 5528 6571 9664 16566 10459 -8836 712 6916 -12688 4183 4884 -27019 -5211
535 -5211 -1424 -27521 3744 10231 -8688 17397 9076 -19606 -6528 -6154 -14070 1803 6718 -8029
549 -8029 -4792 10697 446 1490 20882 923 -1644 20149 -10070 -15132 8438 -15097 -4318
562 -4318 17439 -14037 -9384 6603 -10294 3702 10424 -13432 -12280 -6120 -15191 -11616 1556
575 1556 -2367 -169 20097 6740 -10561 9299 -2397 -5837 29499 4415 -13825 16620 -5373
588 -5373 -7983 27678 2462 -4221 24294 1897 -11205 2198 -14972 -21046 3049 874 -18203
601 -18203 -5922 -1549 -14590 11211 13831 -19356 -185 1272 -23060 7785 4215 -19865 19075
614 19075 17037 -6126 21267 9191 -6909 28868 24894 -2729 5437 -338 -19906 858 16666
627 16666 -9900 -1320 22184 -8709 -5647 13068 -25952 -15324 16807 -15865 -12884 967 -26923
640 -26923 -6513 17058 -2318 4433 8308 -3621 8912 13336 -1417 1014 9880 3433 5792
653 5792 13461 -7009 -1901 28368 6512 444 16482 -23079 -18943 22439 -11704 -13227 17924
666 17924 -17238 -14878 16795 -15804 -22821 11338 1891 -8241 10584 -4489 -25733 7244 19965
679 19965 -3837 14508 15565 -13927 14119 19124 -14712 4858 8029 -9246 13360 5265 -14295
692 -14295 4574 5439 2792 8185 -11115 -20613 -9618 -6101 -5609 -3145 -8854 -14851 965 6234
706 6234 -10606 3562 10899 -6423 17669 13021 -27716 -2369 10807 -9214 22185 21252 -14604
719 -14604 7730 19623 -4523 3183 8963 -11682 -6896 12009 -9595 -24872 135 -3771 -9410
732 -9410 15310 -6236 -25565 4013 -1034 -7374 7668 -11863 -14986 5177 214 2048 6205
745 6205 1516 11744 14814 4850 -3174 -6279 433 9208 13873 5826 -8518 -1298 1529 -2186 9378
760 9378 -4518 -13986 9054 -4161 -16343 -1432 -17364 -12510 17814 3541 -9203 383 -4603
773 -4603 -3050 10800 6488 -11771 -7098 9348 643 2367 14336 -2673 3833 23863 1845
786 1845 -6146 1032 -7294 5081 10427 -5553 -9856 -12154 -5026 8522 2445 -432 1027 -2481
800 -2481 963 -3171 -10433 -12487 -6052 10741 5931 -4935 2125 -4603 811 22907 7050 -4336
814 -4336 5510 -1309 1765 7008 -4344 -4967 990 6406 6711 -4749 -4323 248 2745 10291 -1654
829 -1654 -13680 -9879 -7925 4113 6267 -7178 -876 577 -3626 7091 -2195 -9171 6856 9935
843 9935 6975 2533 -8470 -6187 2163 10491 10496 -3872 -2543 1944 -1235 5489 -1463 -9237 3219
858 3219 3165 1756 1395 -12660 -5130 6583 687 1200 -5839 -13304 -385 7431 6232 410 -3814
873 -3814 1358 258 2314 4992 -8125 -112 13013 55 -1725 -3709 -12148 3759 12245 5404
887 5404 1883 -6922 -4188 2239 -1710 -1058 -4307 -5104 5690 2063 -3973 -5479 -6236 5854 8003
902 8003 1715 298 -9782 -3287 11180 829 -1061 434 -8149 3041 7834 -3285 -550 633
916 633 2586 6451 -1731 -7167 -6762 478 10475 3566 -1745 -5306 -10780 2695 5408 -5096 3013
931 3013 1157 -1777 8568 -1637 -9499 417 2537 6523 6061 -4947 -6048 -4106 3313 7080 -1877
946 -1877 -1826 -584 -711 7182 562 -5059 866 -1445 2738 1208 -11167 -3610 2619 2352 10346 -377
962 -377 -9381 352 1825 4410 5526 -2349 -1490 -560 -478 -1009 -7960 -1467 6051 5362 8875 -1440 -9024
979 -9024 1245 597 2924 4963 -8534 -4288 1830 -3810 1541 -638 -4698 5277 5966 1107 -1721
994 -1721 -4518 711 2886 2329 -487 -10532 -4771 4408 1075 6512 3286 -5197 3473 1907 -3628
1009 -3628 -247 -4564 378 6491 -1560 -3226 -6454 -6756 5862 6512 2973 1454 -4442 -707 970
1024 970 -2469 -314 -3932 674 6536 -1897 -1568 -1000 -4132 7181 5513 -3746 -1332 -5508 -1812
1039 -1812 6396 -496 -1307 -890 -4284 2386 440 -3044 -8 -165 3130 1058 -6144 -3954 -4639 2072
1055 2072 10515 1058 -547 210 -6577 1635 2960 -4821 1739 2038 148 3358 -2557 -2851 2164 3179
1071 3179 7203 1173 -4761 -2030 -3680 919 2837 -4212 -870 106 -141 5246 -410 -430 3883 -1389
1087 -1389 1041 -2097 -10252 -1244 1855 1340 6321 -1631 -4091 2011 1019 3782 3194 -38 1893 -1068
1103 -1068 -1336 -2223 -6087 2342 5279 3589 7333 -2077 -3793 4666 -621 1926 4068 -5421 -387
1118 -387 2503 -2998 1278 60 -965 3369 1002 -429 -2847 -2418 3729 1522 1147 749 -7522 -1309
1134 -1309 3035 -946 4384 1025 -2957 3014 -2409 -2831 1981 -1194 5555 7101 -1526 -693 -3240
1149 -3240 -4344 2986 1852 37 -301 -1194 1288 -1123 999 2997 -2162 3955 3205 -6962 -608
1164 -608 -2018 -6095 5493 1358 -5213 1855 -611 510 6491 1587 -346 -1547 -2870 -2523 -4924
1179 -4924 -1411 102 178 5329 -17 -4160 1008 -2896 1637 5984 -3824 -1885 -1494 -8189 75 130
1195 130 -3225 5696 3423 179 2653 -2811 -2758 489 731 712 -2579 -1063 -665 -1300 5898 1573 -2199
1212 -2199 4236 -3314 -4358 2767 -5760 -2479 4573 -3898 -1041 645 -5546 1002 4050 586 175
1227 175 -3145 -5012 -5496 -2836 893 -902 4139 5837 -1080 3468 962 -4999 4368 1683 -3703
1242 -3703 2433 -4344 -5173 4444 568 2362 6758 633 1538 1510 -2296 -2656 -3120 -2046 -3747 -3760 -424
1259 -424 -3275 1940 8611 1153 4018 3155 -7482 -1098 -244 -6406 2700 1071 -3244 3880 627
1274 627 -601 5597 4955 4622 3906 -105 -4031 -5729 -1176 -1658 -1564 5533 14 -381 7301 -1764 -622
1291 -622 6804 -3418 -1419 2486 -7272 -2533 2569 -464 3730 3880 1166 929 1131 2795 561 773
1307 773 2285 -3671 -1833 391 -3421 3905 4742 1600 5672 -1613 -4625 1101 -5192 -1475 4998
1322 4998 -3106 50 3355 -3426 186 4260 870 1134 2539 -108 -5462 -1355 2262 -4343 3277
1337 3277 7014 -4289 3077 6996 -4393 3087 4715 -5974 -1245 -979 -6037 -1469 1569 2223 1984
1352 1984 1736 1385 -3202 -1496 1334 -3175 131 121 -5226 -1743 -2937 -2048 4070 1457 4485 4961
1368 4961 -3761 459 -183 -6882 1946 1122 -4605 1300 381 -3050 1049 3076 788 -1343 1943 -1508
1384 -1508 -7266 1066 202 -6477 4055 123 -7777 2877 289 -3747 5302 1315 -2935 139 -2780
1399 -2780 -3397 -789 1632 2938 529 1586 -797 -4436 520 -726 -1245 3414 -1355 -1394 731 -4931
1415 -4931 423 1995 -2760 3605 -41 -5965 466 -2479 -4044 2247 -78 -2146 538 788 134
1430 134 35 4269 698 -3541 2440 -2795 -5941 4761 341 -1074 7646 -413 -2546 3710 -1131
1445 -1131 736 3754 -8 -267 -2199 -2841 -1880 -1863 2115 2712 1600 3330 -862 -671 959 -2389 2238
1462 2238 507 -4336 2422 -1485 -3879 5716 600 -1081 6496 -522 -2531 3196 -178 -949 2212
1477 2212 1343 -2592 -2256 2179 -819 507 8012 275 -938 4930 -4041 -2312 5154 -1603 1368
1492 1368 4601 -2101 -223 262 -987 2791 2522 2502 1717 -1478 -238 -892 -751 1835 -149 1350 217
1509 217 -2294 1770 -1746 -1245 4471 -2674 -1991 3495 -4745 -522 5939 -1904 486 3201 -3416 -1720
1525 -1720 1735 759 28 2208 2542 -3407 -693 2273 -3203 2800 6609 -1985 1428 1459 -5708 194
1541 194 745 -2330 2419 -465 -1528 608 -2188 -18 1531 -747 861 -1044 -2445 -2260 -2661 -187
1557 -187 -1388 -1897 1323 -3542 -906 3587 -2142 2240 3620 -4487 -79 -715 -5638 906 1311 -1473
1573 -1473 2439 48 -2031 -69 1057 1587 906 2689 381 -4352 -510 -2287 -4734 2898 450
1588 450 -2458 3628 -1435 -2877 2422 -1519 -560 537 -3665 -2250 -2846 -2884 121 -1647 -212 391
1604 391 -2143 -80 -669 85 1896 -989 305 -688 -4852 829 259 -1257 5926 1304 -1447 2956
1620 2956 -1783 -1166 3411 381 1186 1763 -1264 -1467 -1847 42 665 -75 2885 -569 -1826 1499 -2463
1637 -2463 -802 2857 -2503 -203 790 -3680 598 1005 -985 2689 -140 -1178 800 -1011 1278
1652 1278 1981 666 2328 -855 -869 620 -1008 2039 3083 410 2497 -1323 -1613 1675 -1285 2015
1668 2015 3852 -776 2077 860 -2698 2090 865 343 3131 473 -557 110 -634 1499 682 1911
1684 1911 2257 -1433 1427 1022 -1733 2505 -121 -2760 809 -2921 -2616 1885 -1035 1626 3145 -942
1700 -942 48 -872 -893 1382 167 1200 467 -2446 390 -643 168 4374 2407 3619 4043 -618 706
1717 706 -222 -1771 1669 -786 -1699 1078 -2665 -309 2481 -1044 1631 1005 -2300 -1225 -2834 -3382
1733 -3382 -2035 -2583 -733 -2370 -2402 1110 -815 2046 4893 -446 835 516 -4349 -406 111 -1471
1749 -1471 3029 1412 169 1381 -845 818 1516 478 1321 -2061 -2964 -2268 -4494 -1017 -681 -1975
1765 -1975 1858 -661 -1777 940 -2517 -1542 604 -3173 -1076 -1157 -2872 1530 1543 1215 2835 118
1781 118 -123 -168 -1662 404 -824 -262 820 -2758 -559 -407 -2152 2922 1186 -1823 709 -3766
1797 -3766 -4622 -1012 -3342 -745 1832 -44 1481 1190 220 1409 907 1959 558 -1485 149 -1914
1813 -1914 -646 3448 -78 2273 4226 -1242 1625 1882 -2823 347 -607 -4312 -1902 -3017 -2869 -13
1829 -13 1075 2441 989 443 229 -2925 -65 396 -2137 1780 836 -1562 2709 760 1403 5875 2879
1846 2879 3080 3111 -1365 54 109 -1487 1169 320 -268 848 35 416 163 358 860 -2479 -1049 -1121
1864 -1121 -4489 1273 1495 -1602 3671 1091 -2934 3176 1428 -500 3715 1614 -180 960 992 424
1880 424 1502 4535 2999 753 2727 -1435 -3660 1318 -1858 -2034 2254 -2423 -1403 2111 -2060
1895 -2060 253 1526 -1761 440 -958 -3329 -1084 -913 -198 1220 1710 1393 592 3363 3063 765
1911 765 3831 422 -3211 1446 -2437 -3947 3566 142 -305 4600 -1508 -2434 847 -2315 -1941 100
1927 100 -2419 -3648 -2382 -1724 -2719 1 2912 -125 1758 3036 -3056 68 1772 -3598 1543 1516
1943 1516 -3816 1769 1994 -1237 3478 1998 -1434 991 -453 -2916 -1299 -240 -2044 -1306 819
1958 819 -2907 -3144 1973 -1719 -874 3968 -3096 -2908 1609 -4153 -1333 3405 -1468 1610 3795 -1619
1974 -1619 -19 1322 -1514 89 1669 -709 -1986 236 -495 -2278 2507 586 -2820 2415 -1202
1989 -1202 -4747 2144 -1984 -4263 2881 -1958 -3505 2852 -709 -868 4827 1335 -704 1447 -270
2004 -270 -2433 573 2380 -1426 1319 3415 -2477 564 3462 -2331 2390 3665 -3511 381 -214
2019 -214 -5485 377 169 -2788 1600 605 -1925 1218 1011 -822 564 1637 -1414 -1144 1661 -2066
2035 -2066 -334 4701 -1137 351 5254 -2555 392 5837 -1614 859 4654 -3495 -1305 2321 -2805
2050 -2805 -547 3379 97 -890 1806 -584 -2783 1895 1780 -2227 2621 616 -4310 1703 8
2065 8 -2865 3759 744 -1475 3349 -731 -1105 3282 -161 -373 2234 -1402 -1650 1033 14 -390 1785
2082 1785 1306 -2497 686 1628 -2933 2536 3173 -3662 1910 1265 -5089 2024 2321 -2807 3403 2256
2098 2256 -3142 938 842 -1804 859 2252 -774 -937 1272 -2003 -2131 2289 -1049 -1326 2527 -2636
2114 -2636 -2687 2163 -3044 -834 2637 -2673 -459 1426 -2778 716 1888 -1520 311 450 -1611 -1039
2130 -1039 1243 447 -74 2993 838 -2285 1906 -727 -2795 3346 42 -2869 1912 -2549 -3451 2073
2146 2073 -1133 -768 2684 -719 -1391 461 -1646 -2141 -297 -231 -1882 -841 -108 -2172 296 2026
2162 2026 -1215 1437 1453 -2969 1280 659 -2993 1778 100 -2461 1193 -628 -1767 2368 1479 452
2178 452 1184 56 -1793 -1312 549 -1010 -1041 1762 -1608 -1629 2190 -1567 -332 3612 -528 625 1995
2195 1995 -2816 -862 432 -1310 283 341 -1036 108 147 852 263 430 1120 -805 -190 -152 -1841 601
2213 601 265 -786 1536 -1127 -1325 1991 -346 1096 2882 -1129 -287 886 -1990 -2 1011 67
2229 67 1639 1265 146 -686 -156 1218 39 1298 1373 -1837 308 744 -1784 1286 760 -1234 1651
2246 1651 -106 -1477 273 -841 -233 757 -667 -179 -837 -216 1395 277 926 316 -1233 118 -598
2263 -598 -863 1493 295 1081 1987 -348 626 735 -5 2414 963 -543 468 -1735 -1023 643 -845
2280 -845 464 719 150 1039 -598 -874 -401 -1016 267 -1061 -2191 -607 -1423 28 2225 -275 789
2297 789 1159 -624 1156 613 -635 651 -93 -364 195 -1160 633 1085 1144 2581 111 -1227 -203
2314 -203 -1817 -573 -61 -1897 -257 -832 -1636 -517 -1497 -416 762 -417 894 -620 -2104 436
2330 436 -103 104 1727 -612 368 1425 -272 1149 557 -170 1070 -406 -593 -419 -1109 777 879
2347 879 -72 438 -2360 -2105 -275 -1931 -107 -485 -1720 109 -473 -1108 615 -301 990 1946 -423
2364 -423 -238 -683 -1234 1239 993 734 1560 462 1443 1739 613 878 -288 -547 13 -2337 -1587 -1197
2382 -1197 -2240 576 234 -1482 216 -1157 -617 1041 -548 -883 -735 -1530 -78 171 -7 1859 1695
2399 1695 2878 2356 195 796 313 743 2109 -230 -327 295 -1130 920 781 -743 836 -113 -1072
2416 -1072 -34 -2376 -2208 -929 -1513 -253 -408 -1367 132 341 1445 1624 -428 597 -127 195 1827
2433 1827 313 1202 2781 1171 2075 1376 -1398 1091 835 -770 611 -1601 -2399 -539 -1318 -373 -331
2450 -331 -525 119 -431 -907 -1462 -2519 -689 -577 -1006 1047 -823 -110 3001 1370 2473 2888 96
2467 96 1073 1174 -570 707 -21 -589 1072 209 -22 151 -165 978 -72 -401 -1566 -3743 -1844 -1777
2485 -1777 -2199 432 -1008 -934 2274 -724 -571 1873 -653 801 2296 -738 -122 570 -21 1522 2178
2502 2178 1455 742 870 1532 -122 -173 85 -2347 -441 -144 -3049 -453 -657 -1732 1408 -472 -2566
2519 -2566 -234 -1677 -1069 1134 -454 -173 954 326 804 1117 1155 890 1724 2382 -156 -192 986 -1091
2537 -1091 1205 2413 -1087 792 841 -2578 511 -184 -3272 -272 -645 -2316 -448 -994 -1480 42
2553 42 1157 386 -757 145 -468 -794 2292 365 -868 2237 -2 277 2997 244 890 2831 -232
2570 -232 128 321 -2511 -514 534 -746 -290 -812 -1517 -908 -41 -589 -1345 261 -131 -1904 555 -977
2588 -977 -2199 2109 681 -346 2674 -375 -642 3164 254 192 1828 -454 -375 1142 165 -267 389
2605 389 718 -842 -359 -221 -2786 -689 1283 -1710 215 345 -3000 430 766 -1819 1064 743 -1400
2622 -1400 1480 -46 -1355 1137 737 786 1683 1203 33 153 1141 -76 -385 919 -1598 -1155 1488
2639 1488 -1371 -755 1652 -1718 67 1067 -2331 -662 387 -1680 443 -40 -1927 -383 306 600
2655 600 1256 1642 866 -52 1382 214 -1749 1041 -82 -1098 2526 -852 -1932 1756 -679 -246
2671 -246 2233 -998 -1043 559 -1215 -982 -133 -1054 -724 220 444 -631 -137 1219 -300 942 1439 -1804
2689 -1804 444 860 -1224 1540 559 -1289 1254 121 -1159 1184 -231 -232 1276 -13 -719 -820 -823
2706 -823 -239 -20 822 -435 -714 592 -1338 -361 1372 -1074 536 1854 -1391 387 964 -1399 1123
2723 1123 1357 -688 511 141 -510 359 306 128 -717 186 103 -943 484 190 -805 1149 -416 -1964
2741 -1964 272 -1204 -782 1838 -640 -89 928 -719 464 1019 -300 714 261 -221 259 -679 -314
2758 -314 -222 326 1261 -329 420 676 -1281 706 330 -1863 515 -901 -1723 533 -656 -453 1081
2775 1081 -178 207 374 -532 434 146 564 368 -702 -130 -306 -743 908 -7 477 1360 -354 317
2793 317 190 -1431 659 529 -1014 501 -935 -1145 473 -496 148 450 -180 170 -356 -228 345 -860
2811 -860 406 426 -1003 331 -529 -724 1336 -9 46 731 -1022 -27 383 -282 743 40 -664 343
2829 343 -1315 -664 189 -815 715 -25 -737 368 -700 -414 682 -385 788 272 -853 426 -687
2846 -687 -612 986 -403 559 1048 -849 299 230 -138 982 -212 -73 -34 -860 497 317 -570 977
2864 977 -132 -452 577 -825 -112 500 -186 354 -213 -1094 -12 -797 284 825 -602 982 499 -863
2882 -863 853 -462 -12 1547 -379 290 649 -685 389 460 85 812 -371 124 387 -533 1077 236
2900 236 -281 935 -484 -160 398 -1053 202 261 -1067 192 -551 -987 933 26 523 1156 -263 270
2918 270 145 -763 323 149 192 614 -65 794 344 56 1625 307 382 1075 -1026 -457 71 -1498 118
2937 118 378 -1317 393 42 -466 602 -167 185 -71 -829 -463 -750 -477 527 -163 752 700 -251 1236
2956 1236 681 82 1615 56 49 687 -1354 -287 254 -268 854 545 -533 461 -357 -572 -221 -936
2974 -936 -271 -855 -991 -385 -1234 -348 481 -327 1048 -61 -1156 879 -253 -134 1316 -382 73 1316
2992 1316 -272 777 759 162 719 -197 -435 -550 -1111 104 -350 -251 415 -891 -492 152 -1527 -303
3010 -303 -36 -1498 109 -731 -1433 457 -273 419 1645 323 499 615 -232 503 180 -234 357 -396
3028 -396 765 373 -103 1104 -27 -82 718 -1523 -964 -422 -1965 -362 -428 -1668 -110 -331 -634 909
3046 909 120 355 654 -230 248 -263 -232 502 312 1602 1170 129 1239 508 365 1440 -279 -402 392
3065 392 -1236 -368 203 -1284 86 171 -696 -24 -910 -985 -383 -616 -175 -418 -576 344 -33 966 1237 121
3085 121 1591 863 -593 1354 211 142 1858 483 724 1207 -118 585 663 -174 198 -597 -1119 -696
3103 -696 -1464 -593 -676 -513 672 23 -47 509 -919 274 101 -1062 478 -501 -795 1517 485 529 1985
3122 1985 553 1021 943 -147 2 13 -284 -186 -696 -267 -322 -428 1137 517 -247 495 -1050 -887 -522 -1795
3142 -1795 -416 -329 -985 688 57 -64 1431 335 654 1085 -379 352 148 -260 12 -219 398 194
3160 194 -50 790 -254 -512 611 -1293 -659 12 -1994 -1003 -13 -1077 239 452 -679 21 -499 -248
3178 -248 -63 -212 197 -138 -22 585 -284 575 1363 444 1159 391 -363 527 -778 -696 416 -1228 -365
3197 -365 222 -1263 -70 126 -938 -8 -414 -1363 -762 -1114 -642 -525 -112 278 -343 472 863 -278 960
3216 960 875 -372 877 135 -942 337 -283 74 1414 178 402 168 -336 189 -319 -418 -148 -1010 -478
3235 -478 -603 -1090 -71 -55 129 655 -555 200 313 -685 785 258 -571 776 -424 -364 956 -7 361
3254 361 710 394 340 -75 8 415 -236 293 -298 -935 487 -336 -690 889 -209 91 1113 -298 128
3273 128 402 -433 702 486 -19 655 -287 -87 635 121 530 351 -132 503 -226 228 222 -616 389 78
3293 78 -729 324 -572 -531 787 -631 -121 487 -814 18 251 -156 378 417 -162 562 -218 319 329 -82
3313 -82 1098 -102 118 583 -363 412 873 -92 550 -8 -477 222 -716 -473 293 -531 -49 -54 -766 86
3333 86 -68 -175 463 -419 46 20 -581 417 -227 -206 371 -518 -77 530 -364 586 646 -227 470 -696 -884
3354 -884 78 -554 -347 43 -681 158 -137 -215 451 -379 147 374 -421 29 -525 -847 364 -314 -223 481
3374 481 -425 223 350 -375 283 55 -443 29 -621 -647 -149 -724 215 54 -546 -136 -605 -288 660 -465
3394 -465 -41 -44 -715 302 -658 -496 578 -403 195 631 -519 197 222 -19 846 54 -266 236 -596 205
3414 205 -126 -860 377 -279 -329 352 -700 -23 304 -289 406 45 -567 11 -431 149 639 -260 77 101
3434 101 -515 497 41 34 610 -131 255 418 -783 102 198 -178 468 -213 -264 378 -234 395 49 -404 612
3455 612 2 -112 386 -277 139 390 -387 250 -139 -335 980 -69 497 715 -350 459 500 -81 400
3474 400 -130 -56 529 -449 -25 -156 -322 1130 465 193 913 -637 -95 580 -532 340 -110 -333 252
3493 252 -83 -327 299 -134 465 620 -115 162 -402 -360 244 -333 -197 214 -453 576 263 112 725 99
3513 99 123 501 -628 -38 167 -530 592 46 -292 246 -428 75 528 -375 118 -241 -226 111 -419 -366 184
3534 184 -426 485 -157 -892 174 -356 -317 646 -370 -153 260 -394 368 79 -388 497 -278 -76 189 -869
3554 -869 -122 -28 -224 552 -485 -250 105 -485 398 128 -826 7 -381 -1133 160 -833 -377 889 -43
3573 -43 434 301 -349 218 83 -33 -90 -829 -459 -247 -298 599 69 -113 1037 -49 138 312 -832 -254
3593 -254 25 -816 -227 -745 -854 302 -5 377 470 -93 141 -9 -422 -143 -699 -92 408 -78 449 -151
3613 -151 -10 1381 275 453 454 -1016 -295 -1 -633 128 -60 -309 792 -46 -181 -5 -405 -73 -194
3632 -194 -429 -228 -816 55 679 -55 556 427 -268 1092 282 -303 464 -275 124 573 -360 438 683 560
3652 560 1291 622 -102 49 -474 64 -109 -571 -191 -491 -35 488 -366 215 466 -360 707 -37 -1099
3671 -1099 -130 -443 -278 390 -160 227 879 440 1139 477 230 387 -369 151 -302 -552 265 81 354 994
3691 994 -72 119 505 -263 254 -167 -1084 -182 -640 -751 318 -321 263 834 245 520 120 -215 319
3710 319 -325 52 -24 -626 150 180 -73 845 -188 -27 563 -502 -110 -141 -1145 -125 -94 -576 -36 -614
3730 -614 -106 458 -100 392 -226 -358 182 -313 -103 218 -326 595 556 -339 484 -82 -86 562 -290 33 228
3751 228 -802 210 -234 -346 167 -336 -52 16 -745 -375 -158 -730 -277 -622 -366 221 -278 370 506 -371
3771 -371 288 -22 -644 456 -152 -111 530 -286 214 439 -150 168 133 415 391 -538 -196 -395 -719 178 -232
3792 -232 -510 376 -481 -120 245 -651 174 361 -298 237 -170 -504 176 -274 109 290 -374 115 244 -133
3812 -133 338 183 311 328 -394 274 -220 -612 580 -229 -157 74 -620 -43 214 -256 407 355 -207 298 -309
3833 -309 27 -74 -399 382 208 62 286 -72 202 564 91 212 424 -136 544 -152 -254 474 -614 -34
3853 -34 367 -213 8 291 -164 271 97 -64 63 -471 91 99 -74 423 -254 121 499 -276 409 637 -158
3874 -158 553 338 -237 28 -320 -125 255 -137 153 178 -327 2 -61 53 453 -280 -227 207 -559 -14 -277
3895 -277 -532 419 -406 66 512 -476 -24 511 -132 409 197 -224 229 -145 -200 43 -99 109 -298 -229 262
3916 262 -383 105 461 -416 265 -62 -737 0 -244 -259 289 -494 -362 203 -15 439 81 -55 237 -61
3936 -61 -171 52 -650 -119 -167 -556 41 -23 -77 338 -136 196 300 -461 384 -286 -487 172 -200 -64 36
3957 36 -341 -227 57 -139 396 21 305 334 -316 5 132 -398 567 -202 -420 575 -396 114 429 -379 353
3978 353 324 -355 -63 -329 -84 313 -27 236 -197 -326 300 28 -76 284 -285 140 318 -468 292 275 -327
3999 -327 446 -245 -178 277 -286 161 313 -41 144 -312 160 377 -319 112 178 -409 367 -122 -654 339 -187
4020 -187 279 745 -602 210 189 -172 403 127 -266 147 -380 133 147 -385 251 -130 160 500 -343 161
4040 161 339 -408 538 18 -685 261 -303 -238 697 -193 71 827 154 263 30 -434 378 -21 251 191 -383
4061 -383 -41 141 -51 441 -393 -183 472 -359 -203 174 -860 260 91 -403 79 -527 -259 297 214 205
4081 205 17 -363 223 -174 96 202 -563 226 440 -419 240 -276 -9 843 -135 38 115 -501 26 288
4101 288 -581 310 -183 -299 170 -327 -102 -107 -574 317 -300 -186 122 -532 515 662 -202 171 -48 -307
4121 -307 634 -200 -663 63 -428 57 336 -48 138 235 375 423 -147 -364 -454 -576 314 -188 -244 246 -198
4142 -198 431 848 -290 -35 284 -198 301 -149 -800 161 -51 352 328 60 322 414 17 510 -363 -306 -167
4163 -167 -513 234 -318 -794 437 -209 326 644 -486 -93 308 -165 89 -109 -572 78 -92 -171 360 -387
4183 -387 263 519 -6 475 -355 -146 365 -106 121 1 -593 302 153 -3 328 -153 -13 456 -46 -134
4203 -134 -39 -317 382 242 -46 -13 -442 60 461 -116 194 -431 -233 447 -202 109 443 -310 680 539 -288
4224 -288 108 -463 -104 564 -391 136 -33 -495 330 444 -189 47 -50 -74 223 -657 -95 -385 -282 483 -34
4245 -34 -291 237 37 453 502 -303 41 -212 -200 116 -151 -243 191 -160 160 188 -257 223 -282 85 465 -656
4267 -656 -306 31 -428 486 -3 -429 202 -138 132 232 -573 48 134 68 377 -153 18 255 -30 588 11
4288 11 -171 -56 -33 -138 335 -568 -172 221 -266 400 -98 -495 191 -159 35 59 -817 -40 293 146 732
4309 732 47 -97 414 7 387 86 -369 60 -142 -246 435 -567 7 900 89 501 119 -462 232 -209
4329 -209 -292 -187 -751 -161 86 -144 131 -265 143 831 111 29 -148 -731 119 162 -300 175 -123 -131 636 105
4351 105 195 67 -95 414 24 -432 -246 -510 11 354 -99 101 -32 -205 404 -173 -134 -30 -273 309 182
4372 182 -147 105 -15 167 515 -43 -55 36 -409 652 212 -50 183 -404 141 585 -211 185 16 -283
4392 -283 135 -142 -715 44 27 39 405 -441 149 148 193 519 -287 -176 -54 -310 159 -22 -646 38 15 411
4414 411 570 -454 -238 350 -291 236 -278 -635 -40 -186 177 -2 -226 29 164 165 275 -343 -269 165 -100
4435 -100 54 -246 -460 178 359 111 373 -261 44 505 -245 198 54 -477 440 270 -70 -85 -625 31
4455 31 489 -29 368 -311 -493 485 -379 143 -170 -436 183 493 -235 -35 -135 -63 545 135 -124 -64 -284
4476 -284 498 358 -124 9 -558 186 218 -312 83 -41 -375 421 -104 -154 287 -579 235 386 -123 -3 -123
4497 -123 -173 552 182 -206 225 -199 162 175 36 -24 -221 273 317 -479 66 -166 -107 573 -200 -235 351 -333
4519 -333 91 136 -547 112 -68 -173 167 -333 -334 326 -128 590 269 -309 141 155 20 231 -327 -7 44 -309
4541 -309 333 -160 -395 244 -90 -62 278 -300 13 310 -133 142 49 -327 90 -308 -16 -297 -117 266 -86
4562 -86 -14 392 -485 66 556 -415 202 -101 -345 403 -18 -144 233 -216 255 542 -124 -4 -153 -186 203
4583 203 -213 -78 -65 -504 22 162 -53 183 -462 -132 391 -143 13 278 -416 153 292 -367 187 -49
4603 -49 48 354 -29 338 -86 180 414 -175 79 61 -486 -40 145 -457 -9 -93 -272 632 -96 -36 168 -242
4625 -242 176 35 -410 28 -287 -282 131 -439 -155 154 -117 121 -140 179 503 -293 193 364 -434 53 7
4646 7 -512 200 49 -51 -3 -112 44 255 26 260 -216 -89 65 -303 -62 52 -236 409 -149 182 532
4667 532 -246 98 513 -502 12 -27 -326 293 -212 -201 78 -260 -98 25 -72 -12 -15 -20 329 -281 101 287
4689 287 -459 190 43 -394 357 -258 -33 345 -332 198 296 -2 38 40 -255 9 -193 82 101 -112 280 172
4711 172 -271 353 168 278 159 -279 -26 -79 -339 277 -177 -215 250 -312 -12 305 -344 193 188 -175 239
4732 239 -348 -148 156 22 189 72 -9 274 35 7 556 21 169 275 -463 254 -111 -1 620 -40 -248
4753 -248 376 -39 100 59 -377 40 -238 -128 101 -619 -144 60 -320 456 -177 -319 181 -25 77 214
4773 214 -12 432 438 164 354 -224 -291 481 -217 -230 -35 -407 146 141 205 596 124 -205 -87 -310 -222 -257 -410
4796 -410 95 -367 -262 342 -137 157 350 -75 505 -213 -330 72 -215 -36 -268 -329 241 526 -126 204
4816 204 151 129 288 -328 -118 -170 -402 105 97 -411 -14 -291 -5 93 -385 303 -173 -267 456 -213 -39 226
4838 226 -182 388 450 27 289 443 -151 400 -250 -184 179 -349 201 195 -275 192 -204 -104 -111 -334 -254 -471
4860 -471 -416 -80 -177 -69 400 -308 344 520 26 319 57 -59 -55 -127 -326 55 193 559 341 54 660 216
4882 216 85 549 -298 -389 -187 -419 -98 -157 -160 181 14 135 280 -263 247 31 -358 118 -464 -168 202
4903 202 103 504 501 124 629 362 217 467 -358 -73 268 -377 201 8 -251 -88 115 104 -3 -487 -193
4924 -193 -205 -466 175 -190 -115 253 -12 112 427 -77 440 513 -46 467 -318 -85 351 -385 279 315 -183
4945 -183 398 192 24 36 -258 -224 -102 -109 -218 -472 -201 413 -79 23 71 -577 13 14 -219 255 23 -7 633
4968 633 217 235 361 -75 67 293 -265 -158 -345 76 124 -281 -259 -315 -343 381 -136 -252 17 -484 -48 -27
4990 -27 -697 -105 -17 -281 432 79 -225 389 100 386 406 -4 111 -103 64 207 -222 166 81 -192 543
5011 543 -146 -554 -139 -358 -272 163 -412 -104 -165 -268 199 -132 -149 30 30 99 223 -147 40 29 -117 345
5033 345 -313 102 109 8 88 357 -172 -96 91 62 244 -302 -109 136 -414 57 166 -376 24 -78 4 -131
5055 -131 -228 211 152 16 439 -179 -98 444 -168 236 199 -309 164 275 -135 251 -202 85 447 11 -166
5076 -166 149 -425 252 -52 -78 -101 -389 254 120 -405 -9 -278 70 740 -108 -18 19 -375 411 220 -79
5097 -79 295 12 -113 366 47 -23 172 -60 478 -10 -41 5 -443 -46 209 -229 173 -60 -244 535 -158
5118 -158 41 188 -22 449 138 -514 124 59 208 552 111 237 200 -87 280 -19 -239 -3 -100 87 44
5139 44 -452 -51 -57 -252 -57 -311 -238 211 233 44 16 -521 -130 200 -204 65 -225 -134 433 81 184 -167
5161 -167 161 137 218 -30 22 -540 -218 181 -281 247 -78 -191 126 16 -65 -159 -368 -9 -247 -43 275 -61
5183 -61 -61 200 -45 78 -266 -403 -38 -77 91 330 -180 216 308 -74 -119 -132 -171 343 -70 -176 -171 -190 47 166
5207 166 -223 92 -49 -114 348 -189 -139 -19 -443 259 303 -346 240 -145 351 486 -24 61 133 -76 158 -103
5229 -103 -62 47 -5 -9 40 -293 -274 152 -22 311 -249 -272 -73 -141 78 152 -375 206 -199 -189 559 -167 259
5252 259 457 -74 300 73 -321 -126 177 -99 151 -91 25 126 109 393 41 -157 170 -19 142 51 -326
5273 -326 140 -50 12 88 -258 -173 200 -23 224 107 -187 188 124 1 -19 -134 121 112 -84 182 17 -386
5295 -386 196 147 47 -17 27 91 188 -262 267 -44 -81 290 -145 189 -151 -165 -128 17 -361 104 -12 161 491
5318 491 -281 -134 -348 -257 133 -302 -285 -66 -95 199 86 -101 146 -121 5 290 -63 -128 -14 -409 215
5339 215 82 44 -53 -186 -17 357 -275 -111 179 -269 204 -137 -478 50 -280 173 235 -112 221 205 207 391
5361 391 -66 -261 198 -181 4 60 -219 210 -16 401 349 -47 40 -30 0 157 -162 -265 -35 -250 -126 329
5383 329 -157 373 -92 -95 225 -205 -325 100 -67 -128 282 111 196 173 162 403 162 78 247 -164 176 -124
5405 -124 -265 104 36 -94 21 -199 59 132 -319 -154 16 -477 133 -120 -177 214 53 110 192 -81 21 -70
5427 -70 119 375 -346 253 214 -176 273 273 137 322 -2 74 218 -335 18 -77 -292 127 -126 -46 161 -194
5449 -194 8 56 -261 81 -12 -243 87 -253 -143 264 -133 461 365 5 347 48 14 203 -159 -51 -32 32
5471 32 114 -47 -179 184 -158 -103 144 -233 -151 -251 -232 129 -396 -220 214 -108 195 74 -113 136 125 -157
5493 -157 272 -29 129 492 -2 490 302 -117 454 -3 -20 228 -127 -92 -165 -346 188 -227 -186 108 -427
5514 -427 254 -40 -322 -124 -283 -137 325 73 -47 332 -6 199 452 -8 147 41 110 122 -445 104 -176
5535 -176 -125 133 -122 -303 112 -121 -149 135 -498 -90 -331 -380 -1 -338 -13 94 98 248 265 83 81 41 143
5558 143 33 -224 -20 316 -152 152 144 10 378 6 -87 306 -263 17 -98 -350 -223 -224 -19 306 -267 8
5580 8 205 -257 102 -89 -370 49 -151 -87 276 -157 495 310 -146 257 61 72 112 -83 144 252 -248 -134
5602 -134 116 -427 133 -213 -113 -166 -237 -28 -215 -235 330 0 54 299 -222 83 193 -177 221 -16 28 339
5624 339 -19 -85 283 -8 97 264 17 319 -10 -64 173 -304 -116 -62 -499 54 -147 -215 189 -182 -126 74
5646 74 -283 19 347 -220 -27 -226 -114 223 -206 -52 296 131 -46 273 261 237 -143 -4 207 -198 271
5667 271 95 -292 273 -87 -293 160 -117 143 34 -175 -20 -292 -105 289 51 211 35 1 155 79 18
5688 18 451 147 194 286 104 114 136 -359 175 -96 -611 63 -208 157 199 -104 -19 -104 -349 151 -360 -8 98
5711 98 -246 50 110 -58 260 -61 106 526 -123 91 225 -340 255 391 -337 222 -156 -8 -66 -256 61
5732 61 1 -65 -92 -152 -53 49 -138 112 121 -319 167 82 36 -123 -245 -60 261 -114 220 87 -223 175 -79
5755 -79 -306 564 -275 -309 22 41 275 -262 -73 292 -310 91 3 -212 -20 38 -284 164 -87 -289 274 -93
5777 -93 137 140 -12 36 92 -148 64 -178 -223 36 -249 329 68 -154 264 94 89 81 -120 -151 159 -252 -137 -76
5801 -76 -442 23 -38 -254 34 -21 63 188 -75 227 25 63 149 -266 -101 45 -304 460 103 -59 42 -113
5823 -113 203 163 -66 117 -89 -102 168 -98 -418 156 -217 310 238 -97 319 14 -102 213 -311 139 40
5844 40 -392 229 14 18 140 -56 -179 253 47 106 -26 -415 324 -131 -210 36 -52 83 256 -33 392 -26
5866 -26 -48 156 -158 43 206 -104 258 54 -101 296 0 -105 56 -96 115 267 -398 248 -114 -158 -66
5887 -66 50 46 103 -258 29 67 -26 222 -218 -186 365 101 182 184 -162 286 9 34 156 -202 195 54 -63 114
5911 114 190 -154 -76 172 99 177 -216 108 -96 -86 125 -31 -51 341 17 142 173 -167 100 -4 -290 49
5933 49 -366 -188 90 -236 56 135 -158 -30 98 127 40 -77 174 15 -124 169 -81 -160 269 26 -167 151
5955 151 -157 199 279 -121 356 111 -204 125 -222 3 105 81 180 129 -234 22 78 -129 197 -96 182 -184
5977 -184 -237 210 -144 -131 167 -137 167 -202 -59 122 -27 -64 348 23 -67 171 -203 114 -72 -287 70
5998 70 -242 -83 -4 -102 -26 117 -140 172 -130 -146 281 -386 -139 99 -168 -88 -127 -85 318 -34 112 418 113
6021 113 -54 146 -195 64 -134 178 225 -100 82 239 -129 122 -10 -86 -59 -187 -157 -100 -77 105 -126 -395
6043 -395 -26 -9 -21 151 -116 -29 -85 -25 211 169 78 175 36 -52 426 -173 -162 64 -111 41 -157 -145 181 53
6067 53 -107 117 -267 53 -139 -368 -7 22 -166 154 -228 207 259 -81 186 202 24 110 -199 -82 35 -284
6089 -284 213 67 -76 247 67 210 302 -208 -156 62 -208 -224 124 -211 3 -173 108 43 -268 149 36
6110 36 15 379 -165 297 -20 -336 281 155 -28 221 211 44 192 65 -18 -75 -35 176 -95 -193 212 -5
6132 -5 59 -172 -325 111 -27 5 -28 -185 -244 171 -156 38 17 -194 23 -32 -36 146 136 18 148 -128 102 2
6156 2 -219 139 -60 364 -246 -40 -214 -279 -301 93 -169 -219 335 -73 -27 201 -104 210 -103 -285 332 -98
6178 -98 -203 -87 -122 -88 232 340 155 -69 -18 -141 -316 101 -27 99 36 -136 22 251 -29 -137 377 -66
6200 -66 -83 33 -534 -158 -90 -301 162 176 -179 233 -112 211 8 19 121 -192 -23 168 19 -210 -55 -175
6222 -175 181 -222 -176 192 14 -82 269 -273 -175 -241 -53 181 -48 -309 54 -111 252 -94 -267 70 12 -121
6244 -121 160 114 178 505 -95 226 -37 -255 92 113 75 -93 -253 95 17 49 -44 3 -268 -86 -321 -128 -146
6267 -146 -269 395 -201 -25 60 -142 189 301 -185 138 -125 -185 163 -11 -13 51 -25 -1 -51 -111 40 172 35
6290 35 193 -158 195 243 -146 161 272 -292 228 106 57 355 -134 196 51 -166 164 47 -28 101 4 -12
6312 -12 104 -49 126 84 -179 294 -102 119 308 -380 272 -119 -326 33 -44 -257 -48 0 -197 122 -106
6333 -106 -134 -16 -244 7 -228 26 180 -161 177 -29 -214 255 -32 -176 314 -62 126 363 -226 113
6353 113 98 -225 225 -175 -10 145 -317 154 156 -169 -21 1 -62 -80 -345 78 121 -200 -17 -78 -194 186 15
6376 15 -9 -23 -183 -60 219 0 35 -51 -128 194 -293 -15 141 -222 -1 -31 -197 106 -50 136 -63 -217
6398 -217 4 140 -216 149 202 -103 176 -314 138 2 35 151 198 53 54 148 251 134 -316 -25 -184 -267
6420 -267 29 -83 -37 -11 -282 232 82 114 -16 -224 -309 -7 -2 52 207 1 151 -207 33 308 17 -210
6442 -210 62 -361 268 3 -237 26 -207 -240 76 -141 189 157 -114 171 -133 -136 -64 -237 37 256 -61 137
6464 137 -21 -230 128 -197 141 314 -134 -99 96 -81 91 -93 -171 -2 -158 -71 104 111 174 -82 -155 36
6486 36 -12 -56 -153 -187 61 128 -414 163 247 -79 142 -80 -40 227 -197 83 -14 -123 30 14 -83 17 -105 64
6510 64 278 -38 -104 25 42 213 106 203 220 -213 -165 -22 -7 230 -22 -164 86 164 -10 193 -11 208 183
6533 183 -125 85 15 136 -62 -242 107 -201 -40 216 71 119 102 -192 177 -17 -77 -5 -184 -123 24 -384
6555 -384 90 230 -44 231 228 72 236 -44 -179 207 -184 135 43 -199 180 99 30 192 -274 -19 67 -130
6577 -130 -50 72 -211 71 -147 -267 -50 -90 -137 -9 -334 536 165 -237 -5 -123 -100 269 -141 118 214 -146
6599 -146 106 -204 34 -1 -177 -191 187 -111 18 -130 -81 423 -250 -85 -37 -141 -144 163 -1 301 32 -45
6621 -45 86 -371 22 70 -158 88 -15 -157 141 105 -90 65 179 -80 -24 -96 191 -325 -224 214 -366 -46
6643 -46 -24 -241 56 217 -90 127 -226 -27 228 -25 84 220 -184 64 33 -293 192 -41 62 -20 63 -46
6665 -46 -14 79 329 -309 86 61 -389 163 -4 -234 292 43 150 28 141 124 -101 -147 9 -23 21 264 0
6688 0 79 -16 -173 266 -5 -36 329 -57 89 126 -94 -7 -87 55 232 148 -71 170 -190 -153 -9 -207 78
6711 78 173 -99 50 -129 330 327 -19 188 152 -165 40 -174 -96 171 -39 -4 102 -210 340 -150 55 145 -157
6734 -157 2 -78 124 -67 -96 8 280 72 95 26 -206 170 21 170 165 31 -149 113 -14 133 -84 63
6756 63 159 -184 138 100 -222 -35 -98 -292 34 -43 -235 35 -299 -299 214 -207 351 254 -169 199 18 19 148
6779 148 -91 -210 -75 -93 -95 -86 -109 47 -195 -22 263 -144 -181 -89 85 233 -16 -282 256 -254 3 111 19
6802 19 5 -141 -249 133 -111 -145 123 -79 218 3 -299 369 -134 -2 146 -142 -121 254 -48 270 -70
6823 -70 -33 189 -78 -101 -41 33 -11 149 -11 109 -101 -30 -243 -76 96 -36 -264 -25 -36 334 271 201 -32
6846 -32 192 -259 271 10 -236 210 28 -11 79 -65 -28 39 -140 -125 -51 -3 182 -56 330 155 -151 84 241
6869 241 -207 127 -320 -221 102 105 10 -278 -112 257 98 1 20 -99 60 360 -256 184 -37 -48 220 123 -122
6892 -122 130 -284 -116 62 -293 76 3 171 63 28 118 89 85 130 39 -131 177 131 134 31 -172 -64 188 -75
6916 -75 39 105 -319 -57 76 -15 88 109 208 -4 -437 102 9 -82 246 -167 108 103 -136 316 67 102 412
6939 412 -244 -16 93 -96 47 -131 -191 3 -213 39 77 -205 161 -8 -51 141 75 -80 92 -162 209
6960 209 26 -218 127 -11 -248 -25 -87 -249 83 -77 166 -35 -47 -32 -87 -73 224 -10 29 17 -179 185
6982 185 -92 -301 218 -273 -230 -125 -400 205 2 -180 411 -47 143 67 -169 68 67 -306 51 121 -154 40
7004 40 -221 -301 66 112 -27 -69 -23 168 -11 -273 93 -74 -83 7 -309 59 -39 -39 186 288 -213 -9 -91 123
7028 123 226 -315 64 102 7 108 75 261 114 -129 348 25 -41 78 7 181 161 -120 457 63 -152 118
7050 118 -59 -259 397 -199 -274 170 -400 213 -171 60 150 61 11 -62 -147 288 23 -133 259 -101 -63 51
7072 51 -149 -22 -233 -246 38 -21 -30 40 -129 140 -53 -265 119 37 70 -175 -245 -184 87 -255 -22 23 -54 11
7096 11 -127 88 -51 -161 172 72 -421 208 20 -74 -225 -51 -216 -245 -33 -60 42 -107 240 124 1
7117 1 223 -169 18 118 -32 178 165 -56 308 -138 -83 255 -151 -9 -37 -275 -131 -126 -76 68 -208 -15 -140
7140 -140 -158 468 -82 10 42 -140 76 359 -295 18 -37 -5 269 114 -114 192 25 92 -76 -24 86 -115
7162 -115 -170 -61 -249 7 78 -155 -40 -75 -214 229 -45 -212 115 -304 234 33 -35 76 82 -85 74 -154
7184 -154 1 12 -249 -6 52 257 275 -58 -208 311 -151 105 190 -377 41 -17 -86 284 -125 -3 97 -154
7206 -154 200 -2 -273 195 -243 -146 -32 -249 -36 69 58 85 -37 -15 35 -233 237 99 -358 67 -12 -172
7228 -172 -51 -164 -10 42 -27 30 29 -94 29 -41 -85 -98 -97 122 150 -159 -24 -58 116 210 -82 29 171 -480
7252 -480 -113 109 -45 113 125 -96 204 -3 -42 -116 -209 63 35 -93 28 -86 -219 194 49 239 -37 -223
7274 -223 143 -99 2 195 -157 -50 100 -42 336 117 -23 210 -135 -13 -12 -129 -22 -253 -294 344 -135
7295 -135 65 114 -267 50 -161 -206 29 -136 -24 131 -197 97 75 -144 133 242 -166 336 6 -174 250
7316 250 -51 -167 209 46 25 239 -200 -20 -311 8 93 -17 -18 -76 -83 52 -200 -49 218 -97 167 87 -59
7339 -59 107 102 -201 256 -114 45 131 -326 326 192 -19 487 -146 -145 14 -156 204 -69 -170 330 72 -240
7361 -240 -4 -338 134 -139 52 -16 -10 -156 274 -152 -65 173 -233 31 98 -94 156 -25 123 8 -102 -10
7383 -10 65 -72 286 -207 -168 67 -129 117 -104 -494 -190 23 -185 196 -41 -103 84 -8 139 159 -290 190
7405 190 71 -43 243 -26 -23 147 -260 178 86 -108 310 50 -164 237 -238 -29 328 -157 105 -33 -70
7426 -70 -243 -99 193 82 -61 134 -73 -260 51 -38 -32 120 123 124 112 171 432 -156 68 238 -75 6 180 -118
7450 -118 110 -91 -101 112 -51 14 159 -66 32 36 -14 57 -72 -16 369 -171 163 -52 115 60 37 -163 199
7473 199 -55 255 118 -20 92 -12 -84 250 -4 -221 -66 -210 232 15 -157 107 -25 -289 218 50
7493 50 -91 16 -155 -34 213 -45 154 -49 101 237 17 -132 101 63 -16 144 54 412 -103 -150 83 -289
7515 -289 233 -99 -163 97 -28 -117 -71 -171 61 203 -363 -74 -190 -139 126 -50 149 -33 -12 21 -118 31
7537 31 29 -251 15 223 13 204 2 -270 -75 117 -79 138 -163 97 107 -143 33 -64 74 -50 -133 -214
7559 -214 16 -184 125 102 -72 136 -1 -108 -64 -226 170 91 -6 196 -191 -95 144 -174 -118 11 -181 204
7581 204 -218 -236 181 -34 174 76 -112 13 -111 -242 -20 149 -64 166 -292 -99 108 -137 132 114 -41
7602 -41 134 -129 24 2 -123 131 -107 -99 99 -48 -35 149 -53 344 210 -276 146 -177 -203 254 -56 -188
7624 -188 -21 -116 257 74 -152 94 125 -45 39 -113 -115 3 -10 147 81 -267 88 -180 -79 -92 -300 -37 40
7647 40 -305 59 -344 16 7 -111 -143 -6 3 145 -172 -205 263 -92 -6 364 -188 13 -324 -98 326 -166 -250
7670 -250 278 -161 -91 232 -145 -14 163 -180 118 -192 -190 5 -286 219 137 -204 -319 -67 -33 56 -348 125
7692 125 95 91 131 -58 133 235 26 31 115 -143 59 108 -202 230 -369 -141 176 -186 -55 116 55 47 -79 -270
7716 -270 -180 -161 -1 178 -146 -26 44 -312 149 97 -173 262 -275 -13 303 -239 24 -8 120 172 58 -77
7738 -77 84 -236 85 -28 -116 -91 132 -215 -27 7 19 1 -181 179 27 -136 316 -201 72 -41 -11 62 -4
7761 -4 -40 182 -190 -21 -39 -174 200 -24 -169 34 -13 4 337 -58 -63 222 -11 0 94 -192 60 -16 -328 41
7785 41 -16 48 91 -146 150 -114 -133 132 -238 136 11 -277 191 -137 -132 223 -73 -157 167 118 200 206 -47 221
7809 221 -174 51 328 48 -37 152 17 3 82 95 -88 -24 137 -5 -261 90 69 -79 -29 -94 -109 246 -139
7832 -139 -145 -250 -116 395 83 -17 393 71 55 86 -338 181 174 -196 164 15 103 91 -218 5 28 -215 84
7855 84 120 -423 -64 -286 5 -16 -249 212 258 73 129 98 78 163 15 -83 -78 -282 104 134 -66 -31 71 64 218
7880 218 -58 165 140 -229 136 -65 -60 296 -179 159 -28 -69 236 -59 -66 8 -100 84 82 -91 -72 -54 162 376
7904 376 231 168 260 -208 111 -91 -160 243 44 -26 68 -8 -106 -7 -157 273 -83 -414 -115 -320 183 75 -289
7927 -289 200 181 -67 -5 -21 155 257 67 -24 162 -133 99 -49 2 217 -76 268 326 -129 -4 -129 -160
7949 -160 291 -130 6 -95 -131 -175 95 39 259 120 -77 95 -233 74 77 -55 14 189 -48 99 -165 38
7971 38 242 -305 -89 192 -82 146 -227 -419 128 8 51 -50 -192 127 11 -268 -107 -6 -50 269 -401
7992 -401 120 184 -92 163 14 105 -4 -292 -9 41 -98 94 -92 -117 127 -181 -135 57 -218 133 378 -185
8014 -185 434 -146 -32 -11 -275 -222 120 -327 58 -6 5 -167 -147 -3 85 11 -71 60 -118 27 -127 -41 21
8037 21 -64 64 11 -59 269 -46 21 73 -53 74 124 6 -111 -26 -217 81 -18 2 131 39 202 98 125 123 -95
8062 -95 -10 252 -51 106 124 -44 259 -40 -288 119 -112 69 173 -235 221 -102 -45 282 -196 -112 259 -242
8084 -242 11 6 -156 218 202 131 170 -177 118 134 -120 404 159 -63 207 -236 53 412 -280 -186 79 -35
8106 -35 -81 -93 -86 -171 -305 -144 36 -219 9 54 -51 123 -4 141 203 -98 -63 69 -146 22 225 -46 397
8129 397 -76 -76 368 84 303 121 -272 143 -322 -83 119 -149 -29 -177 -110 -81 -236 -80 161 -151 133
8150 133 -65 -40 285 169 -39 155 -46 30 154 -296 13 18 -268 269 -101 9 -122 -61 58 181 -211 -34
8172 -34 105 -92 174 -152 -97 -83 -225 164 106 -173 74 -35 -140 115 -155 -247 51 -117 271
8191B71
##END NTUPLES=NMR FID
##END=
