##TITLE=1H_52-2021
 DMSO-d6, 8 sc, 
 6.07.2021
##JCAMPDX= 6.0         $$ Bruker NMR JCAMP-DX V2.0
##DATA TYPE= NMR FID
##DATA CLASS= NTUPLES
##ORIGIN= UXNMR, Bruker Analytische Messtechnik GmbH
##OWNER= root
$$ XWIN-NMR		Version 3.5
$$ Tue Jul  6 10:25:01 2021 Russian Standard Time (UT+4h)  she@DPX200
##.OBSERVE FREQUENCY= 200.131506
##.OBSERVE NUCLEUS= ^1H
##.DELAY= (6, 6)
##.ACQUISITION MODE= SIMULTANEOUS
##.ACQUISITION SCHEME= undefined
##.AVERAGES= 8
##.DIGITISER RES= 18
##SPECTROMETER/DATA SYSTEM= spect
##.PULSE SEQUENCE= zg30
##.SOLVENT NAME= CDCl3
##.SHIFT REFERENCE= (INTERNAL, CDCl3, 0, 15.7039)
##AUDIT TRAIL= $$ (NUMBER, WHEN, WHO, WHERE, WHAT)
$$ ##TITLE= Audit trail, XWIN-NMR		Version 3.5
$$ ##JCAMPDX= 5.01
$$ ##ORIGIN= Bruker BioSpin GmbH
$$ ##OWNER= she
$$ F:/spectra/data/she/nmr/H-F/1/audita.txt
$$ ##AUDIT TRAIL=  $$ (NUMBER, WHEN, WHO, WHERE, WHAT)
(   1,<2021-07-06 10:22:46.57 +0400>,<she>,<DPX200>,
      <created by zg, POWCHK disabled, PULCHK disabled
       configuration hash MD5:
       00 E9 B6 7A A2 85 ED C7 34 08 36 98 17 FE 4E 26
       data hash MD5: 16K
       06 52 71 63 3A 42 0A 31 F7 8F A1 CB 50 C0 66 44>)
$$ ##END=
$$ 
$$ hash MD5
$$ F6 BA 29 F6 E6 B1 51 AF 34 D2 59 53 B0 01 CA E9
##$RELAX= 
##$RELAX= 
##$RELAX= 
##$RELAX= 
##$RELAX= 
##$RELAX= 
$$ Bruker specific parameters
$$ --------------------------
##$DU= <F:/spectra>
##$EXPNO= 1
##$NAME= <H-F>
##$PROCNO= 1
##$TYPE= <nmr>
##$USER= <she>
##$AMP= (0..31)
100 100 100 100 100 100 100 100 100 100 100 100 100 100 100 100 100 100 
100 100 100 100 100 100 100 100 100 100 100 100 100 100 
##$AQSEQ= 0
##$AQ_mod= 1
##$AUNM= <au_zg>
##$AUTOPOS= <>
##$BF1= 200.13
##$BF2= 200.13
##$BF3= 200.13
##$BF4= 200.13
##$BF5= 200.13
##$BF6= 200.13
##$BF7= 200.13
##$BF8= 200.13
##$BYTORDA= 1
##$CFDGTYP= 0
##$CFRGTYP= 5
##$CHEMSTR= <none>
##$CNST= (0..31)
1 1 145 1 1 1 1 1 1 1 1 1 1 1 1 1 1 1 1 1 1 1 1 1 1 1 1 1 1 1 1 1 
##$CPDPRG= <>
##$CPDPRG1= <>
##$CPDPRG2= <>
##$CPDPRG3= <>
##$CPDPRG4= <mlev>
##$CPDPRG5= <mlev>
##$CPDPRG6= <mlev>
##$CPDPRG7= <mlev>
##$CPDPRG8= <mlev>
##$CPDPRGB= <>
##$CPDPRGT= <>
##$D= (0..31)
0 1.2 0 0 0 0 0 0 0 0.06 0 0.03 0 0 0 0 0.0002 0 0 0 0 0 0 0 0 0 0 0 0 
0 0 0 
##$DATE= 1625552565
##$DBL= (0..7)
120 120 120 120 120 120 120 120 
##$DBP= (0..7)
150 150 150 150 150 150 150 150 
##$DBP07= 0
##$DBPNAM0= <>
##$DBPNAM1= <>
##$DBPNAM2= <>
##$DBPNAM3= <>
##$DBPNAM4= <>
##$DBPNAM5= <>
##$DBPNAM6= <>
##$DBPNAM7= <>
##$DBPOAL= (0..7)
0.5 0.5 0.5 0.5 0.5 0.5 0.5 0.5 
##$DBPOFFS= (0..7)
0 0 0 0 0 0 0 0 
##$DE= 6
##$DECBNUC= <off>
##$DECIM= 32
##$DECNUC= <off>
##$DECSTAT= 4
##$DIGMOD= 1
##$DIGTYP= 9
##$DL= (0..7)
0 120 120 120 120 120 120 120 
##$DP= (0..7)
150 150 150 150 150 150 150 150 
##$DP07= 0
##$DPNAME0= <>
##$DPNAME1= <>
##$DPNAME2= <>
##$DPNAME3= <>
##$DPNAME4= <>
##$DPNAME5= <>
##$DPNAME6= <>
##$DPNAME7= <>
##$DPOAL= (0..7)
0.5 0.5 0.5 0.5 0.5 0.5 0.5 0.5 
##$DPOFFS= (0..7)
0 0 0 0 0 0 0 0 
##$DQDMODE= 0
##$DR= 18
##$DS= 0
##$DSLIST= <SSSSSSSSSSSSSSS>
$$ [...]
##$SUBNAM2= <"">
##$SUBNAM3= <"">
##$SUBNAM4= <"">
##$SUBNAM5= <"">
##$SUBNAM6= <"">
##$SUBNAM7= <"">
##$SUBNAM8= <"">
##$SUBNAM9= <"">
##$SW= 20.0188882624521
##$SWIBOX= (0..15)
0 0 2 0 0 0 0 0 0 0 0 0 0 0 0 0 
##$SW_h= 4006.41025641026
##$TD= 16384
##$TD0= 1
##$TE= 0
##$TE2= 300
##$TE3= 300
##$TEG= 300
##$TL= (0..7)
0 120 120 120 120 120 120 120 
##$TP= (0..7)
150 150 150 150 150 150 150 150 
##$TP07= 0
##$TPNAME0= <>
##$TPNAME1= <>
##$TPNAME2= <>
##$TPNAME3= <>
##$TPNAME4= <>
##$TPNAME5= <>
##$TPNAME6= <>
##$TPNAME7= <>
##$TPOAL= (0..7)
0.5 0.5 0.5 0.5 0.5 0.5 0.5 0.5 
##$TPOFFS= (0..7)
0 0 0 0 0 0 0 0 
##$TUNHIN= 0
##$TUNHOUT= 0
##$TUNXOUT= 0
##$USERA1= <user>
##$USERA2= <user>
##$USERA3= <user>
##$USERA4= <user>
##$USERA5= <user>
##$V9= 5
##$VALIST= <valist>
##$VCLIST= <CCCCCCCCCCCCCCC>
##$VD= 0
##$VDLIST= <DDDDDDDDDDDDDDD>
##$VPLIST= <PPPPPPPPPPPPPPP>
##$VTLIST= <TTTTTTTTTTTTTTT>
##$WBST= 1024
##$WBSW= 4
##$XGAIN= (0..3)
0 0 0 0 
##$XL= 0
##$YL= 0
##$YMAX_a= 138412
##$YMIN_a= -214530
##$ZGOPTNS= <>
##$ZL1= 120
##$ZL2= 120
##$ZL3= 120
##$ZL4= 120
##$ABSF1= 10
##$ABSF2= 0
##$ABSG= 5
##$ABSL= 3
##$ALPHA= 0
##$AQORDER= 0
##$ASSFAC= 0
##$ASSFACI= 0
##$ASSFACX= 0
##$ASSWID= 0
##$AUNMP= <proc_1d>
##$AZFE= 0.1
##$AZFW= 0.1
##$BCFW= 1
##$BC_mod= 2
##$BYTORDP= 1
##$COROFFS= 0
##$CY= 11.3945322036743
##$DATMOD= 1
##$DC= 2
##$DFILT= <>
##$DTYPP= 0
##$F1P= 15.9154993809931
##$F2P= -4.1035820241983
##$FCOR= 0.5
##$FTSIZE= 0
##$FT_mod= 4
##$GAMMA= 1
##$GB= 0.15
##$INTBC= 1
##$INTSCL= 1
##$ISEN= 128
##$LB= 0.24
##$LEV0= 0
##$LPBIN= 0
##$MAXI= 10000
##$MC2= 0
##$MEAN= 0
##$ME_mod= 0
##$MI= 1.114404
##$NCOEF= 0
##$NC_proc= 0
##$NLEV= 6
##$NOISF1= 3.799351
##$NOISF2= 2.8
##$NSP= 1
##$NTH_PI= 0
##$NZP= 0
##$OFFSET= 15.70392
##$PC= 1
##$PHC0= -11910.12
##$PHC1= -2.199011
##$PH_mod= 1
##$PKNL= yes
##$PPARMOD= 0
##$PSCAL= 0
##$PSIGN= 0
##$REVERSE= no
##$SF= 200.130013532006
##$SI= 16384
##$SIGF1= 3
##$SIGF2= 2
##$SINO= 400
##$SIOLD= 16384
##$SREGLST= <1H.CDCl3>
##$SSB= 0
##$STSI= 0
##$STSR= 0
##$SW_p= 3612.71676300578
##$SYMM= 0
##$S_DEV= 0
##$TDeff= 0
##$TDoff= 0
##$TI= <>
##$TILT= no
##$TM1= 0
##$TM2= 0
##$TOPLEV= 0
##$USERP1= <user>
##$USERP2= <user>
##$USERP3= <user>
##$USERP4= <user>
##$USERP5= <user>
##$WDW= 1
##$XDIM= 8192
##$YMAX_p= 0
##$YMIN_p= 0
$$ End of Bruker specific parameters
$$ ---------------------------------
##NTUPLES= NMR FID
##VAR_NAME=  TIME,          FID/REAL,        FID/IMAG
##SYMBOL=    X,             R,               I
##VAR_TYPE=  INDEPENDENT,   DEPENDENT,       DEPENDENT
##VAR_FORM=  AFFN,          ASDF,            ASDF
##VAR_DIM=   8192,          8192,            8192
##UNITS=     SECONDS,       ARBITRARY UNITS, ARBITRARY UNITS
##FACTOR=    0.0002496,     1,               1
##FIRST=     0,             0,               0
##LAST=      2.0444736,     0,               0
##MIN=       0,             -214530,         0
##MAX=       2.0444736,     138412,          0
$$ Real data points
##PAGE= N=1
##DATA TABLE= (X++(R..R)), XYDATA
$$ [...]
1836b87K36J37R3k2p6j16O9j42J46k12K16q6o0K00k42L03k57R2k3K2n7j04M29
$$ -287 -51 86 179 157 81 -35 34 -108 38 -174 42 -44 -104 96 -146 157 -100 -8 -31 -9 -66 -170 259
1859B59m12j03J75J28k98M69l10kK07k89K27M8j50Q8j2k17L94m90J70K13q5q5
$$ 259 -153 -256 -81 47 -251 218 -92 -94 113 -176 51 99 -51 37 25 -192 202 -288 -118 95 10 -75
1881g5Q8L2j86N3j3M01m65K93j40L64l04O9j24o0L20m20Q4O7m3r0k8J64K49M7
$$ -75 13 45 -141 -88 -101 300 -165 128 -12 352 48 117 -7 -67 253 -167 -83 -16 -59 -149 -177 -13 236 283
1905B83l75R2j61L14l31L23k70K48j03j36K38j72o5J50pK90o6n96L43j2k04K81
$$ 283 -92 0 -161 153 -178 145 -125 123 20 -116 122 -50 -115 35 28 318 252 -344 -1 -13 -217 64
1927F4o4o3J3j49L87j05N5l40Q0J74m8O2Rn53O40j07j96n9L17j63j31J4J25j08
$$ 64 0 -63 -50 -199 188 83 138 -202 -122 52 4 66 75 -478 162 55 -141 -200 117 -46 -177 -163 -38 -146
1951a46K8L1q1Q3l4K31l28J95k26K18nK38k79o4J39j8O1l33K16j09M18m09L03
$$ -146 -118 -87 -168 -85 -119 112 -216 -21 -247 -29 -34 204 -75 -139 0 -18 43 -290 -74 -183 235 -174 129
1974A29J02j02k01J87j30l7J2J11j20K99j59j50QL4N3j25J09M8N1o3K3m8P4k59
$$ 129 231 129 -72 115 -15 -52 -40 71 -49 250 91 -59 -51 -17 36 -89 20 68 119 56 79 31 105 -154
1998a54M7J30K8L3j29J03K59k36n0j69L6K8k22N71k22k01O0q7M4K35k06J62j18
$$ -154 -107 23 51 84 -45 58 317 81 31 -138 -102 -74 -296 275 53 -148 -88 -175 -131 104 -102 60 -58
2021e8k4Q3r1K03j68q6ML51l47J38J2N0k7K54j78k03J32j77rK47j32l06J17J41
$$ -58 -82 1 -90 113 -55 -141 -137 214 -133 5 17 67 40 294 116 -87 45 -132 -141 106 -26 -332 -215 -74
2045g4J85mJ3Kl11J7J10K13k17J43k39j15M9N2J60m1L33k51k39K75j41lK04J91
$$ -74 111 107 120 122 -189 -172 -62 151 -66 77 -162 -277 -228 -176 -16 -57 276 25 -214 61 -80 -83 121 312
2069C12l77N8k60J95Q5O6k13P9Q8j09j50n0Q8R3J07kJ11j69K5K80j11m02J44K48
$$ 312 -65 -7 -267 -72 13 79 -134 -55 33 -76 -226 -276 -188 -95 12 10 121 -48 -23 257 146 -256 -112 136
2093A36r0RJ24n56M68q2r5J73J37l78K27k27n6J65K94j11k75O3P5l31J71J14L6
$$ 136 46 55 179 -377 91 9 -86 87 224 -154 73 -154 -210 -45 249 138 -137 -74 1 -330 -159 -45 -9
2116ip1Q5j77m6J75J08P0k89J46Jj69J81J75l52K01j66j20R2N6j5M0K87l94J31
$$ -9 -80 5 -172 -218 -43 65 135 -154 -8 -7 -176 5 180 -172 29 -137 -257 -165 -109 -124 -84 203 -191 -60
2140f0K01O9o1J46j57l8L85m22k80J31K38j05J22q6k08N32n03J32o8j04J14l1
$$ -60 141 210 149 295 138 100 485 63 -217 -86 152 47 169 83 -125 407 -96 36 -32 -136 -22 -53
2162e3l5M06k40l8o4J84k59L47k86q5K09k96K75l65L48m6j96K11J6j46O3Oq7k5
$$ -53 -88 318 78 40 -24 160 -99 248 -38 -123 86 -210 65 -300 48 2 -194 17 33 -113 -50 -44 -131 -156
2186a56K50k8k41o7L51k26J14j48K76n4Q0k32P4m4Q3K10m46J27n5J64k12J04R9
$$ -156 94 66 -175 -242 109 -117 -3 -151 125 71 151 -81 -7 -51 32 242 -204 -77 -132 32 -180 -76 23
2209B3Q8r0M6j89J16L10l40j58L01q0O1j46J68k24l3J94n7rn1n3J29J39L1J3k02
$$ 23 111 21 67 -122 -6 304 -36 -194 107 27 88 -58 110 -114 -147 47 -10 -19 -70 -123 6 145 176 189 -13
2234a3K6j02JP0J60k32n5J94K25n04M9J26Q9J34l3k39K86k34K38l91K61K03l97
$$ -13 13 -89 -88 -18 142 -90 -145 49 274 -230 -181 -55 34 168 135 -104 182 -52 186 -205 56 259 -138
2257a38J63k0ml44J78K29M2K27k46k21nJ2J68j48L89l99L18j42L2o0P5j51l4J06
$$ -138 25 5 1 -343 -165 64 106 333 87 -134 -139 -127 41 -107 282 -117 201 59 91 31 106 -45 -79 27
2281B7j76m3K24l7j22JR7l3J63P0j08O3O7L6j61J3K7l18L23k25p9L8M15k41k5
$$ 27 -149 -192 32 -5 -127 -126 -29 -62 101 171 63 126 193 229 68 81 108 -210 113 -112 -191 -153 262 21 -4
2306dj33K72j53l9K52k13L55k20k7j22P5J54k9j04o2R7r6j91L38r3K47j32j27
$$ -4 -137 135 -18 -57 195 -18 337 117 90 -32 43 197 168 64 2 99 3 -188 150 57 304 172 45
2329D5j52K09l87J45K10j15P8j63J07j05J65Kq1j05L1j6J23J47j55P2o3J86k02
$$ 45 -107 102 -285 -140 70 -45 33 -130 -23 -128 37 39 -42 -147 -116 -132 -9 138 -17 55 -8 178 -24
2352b4M4k93L96j89r1J2L12j67kMq5O3j95L38k69K88k36m4K41j00o4O0J69k99
$$ -24 20 -273 123 -66 -157 -145 167 0 -2 2 -83 -20 -215 123 -146 142 -94 -138 103 3 -61 -1 168 -131
2376a31L30o6m2j66O7k63K13j66J78K10j61k41J06L86l77J66j31J93J06M1j49
$$ -131 199 133 91 -75 -8 -271 -58 -224 -46 164 3 -238 -132 254 -123 43 -88 105 211 252 103
2397A03k58n8K58R0m1r2J04j49J59m5P8k1k5j71J87k17J3o3J11k7N1M5j17J95
$$ 103 -155 -213 45 135 94 2 106 -43 116 71 149 128 103 -68 119 -98 -85 -148 -37 -64 -13 32 -85 110
2421A10q8q3o3L22k21kJ31k5o8K96m57K94r1K83l41j32J25k9o4kJ14j59M83j82
$$ 110 22 -61 -124 198 -23 -25 106 81 13 309 -148 146 55 338 -3 -135 -10 -39 -103 -105 9 -150 333 151
2445A51j94J14l56L42o9R0L5p9j35J28r0J92J82m62M75l41j44L53k52Q3n2M0R5
$$ 151 -43 71 -285 57 -12 78 113 34 -101 27 -63 129 311 -151 324 -17 -161 192 -60 23 -29 11 106
2468A06q8J9j6j76K44k01R3L2OPq4%J80q8p0R0p1R5j15J27k15r0K93p0ml4j72
$$ 106 18 37 21 -155 89 -112 -19 13 19 26 -58 -58 122 34 -36 54 -17 78 -37 90 -125 -215 78 8 4 -30 -202
2495b02J25K30j40K35j40j2l16J03j5N0Q8K55k38j19L3n2J93j36J03L4J63k37
$$ -202 -77 153 13 248 108 96 -220 -117 -132 -82 6 261 23 -96 -63 -115 78 -58 45 79 242 5
2517EQ0l8J0j11J59q3J19p8Q5j64j20m6J80k3J33K9j73J06k38K35J1k30R4j35
$$ 5 85 47 57 -54 105 22 141 63 148 -16 -136 -182 -2 -25 108 137 -36 70 -168 67 78 -152 -58 -193
2541a93j16L24K05l43O9K54o0m31N37k04l9J50j19P3j32k2J9k5O1M1k43R6L03
$$ -193 -309 15 220 -123 -54 200 140 -291 246 42 3 153 34 107 -25 -47 -28 -53 8 49 -194 -98 205
2564B05k26j36m9q3L16Ll4n4P6k18L71l13K5J50l8Q9r4J16k19K08o3j97K03K1
$$ 205 -21 -157 -206 -289 27 30 -4 -58 18 -200 171 -142 -117 33 -5 84 -10 106 -113 95 32 -165 38 59
2588E9n8j11J11L66m52MQ1K89k40r4J67k19k7L08n2k50R6K37rj61q0n9K28J22
$$ 59 1 -110 1 367 -85 -81 0 289 49 -45 122 -97 -124 184 132 -118 -22 215 206 45 -35 -94 134 256
2612B56m37L5J94j21k8K6P5P1O2j27J03k77J91j90J11J21J07j96k8J95p6j89J2
$$ 256 -181 -146 48 -73 -101 -75 0 71 133 6 109 -168 23 -167 -56 65 172 -24 -52 143 67 -122 -110
2635a10%L5N1N7m5r9J03K46l15M7k22J87J36P7J06k43J2k28k13M00P7k39L31k78
$$ -110 -110 -75 -24 33 -12 -111 -8 238 -77 -30 -252 -65 71 148 254 11 23 -205 -418 -18 59 -180 151 -127
2659a27K43j44J03K49l41j5L7o8j47L62o1j56kj07J83o9K18R9j70N8j79Q0K3j15
$$ -127 116 -28 75 324 -17 -32 5 -63 -210 152 91 -65 -67 -174 9 -60 158 257 87 145 -34 46 69 -46
2683d6L2p9L5k27M49k13L62k18j03P0K58k56J53O6m06N58p53K66J6R8j06Q4l2
$$ -46 -14 -93 -58 -285 164 -49 313 95 -8 62 320 64 217 283 -123 435 -318 -52 -36 62 -44 40 8
2706Hk28L72j38NqJ44j31J9o6Q9R5l8j91n7o3L63J69m59L16k65J6o4J68m3O9k33
$$ 8 -220 152 14 19 11 155 24 43 -23 66 161 123 -68 -125 -188 175 344 -115 201 -64 -48 -112 56 13 82 -151
2732a51N3J99j52L1k35L07L55l51P6l44P9L07K9k57L11l53N8J70j26K23l81J98
$$ -151 -98 101 -51 -20 -255 52 407 56 132 -212 -133 174 203 -54 257 -96 -38 132 6 229 -152 46
2754D6k88L47k65K43n3n0o2ml6L10P7j01l52L3L6mJ87K10q8k83N8OL1R5J4o1J81
$$ 46 -242 105 -160 83 30 -20 -82 -86 -122 188 265 164 -188 -155 -119 -123 64 274 186 -97 -39 -33 -2 93 107 46 227
2781B27l74l8L61o7l5k36K60o5J2pp4J68j01R9p0j3K27j59k28K01j50N7KJ74j
$$ 227 -147 -185 176 109 74 -162 98 33 45 38 -36 132 31 130 60 47 274 115 -113 88 -62 -5 -3 171 170
2806A70j48R8k68K32l10L04J6P3j42J41l87J77J70j66L3K41m14M33k80lJ37Qk49
$$ 170 22 120 -148 84 -226 78 94 167 25 166 -221 -44 126 -40 -7 234 -180 253 -27 -30 107 115 -134
2829a34p6L23l27J19M24l44K17n10L57l71K39M7K06n31M76m1j80Q6Q5J85j57k74
$$ -134 -210 113 -214 -95 329 -15 202 -308 49 -322 -83 -36 170 -361 115 74 -106 -20 65 250 93 -181
2851a81K30J07j83Q6l34N67k58J41J19m85L20j79r2R7mK72m64J63L3K82l22pj45
$$ -181 49 156 -27 59 -275 292 34 175 294 -191 129 -50 -142 -45 -49 223 -241 -78 -45 237 -85 -92 -237
2874b37J27j09J56K51m22R3J66r1K94l07J01p7N4nK82l1ol67K90j01pn9J27m5
$$ -237 -110 -219 -63 188 -234 -141 25 -66 228 -79 22 -55 -1 -6 276 245 239 -128 162 61 54 -5 122 77
2898G7Q9m94J87J89l10K84k04K46p7P1k65J33K32Jk25J6l7J45J22k69L35l78J53
$$ 77 166 -328 -141 48 -262 22 -182 64 -13 58 -207 -74 158 159 -66 -50 -87 58 180 -89 246 -132 21
2921B1Q9Lj07KL8p1R0J19j70R4Q5M7k28N4p4Ll9J65k39J54O0k83K36p1k41J07
$$ 21 110 113 6 8 46 -25 65 184 14 108 193 240 12 66 -8 -5 -44 121 -118 36 96 -187 49 -22 -263 -156
2947a56K48k83J42j49K51n6O6P2k87j61L20j01L08m33l2M38j72j65Q8r8j63N17
$$ -156 92 -191 -49 -198 53 -3 63 135 -152 -313 7 -94 214 -219 -251 187 15 -150 -62 -160 -323 194
2969A94k62l2J9K58k18j87L49l27K32R3j23j96J09K55J74k74Lr7p8J3K2K18j23
$$ 194 -68 -100 -81 177 -41 -228 121 -206 26 119 -4 -200 -91 164 338 64 67 -30 -108 -95 -73 145 22
2992B2j83L12q9J08k71J01j45K25NN6j54J21j73j21K16k22R0%K05qL7m35J14q
$$ 22 -161 151 62 170 -101 0 -145 80 85 141 -13 108 -65 -186 30 -192 -102 -102 103 95 132 -303 -189 -197
3016a97N21m37k9J98K57l32p6K55l67M23j51R0K0j59J0l4O2R7k49o7J57L24l53
$$ -197 324 -113 -142 56 313 -19 -95 160 -207 216 65 155 175 16 26 -8 54 151 -98 -165 -8 316 -37
3039c7J39j52j36R8J75J8j15M7k6j30k68L13j44J26J09j28j8J64k84J79QO1L95
$$ -37 102 -50 -186 -88 87 105 -10 37 11 -119 -387 -74 -218 -92 17 -111 -129 35 -249 -70 -62 -1 394
3062C94l22k38L66r0j53K22j11J22k19J0R0j68J02O5K34k91O5j77j09J77r0K3
$$ 394 72 -166 200 110 -43 179 68 190 -29 -19 71 -97 5 70 304 13 78 -99 -208 -31 -121 -98
3084i8J68j11j8p8J02%j9J72k6K6p7OL4n4J01J19j93J10l41J2L02L0q6o0J70j38
$$ -98 70 -41 -59 -137 -35 -35 -54 118 92 118 41 47 81 27 128 247 54 164 -177 -165 137 167 81 21 191 53
3110E3j50K21l67K73j94J02lP0K3P0K7k06J9q0N9k47J62K57Rk46J80o0k49K42
$$ 53 -97 124 -243 30 -164 -62 -65 5 28 98 125 -81 -62 -142 -83 -330 -168 89 98 -148 32 -28 -277 -35
3134c5J29pj28l7K24k12J18J8j32K04k37K02k80K00k58J20J97m51M54j92R0j19
$$ -35 94 87 -41 -78 146 -66 52 70 -62 142 -95 107 -173 27 -231 -111 86 -365 89 -103 -13 -132
3156a32J25p5K91j85O0j1j10J49j48O8L4N9j56J78p5J42q5j17O4q9J51j7P0m15
$$ -132 -7 -82 209 24 84 73 -37 112 -36 32 66 125 -31 147 72 214 129 12 76 -13 138 121 191 -224
3180b24K37K21j62k16K60j19j16L20j12l9k18L04k01K62m54K37J07K00k25l29
$$ -224 13 234 72 -144 116 -3 -119 201 89 50 -168 136 -65 197 -257 -20 87 287 62 -267
3200b67O2M89p7j91o2K70k99K51k61rlJ97j87O6K24k39kJk9K83pJ72p2l04k9J94
$$ -267 -205 284 207 16 -46 224 -75 176 -85 -94 -97 100 -87 -21 203 -36 -38 -37 -66 217 210 382 310 6 -23 171
3226A71j63k49J94j47J68j17K29K2m0k7j41J93J02k97R8J04O8R9n9j63j29J05
$$ 171 8 -241 -47 -194 -26 -143 86 108 68 41 -100 93 195 -102 -4 100 168 267 208 45 -84 21
3248B1p0N7J20J7J71k43Q8j31L87n14o0J67J54k94l0K14j87J38L1r0K30l21K73
$$ 21 -49 8 128 145 316 73 161 30 417 -97 -157 10 164 -130 -160 54 -133 5 36 -54 176 -145 128
3271A28n9O6J15m03K27Olj87J18m6K21k01J89p0mk61j8K0J67J5l8o0Lk5K67k62
$$ 128 69 135 250 -153 74 80 77 -110 8 -38 183 -18 171 101 97 -164 -182 -162 5 20 -18 -78 -75 -100 167 -95
3297i5J23Q1kPk33n9L42J99m26j36L52l78M33N0r9j89j67J35P1j12K04k70K73
$$ -95 28 109 107 114 -119 -178 164 363 -63 -199 153 -225 208 258 159 -30 -197 -62 9 -103 101 -169 104
3320A04j57M4J9K7J26k93J93q0M1r5J71J3l21L98k49Q2J66r7l87L08j17J27l53
$$ 104 -53 -9 10 37 163 -130 63 -17 24 -71 100 113 -208 190 -59 23 189 92 -295 13 -104 23 -330
3343c30N14l40M5K07k68K93J04k53j68K7L16j05p5Pj02K12j06RL8j36J99k18M15
$$ -330 184 -156 -111 96 -172 121 225 -28 -196 -169 147 42 -33 -26 -128 84 -22 -13 25 -111 88 -130 285
3366B85r8l2R2j13J14j71q6P4j32p1K06PNj21k34M61j51j50P1Q4J84l43J28Q4
$$ 285 187 155 247 134 248 77 -9 65 -67 -138 68 75 80 -41 -275 186 35 -115 -44 40 224 -119 9 93
3390I3l55L69L8j84J27o3K8m1J0J06k44q3K30l31J64N5K65l16M1J48r5o6K64k23
$$ 93 -262 107 145 -39 88 25 53 12 22 128 -116 -199 31 -300 -136 -81 184 -132 -91 57 -38 -104 160 -63
3414f3J61J73k17K7R6M4l21J13j67K33l6J42k12j10j4L13k3j01n5K15k76M1K30
$$ -63 98 271 54 81 177 221 -100 13 -154 79 43 185 -27 -137 -151 162 139 38 -17 198 -78 -37 193
3437A93M18q45L49r0q0M5j08J26R8q7j67K89l05K73J44q2r2L2j26J52j89P4K11
$$ 193 611 -234 115 25 -55 -10 -118 8 106 19 -148 141 -164 109 253 171 79 111 -15 137 -52 22 233
3460B33k49l8oJ49j41L5j19J92n3k30J79K0L37k74j53K02o2J90l40J84r5p4R8
$$ 233 -16 -54 -60 89 -52 -17 -136 56 3 -227 -48 -28 309 35 -118 84 22 212 -128 56 -39 -113 -15
3483a5n7n6K4K21P7l47J79m0L5l75N00j2j60m9K48m20K92M9j84J52j36J63J00
$$ -15 -72 -128 -104 117 194 -153 26 -14 21 -354 146 134 -26 -75 173 -247 45 94 -90 62 -74 89 189
3506A89l04L24j42k51J5j4j54J86j18L92j63R8J22j28j15J90J74m95J8J29R9K1
$$ 189 -115 209 67 -184 -169 -183 -337 -151 -269 123 -40 58 180 52 -63 127 301 -194 -176 -47 52 73
3528G3J12M2j8k35J2K6Q1Q1J73n34L49r8Nr1J16J2k40M31j10q5j79M1NJ30k69
$$ 73 185 227 209 -26 -14 12 93 174 347 -187 162 64 69 -22 94 106 -134 297 187 102 -77 -36 -31 99 -170
3553a70J64J6j23J2L29l12j00J55J84j27n8L2j53K15n7r1J93j43M7P1l79K26j74
$$ -170 -6 10 -113 -101 228 -84 -184 -29 155 28 -30 2 -151 64 7 -84 109 -34 13 84 -295 -69 -243
3576b43k2J78K01j93N7l3J1P1k82K32J31n31L51o9J51J33J79q2l65L02R5k04j97
$$ -243 -265 -87 114 -79 -22 -55 -44 27 -255 -23 108 -423 -72 -141 10 143 322 240 -125 177 272 68 -129
3599a29K00k7m5q0R9n4J79L5Rl06K13M2p0j24m4K61l35n3K64R7n6j42j0j5J3P2
$$ -129 71 44 -1 -81 18 -36 143 178 187 -119 94 136 66 -58 -102 159 -176 -229 35 132 76 -66 -76 -91 -78 -6
3625fJ51j94R2N2q7L8l28L42o8k02L60j88J9p4K56k80K19k59j4J90m2M7J15l77
$$ -6 145 -49 43 95 8 46 -282 60 -8 -210 150 -38 -19 -93 163 -117 102 -157 -171 19 -23 24 139 -238
3649b38N0J61Kj61J34J23J48n16K23J74P7jj84j35P7L85m90M41k33J26o3j58M06
$$ -238 -188 -27 -25 -186 -52 71 219 -297 -74 100 177 176 -8 -143 -66 319 -171 270 37 163 100 -58 348
3672C48j90l03L44l63L33k08K19p6k19K78l23J98k3n5J35l49J97l8R0J7j73n9
$$ 348 158 -145 199 -164 169 -39 180 104 -115 163 -160 38 15 -40 95 -254 -57 -95 -5 12 -161 -220
3694b20L04k80K19J09j69L02j56j41r0N36l73J48l23K02l24K67k7L1k7P6k88J55
$$ -220 84 -196 23 132 -37 265 109 -32 -122 414 41 189 -134 68 -256 11 -16 15 -12 64 -224 -69
3716f9M9J96K4k38J6L6k9J53O4j19J26l75J33k26L16p6K20mj53j50j24M00l48
$$ -69 -20 176 200 -38 -22 14 -15 138 202 83 209 -166 -33 -259 57 -19 201 197 44 -106 -230 170 -178
3739a78J39j31P8l3P7l3K41j19j30K18j05L3j13K21k07L0k25L09K11p9k89l4M08
$$ -178 -39 -170 -92 -125 -48 -81 160 41 -89 129 24 57 -56 165 -42 -12 -237 72 283 204 -85 -119 289
3762B89m36R0J34o9k64M47l2k35J78q4R6j97P5K66j80k37k6K84l7j41R3j08Q2
$$ 289 -147 -57 77 8 -256 191 159 -76 102 18 114 -83 -8 258 78 -159 -185 99 62 -79 14 -94 -12
3785a2J4K80l14K46m38J00m7K61L6j76N7j11K93j87Q6M4nl14L04n5K65n37K77
$$ -12 2 282 -32 214 -224 -124 -171 90 126 -50 7 -104 189 2 88 132 127 -187 117 62 327 -210 67
3808F7j19O6P0j80k7l9L40j41l1k12K77k2k35M7K57k57L8J04r8R3j7J67k80N4
$$ 67 -52 14 84 -96 -123 -162 178 37 6 -206 71 49 -186 -139 118 -139 -101 3 -95 -2 -19 148 -132 -78
3832g8K21r1p3j36J76K02k74K5M11k92j93J79l55K87j3k09K0l9K85p3P3N6k22
$$ -78 143 52 -21 -157 19 221 -53 -28 383 91 -102 77 -278 9 -4 -213 -193 -232 53 -20 53 109 -113
3855a13L84l86j87L60j9J73L4k45M2K79k97L3L7l30L46k14K02j06k35O3J87j5
$$ -113 271 -115 -302 58 39 212 246 1 43 322 25 58 95 -235 111 -103 99 -7 -242 -179 8 -7
3877gJ29k83J85J98l29K61k76M21m11K51j72M1j98P4K47lk02N2p0k53K46J52J03
$$ -7 122 -161 24 222 -107 154 -122 299 -112 139 -33 8 -190 -116 131 128 -74 -22 -92 -345 -99 53 156
3900A56n3j57j83K46K35l79K78l14K60K11p0j31Rk20K18o6k5j46O8nL74j80j65
$$ 156 103 -54 -237 9 244 -135 143 -171 89 300 230 99 108 -112 106 40 15 -131 -63 -68 306 126 -39
3923c9Q4k64K74j56J60j30K78k64L00l49Q2r2o3L25Q4m69Q7L30m90M29k79lK22
$$ -39 45 -219 55 -101 59 -71 207 -57 243 -106 -24 -116 -179 146 230 -239 -152 178 -312 117 -162 -165 57
3946E7n5K12j40j02p9J83p2l03Q9J57N4m6O4o7lR0L2L6j64O7j40J61j07k60M26
$$ 57 2 214 74 -28 -107 76 4 -299 -210 -53 1 -45 19 -48 -51 39 71 107 -57 10 -130 31 -76 -336 90
3971I0q4P6j30kj65N01k84j7J64l48M8J90k4k52L33O8l16L90m1k94L39n23L12
$$ 90 6 82 -48 -50 -215 286 2 -15 149 -199 -151 39 15 -237 96 164 -152 238 197 -97 242 -281 31
3994C1m9k7j3Q8j70oK20n0q1L73m52J47p3J50k26q6K02r8N6m6J34r5K79k78L62
$$ 31 -18 -45 -58 30 -140 -146 74 24 -57 316 -136 11 -62 88 -138 -224 -22 -120 -64 -110 24 -71 208 -70 292
4019B92j49j55kJ75k85j86M46n43M63J64j9k15k79J15M09l78K6KJ62j7nP0k08
$$ 292 143 -12 -14 161 -124 -310 136 -407 56 220 201 -14 -293 -178 231 -147 -121 -119 43 26 21 91 -117
4042a17q6J53k83K71L78l59j1K3m8J18N8J77Ll76J65j20L53m55j29J92p0K89m4
$$ -117 -203 -50 -333 -62 316 -43 -54 -31 -79 39 97 274 277 -99 66 -54 299 -156 -285 -93 -163 126 82
4065H2k96K71q6n3J17J85l54Q0k45M17R2m11J03N4J32n4k18J3K65k70K63n15N13
$$ 82 -214 57 -29 -82 35 220 -134 -54 -299 118 210 -201 -98 -44 88 34 -184 -171 94 -176 87 -428 85
4088H5j79K6M0J1j0j63R0K36rj81J0J78P5l35Q9j2P6J50k53O9M3j87K32m5J11
$$ 85 -94 -68 -28 -17 -27 -190 -100 136 127 -54 -44 134 209 -126 -37 -49 27 177 -76 -7 36 -151 81 36 147
4113A47k30L5J80l15K17m5K64j37k62q9K82nL3j21%K61j40p5q8J60k70K21J69
$$ 147 -83 -48 132 -183 34 -11 253 116 -146 -235 47 42 75 -46 -46 215 75 0 -88 72 -198 23 192
4136A92ON1k74k27K53p7Q6m6L1L95n78N36m61J92j29K21m33n6K02J42J01rj41
$$ 192 198 249 -25 -252 1 -76 10 -36 -5 390 -188 348 -113 79 -50 171 -262 -318 -116 26 127 118 -23
4159b3L31P7o24N83l58M1qpM9k06o0J59j9L59k13j29M7o1J16l45M31k61N3K04
$$ -23 308 385 -239 344 -14 27 19 12 61 -145 -205 -46 -65 294 81 -48 -1 -62 54 -291 140 -121 -68 136
4183A36l29J44L5k46J20J93Q2k94L22l07J61j25q7K83j28Nj15L00m16M05l4R8
$$ 136 -193 -49 -14 -260 -140 53 135 -159 163 -144 17 -108 -195 88 -40 -35 -150 150 -266 139 105 203
4205B03k57P3j18O9J34j57N8j44J89k14K09O0k4M4l39j09J5L41j9J40k13PK0q8
$$ 203 -54 19 -99 -30 104 -53 5 -139 50 -164 45 105 81 125 -214 -323 -308 33 14 154 -59 -52 -32 -120
4229a20J67j7n8M2j10j7L41k02k79Q7M89m4j39k46K79j21l57K66K02J06m29K88
$$ -120 47 30 -28 14 -96 -113 228 26 -253 -166 323 279 140 -106 173 52 -305 -39 163 269 -160 128
4251A28k31J38O1L6O1l90K61qj26j97J62Q0j60L82k62K90k41p6J56k02R6k60L01
$$ 128 -103 35 96 132 193 -197 64 56 -70 -267 -105 -25 -185 197 -65 225 -16 -92 64 -138 -42 -302 -1
4274aq4K4j94K48j04K88p7n4M0j17K34l8o5j02J76J11m32K95l89L89l42J33J32
$$ -1 -85 -61 -255 -7 -111 177 100 46 86 -31 203 165 100 -2 174 285 -147 148 -241 148 -194 -61 71
4297G1J94r5o9J13k71Q4k87M26j69P5o4k04K93j25m0K61j93J97k36j36J77M0j71
$$ 71 265 170 101 214 -57 27 -260 166 -3 72 8 -196 97 -28 -68 193 0 197 -39 -175 2 42 -129
4320a29Q5k6pK3O6P7l2k39J90m8k35K00J46q4j01l6J36j30j2J49L30k86P9l76
$$ -129 -44 -70 -77 -54 12 89 57 -182 8 -40 -275 -75 71 -13 -114 -150 -14 -144 -156 -7 323 37 116 -260
4344b60J36L59j69j0o6L1k90J37P6P9m6l8l2J88j42j56K26L0jpk2k92M93m64O17
$$ -260 -124 235 66 56 -10 21 -269 -132 -56 23 -23 -61 -93 95 -47 -203 23 53 52 45 23 -269 224 -240 377
4369C77o19K77p3J91N1j53L35m68qp9K36K38j79m34M47q6n4j64L81k64l4K40k26
$$ 377 -242 35 -38 153 204 51 386 -82 -90 -169 67 305 126 -308 139 53 -1 -165 216 -48 -82 158 -68
4392f8J72j28k75K54p4k7J85j32l10J70R8J54k03r7K30J08j96k9Q7K55O3k83L38
$$ -68 104 -24 -299 -45 -119 -146 39 -93 -403 -233 -135 19 -184 -281 -51 57 -139 -168 -81 174 237 -46 292
4415B92m34K31k0k81P6J77ork0J06k10J67l85L13K10j39O3k26K57k87R2O2N4j02
$$ 292 -142 89 69 -212 -136 41 35 26 6 112 -98 69 -316 -3 207 68 131 -95 162 -125 -33 29 83 -19
4439a9k62K94J94k17J26j05j58M1J90j76m1J80O4q0j65O2J87j11k1J20k03K05
$$ -19 -281 13 207 -10 116 11 -147 -106 84 -92 -133 47 111 31 -134 -72 115 4 -17 103 -100 105
4461A05q0l7k18M30m24L64O0j49k6j02K77j01P7k24O8K9J70l01M9j94N30m03j8
$$ 105 25 -12 -230 200 -224 140 200 51 25 -77 200 99 176 -48 20 49 219 -82 -33 -227 303 -100 -118
4484a18K8J97K02m72J64J76m58J86O6J90k1k22j40L55j59PK7K98m47J55%l0j8
$$ -118 -90 107 309 -163 1 177 -281 -95 -29 161 140 -82 -222 133 -26 -19 8 306 -141 14 14 -16 -34
4507c4J01k32J59J14j6Q4K0k05p1L45l6Ln33M97j09m0j28j26K68Oj44J83M8p4
$$ -34 67 -165 -6 108 92 176 196 -9 -80 265 229 232 -301 196 87 47 -81 -207 61 67 -77 106 154 80
4531H0l3K73l87J01r1N1O9j32K11l38J54N34n40j6R5J38l41J64q0q4J93j40K44
$$ 80 47 320 -67 34 -57 -6 63 -69 142 -196 -42 492 -48 -64 31 169 -172 -8 -88 -172 21 -119 125
4554A25M4n5k18L15k91k6k6Q4J10K76n26K6J15q0k9J8M01k46J05k12j8J37o2J34
$$ 125 169 114 -104 211 -80 -106 -132 -48 62 338 -188 -162 -47 -127 -156 -138 263 17 122 -90 -108 29 -33 101
4578A01J18k29lN2j3k61K15J87m37K05J27l0Q3j39P9p5PJ55m11J11J56k7M3Pn4
$$ 101 219 -10 -13 39 26 -235 -20 167 -270 -65 62 32 115 -24 55 -20 -13 142 -269 -158 -2 -29 14 21 -33
4603c3J42L7j23J56k20j89K11n7q5J14n8K37K2r1J27n07L78j13q4N8k4K06j35
$$ -33 109 146 23 179 -41 -230 -19 -76 -161 -47 -105 132 154 63 190 -317 61 -52 -136 -78 -102 104 -31
4626c1r0J20j25J63jk3Q5q5j66N6r1J44L6j56L72k26J90j78pj41J84N0j48k31
$$ -31 -121 -1 -126 37 36 13 98 13 -153 -97 -188 -44 -8 -164 208 -18 172 -6 -13 -154 30 80 -68 -299
4650b99K81K16n44M72K07j20k91M5k69M53k60J56j0j60J3K0O2n0j13J22L04k71
$$ -299 -18 198 -346 126 333 213 -78 -33 -302 151 -109 47 37 -123 -110 -90 -28 -78 -191 -69 235 -36
4672c6Ll5K35m9k48j15L80j35k2q7N9q9L68N3m57O9M7K79k31O6j65J99k33K55
$$ -36 -33 -68 167 118 -130 -245 135 0 -22 -109 -50 -139 229 282 -175 -106 -59 220 -11 55 -110 89 -144 111
4696A11k75j0J76l2J89N8k83J55J14m04M37j23o3j85M0L56k47q4q6K26J88m37
$$ 111 -164 -174 2 -30 159 217 -66 89 203 -201 236 113 50 -135 -95 261 14 -70 -156 70 258 -179
4718a79r1N7L93k09K17j71n3MJ10k17j54J08p0J86K4J17j79J20K1j56K01j62M5
$$ -179 -270 -213 180 -29 188 17 -36 -32 78 -139 -293 -185 -255 -69 -45 72 -107 13 34 -122 79 -83 -38
4741c8m3K31o4L72k47l07J72o9K6l31L37j63q4j7J57n8L23l59J81M8o6J26k20
$$ -38 -81 150 86 458 211 -96 76 7 33 -298 39 -124 -208 -225 -68 -126 197 -162 19 67 1 127 -93
4764i3J66k98L30K5j03j6k5JR9j23lJ48j37J62p1J63k48J82l57M16l77L36O6l15
$$ -93 73 -225 105 130 27 11 -14 -13 86 -37 -40 108 -29 133 62 225 -23 159 -198 218 -159 177 243 -72
4788g2l7J36N2m4L9%J5k25M61j21k41o3L73k71M5L5k00O2k4R2K09j27p6p6K3n
$$ -72 -109 27 79 35 74 74 89 -136 325 204 -37 -100 273 2 47 82 -118 -56 -80 12 221 94 18 -58 -35 -40
4814d0J02l8k7j6J11o3k24J80r7j05K9J33R7j48J09Q6N6J06p4k20J4O2J71m04
$$ -40 62 24 -3 -19 92 29 -195 -15 -112 -217 -188 -55 42 -106 3 89 145 251 177 -43 -29 33 204 -200
4838b00M13q8N5o4J31j65l65K76l7K14n9K11j82l28K5jP6N6J71j84K81k44j97
$$ -200 213 125 180 116 247 82 -283 -7 -44 170 111 322 140 -188 -163 -164 -88 -32 139 -45 236 -8 -205
4861b05J01K6P8o2M0L4O5j57K46q9l28K72J86n6o8o7j58J54N8O3q2j67K93l39
$$ -205 -104 -78 0 -62 -22 12 77 -80 166 77 -251 21 207 151 83 16 -142 12 70 133 51 -116 177 -162
4885a62N0j19K33M02m71P4M3J42k37nk46K17r0M01k11J84j59J5J79j71k31r6J32
$$ -162 -112 -231 2 404 -67 7 50 192 -45 -50 -296 -79 -169 232 21 205 46 61 240 69 -162 -258 -126
4908a26L69l55Q8p5j38L56j66p2L55L3k18n7l71L74Qj52P8J27j53K21J4m27L81
$$ -126 243 -112 -24 -99 -237 119 -47 -119 236 269 51 -6 -377 -3 5 -147 -69 58 -95 126 140 -287 94
4931I4o4J93l55K17K30k71j37K22q0k36K71k01J04j28L28k72Q3j55J86j72J58
$$ 94 30 223 -132 85 315 44 -93 129 49 -187 84 -117 -13 -141 187 -85 -2 -157 29 -143 15
4952A5k60M41k92p3L4L10k96J67K7k58J11P2J87k18p4J29j85j3J82R5l96L19p1
$$ 15 -245 196 -96 -169 -135 175 -121 46 73 -185 -74 -2 185 -33 -107 22 -163 -176 6 101 -295 24 -47
4975d7J51k80K3K18j79M21l71R6R0P3k62L58l28N4j21L47l78J74NK35m02R7J28
$$ -47 104 -176 -153 65 -114 307 -64 32 122 195 -67 291 -37 17 -104 243 -135 39 44 279 -123 -26 102
4998A02j67K15j51L64l39n3j7o5J06L26n86K27j68M84m37K53L9j74J75n2l47K35
$$ 102 -65 150 -1 363 24 -29 -46 -111 -5 321 -265 -38 -206 278 -159 94 133 -41 134 82 -265 -30
5020c0j52K21j75J13K09k59M5J09N9j5J54k3l11K97rm87K85N7l15K97k37K13l7
$$ -30 -182 39 -136 -23 186 -73 -28 81 140 125 279 256 -55 242 233 -254 31 88 -227 70 -167 46 9
5043Ik18J09n0L64l38J03JJ91k17L05j37j65j90L99j13Q0k1j85J32j2n9K73j05
$$ 9 -209 -100 -150 214 -124 -21 -20 171 -46 259 122 -43 -233 166 53 133 112 -73 59 47 -12 261 156
5066A56q1K31n20L70j14j55K66P4n43J18J80J17j49R6qk7l58L40j3J55k98J34
$$ 156 75 306 -214 156 42 -113 153 227 -316 -198 -18 99 -50 46 38 11 -347 -7 -20 135 -163 -29
5088b9J17l03L21l33J83p5k21K52K60j30kr9J10M2j97J82n2oJ88j67k2K7J10j48
$$ -29 88 -215 106 -227 -44 -119 -340 -88 172 42 40 -59 51 93 -104 78 26 20 208 41 19 46 156 8
5112Hm1J63k62K33k5l06L40r3O7M3j34L13r4j69r4M5J52k52J9M35q6k36r0j4J88
$$ 8 -33 130 -132 101 76 -230 110 17 84 127 -7 306 212 43 -51 -6 146 -106 -87 348 262 26 -64 -78 110
5137A10l26J60k28J81J82j9j29N8R3k7j31j12L58j18J02k87L3K5L5k3J99j66J14
$$ 110 -216 -56 -284 -103 79 60 -69 -11 82 55 -76 -188 170 52 154 -133 -100 -75 -40 -63 136 -30 84
5160H4p1n3J23j61j64L88l04M31j04q5k3OL0jpJ9n2r1k3J1j52K09j07j14M25j72
$$ 84 13 -40 83 -78 -242 146 -158 273 169 84 61 67 97 96 89 108 56 -35 -58 -47 -199 10 -97 -211 214 42
5186D2J58p5n19K10J98N6j6J27J23n04J24J79j4o6NP0J8J6Q4j47J37j87lj83K22
$$ 42 200 125 -394 -184 14 70 54 181 304 -200 -76 103 89 23 28 98 116 132 216 69 206 19 16 -167 55
5211E5K07j44p6r0j47K83j05K37j49l4Rn4j95J03J10J73k20K11j13J16j16j86
$$ 55 262 118 42 -48 -195 88 -17 220 71 37 46 -8 -203 -100 10 183 -37 174 61 177 61 -125
5233a25J48J35j95Q5r1Kn3k07K69K8k4l8J08l58K37rL92m39oL58l20J15K8j01
$$ -125 23 158 -37 48 -43 -41 -94 -301 -32 -4 -28 -66 42 -316 -79 -88 304 -135 -141 217 -103 12 40 -61
5257f1J34J36k09r4K06q6k76K07n5p5L86j74l45K77j97l0K53QQ5j75P8j16K36
$$ -61 73 209 0 -94 112 26 -250 -43 -98 -173 213 39 -306 -29 -226 -256 -3 5 90 -85 -7 -123 113
5280A13N7j11Q9k05J13k22ONL12J4RL3J13n89J23J69k98M13j65M6j47Q7K81j23
$$ 113 170 59 148 -57 56 -166 -160 -155 157 171 180 213 326 -263 -140 29 -269 144 -21 25 -122 -35 246 123
5304A23%k75K15J05k87M42n27M31m34K60J03k73N2l9J56j28K24j05k8N3k50l8
$$ 123 123 -152 63 168 -119 323 -204 227 -207 53 156 -117 -65 -104 52 -76 148 43 15 68 -182 -220
5326b20M42k66J38O9j59Kj79J14q8n8M58j35n7j22q7K29Pj54lLj35J90j67J56
$$ -220 222 -44 94 163 4 6 -173 -59 -147 -205 253 118 61 -61 -148 81 88 -66 -69 -66 -201 -11 -178 -22
5350b2l08L94J91j71n3k09J60R0N5j01oj33Q1k6j66K24j37J94k0k11J00K34j85
$$ -22 -330 64 255 84 31 -178 -18 72 127 26 20 -113 -32 -58 -224 0 -137 57 37 -174 -74 160 -25
5373b5K86k71k2j9N6j29K07j0K6K67m10J50l11J34J09j40K44j37N9L37o32k0K58
$$ -25 261 -10 -32 -51 5 -124 83 73 99 366 -44 106 -205 -71 38 -102 142 5 64 401 -231 -251 7
5396GJ45N3k64j97L10l7Q0O3J0l06J13K97m18K84j29O6n2k56L61j28j25M7L7l1
$$ 7 152 205 -59 -256 54 17 97 160 170 -136 -23 274 -144 140 11 77 25 -231 130 2 -123 -76 -39 -70
5420g0K16j00l6r6J25o2n6j2o6K84k59J26J43j69J2j74J48K75j90Lj80M0K88k20
$$ -70 146 46 10 -86 39 -23 -79 -91 -157 127 -132 -6 137 -32 -20 -194 -46 229 39 42 -138 -98 190 -30
5444c0q2P9K0Q0J10j0k46K60m8j8R5j39k56M78l90J68j02J40k87L03l86m9K00
$$ -30 -112 -33 -13 67 177 167 -79 181 133 115 210 71 -185 293 -97 71 -31 109 -178 125 -261 -310 -110
5467a10J90P5j81k5P1k02K99j17q9L35k20Q4J37k45K17j27j39n9J27J0j21K4q7
$$ -110 80 155 -26 -51 20 -182 117 0 -89 246 26 110 247 2 219 92 -47 -106 21 31 -90 -66 -153
5490a53J52k80L30o9j44J32R9j89K24K09o00M31j06j86N36l25j72J43j8j93J58
$$ -153 -1 -281 49 -20 -164 -32 67 -122 102 311 -289 142 36 -150 386 61 -111 32 14 -179 -21
5511b1j04N7Q5o4K13l39J72M54m13Lk70M49j52j03j02K19Q7l06K34p4j98J85M1
$$ -21 -125 -68 17 -47 166 -173 -1 453 40 43 -227 222 70 -33 -135 84 171 -135 99 25 -173 12 53
5534E3J39k36J9R6p9lR0J20j56j71m5J58Q0J75j57K7j7n6mJ15L8k60K20k51P8
$$ 53 192 -44 -25 71 -8 -11 79 199 43 -128 -173 -15 65 240 83 110 93 37 33 148 186 -74 146 -105 -27
5559b7m8K1k03J98j73M41l29Q5P6r0K3j2o6L47j05l58K36l58N16k96L29o6Mk45
$$ -27 -75 -54 -257 -59 -232 209 -120 -35 41 -49 -26 -38 -104 243 138 -220 16 -342 174 -122 207 141 145 -100
5583a00J95j99O4J84m0k15L2L39l43K64o4k13Q7K4p7L71l00l07K76J40l04K23
$$ -100 95 -104 -40 144 104 -111 -79 260 -83 181 117 -96 -9 15 -62 309 9 -298 -22 118 -186 37
5605C7M8k70M60l46l5K70l48K34j98L28l69P1j27K34P9k9k09M7K41j60K76l77
$$ 37 85 -185 275 -71 -106 164 -184 50 -148 180 -189 -118 -245 -11 68 39 -170 -123 118 -42 234 -143
5627a43J82K35j25l93L54j43m9l3J25M9k9J96j76j36J43J6L1k31o4K85q1J54o7
$$ -143 39 274 149 -244 110 -33 -82 -115 10 59 30 226 50 -86 57 73 104 -127 -191 94 13 167 100
5650A00r4L4R8l42J53N9J12L4j98J86oj3l96N4M63k05N0n2j93P2o3K39o6m1K33
$$ 100 6 40 138 -204 -51 8 120 154 -44 142 136 123 -273 -219 244 39 89 37 -156 -84 -147 92 26 -15 218
5675B18k16M9k03M2pK42k42M77j98j25J67j35L4j50O7J2p4n8n6K77Ko5k47J68
$$ 218 2 51 -152 -110 -117 125 -117 360 162 37 204 69 103 -47 20 32 -42 -100 -156 121 123 58 -189 -21
5699b1K9J33m26ML14l44N16j45n5m2k15K62o2J59j86j5j6L91r8j08j24n0J67l08
$$ -21 8 141 -285 -281 33 -311 205 60 5 -37 -252 10 -52 107 -79 -94 -110 281 183 75 -49 -99 68 -240
5723b40M18k44K06R8J68m12k4l7M9k5Q3J74pl03j37L16j38J80k2m80N20k26K17
$$ -240 178 -66 140 238 406 -6 -30 -67 -18 -43 40 214 207 -96 -233 83 -55 125 103 -377 143 -83 134
5746A34k26P3J90m6J57k44j1o1J92k03k56K49j7J4R5j47K57j89O8q2j10L66j99
$$ 134 -92 -19 171 125 282 38 27 -34 158 -45 -301 -52 -69 -55 40 -107 150 -39 29 -53 -163 203 4
5769Dk33M24j00j85J84m0p6R5r5r1J30j65J80j4p5j19K56j14j4o7j1L5R9k62L40
$$ 4 -229 195 95 -90 94 54 -22 73 -22 -113 17 -148 32 18 -57 -176 80 -34 -48 -115 -126 -91 8 -254 86
5794H6k04K7K13j71L2j13J4J98k73K79o8Q4Qj44k9K19P1l29K75l5k61L12J2j68
$$ 86 -118 -91 122 -49 -17 -130 -116 82 -191 88 20 104 112 -32 -61 158 229 -100 175 140 -121 191 203 35
5818C5j15K45k52r5J91J40l46J25J74O5j78j61O5J98k06J10j16o9KL58k74Q8k2
$$ 35 -80 165 -87 -182 9 149 -197 -72 102 167 -11 -172 -107 91 -115 -5 -121 -190 -188 170 -104 -16 -38
5841c8l91K78K71k0l01K36k33L46m02M10j23k39J46nj26K06j58k3L34m42K60j93
$$ -38 -429 -151 120 100 -201 35 -198 148 -254 156 33 -206 -60 -65 -191 15 -143 -166 168 -274 -14 -207
5863b07L31l6j01K13k58L08j81n2K08l05n0m8K65j05K19k88k65M27N4J5j23j25
$$ -207 124 88 -13 200 -58 250 69 17 225 -80 -130 -178 87 -18 201 -87 -352 75 129 144 21 -104
5885a04n6K11L7J10Km15M74j72r9j48N5l5J10J0m6K66l09K19L28l09k50J85j12
$$ -104 -160 51 88 198 200 -215 259 87 -12 -160 -105 -140 -30 -20 -66 200 -109 110 438 129 -121 64 -48
5908d8k47K04Pp1j21L17qn2LpJ05j21O2k28J64J33P5j55p1%J27q0l7q1O6J30k35
$$ -48 -295 -91 -84 -155 -276 41 33 -19 -16 -23 82 -39 23 -205 -41 92 167 12 -59 -59 68 -12 -49 -130 -64 66 -169
5935a69K89j53J47p3k64K5K33j7j08j04M7N4l74L43qj11L81j64%K7l52K98N3J4
$$ -169 120 -33 114 41 -223 -198 35 18 -90 -194 -147 -93 -467 -124 -132 -243 138 -26 -26 1 -351 -53 0 14
5959A4k07J98J29j49K44k28J99n8R6j75l35J32J72m6r7J83j28J32K04m73L35k03
$$ 14 -193 5 134 -15 229 1 200 142 238 63 -272 -140 32 -14 -111 72 -56 76 280 -193 142 -61
5981f1r3J14K69j90kj89q0L12j97m9J18R6o6j37K74q8n0K58J4k56J49k94J16j06
$$ -61 -154 -40 229 39 37 -152 -232 80 -117 -166 -48 48 -18 -155 119 31 -19 239 253 -3 146 -148 -32 -138
6005a38LL54j23k29N6K14%l64J56J0K01j01k04k3R6K43j47r7j2O4L57q4m45O31
$$ -138 -135 219 96 -133 -77 137 137 -227 -71 -61 140 39 -165 -188 -92 151 4 -93 -105 -41 316 232 -213 418
6029D18j38j80j9k21J86o8O3Mj93Q8J33j81j20K32k51L57k8N8l22K25O3k00N0
$$ 418 280 100 81 -140 46 -22 41 45 -148 -60 73 -108 -228 4 -247 110 82 140 -182 43 106 -94 -44
6052d4j9m8P6K74K3j31N5j72n2N4J08j16O1o8K27k63O1o8j93L34J50n0j29j92
$$ -44 -63 -111 -35 239 262 131 186 14 -38 16 124 8 69 1 228 -35 26 -42 -235 99 249 199 70 -122
6076a22J11K07k79L40m81L30O9J3j96J70j01l46O7J32r3K34j95M57l14r1K62l95
$$ -122 -11 196 -83 257 -224 106 175 188 -8 162 61 -285 -218 -86 -179 55 -140 317 3 -88 174 -221
6098b21J90j54K04j8%K52k54k13J65J3J79j29k48n2L70j7k28n9K67o7J22mR4j69
$$ -221 -31 -185 19 1 1 253 -1 -214 -49 -36 143 14 -234 -286 84 67 -161 -220 47 -20 102 98 192 23
6122B3j03Q0k6k1K6q3j17rL46j19j5O3Q9j50K8N3l76N29k50J37q3j90N1J80l39
$$ 23 -80 0 -26 -47 -21 -104 -221 -230 116 -3 -18 45 134 -16 12 65 -311 218 -32 105 22 -168 -117 63 -276
6147b76K84n8j00j4J22P4M0K4m1J18r3k10kL4Q7K15k09Q2L68o05j07L38l5J19
$$ -276 8 -50 -150 -164 -42 32 72 96 55 173 80 -130 -132 -98 -11 204 -5 77 445 -160 -267 71 36 155
6171A55n9r5M0K26r4l06N3J8k5o2J96%M0O7k14j3J60J90j54k1R5k91J38J32p6
$$ 155 96 1 41 267 173 -133 -80 -62 -87 -149 47 47 87 154 -60 -73 87 277 123 102 197 -94 44 176 100
6196A00J3O9q2J30l2j65k6L1k15K0J32j20L66k10r6J82k04K25j32l2J6n5L42j21
$$ 100 113 182 100 230 198 33 7 38 -177 -157 -25 -145 221 11 -85 97 -107 118 -14 -46 -30 -85 257 136
6220A36pl14R1j3J51k04L37q7q2J84m81RK98j68l3J12J51j15j57r0M39j49k12
$$ 136 129 -185 -94 -107 44 -160 177 90 8 192 -289 -280 18 -150 -183 -71 80 -35 -192 -282 157 8 -204
6243b04R7K47j35J0K1l4J57m7%j80J39j64q2L88l37K76j58q4j5N9J95j81l0N6
$$ -204 -107 140 5 15 36 2 159 112 112 -68 71 -93 -175 213 -124 152 -6 -90 -105 -46 149 -32 -62 -6
6267fr6J86k95R6M85l61J38K3l32J70r3P5j68j9P4K1N5J48J52j53r4jo5j4J88
$$ -6 -102 84 -211 -115 370 9 147 170 -162 8 -85 -10 -178 -197 -123 -102 -47 101 253 100 6 5 -60 -74 114
6292A14l20K52j45j52L17k29K38k7P0N0L0m91L11r3J18K3j55J46l09J54J59k30
$$ 114 -206 46 -99 -251 66 -163 75 48 118 168 198 -293 18 -75 43 66 -89 57 -252 -98 61 -169
6314a69J24K11l05J11n4J26o1j57K09J5k05J79R2l69K48j15K75j80oL16j86j4
$$ -169 -45 166 -139 -28 -82 44 -17 -174 35 50 -155 24 116 -253 -5 -120 155 -25 -31 285 99 85
6336H5j15J0O6j47J35J38k09r8K13L8J03l33K61k42m6L36j90lq6N3J01r5l04L20
$$ 85 -30 -20 46 -101 34 172 -37 -135 78 116 219 -114 147 -95 -141 195 5 2 -84 -31 70 -25 -329 -9
6360ik66L1K17K98k63J52l3J66l93J95O2j88K02p3j22J90l55K84l5nJ07j71o5
$$ -9 -275 -244 -27 271 8 160 127 293 -100 95 157 -31 171 98 -24 166 -189 95 60 55 162 -9 -74
6383g4J9L3K03j56j48K44j76Q4n0R3R2j00j03J15j41K3K20j48q1j25K13o8j55
$$ -74 -55 -22 181 25 -123 121 -55 29 -21 72 164 64 -39 76 -65 -42 178 30 -51 -176 37 -31 -186
6406a86K20k60R9R8j5N8K68l67J93l28K10j15R5K4k52L13o0L43j83m9l36L19P8
$$ -186 34 -226 -127 -29 -44 14 282 -85 108 -220 -10 -125 -30 -6 -258 55 -5 338 155 106 -230 89 167
6429A67j94N7k02J06K31n02M95k08J10K6j84QPK06j00j43K40j62K66j24l44O72
$$ 167 -27 30 -172 -66 165 -337 158 -50 60 86 -98 -90 -83 123 23 -120 120 -42 224 100 -244 428
6451D28l00j06k6NLJ74k94J06k13J73J06j02L3J62k50M11m15K6J42K3n09L90M4
$$ 428 128 22 -4 1 4 178 -116 -10 -223 -50 56 -46 -13 149 -101 310 -105 -79 63 86 -423 -33 11
6474A1j29J57k22L74j21J55p6l1M3j82j20J64k67K36j09O6J62j65k62K76m9J20
$$ 11 -118 39 -183 191 70 225 149 118 161 -21 -141 23 -244 -8 -117 -51 111 -54 -316 -40 -89 31
6496C1J60l71J53J48k27J74K37n01L64p3J55k06o7K3J25N0l63K9qL62J26l06J6
$$ 31 191 -180 -27 121 -106 68 305 -196 168 95 250 44 -23 0 125 175 -188 -159 -167 195 321 15 31
6519C1J45j53O3r5j10O9j11L67l0j58K6o5J95k01J03k96K92Jn1J4J83m51J45K09
$$ 31 176 23 86 -9 -119 -50 -161 206 176 18 44 -21 174 -27 76 -220 72 73 22 36 219 -232 -87 122
6543A22M4j36K66k10j63J63k3K1l8m3q2L04k51j19K51j66L8K34k54k3L30k1p5
$$ 122 166 30 296 86 -77 86 63 84 46 3 -79 225 -26 -145 106 -60 -22 212 -42 -65 265 244 169
6566A69l64L13K40l79L0P7J0J47J19l55n4J78j28J64l01K85l04LL78k05O7Mk12
$$ 169 -195 118 358 -21 9 86 96 243 362 7 -47 131 3 167 -134 151 -153 -150 228 23 90 94 -118
6589a18J13J43J56j79j17n0j17L91M4n06L21r9k09K07j60L41j78k01J59q4O4j87
$$ -118 -5 138 294 115 -2 -52 -169 222 266 -240 81 -18 -227 -20 -180 161 -17 -218 -59 -143 -79 -266
6611b66N04m22K5L64j29j23nK37l03J20J69k95L5n4K15J6j43Q3J50k09mK18l48
$$ -266 238 -184 -159 205 76 -47 -52 185 -118 2 171 -124 -89 -143 72 88 -55 28 178 -31 -35 183 -165
6634a65J70J88j36Q5k57J94mM5j72M2o8J02k88M31j52l14K29J38l2j30lN9J42
$$ -165 5 193 57 142 -115 79 75 120 -52 -10 -78 24 -264 167 15 -299 -70 68 36 -94 -97 -38 104
6657A04J95j67k70R3o4K14k68oJ1P9J97j53j37K94j24J49l40L07R6k19j58K54
$$ 104 299 132 -138 -45 -109 105 -163 -169 -158 -79 118 -35 -172 122 -2 147 -193 114 210 -9 -167 87
6679H7N7k63J29l6K8k25j13L32rk93O43k71j9p6o8L37k51l14K67p3p4J17J94j28
$$ 87 144 -119 10 -26 2 -223 -336 -4 -13 -306 337 66 47 -29 -97 240 -11 -325 -58 -131 -205 -88 106 -22
6703b2o9O1K09R7n82N21l05J87j31J15L8J14j59j31j21K30Oj80j0L21l66L62l00
$$ -22 -91 -30 179 276 -306 215 -90 97 -34 81 119 233 74 -57 -178 52 58 -122 -132 189 -177 185 -115
6726a15L3K00l6K8k01K06l21Q8P4j56L72J47l08oO9r2K30m86K84R2p7j51J89m8
$$ -115 -82 118 82 110 -91 115 -206 -118 -44 -200 172 319 11 5 74 -18 212 -274 10 102 25 -126 63 15
6750A5J29k26k1J68j56K77k3j80N3l7j8l1n0J31j85J07P4m9M3k65L23m0pK77l10
$$ 15 144 -82 -103 65 -91 186 163 -17 36 -1 -19 -50 -100 31 -154 -47 27 -22 21 -244 79 39 32 309 -1
6775aR7m04M67k85L9OJ72o2K29o8k25L25l88l6K52q8j25J01Jm1j5m8J86k48K23
$$ -1 96 -308 159 -126 -87 -81 91 29 258 190 -35 290 -98 -134 118 30 -95 6 7 -34 -49 -97 89 -159 64
6800F4o4J50o8j04K96l39J88J48k89K87l1q5j35K44k43j36j9m4K69M0j58k81N89
$$ 64 0 150 82 -22 274 -65 123 271 -18 269 238 153 18 262 19 -117 -136 -180 89 129 -29 -310 279
6823B79l23j42L24l41J58l08K71j9nk07K87L55j81k29K3p9J81l39J19J38K36r6
$$ 279 -44 -186 138 -203 -45 -353 -82 -101 -106 -313 -26 329 148 -81 -58 -137 44 -295 -176 -38 198 102
6845A02k83L39l16m1n9J56O9Q4J94k06l01J98n7K73j07l7o6N6R5K9k58J77j76
$$ 102 -181 158 -158 -199 -258 -102 -33 51 245 39 -262 -64 -121 152 45 8 -58 -2 93 122 -136 41 -135
6868a35N03o36K70O7j23K34m17K55O1l7l8Ro4l3o7K90j64J99j09k66n4J88Q2j11
$$ -135 368 -268 2 69 -54 180 -237 18 79 42 4 13 -51 -84 -151 139 -25 174 65 -201 -255 -67 15 -96
6892i6L66j95L0n18L32K6QJ47j89k7J27J5o1K05k11j08K96l77K84M2J8j42o8p1
$$ -96 270 75 105 -413 -81 -55 -47 100 -89 -116 11 26 -35 170 -41 -149 147 -230 54 96 114 -28 -96 -167
6916a67J00J29j24q3N1K26k22j87K53K73l45J65l68M28K53m07J19o1j36Q3m7n7
$$ -167 -67 62 -62 -145 -94 132 -90 -277 -24 249 -96 69 -299 129 382 -25 94 33 -103 -20 -67 -124
6938a24L37j32j17rP4k83L28O8L9m30K64o1L5J5k46R2K36K0k9j33J61l41J97J60
$$ -124 213 81 -36 -45 29 -254 74 142 181 -249 15 -46 -11 4 -242 -150 86 106 77 -56 105 -236 -39 121
6962A21m25L75m3p8J04j21R4k37K74n4n7k25M16k21k51O4N03k09o7r0J94J0j3
$$ 121 -304 71 28 -50 54 -67 27 -210 64 10 -47 -272 144 -77 -328 -264 239 30 -37 -127 67 77 64
6985F4k20l4J04R9J06r3K3j04P7K36k01r3l5K9M6Q4j97J28j78J7J84K44m03J1
$$ 64 -156 -190 -86 13 119 26 49 -55 22 258 57 -36 -71 -42 4 88 -109 19 -159 -142 42 286 -117 -106
7009a06J83K4L2K23l85j11K16Q1k28n9j05R1j69K19N1j43K88J10J23o40M17m2
$$ -106 77 101 133 356 -29 -140 76 157 -71 -130 -235 -144 -313 -94 -43 -186 102 212 335 -305 112 70
7031G0j2j60o1j20L82j30j19M49k68k1K7Nj8J12Ro4L37o20L58o1q2J41j66J91
$$ 70 58 -102 -163 -283 99 -31 -150 299 31 10 37 42 24 136 145 81 418 -202 156 95 13 154 -12 179
7055A79j22j20OM6j71L06j97J41k80M91l77k3J77J4K02n18K23R8l05L01k64K28
$$ 179 57 -63 -57 -11 -182 124 -73 68 -212 279 -98 -121 56 70 272 -246 -23 75 -230 71 -193 35
7077C5J49n46K09K29j81M6o2K27M9Kl05Q9O4q4n2K58k47L0L18l28J11L90k29l81
$$ 35 184 -362 -153 76 -105 -59 -121 106 155 157 -148 -59 5 -79 -131 127 -120 -90 228 -100 11 401 172 -209
7101b09N37l91K44l82o5K92J65k78J77l89L59L09o43R8K39Q0k34m0l6K40R8j31
$$ -209 328 -63 181 -201 -266 26 191 -87 90 -299 60 369 -274 -176 63 143 -91 -131 -167 73 171 40
7123D0n4K18j94p9K29j12M6j92J08O6k3o4K50l14pM64p4j65o4J09k73k5L6J26
$$ 40 -14 204 10 -69 160 48 94 -98 10 76 53 -11 239 -75 -82 382 308 143 79 188 -85 -110 -74 52
7147E2o1J41J01l27J76O9j73K72j96J44k71K51k90j2K35j7K5j06o7L9J13j68K13
$$ 52 -9 132 233 -94 82 151 -22 250 54 198 -73 178 -112 -124 111 94 119 13 -54 -15 98 -70 143
7170A43l5l57M2M7J54Q9j51O1kj9K19l42K39L9l8J69k74M5j39L59l41J30j96J36
$$ 143 108 -249 -207 -160 -6 83 -68 -7 -9 -28 191 -151 88 127 89 258 -16 29 -110 249 -92 38 -158 -22
7194b2Kj50J95j07J83p4m2J6J33p1j12J67j21M2j49L12l43l5J90j17M03k90j29
$$ -22 -20 -170 25 -82 101 27 -15 1 134 63 -49 118 -3 39 -110 202 -141 -176 14 -103 300 10 -119
7217a19J27J44n6j18N6k22K33R1J63k43K81k51j24o2J27j46M11l78J73j59j53
$$ -119 8 152 96 -22 34 -188 45 136 299 56 337 86 -38 -100 27 -119 292 -86 87 -72 -225
7238b25K85l05M81L3l47M5j61J67J36j13j29l7K31Oj19m2P1k3p1M6K06Ol82J05
$$ -225 60 -245 236 269 -78 -33 -194 -27 109 -4 -133 -170 61 67 -52 -94 -23 -46 -117 -71 135 141 -241 -136
7262a36K98m42M17J83j85j45K47q7q3n8n02J56K59j03J58P6pJ65l19J70J25k07
$$ -136 162 -280 137 320 135 -10 237 150 67 9 -493 -337 -78 -181 -23 53 46 211 -108 62 187 -20
7284b0J9K2J61l72J42J52j8l8o1J71k79R7j17K09k75J09J16k66K84n7j20L07j00
$$ -20 -1 21 182 -190 -48 104 86 48 -13 158 -121 -24 -141 68 -207 -98 18 -248 36 -21 -141 166 66
7307F6J2j44K36j26l3m0O3k74L33r5r5pK57m3j30J60qk42K75j67P2q1P7O2j24
$$ 66 78 -66 170 44 11 -29 34 -240 93 -2 -97 -104 153 110 -20 140 132 -110 165 -2 70 -11 66 128 4
7332DQ4Q6m08K96j43J72M9l0N2l04K42j80K53j00k24J36%k23M59j07j14j04j20
$$ 4 88 174 -234 62 -81 91 140 110 162 -142 100 -80 173 73 -151 -15 -15 -238 221 114 0 -104 -224
7355b24J11p3L23k65J94j22m5n3J09r9M15l6Oj73NJ9q9j64M9L19q3q3j48J81k41
$$ -224 -113 -186 137 -128 66 -56 -101 -154 -45 -144 271 235 241 68 73 92 3 -161 -112 207 124 41 -107 74 -167
7380a67k0K18j72M2J14l0O0j60M8R7p8o4J30n7L0j36K99k23k21K02Qm4J00J97
$$ -167 -187 31 -141 -99 15 -15 45 -115 -67 30 -48 -112 18 -39 -9 -145 154 -69 -290 -88 -80 -124 -24 173
7404A73q0k75K08j89J34L26j96j59J09l6r6J40j01O5n1k30N51n13K65MP4j26j82
$$ 173 93 -182 26 -163 -29 297 101 -58 51 15 -81 59 -42 23 -28 -258 293 -220 45 49 123 -3 -185
7427a85L71l70K89J53j68k9j82K02p9K19j76K44l34K33K2k47J87j63M8j75K21
$$ -185 186 -184 105 258 90 61 -121 81 2 221 45 289 -45 188 210 -37 150 -13 35 -140 81
7448H1j96L60l11J87r0o4Q0Nq4J97m52K82L9j10K85j87K2J48j14l61M06q9k56
$$ 81 -115 245 -66 121 31 -33 47 52 -32 165 -287 -5 34 -76 209 22 44 192 78 -283 123 34 -222
7471b22J19K56l06M9K09l05J43J08K74j03k56J3K6K25r2k22N5Q9lj74PM22j95
$$ -222 -103 153 -153 -104 105 -200 -57 51 325 222 -34 -21 5 230 138 -84 -29 60 57 -117 -110 312 117
7494A17j30j93M70j71L8k98M01l60J70P3j76M9l17K39R5O7M5N4k47j83p6L63l00
$$ 117 -13 -206 264 93 131 -167 234 -126 44 117 -59 -10 -327 -88 7 74 119 173 -74 -257 -333 30 -270
7517b70J34K50J22j06J91m01J30L0Lj53J51Jp6J55l24P0pj05R1LrJ64J50j65j14
$$ -270 -136 114 236 130 321 -80 50 80 83 -70 81 82 6 161 -163 -93 -100 -205 -114 -111 -120 44 194 29 -85
7542h5L4J74j73Q2j35R4K04k96K7o5J08j17J18K35l35J60Pj18R9j58j00K44O6
$$ -85 -51 123 -50 32 -103 -9 195 -101 -74 -139 -31 -148 -30 205 -130 30 37 -81 18 -140 -240 4 70
7565G0j47K14n5Lj99J99k90M28j0l46J53J01j51j63J33r5L68l98L36l63K07J14
$$ 70 -77 137 82 85 -114 85 -205 223 213 -133 20 121 -30 -193 -60 -155 213 -185 151 -212 -5 109
7587A09k18kq1K11K5Q6k73M28k63J76J86m17P9j41K70j33m5K2j90K39L13n47L36
$$ 109 -109 -111 -192 19 44 130 -143 285 22 198 384 -33 46 -95 175 42 -3 19 -171 68 381 -166 170
7610A70j58j80L24j73L5J3K2J32k70k0l5J57j36K22j52j60J64j65K92P2k85RJ71
$$ 170 12 -168 156 -17 18 31 53 185 -85 -105 -140 17 -119 103 -49 -209 -45 -210 82 154 -131 -122 49
7633D9K69m33K31l46K83k0k43q0K53J47n8j10K6j60K6k2K98L9k06Q5k4J04j99
$$ 49 318 -115 116 -230 53 33 -210 -290 -37 110 52 -58 -32 -192 -166 -188 110 149 -57 28 4 108 -91
7656i1J75j34j62k5L05q7P0j35Q3J46o6q0J94l20l5K90k85K87J07m6l90N6K1J94
$$ -91 84 -50 -212 -237 68 -19 51 -84 -1 145 79 -1 193 -127 -162 128 -157 130 237 191 -199 -143 -122 72
7680G2j48L34M6n20J5j72K78K72l30K24k85L03J03j18r8j33K54j14O6m8pO1R5
$$ 72 -76 258 304 -216 -201 -373 -95 177 -153 71 -214 89 192 74 -24 -157 97 -17 49 1 -6 55 150
7703A50j65N8k31R1L9n2L40o1j75m8K89k02j12P7j19J31k01J61j13M7j83L4J57
$$ 150 -15 43 -188 -97 -58 -110 230 169 -6 -54 235 33 -79 -2 -121 10 -191 -30 -143 -96 -279 -245 -88
7726h8L6J10k69R4M1K72l70K08r1j0j36M4J55m5J17k05J5J11p5N6m23M78K5J8
$$ -88 -52 58 -211 -117 -76 196 -174 34 -57 -67 -203 -159 -4 -49 68 -137 -122 -11 -86 -30 -453 25 50 68
7750F8L2k69J69j96L67j57j58J97p4o9K05J33k73N4J2m2J90j65n0J07j33j43R7
$$ 68 100 -169 0 -196 171 14 -144 53 -21 -90 115 248 -25 29 41 -1 189 24 -26 81 -52 -195 -98
7773i8J22M5J76j96J75k27j39J90j64K1K38l05K30k60K8N1L93m36J86l2O8j48
$$ -98 24 69 245 49 224 -3 -142 48 -116 -95 143 -162 68 -192 -164 -113 280 -156 30 -2 66 -82
7795h2L2M9K12j00j61K52l38N2J46r9J90j58l7M7j22l3L58k17o6L3k2L36m45J99
$$ -82 -50 -1 211 111 -50 202 -136 -84 62 -37 153 -5 -42 5 -117 -150 208 -9 -75 -42 -64 272 -173 26
7819B6lq5J1N1m4J2m1k8k94L81j20L24j08p8J33j09n6K21k15nK9k4O8j93M2m9
$$ 26 23 -62 -51 0 -44 -32 -73 -101 -395 -14 -134 190 82 4 137 28 -28 193 -22 -27 2 -22 46 -147 -105 -154
7845a54J51K7L0l1j40J05M6L4j22m8N1J77j41q0M84n64J73r5lL69l45O7J67OP9
$$ -154 -3 24 54 23 -117 -12 34 68 -54 -102 -51 126 -15 -95 389 -175 -2 -97 -100 269 -76 -9 158 164 243
7870B43O5L5j51j34J31j14m63N05O7k42j58N16j97J6p6K67n06J36J78l01n7L91
$$ 243 308 343 192 58 189 75 -388 117 184 -58 -216 300 103 119 43 310 -196 -60 118 -183 -240 151
7892A51j31R9R3k87j43K71J14j69k6j12J88q0k15N21k22L8j25K27K4R5l4l15l6
$$ 151 20 119 212 -75 -218 53 167 -2 -28 -140 48 -32 -247 274 52 90 -35 192 216 311 277 -38 -74
7915g4j7J01L0j75K08j56O2j77J92J19j97K3j17J44K57j64J75m7l29n0qL82k02
$$ -74 -91 10 40 -135 73 -83 -21 -198 -6 113 -84 -61 -178 -34 223 59 234 187 -142 -192 -200 182 -20
7938b0l2J69k99K26J26j53J79j52j10R5k36L34j52j2J47O4k31P9r8K47k10k96
$$ -20 -52 117 -182 44 170 17 196 44 -66 29 -207 127 -25 -37 110 174 -57 22 -76 171 -39 -335
7960c35M75m01M44J08l56M2J57k61R4qJ31J00k66L15k75n7J31m8L3rQ5n4J81q9
$$ -335 140 -261 183 291 -65 -23 134 -127 -33 -41 90 190 -76 239 -36 -93 38 -10 23 14 99 45 226 137
7984A37J00k14K9o0k21L15l12K65j47K03J03j88J4o0K51k05jR1j96L0J99j95J79
$$ 137 237 23 52 -8 -229 86 -226 39 -108 95 198 10 24 -36 215 10 9 100 -96 -66 133 -62 117
8007A17k19K81r4l01K39n1J60j2j01O8m0lk6J0n7j0J7r2R1J2J7j24j27M27l90
$$ 117 -102 179 85 -216 23 -28 132 120 19 87 47 44 18 28 -29 -39 -22 -114 -23 -11 6 -118 -245 182 -208
8032b08L37J1L7O6q5j33pJ02n5P5j84N7j31r1K43K51j13R1m45K77j2J00k22N9
$$ -208 129 140 177 243 158 25 18 120 65 140 -44 13 -118 -209 34 285 172 263 -182 95 83 183 -39 20
8056B0J81p2O0j42r1j79K87J2j05j35K24l72J91J17q8K05p1j16J37r2M5k8K57
$$ 20 201 129 189 47 -44 -223 64 76 -29 -164 60 -312 -121 -4 -92 113 42 -74 63 -29 16 -12 245
8079B45p2o3j85J37k15O7M9k1J22qL7k13K81k13J35M8j73K43k08J35l19K31j80
$$ 245 173 110 -75 62 -153 -86 -37 -58 64 56 93 -120 161 -52 83 131 -42 201 -7 128 -191 40 -140
8102a40J41P4J04l13K45r4K0j12L38m80J90L44j63m38K84Q9p3j48M34m27J1P7
$$ -140 1 75 179 -134 111 17 37 -75 263 -217 -27 317 154 -284 0 89 16 -132 302 -125 -114 -37
8124c7J12j06p0J35M4nj53O0o2n0J99j64L13j36M2j05jjJ2N1j21N0r1O8Qj44K17
$$ -37 75 -31 -101 34 78 73 -80 -20 -82 -132 67 -97 216 80 122 17 16 15 27 78 -43 7 -84 -16 -8 -152 65
8151F5l04N21l60K83j79k71J57J09q9Q3o8P9L2l11K12mJ18J17j27J67n45K97J92
$$ 65 -239 282 -78 205 26 -245 -88 21 -68 15 -53 26 58 -253 -41 -45 73 190 63 230 -315 -18 174
8174A74n8K06l33pL4kj20J66j71j55L06Qj13OJ19J7K85
$$ 174 116 322 -11 -18 16 14 -106 60 -111 -266 40 48 -65 -59 60 77 362
8191C62
$$ Imaginary data points
##PAGE= N=2
##DATA TABLE= (X++(I..I)), XYDATA
0@%%%%%%%%%%%%Qj6J6j6J6k4L2l2M0m8N6o9P7q8J04j21J40j63J86k11K42k75L09
$$ 0 0 0 0 0 0 0 0 0 0 0 0 0 8 -8 8 -8 8 -16 16 -16 24 -24 32 -37 40 -48 56 -65 75 -88 98 -113 129 -146 163
35A63l46L89m36M86n43O06o73P45q24R11j008J114j228J353j491J643j810J996
$$ 163 -183 206 -230 256 -287 319 -354 391 -433 478 -530 584 -644 709 -782 861 -949 1047
53A047k201K432k692K988l330L726m192M752n440O306p435Q969j1190J4702k1079
$$ 1047 -1154 1278 -1414 1574 -1756 1970 -2222 2530 -2910 3396 -4039 4930 -6260 8442 -12637
68a2637L6202j33931j04164K78251o6324q4272Q9735m431l0865N4375n9595K090
$$ -12637 23565 -110366 -214530 63721 -2603 -86875 2860 -1571 -32436 21939 -37656 -35566
80c5566J02872n5144r2825J10547K5395j00061L6595M7311n1586J5274M352k2326
$$ -35566 67306 12162 -80663 29884 55279 -44782 -8187 39124 -12462 2812 7164 -15162
92a5162L8426m183n0826K9671L5685l9812j9469M5156n825l4523K1708P433j2769
$$ -15162 23264 19081 -31745 -2074 33611 -6201 -25670 19486 13661 -20862 846 8279 -4490
105d490J4346j5848p292L0066j3250k3799K5382J2279k7308k240K5751j1729j1074
$$ -4490 9856 -5992 -13284 16782 3532 -20267 5115 17394 -9914 -12154 13597 1868 -9206
118i206J5041j0150L558J3425k5815Q467K3373k6007m113K2131p787r194N994
$$ -9206 5835 -4315 -757 12668 -13147 -4680 18693 -7314 -11427 10704 2917 -6277 -283
131b83K637k056J540l787l998J4223n517j5437J8551J957j6562Q617K360k265
$$ -283 2354 298 1838 -1949 -5947 8276 2759 -12678 5873 7830 -8732 -115 2245 -20
145b0K546p008L883N945p017j537L740L833m323o355R620L70o852K543J02L266
$$ -20 2526 -4482 -599 5346 -1671 -3208 532 4365 42 -6313 3307 3677 -3175 -632 -530 2736
161B736k142n355O805N70l942J92m91O078l898o227R127j573n041L738j589K982
$$ 2736 594 -4761 2044 2614 -1328 -1136 -1627 4451 553 -5674 3453 1880 -3161 577 -1012 1970
177A970n02n987N415K043l665j021J570L470m401j913N513k320l42l19k013O248
$$ 1970 1468 -4519 896 2939 -726 -1747 -177 3293 -1108 -3021 2492 172 -170 -489 -2502 3746
193C746l492m555O902j428k287J101j199L798k505k679L885m28j078r57o5M095
$$ 3746 254 -4301 2601 1173 -1114 -13 -1212 2586 81 -2598 1287 859 -219 -1176 -1241 2854
209B854l795j248L905j771M91j005o31M171l546j316L866k285O65r01p59L722
$$ 2854 -941 -2189 1716 -55 436 -569 -1200 2971 -575 -1891 1975 -310 355 -546 -1305 2417
225B417l050q67L054j468J43r11J07K618k927k2J966j454J496k627O46L124l459
$$ 2417 -633 -1500 1554 86 229 -682 -575 2043 -884 -906 1060 -394 1102 -1525 -879 2245 -1214
242a214P49J317j641J659j603L8K837l261L18J553r42J049j618O87J584k463O79
$$ -1214 -465 852 -789 870 -733 -695 2142 -1119 -801 752 -190 859 -759 -72 1512 -951 -272
259b72M83n36J469k578J264J710k848J619m0j086J792k158J042J362k246J160
$$ -272 211 -325 1144 -1434 -170 1540 -1308 311 271 -815 977 -1181 -139 1223 -1023 137
275A37j75k17J063j828J080R20k230J644o96L05P72j773J397M97j556Q89k76j04
$$ 137 -38 -255 808 -1020 60 980 -1250 394 -302 3 775 -998 399 896 -660 229 -47 -151
293a51J182k399J598O23j845J619r62L68J067k490J690N00j648J448j299P64O16
$$ -151 1031 -1368 230 853 -992 627 -335 33 1100 -1390 300 800 -848 600 -699 65 681
310F81j858J754r7j048J178j184Q53L64j626J693n09p81J122j164J006L44j504
$$ 681 -1177 577 480 -568 610 -574 279 643 -983 710 201 -580 542 -622 384 728 -776
327g76J072l25l15O77q17Q74p3j172J292o92O5P21j601J712m38q16J269o48l39
$$ -776 296 -29 -344 333 -484 390 317 -855 437 -255 -190 531 -1070 642 204 -612 657 9 -330
346c30P43j083J419q24p46J628r55j15N09o83R13m64n65R60j001P32J46p72J036
$$ -330 413 -670 749 -75 -821 807 -148 -263 246 -437 476 12 -553 407 -594 138 284 -488 548
365E48p41j99N82o68N69J70r41J385o77k86Q62j145P00j2o14Q95m59K2L23r67
$$ 548 -193 -392 190 -478 91 261 -680 705 28 -258 604 -541 159 147 -467 428 -31 -9 314 -653
385f53J007k64o11J149q38j8O41r91R90p83j25J371j209J42O44j025J263r58K4
$$ -653 354 90 -521 628 -210 -228 413 -578 412 -371 -496 875 -334 -192 452 -573 690 -268 -244
404b44R51j065O03j87m49P44p75K3Q45p82O05L3o88P58n92RP00r38N38q7k30L15
$$ -244 707 -358 245 58 -391 353 -422 -399 446 -336 269 302 -386 372 -220 -211 489 -449 89 2 -228 87
426H7k90K41K85p65N97j69l84J102j114L05K68o35O99n9n37N53n87M92J79n06
$$ 87 -203 38 323 -442 155 -14 -398 704 -410 -105 163 -472 227 168 -369 184 -403 89 268 -238
446b38P65o90j46N96r90J087l11o16P15l46k28R94j002P44l23o75R89m36J62L3
$$ -238 527 -163 -309 287 -703 384 73 -543 172 -174 -402 592 -410 334 11 -664 325 -111 51 84
466H4l70O78l24k31N95m05j9N0l62N63m43J3M72o36J12N41m83K76j76j03M80m04
$$ 84 -286 392 68 -163 432 27 8 58 -304 259 -184 -171 301 -335 -223 318 -165 111 -65 -168 312 -92
488i2J93K7m33O56l06n5J12l90L13J02m48M83l13k2K92j90J60j00p3J76k01l12
$$ -92 101 128 -305 351 45 -10 102 -288 25 127 -321 162 -151 -173 119 -71 89 -11 -84 92 -109 -421
510d21P32q71N91k30k83N69l78J94K35l96K62L2o3K52l18J36J95l67L85l82n6
$$ -421 311 -560 31 -199 -482 87 -291 -97 138 -258 4 36 -27 225 -93 43 238 -129 256 -126 -182
531a82M37n64l6O58l35J29k57L2L68m62M76m69q2K89k57M51j7l96M70m28k68O54
$$ -182 255 -309 -345 313 -22 107 -150 -118 250 -212 264 -205 -287 2 -255 196 179 -217 253 -175 -443 211
553B11k87L5K71o25N07m3l49M60l76K49o7k36L29Q5j93J8k11J44L3r5K43l11o4
$$ 211 -76 -41 230 -395 112 69 -280 180 -196 53 -14 -250 79 164 -29 -11 -222 -78 -45 -140 103 -208 -272
576b72L20n16O03j36p8J33l56M23K14o08L63p8Q8J17j45j54J55k42L32j2j90K78
$$ -272 48 -468 135 -1 -79 54 -302 121 335 -273 90 12 100 217 72 -82 73 -169 163 151 -39 239
598B39l26R7q8j52O62o85j43N83l48L58k03k24K50Jm24M45O3m5K51o36N36j4l46
$$ 239 -87 10 -78 -230 432 -253 -396 187 -161 197 -6 -230 20 21 -403 42 105 60 311 -325 211 197 -149
621a49K89k22K19j04j79M89m05o1J81l87N83k21j66K89m00N00q2l23M42j87K9
$$ -149 140 -82 137 33 -146 343 -62 -123 58 -329 254 33 -133 156 -244 256 174 -149 293 106 135
642A35l0j41K0L15o55M73l72J61L65k74N2j43J05l2j93j42N94n22J13M04j61j93
$$ 135 105 -36 -16 299 -356 117 -255 -94 271 -3 49 -94 11 -21 -214 -356 238 -284 -171 233 72 -121
664a21J6O1Lj46N16n20K49P8j14K14k5k20MJ51j88P1j06J43J03k36J00k38O9j01
$$ -121 -105 -44 -41 -187 329 -191 58 136 22 236 211 -9 -5 146 -42 29 -77 66 169 -67 33 -205 -136 -237
688b37J15L20j09m01N08l80M21j70j69J01K1k11J55k57P2Q0K11j7j80O5J72l23
$$ -237 -122 198 89 -312 196 -184 237 67 -102 -1 20 -191 -36 -293 -221 -141 70 53 -127 -62 110 -213
710b13K58J3k64K99k95L89l7j2k58L48j93j01Lq4J74P4l6J62k75J86l1m7j2r3
$$ -213 45 58 -206 93 -202 187 150 138 -120 228 35 -66 -63 -147 27 101 65 227 -48 138 107 60 48 -45
734d5J6j39K16Lj67J2J27k48K93j92J95L50n26J48q4J53k21J85j47K04k52J26
$$ -45 -29 -168 48 51 -116 -104 23 -225 68 -124 71 421 -105 43 -41 112 -109 76 -71 133 -119 7
756GO8j65j48K7K25M1j56K38j50N2Q5j89K8J41L5j70rJ03M5m19L78J60j94j88
$$ 7 75 -90 -238 -211 14 55 -101 137 -13 39 124 -65 -37 104 139 -31 -40 63 108 -311 67 227 33 -155
780a55J72l97K02J66k00J72J57k14J73l10K87o8p7J76l15L47k83J6J82O7k05K9
$$ -155 17 -380 -178 -12 -212 -40 117 -97 76 -234 53 -15 -92 84 -231 116 -167 -151 31 98 -107 -78
802g8p4J23l45J86L48j43Kr0j35K64jj10nJ26J28k59M9J89n8J2j8q4mK98l78L29
$$ -78 -152 -29 -374 -188 160 17 19 -71 -206 58 57 -53 -58 68 196 -63 -14 175 117 129 111 27 23 321 -57 272
828B72m14oJ09j73K70j21J0L8j09P6j08L4K68m32L19R1m57M48l6j28K45n53K60
$$ 272 -142 -148 -39 -212 58 -63 -53 -15 -124 -48 -156 -122 146 -286 33 124 -333 115 79 -49 196 -357 -97
851i7J97M3j82K00m79M37k32n6K61j10K63j60j33R2J55k02J00k17P2J48k7N2k60
$$ -97 100 143 -39 161 -318 119 -113 -169 92 -18 245 85 -48 44 199 -3 97 -120 -48 100 73 125 -135
874a35K95j51j16q7K81k9J19m51N56m62J28Q7j53j03j87L18K03j00j03O19o99
$$ -135 160 9 -107 -194 87 58 177 -274 282 -180 -52 35 -118 -221 -408 -90 113 13 -90 529 -170
895a70m1J25j63L73Q2k38J55j12R0K5j46J81q4k08R5P1K9O6k91J42J1J24J42n
$$ -170 -211 -86 -249 124 206 -32 123 11 101 126 -20 161 77 -131 -36 35 64 130 -161 -19 -8 116 258 253
919B53n3l34n2O4K69j20KK6K3L55l58L83m40O8o2k12K20L0m1r4Q9k26J70J16k4
$$ 253 200 -134 -186 -122 147 27 29 55 78 433 75 458 18 86 24 -188 32 62 21 -73 16 -210 -40 76 52
944E2K9j36L3M6l5O7l3pj45J18K78r2j75R7p4j12P0j51L93Qm7ml35j02O2J78o
$$ 52 81 -55 -22 24 -11 56 23 16 -129 -11 267 175 0 97 23 -89 -19 -170 223 231 184 180 -155 -257 -195 -17 -23
971b3J22P2k10J21J72k63j8m2q2J24J56k8j88J9q1k7L98j59J14lk74K97j33k6
$$ -23 99 171 -39 82 254 -9 -27 -69 -151 -27 129 101 -87 -68 -149 -176 222 63 177 174 -100 197 64 38
995C8j54Q3k21K53j38K48j18jpj91L30j54j26k6K00p8N3J48m84M38k23J93M0p8
$$ 38 -116 -33 -254 -1 -139 109 -9 -10 -17 -208 122 -32 -158 -184 16 -62 -9 139 -345 93 -130 63 103 25
1019B5K0k60K97o7j87J66J39L6j36j51LL90l75J87j40M07k94m03L46N1k26R9J99
$$ 25 45 -215 82 15 -172 -6 133 169 33 -118 -115 275 -100 87 -53 354 60 -343 3 54 -172 -73 126
1042A26k13J88j6m55L29K5rp1L28l52m2K25R9m13K81R8j96%l23M69k02K73j38
$$ 126 -87 101 85 -370 -41 -16 -25 -96 232 -120 -162 63 162 -251 30 128 -68 -68 -391 78 -124 149 11
1065A1r6K75m8k1j14k05K20o1K74k56k79J23J74Rj20R2J55J05n65P3M7J19J36
$$ 11 -85 190 142 121 7 -198 22 -39 235 -21 -300 -177 -3 6 -114 -22 133 238 -327 -254 -207 -88 48
1088D8j22K64j64J08M3j73j1r5N7n0J91q7Nl4J89j72K5j21k2M46m82N8n0OK16
$$ 48 -74 190 26 134 177 4 -7 -102 -45 -95 96 9 14 -20 169 -3 22 -99 -121 325 -157 -99 -149 -143 73
1113G3N8l51L71j23J36k82J91k89J37K85k86l2R7L12k39k89K85j69J86%l58K91
$$ 73 131 -220 151 28 164 -118 73 -216 -79 206 -80 -112 -15 297 58 -231 54 -115 71 71 -287 4
1135Dn9K67l66K13j28J31J74k43rj90K01j02M45l90Pk4L40k16Q6j13j24K75j1
$$ 4 -55 212 -154 59 -69 62 236 -7 -16 -206 -5 -107 338 -52 -45 -69 271 55 141 28 -96 179 168
1158A68k25K72l97L58j3pJ13k50j17K0J72o8J20L2R9l11K39k15RL9L59l61r3o0
$$ 168 -57 215 -182 176 163 156 269 19 -98 -78 94 26 146 178 277 -34 205 -10 -1 38 397 36 -57 -117
1182a17j28K04K57k64j83K37k13J1J08J77J0p2k38J31o4J56j61J24j02P4P7K0
$$ -117 -245 -41 216 -48 -231 6 -207 -196 -88 89 99 27 -211 -80 -144 12 -149 -25 -127 -53 24 44
1204D4J58l76K17k47L87k33K4O5k18J93o0j44J96j21L47m00K27M8l37K17n3J3
$$ 44 202 -174 43 -204 183 -50 -26 39 -179 14 -46 -190 6 -115 232 -168 59 107 -230 -13 -66 -53
1226e3j38K44Qk7o8R9m0J44o2Jk05L78l81L37l27K76j50m6J84O1m20M21k9m54
$$ -53 -191 53 61 34 -34 65 25 169 107 108 -97 281 -100 237 -90 186 36 -10 174 235 -185 236 207 -247
1250b47J18J9L06k61P2K53l54J10mk05M3J84l61J87J55OK2K61m53K4J91J14j97
$$ -247 -129 -110 196 -65 7 260 -94 16 12 -193 -150 34 -327 -140 15 21 43 304 -149 -125 66 180 -17
1273a7n7J36j20Q3l6O3r1Q6j66L32j03j51R6l8k18K76J73j83k23Q0K29Q0m46K6
$$ -17 -74 62 -58 25 -11 52 -39 47 -119 213 110 -41 55 17 -201 75 248 65 -158 -78 151 231 -215 -189
1297a89N47l84L62l47N7r3J57j59N7j21K73j60m2j0l1K95q8j0j43p1M62m59p3
$$ -189 358 -26 336 -11 46 -47 110 -49 8 -113 160 0 -42 -52 -83 212 124 114 -29 -100 362 -97 -170
1320a70j31K56Q4J21j50J4k3L8Q4j97J17k16K57m1l90M59J9o0M4j82J07R0r0R0
$$ -170 -301 -45 39 160 10 24 1 39 123 -74 43 -173 84 43 -347 112 131 71 115 -67 40 130 40 130
1344A30M1k66K10k01J72L7k63J6J27k31J68N6J65j35J45k11k08M33l36J56J79
$$ 130 171 -95 115 -86 86 123 -140 -124 3 -228 -60 -4 161 26 171 -40 -248 185 -151 5 184
1365A84l23Pj52L80p3lk98M93J26l52n1o3K29l69K48l1J48j43M7o6J49k0K40j79
$$ 184 -139 -132 -284 96 23 20 -278 215 341 -11 -62 -125 104 -265 -17 -48 100 -43 4 -62 87 67 307 128
1389A28j96K15n6k84j0J27p4R4P9M1m28L63j74J50J68j55m3J73k28J28n2K8n7
$$ 128 -68 147 91 -193 -203 -76 -150 -56 23 64 -364 -1 -175 -25 143 -12 -55 118 -110 18 -34 -6 -63
1412f3K12j77K1n6j83K89J44l48J73Pq9L06k16r5J46j09J33J0k38J77l45J97K56
$$ -63 149 -28 -7 -63 -246 43 187 -161 12 19 -70 236 20 -75 71 -38 95 105 -133 44 -301 -104 152
1435A52k80J74J41l06J7k05L00p0j42K95m06J57L13l03J40J85j39k32M70j15k56
$$ 152 -128 46 187 -119 -102 -307 -7 -77 -219 76 -330 -173 140 -163 -23 162 23 -209 261 146 -110
1456a10K88j67j44M0K8J06j78K07L10m08K6o4m1P5n1jk54L67P3m3J82n24K62K3
$$ -110 178 11 -133 -93 -65 41 -137 70 380 -28 -2 -66 -107 -32 -83 -84 -338 29 102 59 241 -283 -21 2
1480Bj82kM48k24l73K22P0K84j25j25j02p4N7Q9k17K49K19j93J3J6k35K25j58
$$ 2 -180 -182 266 42 -331 -109 -39 245 120 -5 -107 -181 -124 -35 -252 -3 216 23 36 52 -183 42 -116
1503a16K66k54l0J92j98r7R9K74j7Jj00L0J34k23j05L24l08J66J33j62J94j69
$$ -116 150 -104 -134 58 -140 -237 -138 136 119 120 20 50 184 -39 -144 180 -128 38 171 9 203 34
1525C4j42J39JO0j32j19r4L84q3m28M24q2n1n1J59k0j25P7J18R5j26J11j88Q9
$$ 34 -108 31 32 92 -40 -159 -253 131 48 -380 44 -38 -89 -140 19 -1 -126 -49 69 164 38 149 -39 50
1549E0K1l7m4p4J08l09K01J92P5k14J16j80qJ14m9K41l50k33L90p8L7r6J09j95
$$ 50 71 34 -10 -84 24 -285 -84 108 183 -31 85 -95 -103 11 -38 203 -147 -380 10 -68 -31 -127 -18 -213
1573b13K7J19K3L4K49k05k7J27k88j13N3L6K42k63L39n0Q1j99J24j12j85L33j92
$$ -213 -186 -67 -44 -10 239 34 7 134 -154 -267 -214 -178 64 -199 140 90 171 -28 96 -16 -201 132 -60
1596f0L7K8o5J27k90L67n54M03J5n5J03J80m72j00L25p5J94l61L09n3K32m93K37
$$ -60 -23 5 -60 67 -223 144 -410 -7 8 -47 56 236 -236 -336 -11 -86 108 -253 56 3 235 -258 -21
1619b1P7P4j23J29o4J8r4r4R1j8K26k74P0jN0p8P7j37K08j10K71m30L09j08k45
$$ -21 56 130 7 136 72 90 -4 -98 -7 -25 201 -73 -3 -4 46 -32 45 -92 116 6 277 -153 156 48 -197
1644a97K01Rj54N9O1N0r9K25q2L4oN7k31M37j14l56R0J29k06J7J39qO3N7l8J0
$$ -197 4 13 -141 -82 -21 29 -70 155 73 107 101 158 -73 364 250 -106 -16 113 -93 -76 63 55 118 175 137 147
1670A47j49N4J0q5O1J74k87k11M59j96q4n3J33j17K00r6l2l3J23k2j12L3o5L93
$$ 147 -2 52 62 -23 38 212 -75 -286 173 -23 -107 -160 -27 -144 56 -40 -72 -105 18 -4 -116 -83 -148 245
1694B45l31o6J74j84p8K18k1K27l00j90K26k5L8k21J09J24J57k01K42K01k57k98
$$ 245 -86 -152 22 -162 -240 -22 -43 184 -116 -306 -80 -105 -67 -288 -179 -55 102 -99 143 344 87 -211
1716b11K96k4k78R6J82k38M16j59k8P8j88j5K03l7O2n2J04n9j72j93L13J0k50
$$ -211 85 61 -217 -121 61 -177 239 80 52 130 -58 -73 130 93 155 103 207 148 -24 -217 96 106 -144
1739a44M25l92M28k68j90L2J00k6J92k43K39K5O8l10l8J62j89K97j28qr2N3J85
$$ -144 281 -111 317 49 -141 -109 -9 -35 157 -86 153 178 246 -64 -102 60 -129 168 40 32 -60 -7 178
1762A78j24j90J21j05r4J58K2J44o8J46j41J13j45j71J22k3J62Jl15N8J92P2j62
$$ 178 54 -136 -15 -120 -214 -56 -34 110 42 188 47 160 15 -156 -34 -57 105 106 -209 -151 41 113 -49
1785d9J72m7l3j54J21L03m92K6L20K46j57n49J71J83j22l9K42k75J6J48q9J25
$$ -49 123 76 43 -111 10 313 -179 -153 167 413 256 -293 -122 61 -61 -100 142 -133 -117 31 -58 67
1807F7Q5j51M9O0j64K46j69j89K17k50L15k63J28jj94M17J15k77l8J4j7J03r6
$$ 67 152 1 50 110 -54 192 23 -166 51 -199 116 -147 -19 -20 -214 203 318 41 3 17 0 103 7
1830GJ40l62J54K16j27L30m27K04j2L8l89K58J%J31j23O5J10m5j84l4O0O9k37
$$ 7 147 -215 -61 155 28 358 -69 135 123 161 -228 30 31 31 162 39 104 214 169 -15 -49 11 80 -157
1854a57J21L5j44o2J74J54J02k50O2m8K6M7N3J9j5j33j36L27k64J00k20J5K93
$$ -157 -36 -1 -145 -207 -33 121 223 -27 35 -13 13 60 113 132 117 -16 -152 175 -89 11 -209 -194 99
1877I9k17K20m4j41r7L07k50K94k61J82o9J25J39m51J74l8N6j54n0L63m49L45
$$ 99 -118 102 58 -83 -180 127 -123 171 -90 92 23 148 287 -164 10 -28 28 -126 -176 187 -262 83
1899H3o7j32JK63j87R1k22K32n4j09J81L4j66J54k33J85N9K3m5j10k27M20l17
$$ 83 16 -116 -115 148 -39 52 -170 62 8 -101 80 114 -52 102 -131 54 113 136 91 -19 -246 174 -143
1922a43j66M36j97J46j64L42j48K11L3k2m48O2K96m58J91O0Q9L1k74L42m38L22
$$ -143 -309 127 -70 76 -88 254 106 317 350 328 -120 -58 238 -220 -29 31 120 151 -123 219 -219 103
1944A03Rk36M55l90k4J01p0LM04l90o6J13k81O67k26j07l40K2L4J62k28P2K84
$$ 103 112 -124 331 -59 -83 18 -52 -49 355 -35 -101 12 -269 398 172 65 -275 -253 -219 -57 -285 -213 71
1967G1J24k19M5p3r1j17J38J10L4J27l59K25Q3m4j77K02j29K03j98j22j7J19R0
$$ 71 195 -24 21 -52 -143 -260 -122 -12 22 149 -210 15 98 54 -123 79 -50 153 -45 -167 -184 -65 25
1990B5k5O2p3q4P9K23J98m22j79j48K08K31k55P3J61r2N4q3lj41N4p8R9K00O8
$$ 25 0 62 -11 -95 -16 207 405 -17 -196 -344 -136 95 -160 -87 74 -18 36 -47 -50 -191 -137 -215 -116 84 152
2015A52k44J86l66M84k08oJ64l4j46qJ54k10L1R7O7j37k3K45k35j2K14J28l13
$$ 152 -92 94 -272 212 4 -2 162 128 -18 -26 128 -82 -51 46 113 -24 -47 198 -37 -49 165 293 -20
2038b0L8m26L24J17J57l95M0m4J80N1n2J08j09Pr7J82n0p1j83M31k52L1K02o7
$$ -20 18 -408 -84 33 190 -205 -165 -209 -29 22 -30 78 -31 -24 -121 61 11 -60 -243 188 -64 -33 169 102
2062A02q7j10j25L15j88K67p0J62j15j15J1m43M84l2q3r3K82N9l75K69l07p0K82
$$ 102 15 -95 -220 95 -93 174 104 266 151 36 47 -396 88 56 -27 -120 162 221 -154 115 -192 -262 20
2085B0j12J37j69J52K30j54J96k09o0Ql8l8j58K35J88k19j99J24N7j35J73Lk20
$$ 20 -92 45 -124 28 258 104 300 91 31 39 1 -37 -195 40 228 9 -190 -66 -9 -144 29 32 -188
2108a88R4n6j17N37k11j69k0K75J38k34j42L6j20P4J73K32l52L0o1R7J00k14j11
$$ -188 -94 -150 -267 270 59 -110 -130 145 283 49 -93 -57 -177 -103 70 302 -50 -20 -81 16 116 -98 -209
2131b09o0J35q8L63j58O6j98K60k39K36qj94K58M0l1j37j49J08j4j15L38j94j49
$$ -209 -269 -134 -222 141 -17 49 -149 111 -128 108 100 -94 164 204 173 36 -113 -5 -19 -134 204 10 -139
2154a39k3O0J80m4kR5j40oJ30j30K22k49L70k11jK3m68M97r6J63j07n2k03K34
$$ -139 -162 -102 78 34 32 127 -13 -19 111 -19 203 -46 324 113 112 135 -333 164 68 231 124 72 -131 103
2178A03j03n7J11p4N3k48J18J21n7k29L10J12j17K7R4k38K93j53k66M2K33k53
$$ 103 0 -57 54 -20 33 -215 -97 24 -33 -262 48 160 43 70 164 -74 219 66 -200 -158 75 -178
2200a78K30j3n3K08k54j4K44j86OM0l1P7Q5j72j17J04p6K49j22kj05J98m30K02
$$ -178 52 39 -14 194 -60 -74 170 -16 -10 30 -1 76 161 -11 -128 -24 -100 149 27 25 -80 118 -312 -110
2224a10K0Nj41O0J17m4J45p4k0j17M07k62q9J23j04j71L81j53j16K13J95k96j8
$$ -110 -90 -85 -226 -166 -49 -93 52 -22 -42 -159 248 -14 -103 20 -84 -255 126 -27 -143 70 265 -31 -49
2247d9M2m7N4L0l5K18j90k03N0O4J47k7R1j41J01l3j84K31K7j83J10L3m6N8K4
$$ -49 -7 -54 0 30 -5 213 23 -180 -130 -66 81 54 145 4 105 72 -112 119 146 -37 73 106 60 118 142
2272A42l9lR7k77J56K25j57l73Q0J60q4k18M26o6j26L9O8L0J76m56K40J10j09
$$ 142 103 100 197 -80 76 301 144 -229 -149 11 -73 -291 135 69 -57 -18 50 80 256 -200 40 150 41
2295D1N9j97N5J90k1j85M2l28K07L13k23J84k6j34J0l5J71j5M7l80L15O4k58N9
$$ 41 100 -97 -42 148 127 -58 -16 -344 -137 176 -47 137 111 -23 -13 -48 123 108 155 -225 90 154 -104 -45
2319d5J15o8Q6r0r8j34N00k41J2r1p2j65K65mj56L82m00J28K44L9l22R7K28l45
$$ -45 70 2 88 -2 -100 -234 266 25 37 -54 -126 -291 -26 -30 -186 196 -204 -76 168 207 -115 -18 210 -135
2343a35K02k58J75J54k19K98k64j58L70j32J43j48l2k45N47p3k06J22p3q6Q0j9
$$ -135 67 -191 -16 138 -81 217 -47 -205 165 33 176 28 -4 -249 298 225 19 141 68 -18 62 43
2365D3j32l2n8K98o2j89N3K53k02L7J51j18n7J12p4j13k34K69M3q6J74m35J59
$$ 43 -89 -121 -179 119 57 -132 -79 174 -28 9 160 42 -15 97 23 -90 -324 -55 -12 -98 76 -359 -200
2388b00J31N3j04p4J62k02J57K16r4j44P9K1M2L5N8Qj08q6j38N0J83J8j4q6j5
$$ -200 -69 -16 -120 -194 -32 -234 -77 139 45 -99 -20 1 43 78 136 144 36 -50 -188 -138 45 63 49 -37 -52
2413e2n2m9K44l39M0J74K25n1j1k37J30j2o4L85m95K58j18J55k2j36j34R0J35
$$ -52 -104 -153 91 -248 -208 -34 191 140 129 -108 22 10 -54 331 -164 94 -24 131 109 -27 -161 -71 64
2436F4N2p6n8Q1J62k86R9q5J88l38R9K99k49J73k80J86ko4Q6k3k25K21M7j80J62
$$ 64 116 40 -18 63 225 -61 38 -47 141 -197 -98 201 -48 125 -155 31 29 -35 51 28 -197 24 71 -109 53
2461E3j54J06o9K93k18J58j45J15o7l34J11K18j3N8j86K71l01K49m26K17L00p8
$$ 53 -101 5 -64 229 11 169 24 139 72 -262 -151 67 54 112 -74 197 -104 145 -281 -64 236 158
2483A58j53m8m1j70L59P5j29N5j50K48j68N0l3OK8N4j46n4r0M4K71k68J77l53
$$ 158 5 -43 -84 -254 105 180 51 106 -44 204 36 86 53 59 87 141 -5 -59 -149 -105 166 -102 75 -278
2507b78K90K48j74j5r9J85j60J36k36J63j14L19j93j67J35Lq7K0QJK2L1j3m8O8
$$ -278 12 260 86 71 -28 157 -3 133 -103 60 -54 265 72 -95 40 43 -44 -24 -16 -15 7 38 25 -23 45
2532D5J26l1k74J01K19M4l25K22j19NM5l44L79l28L06m6J1k13K94m42M18l24K98
$$ 45 171 140 -134 -33 186 230 -95 127 8 13 58 -286 93 -235 71 25 36 -177 117 -325 93 -231 67
2555F7l5j28L3J73r0j23j3L57m11K29k09L01j09j90J32J76l09R3N9j45K76j19
$$ 67 32 -96 -63 110 20 -103 -116 241 -170 59 -150 151 42 -148 -16 160 -149 -56 3 -142 134 15
2577A5q7L79m00J9L57k56L4j37K05k76N7J86k81J26R8q8K7L6k4k56N34l51N0N9
$$ 15 -72 307 -93 -74 283 27 61 -76 129 -147 -90 96 -185 -59 39 -49 -22 14 -10 -266 268 -83 -33 26
2601B6m8J11j61O1K47k98Q2j06K02j34J00k40R4J17Q1l06K42j46M2J05j14K0o2
$$ 26 -22 89 -72 -11 236 -62 20 -86 116 -18 82 -158 -64 53 134 -172 70 -76 -34 71 -43 -23 -85
2624h5L5j31K06L1K22j34j64J78k73MK93j76O6l07K11L28j20l06K93k35J01M2
$$ -85 -50 -181 25 56 278 144 -20 158 -115 -111 182 6 72 -235 -24 304 184 -122 171 -64 37 79
2646G9m5n6n1R1O7l07K10l6J94m4k10R1Q2l46K64l9k4J53K01l25M75r21N23J80
$$ 79 34 -22 -73 18 85 -222 -12 -48 146 102 -108 -17 65 -281 -17 -56 -80 73 274 -51 424 -497 26 206
2670B06m69p0L29J36j84j62J70J5n5L7K03m50M65m45K19r0L52n4j02j96K11m6
$$ 206 -263 -333 -4 132 -52 -214 -44 -29 -84 -47 156 -294 171 -274 -55 -145 207 153 51 -145 66 20
2692B0m7m9J32L07m21l9L2M3L7j84n9q0L08P4K5N0j59m0J73j08J93k43Q6K04k86
$$ 20 -27 -76 56 363 -58 -97 -65 -22 15 -169 -228 -308 0 74 99 149 -10 -50 123 15 208 -35 51 255 -31
2717c1r2k28N52j37J97j06k61j60K64j30J05J29k79J21O3J54j30j45K96k2k08
$$ -31 -123 -351 201 64 261 155 -106 -266 -2 -132 -27 102 -177 -56 7 161 31 -114 182 160 -48
2738d8J09p4J27L9k04j11R9p4R3j35J99M6j63J01R2k51M23m75L87j48R9k91j50
$$ -48 61 -13 114 153 -51 -162 -63 -137 -44 -179 20 66 -97 4 96 -155 268 -207 180 32 131 -160 -310
2761c10M80l87L36p0j0l09N80l96L03j07r2O4O7q5K42j81j9k69n4L44p1k81J43
$$ -310 170 -217 119 49 39 -270 310 -86 217 110 18 82 149 64 306 125 106 -163 -217 127 56 -225 -82
2784h2P1Qj23J16O9m0O4P4k50J04p3J36M4j60l1Q1R9K15k00j13O4k07Pr2J01j1
$$ -82 -11 -3 -126 -10 59 19 83 157 -93 11 -62 74 118 -42 -73 8 107 322 122 9 73 -134 -127 -219 -118 -129
2810a29j8J94J9n4N1m4k08J61k56P6l3K84o4j60K13j96J52o1n4Q5q1J13j86J42
$$ -129 -147 47 66 12 63 19 -189 -28 -284 -208 -241 43 -21 -181 32 -164 -12 -73 -127 -42 -123 -10 -196 -54
2834e4O8j00K93k11j10K59k74L32n30L06m6q8K89k84L41k42j37K73j31J4j51L33
$$ -54 14 -86 207 -4 -114 145 -129 203 -327 -21 -67 -155 134 -150 191 -51 -188 85 -46 -32 -183 150
2856A50j80J02L4j94L66r3k24k3J21J06m00L17k11n0K2L16l6k32K78l45L59n7
$$ 150 -30 72 106 -88 278 185 -39 -62 59 165 -235 82 -129 -179 -157 159 123 -109 169 -176 183 126
2878A26k13JJ80k96R1J40q3j87M52o30M86J83j04k35o2K36j03n1J1j1O5RJ57j19
$$ 126 -87 -86 94 -202 -111 29 -54 -241 211 -419 67 250 146 -89 -151 85 -18 -69 -58 -69 -4 5 162 43
2902D3j42L8L7J09K6m25J03K92j1k5m1J58k51K7r4J15R6J27k63k90M94j80m7N4
$$ 43 -99 -61 -24 85 111 -314 -211 81 70 45 4 162 -89 -62 -156 -41 55 182 -81 -371 123 -57 -104 -50
2926e0j45J71R0k45N0j32K39j92K28jJ81Qk81j02J61K76o9j24j76K6J53j32k0
$$ -50 -195 -24 66 -179 -129 -261 -22 -214 14 13 194 202 -79 -181 -20 256 187 63 -113 -87 66 -66 -86
2949h6R2J37l24j7K36j2m14L45J28j16R5j34L22j40r0O7j97O8k8k9K31j58N3J25
$$ -86 6 143 -181 -198 38 26 -388 -43 85 -31 64 -70 252 112 22 89 -108 -40 -68 -97 134 -24 29 154
2973A54L6k44N3O0p6K57j95R0N5o4N8J7j82rj6N5q1O9p8J21k19K96o2j56j9l5
$$ 154 190 -54 -1 59 -17 240 45 135 190 126 184 201 19 10 -6 49 -32 37 -41 80 -139 157 95 -61 -80 -115
2999a15J67l0r8J64j61L18j78j21M2j8l0L55l19N9j94J63l7p4J16j08K11k53N72
$$ -115 52 22 -76 88 -73 245 67 -54 -12 -30 -60 295 -24 35 -159 4 -33 -107 9 -99 112 -141 431
3022D31l37l63L49l9j8L12l05J3o9L15J3k32l11K21j6R7k20L48j9P1j12p3k82
$$ 431 94 -269 80 41 23 335 30 43 -26 289 302 70 -241 -20 -36 61 -159 189 170 241 129 56 -226
3045b26%K69k19K00M5j60M2K44j58R3q9P6k87O5J74j43J55k34R4J01o7j51L02
$$ -226 -226 43 -176 24 69 -91 -49 195 37 130 41 117 -170 -105 69 -74 81 -153 -59 42 -25 -176 126
3068A26oq7o3m69N18N1k22%K4n2K98j63o3R8P0k4L7J8M7j27Q9j23P6j2K3o1j15
$$ 126 120 33 -30 -499 19 70 -152 -152 -128 -180 118 -45 -108 -10 60 36 73 91 138 11 100 -23 53 41 64 3 -112
3095a12N1J43j36J70J1n7l30qJ06J72p0O2K7k01K98J69l65J66k5J47j96QP1o0
$$ -112 -61 82 -54 116 127 70 -260 -268 -162 10 -60 2 29 -172 126 295 -70 96 71 218 22 30 101 41
3119D1l4l7J2n5Q3R2JJ33j70k31J12k5R4O1j93J33j3J83j28j62J19nMO6o6o5J24
$$ 41 7 -30 -18 -73 10 102 103 236 66 -165 -53 -78 16 77 -116 17 4 187 59 -103 16 11 15 81 15 -50 74
3146G4j71j6P1P6k00N0jK30n9J90k63j34J28m4M0r3J41k83L23Mk49M05Q4k70N
$$ 74 -97 -113 -42 34 -166 -116 -117 113 54 244 -19 -153 -25 -69 -29 -122 19 -264 59 63 -186 219 303 33 38
3171C8Qm67M92J05m24M02k52K28J2K9k53O3M2l5JM9J9l03J67M9k0J06j70m7J37
$$ 38 46 -421 71 176 -248 154 -98 130 142 171 -82 -19 23 -12 -11 38 57 -246 -79 -30 -50 56 -114 -161 -24
3196b4j55K22O1m5l46J94K72k4r4K1j75m9J99j13k9J96q0k6j3j2J5nj81K30j26
$$ -24 -179 43 104 59 -287 -93 179 155 61 82 -93 -142 57 -56 -85 111 31 5 -8 -20 -5 -10 -191 39 -87
3221h7L1M4J28j54O4j12J18j52L32n4j68Q7n6J09l8q7Qm9K16j95k34O04l16J8
$$ -87 -56 -12 116 -38 26 -86 32 -120 212 158 -10 77 21 130 92 5 13 -36 180 -15 -249 355 39 57
3245E7Q5j19o7K58l0k83K35l64Q9J25N5j88l1J13j5L45j99J37j72q4m2p6K84j9
$$ 57 142 23 -44 214 184 -99 136 -228 -139 -14 41 -147 -178 -65 -80 265 66 203 31 -53 -95 -171 113 94
3269I4m4l21K39K81l7m01J44P6n0K18o6J56k4l45J07J56m76L96k12K07L0k41K24
$$ 94 50 -271 -32 249 212 -189 -45 31 -19 199 133 289 265 -80 27 183 -293 103 -109 98 128 -113 111
3292A11Q6l88L07j40O6l99J96J33l5r1Q6LK09j32P6n5o3qj5jJ91r2k00r5J89J8
$$ 111 197 -191 116 -24 42 -357 -161 -28 -63 -154 -68 -65 144 12 88 33 -30 -38 -53 -54 137 45 -155 -250 -61 -43
3318d3O0L2R4O7k63k0K6J49l76L47k00Q0R8j07K21k42K3J67q3J77l21L38j31j52
$$ -43 17 49 143 210 -53 -73 -47 102 -274 73 -127 -47 51 -56 165 -77 -54 113 30 207 -114 224 93 -59
3342e9J7Q6J99k28k78K92p5R6l61J53J28p4J71j06J68m07KqM00L8m79K80k7J46
$$ -59 -42 44 243 15 -263 29 -46 50 -311 -158 -30 -104 67 -39 129 -278 -276 -284 116 154 -325 -45 -72 74
3366G4j15jM1O8R1m2r3j58O3K12Q3k40k3M92n90j53L46J72J8j56l71J65M0MJ92
$$ 74 -41 -42 -1 67 158 116 23 -135 -72 140 223 -17 -40 452 -138 -291 55 227 245 89 -282 -117 -77 -73 119
3391A19J00j84j35L81l79K80k45K02J7k00J35K16n78J67O1L8j55J35K1m3j36J81
$$ 119 219 35 -100 281 -98 182 -63 139 156 -44 91 307 -271 -104 -43 -5 -160 -25 -4 -47 -183 -2
3413bl5j60L31k6r9m2O0k59K85j06r9K7J38m4j4L0J19R0J3K7j84j84K92k1j49
$$ -2 -37 -197 134 108 9 -33 27 -232 53 -53 -152 -125 13 -31 -45 -15 104 194 207 234 50 -134 158 137 -12
3438a2l9j93L32k07R3j61M6j6K4J07Q1j22j59P8J23J13l2j75K16Nj0m47M85K2
$$ -12 -51 -244 88 -119 -26 -187 -141 -157 -133 -26 55 -67 -226 -148 -25 88 56 -119 97 102 92 -355 130 152
3462A52l74K19K78n02Q3J24j29L30j21rj43J63J39n9q0J3j9k45K53r1O8K94m25
$$ 152 -222 -3 275 -227 -144 -20 -149 181 60 51 -92 71 210 151 71 84 65 -180 73 -18 50 344 -81
3485h1Q4R8n5r2Q8k27k9N0J64J11p1j24J7K2j94J26J97O9k30K37q1N7j42Oo9K77
$$ -81 3 101 46 -46 42 -185 -214 -164 0 111 40 -84 -67 -45 -239 -113 84 153 -77 160 79 136 -6 0 -69 208
3511B08j75qj4L9R8l08k1K63p4J38N3k37qJ9R4l2J03p5P5j23p7K8N2q7J02J15
$$ 208 33 25 11 50 148 -160 -181 82 8 146 199 -38 -46 -27 67 35 138 63 138 15 -62 -34 18 -69 33 148
3537A48q7l85O97l55l56L69P4J52o0l53n2K34j14j29J44K4l2K24k08P8k9RK0r2
$$ 148 61 -324 373 18 -338 31 105 257 197 -156 -208 26 -88 -217 -73 -49 -81 143 -65 13 -16 -7 13 -79
3561g9Qj33K50J48l12J95K0j90q6K01k50m8K39j2j46J94j28j00J48L1K4j5K50
$$ -79 -71 -204 46 194 -118 77 97 -93 -179 22 -228 -276 -37 -49 -195 -1 -129 -229 -81 -50 -26 -41 209
3584B09k21q0p4K80k59K06j34K89K8l49K69l23J98Q4j00m3o8o4J35k15J39k3L66
$$ 209 -12 -92 -166 114 -145 61 -73 216 244 -105 164 -159 39 123 23 -20 -88 -152 -17 -232 -93 -116 250
3607B50j47j79n5J76j25L09l87K02o4q8Q0L16l78K50j83j79K28M8Q5m05J35j38
$$ 250 103 -76 -131 45 -80 229 -158 44 -20 -108 -28 288 -90 160 -23 -202 26 74 159 -246 -111 -249
3629b49J40l5n3K95j36r9R7l9K90l65N6K55j42J2q9o1RJ63K77l57O4o6K71k70
$$ -249 -109 -144 -197 98 -38 -137 -40 -79 211 -154 -98 157 15 27 -62 -123 -114 49 326 -31 33 -33 238 -32
3653c2j5K88k82kqP5j60K72j29k10j16K32m2K06m1L3l20L09j12O5j49J92j95J99
$$ -32 -47 241 -41 -43 -51 24 -136 136 7 -203 -319 -87 -129 77 36 69 -251 58 -54 11 -138 54 -141 58
3677E8O4k79J29J45r3J51l04J73l3j02L12l88J16j65K73l10Q4K70R1P4k18Q5l10
$$ 58 122 -157 -28 117 24 175 -129 44 11 -91 221 -167 -51 -216 57 -253 -169 101 192 266 48 133 -177
3700a77J20Q3K23j17j5n1L1k48J46k20L52k62J89J6q4j27K21J47j91l61N92k12
$$ -177 -57 26 249 132 117 66 97 -151 -5 -225 127 -135 54 70 -14 -141 80 227 36 -325 267 55
3722E5j15j20K5J52l62L89K0j76J62j95l7p6K61K84n50L75j18j5J3K56k66p4J92
$$ 55 -60 -180 -155 -3 -365 24 44 -132 30 -165 -202 -278 -17 267 -283 92 -26 -41 -28 228 -38 -112 80
3745H0j14J75m02M01k38L47n05J69L28k29k5m6J0J51J73l10j37K44J4j65J21m0
$$ 80 -34 141 -261 140 -98 249 -256 -87 241 12 -13 -59 -49 102 275 -35 -172 72 86 -79 42 2
3767BJ32n8p1p0o1J12j50j9J58K7N2j25R0J95l09P3O0j71L24l65M42j41M2N5q8
$$ 2 134 76 5 -65 -126 -14 -164 -183 -25 2 54 -71 19 214 -95 -22 38 -133 191 -174 268 127 169 224 136
3792A36k70J63R4p4k89M25j41k41K85M6j4l05K90k01K05k11j45L1L37m81K48O
$$ 136 -134 29 123 49 -240 185 44 -197 88 134 120 -185 105 -96 109 -102 -247 -216 121 -360 -112 -106
3814a06O7N4J49P5m06K04k31K96l9J26m47K88P2n2J31k37j76K4L88m48K93mk2
$$ -106 -39 15 164 239 -167 37 -194 102 63 189 -258 30 102 50 181 -56 -232 -208 180 -268 25 21 -1
3837aj53J93m2J12J4p0K16l77J65j0n9l0L48k95p5J9L16k97j05J06J31j46j1K01
$$ -1 -154 39 -3 109 123 53 269 -108 57 47 -12 -42 306 11 -64 -45 271 -26 -131 -25 106 -40 -51 150
3861A50k12K07k56qQ6K7m10O55l91J7L11J7k71K7l4J75j27l4J48r8J27l6K14l13
$$ 150 -62 145 -111 -119 -33 -6 -416 239 -152 -135 176 193 -78 -51 -85 90 -37 -71 77 -21 106 70 284 -29
3885b9J70jn0k10J33m4N2J31n7j93K52J2j98j79J78K8J22p0O3m28J98rJ3k1J66
$$ -29 141 140 90 -120 13 -31 21 152 95 -98 154 166 -32 -211 -33 -5 117 47 110 -318 -120 -129 -116 -137 29
3910B9J51l0k00J77ll03K87m0p0m0K95j73N4J65k84k09M40l35k0R8m4l5p7K77
$$ 29 180 150 -50 127 124 -179 108 68 -2 -42 253 80 134 299 15 -194 246 -89 -109 -11 -55 -90 -167 110
3934A10M1k66Q5K06j41Nm7o8J22J21Q7j91q7P4j85m3L30o5P7m38M60k05J06k48
$$ 110 151 -115 -30 176 35 40 -7 -75 47 168 255 64 -23 51 -134 -177 153 88 165 -273 187 -18 88 -160
3958a60K29j92J71L06k92j7j33L71k31k41J36j87L03j13M5J89m6Ml48L1J79j6
$$ -160 69 -123 48 354 62 45 -88 283 52 -189 -53 -240 63 -50 -5 184 138 142 -206 -175 4 -12
3980a2J8j5K0j43K7P4N3N7n9J5p9P8R9k87K7J71m31L73n2n9J98nj1k4J2J28k58
$$ -12 6 -9 11 -132 -105 -31 22 79 20 35 -44 34 133 -154 -127 44 -387 -14 -66 -125 73 68 57 33 45 173 -85
4007h5J20J16j82O0k35K04O4o1o5oN1jM8r6k38K25Q9m6K31m13K90n8k9j40R3j07
$$ -85 35 151 -31 29 -206 -2 62 1 -64 -70 -19 -20 28 -68 -306 -81 8 -38 193 -220 70 12 -17 -157 -64 -171
4033a71J6J9K77k95L02j7k72J17l7J47R2q5j01J65j53k5Q3m2K24j74Q2l47J37
$$ -171 -155 -136 141 -154 148 131 -141 -24 -61 86 178 93 -8 157 4 -21 62 20 244 70 152 -195 -58
4056e8O3J3j59O1K16k51k3K29O6J03l08L35j62k60K14k61J8J15Q9n6k86L26J07
$$ -58 5 18 -141 -80 136 -115 -138 91 157 260 -48 287 125 -135 79 -182 -164 -49 40 -16 -302 24 131
4079A31j66q4J0j0l1K36l9m4J58o7l60K0K33M6J3K42k82J3l7j49J41K42j04m2
$$ 131 -35 -119 -109 -119 -150 86 47 3 161 94 -266 -246 -13 33 46 288 6 19 -18 -167 -26 216 112 70
4103G0N9Kl2l78K95m31K24K30m5p7J38K30k81kO0N3J73k69k13m0K20J64R9l57
$$ 70 129 131 99 -279 16 -415 -191 39 -6 -83 55 285 4 2 62 115 288 19 -194 -234 -14 150 249 -108
4127a08M74l50r1J88j66J18j18J52k60K73m45M62r8j39J23l26L08K14r0j01k21
$$ -108 366 16 -75 113 -53 65 -53 99 -161 112 -333 129 31 -108 15 -311 -3 211 121 20 -201
4148b01q7K18J05J60l09K80m6j30j09J01J50k89K69j35n1rJ7K8J02l46K07M10
$$ -201 -288 -70 35 195 -114 166 120 -10 -119 -18 132 -157 112 -23 -74 -83 -66 -38 64 -282 -75 335
4170C35k28j73K56m67K59J59j28m9j13J72P2j09m8P4j39J18N3o4m3J9J25M5j33
$$ 335 107 -66 190 -277 -18 141 13 -36 -149 23 95 -14 -62 12 -127 -9 44 -20 -63 -44 81 126 -7
4193gK07j89lk30K97j81j73R6j00K90j3m2J26R8p5j77Q8J08j99K9R8j02L94l24
$$ -7 200 11 8 -222 75 -106 -279 -183 -283 7 -6 -48 78 176 101 -76 12 120 -79 -50 48 -54 340 16
4217A6k2M2k08K85l36J46p2K20K46l32j58Q1K55j35M6n8N4k4n1j60J05L10j03
$$ 16 -6 36 -172 113 -223 -77 -149 71 317 -15 -173 -92 163 28 74 16 70 46 -5 -165 -60 250 147
4240A47k42J46o5N8k3J88k28j7O3J6l14M36k35M1M5J16l46P3Q4k31K04lL04J4
$$ 147 -95 51 -14 44 21 209 -19 -36 27 43 -271 165 -70 -29 16 132 -214 -141 -57 -288 -84 -87 217 231
4264B31o8k04R3L9j72N5K21q5J47k24p8K79k13J21o3o3j63K17J90m37n5K51q4
$$ 231 163 -41 52 91 -81 -26 195 110 257 33 -45 234 21 142 79 16 -147 70 260 -177 -232 19 -65
4287f5J74j28R7O3l21J99J62l82J07J00m3p3R8J09k2K6j19P3J88j80L15o18J69
$$ -65 109 -19 78 141 -180 19 181 -201 -94 6 -37 -110 -12 97 75 101 -18 55 243 63 378 -240 -71
4310g1j31M89k16J14l72L9J3K67r1Kk57K08kj29KJ86j60L19l73M6K31p4J04J4
$$ -71 -202 287 71 185 -187 -148 -135 132 41 43 -214 -6 -8 -137 -135 51 -109 210 -163 -117 114 40 144 158
4334A58J82l21n4Jj05K03L8p8m9J19j34r9K97R7m06O7J13p7K1q8J4N3M5m6N4J
$$ 158 340 19 -35 -34 -139 64 102 24 -25 94 -40 -139 158 255 -151 -84 29 -48 -27 -115 -101 -48 -3 -49 5 6
4360Fk27J00Q2l3m3l9J52j29J77j08R1jk16K60j01K9j30J68J09o4j92l9O1r4L95
$$ 6 -221 -121 -39 -72 -115 -154 -2 -131 46 -62 29 28 -188 72 -29 0 -130 38 147 83 -109 -148 -87 -181 214
4385B14j7k08k41M13k38j4L55m41M06j39q3j08K2J85K9k37o5K63j07L0RK65j81
$$ 214 197 -11 -252 161 -77 -91 264 -177 229 90 7 -101 -79 106 135 -102 -167 96 -11 19 28 293 112
4408A12j01k20J15N16o36J01K50L7l05J45j16O4j6j39J06J47r2K75m06J40p3j77
$$ 112 11 -209 -94 422 -214 -113 137 174 -131 14 -102 -38 -54 -193 -87 60 -32 243 -163 -23 -96 -273
4430b73J00n3L38r6J54k44M33m51J50j78K6J20p6L3R5j26L23jl19K75l02J06M1
$$ -273 -173 -226 112 16 170 -74 359 -92 58 -120 -94 26 -50 -17 78 -48 275 274 -45 230 -72 34 75
4453G5k6k07J96j64K22k23L12n0j08l2j7J01JL00k69k04L79k86j29J32K7l0j14
$$ 75 49 -158 38 -126 96 -127 185 135 27 -5 -22 79 80 380 111 -93 286 0 -129 3 30 0 -114
4476a14L06oJ66o01J87J81k12J36q5k9j66J67j0K31j3j71J8L41k76k05P7j44K99
$$ -114 192 186 352 -249 -62 119 -93 43 -42 -71 -237 -70 -80 151 138 -33 -15 326 50 -155 -78 -222 77
4499G7q4P2P9k62JK32m58L93J50j48L5k74K30o3k13K90J9k94K43K8J9m31M01R9
$$ 77 -7 65 144 -118 -117 115 -343 50 200 52 87 -187 43 -20 -233 57 76 -218 25 53 72 -359 42 141
4523A41j57j08q2K21J94m25j5L18j82P8J21N5j81RQ0j86K05j46J41j02R3j02J27
$$ 141 -16 -124 -206 15 209 -216 -231 87 -95 -17 104 159 -22 -13 67 -119 86 -60 81 -21 72 -30 97
4546I7k60K50o8J41k25J98j6n2j45J84k75J83J6l23M18j85P1N7R4k26K43k36L0
$$ 97 -163 87 19 160 -65 133 117 65 -80 104 -171 12 28 -295 123 -62 9 66 160 -66 177 -59 -29
4569b9p8m0K91k32l2K02k8N4Q6k51J16j34oK81j85j35J65R7j81o9J61j40J74m5
$$ -29 -107 -147 144 -88 -120 82 54 108 194 -57 59 -75 -81 200 15 -120 45 142 -39 -108 53 -87 87 42
4593D2k15J58P4j51K42k39K68l1k11Q3N7q0j42nM47m88jn4K20O7o1r4J77j68l7
$$ 42 -173 -15 59 -92 150 -89 179 148 -63 20 77 -3 -145 -150 297 -191 -192 -246 -26 41 -20 -114 63 -105 -142
4618a42K54j2j11J03K44j51j16j3o8M4j3j23P8Q3m1k60N43j73j4k49L56j22j48
$$ -142 112 100 -11 92 336 185 69 56 -12 32 19 -104 -26 57 16 -244 299 126 112 -137 219 97 -51
4641e1K72p8q7l9l35L13K09m72J28JJ07J19P9j01m7j1K9P3k31O0J55k4k73n0l2
$$ -51 221 143 56 17 -318 -5 204 -268 -140 -139 -32 87 166 65 18 7 36 109 -122 -62 93 69 -204 -254 -286
4666b86L55o0l7j37K97j84N4O5J01k44K32n08K72k7k44N83k25J76K7n24N04n32
$$ -286 69 9 -28 -165 132 -52 2 67 168 -76 156 -352 -80 -107 -351 232 7 183 210 -314 190 -342
4688c42J95l6N6J68j25K38r4q3OQ2M42n00L60j95l02J05j49J41L4j07m2J34j36
$$ -342 -147 -183 -127 41 -84 154 60 -23 -17 65 507 7 367 172 -130 -25 -174 -33 1 -106 -148 -14 -150
4711a50K42R3o9j21m1k74Q8M54j91p0r9K69j38n7n4J7L0K89k36J30j89J35m4O4
$$ -150 92 185 116 -5 -46 -320 -232 222 31 -39 -138 131 -7 -64 -118 -101 -71 218 -18 112 -77 58 14 78
4735G8J06l69J18K15k65J22N6L1J45p4j70l3J51l33L33j13j2J3K83m80%P8J23
$$ 78 184 -185 -67 148 -117 5 61 92 237 163 -7 -40 111 -222 111 -2 -14 -1 282 -198 -198 -120 3
4758CK8p7q2J78R5k04K1J36q9J60j51j32J03J53K8l16K97k4k8l53K22R3OJ90J4
$$ 3 31 -46 -128 50 145 -59 -38 98 9 169 18 -114 -11 142 170 -146 151 127 99 -254 -32 61 67 257 271
4783B71l53j67L86m5n3k05J11J37L3J35n59L10J33q1k10j3J01K23n1j99K59k13
$$ 271 -82 -249 137 92 39 -166 -55 82 115 250 -309 1 134 53 -157 -170 -69 154 103 -96 163 -50
4805e0J48j45J05j58J4k5K62k19N1j11J38m6m4K0J70l44K09o2J73j38J29k21Q
$$ -50 98 -47 58 -100 -86 -111 151 -68 -17 -128 10 -36 -80 -60 110 -234 -25 -87 86 -52 77 -144 -136
4828a36J88k24L04k21K54l44K38r6Jk07M66m18K72k55J03O0p1J07m3l70L26J89
$$ -136 52 -172 132 -89 165 -179 59 -37 -36 -243 223 -195 77 -178 -75 -15 -86 21 -22 -392 -66 123
4850A23j86J96l90L30j86L56l18P9n2J86o4k20rj00M55n23J61L58l33N3q8L69
$$ 123 -63 133 -257 73 -113 243 -75 4 -48 138 74 -146 -155 -255 200 -323 -162 196 -137 -84 -172 197
4872A97k25M1k30K65k78K26K1j84M8R3q2N3m5L42l52M84k96k92K51j35N9pJ40
$$ 197 -28 13 -217 48 -230 -4 17 -167 -119 -26 -108 -55 -100 242 -110 374 78 -214 37 -98 -39 -46 94
4895I4j57N9J3j4m7P5Q0kOJ9J60m06K99K2k83k9K83k66K90L3k68K14Pj78k51L44
$$ 94 -63 -4 9 -5 -52 23 103 101 107 126 286 -120 179 201 -82 -111 172 -94 196 229 -39 175 182 4 -247 97
4921I7k04q5O24n84K15n6n2L77k36j69k73J88J91N7O9k60K26p7O8q8k45J26j5
$$ 97 -107 -192 432 -152 63 7 -45 332 96 -73 -346 -158 33 90 159 -101 125 48 116 28 -217 -91 -106
4944a06K89j39k45O4n1J18R8r1n0L16l00j09J06L09k47J84n4j77k3Q1P1K48l21
$$ -106 183 44 -201 -137 -188 -70 28 -63 -113 203 -97 -206 -100 209 -38 146 92 -85 -108 -27 44 292 -29
4967b9J45j51j15K67j52Q6k32J73J00R9k58k0L22m44L82l76O0R8N7q2J85K0n15
$$ -29 116 -35 -150 117 -35 51 -181 -8 92 191 -67 -87 235 -209 173 -203 -143 -45 12 -70 115 135 -380
4990c80J70M9J16R0j73R5o1L5K7Q9j12Q2j70R2j00L98j73L1N9k02M1P3J24qk01
$$ -380 -210 -161 -45 45 -128 -33 -94 -59 -32 57 -55 27 -143 -51 -151 247 74 105 164 -38 3 76 200 192 -9
5015ik12K62J24j72jO9q6pk08M52k35J90l57L50j00j22r2N30k23J66m42M8p6J97
$$ -9 -221 41 165 -7 -8 61 -25 -32 -240 212 -23 167 -190 160 60 -62 -154 376 153 319 -123 -75 -151 46
5039D6l7J78j2k95kJ12j63K39k58K26P2j07j47o7K31M2rl12K54J76p8p6k13J27
$$ 46 9 187 175 -120 -122 -10 -173 66 -192 34 106 -1 -148 -215 16 58 49 -263 -9 167 89 13 -200 -73
5063g3j70J49rJ60k31K39q1K81j97j96J5q2L74k96O2j71L8n1J11J25K08l23J16
$$ -73 -243 -94 -103 57 -174 65 -16 265 68 -128 -113 -195 179 -117 -55 -226 -188 -239 -128 -3 205 -118 -2
5086bJ30j36J16k02L41k35LQ0r6l17J44K77j68L38j03j9m7J03m88J42J81J3N4
$$ -2 128 -8 108 -94 247 12 15 95 -1 -318 -174 103 -65 273 170 151 104 207 -281 -139 42 55 109
5109A09j01p0J50j37J83j43k61J87r6L60j03k70K44O2J50j06O6l61O6J16m6j43
$$ 109 8 -62 88 -49 134 -9 -270 -83 -179 181 78 -192 52 114 264 158 224 -137 -71 45 -1 -144
5131a44J03K36m51J97J20O5j15J56q3q5j4J35n7O0k5O6p1p8J64j28j35N9k0P6
$$ -144 -41 195 -256 -59 61 126 11 167 84 -1 -15 120 63 123 98 164 93 15 179 51 -84 -25 -45 31
5155C1n0J35j23M4J38r1k30J13j4K2m4m6kJ30J81m33Q3N3L6j1m9J29j6P5j81J26
$$ 31 -19 116 -7 37 175 84 -146 -33 -47 -25 -69 -115 -117 13 194 -239 -156 -103 -67 -78 -127 2 -14 61 -120 6
5181FJ75q3Q1k59L83m81m5L81J99n80J57J31k60J99N3l14K35JK73Qj00j04J5j51
$$ 6 181 98 179 -80 303 -178 -223 158 357 -223 -66 65 -195 4 57 -257 -22 -21 252 260 160 56 71 -80
5205h0n9J73q0J54n7Q0n4J0n7j41j04M6J14J17K6o1l70L15o3j60L30k27P9K5l9
$$ -80 -139 34 -46 108 51 131 77 87 30 -111 -215 -169 -55 62 88 27 -343 -28 -91 -251 79 -148 -69 -44 -83
5230h3p1J15JJ60N0J3k69K48K3j59P0o8q2J32j09K93k61J57k24r2N71l28j74L64
$$ -83 -154 -39 -38 122 172 185 -84 164 187 28 98 30 -52 80 -29 264 3 160 -64 -156 415 87 -87 277
5254B77l46mJ84k90K08J87k43K07k16j1R4k93L56j78P4J55q8l6j48J04J72l19
$$ 277 -69 -73 111 -179 29 216 -27 180 -36 -47 47 -246 110 -68 6 161 73 37 -111 -7 165 -154
5276a54p2K07L4K11m06P6J64J39o0j38qM5N5j84J46r1L69l29j59l2K27l4J74R1
$$ -154 -226 -19 15 226 -180 -104 60 199 139 1 -7 38 93 -91 55 -36 333 4 -155 -187 40 6 180 271
5300B71l30q3K38j23J53p1k86L55j07M5k09J19N0j51Q4Ol9K29j32K89n30K21Q1
$$ 271 -59 -142 96 -27 126 55 -231 124 17 62 -147 -28 22 -129 -45 -39 -78 151 19 308 -222 -1 80
5323H0o6J82j00k11O5K61m5k3K3J03l89J35j59J15J41r4Q7j67J36j94K28j44k5
$$ 80 14 196 96 -115 -50 211 166 143 166 269 -120 15 -144 -29 112 18 105 -62 74 -120 108 -36 -61
5346f1J18J91l26K68l64J99M9k15K76N2j66j73rJ12o5P7K42k37j11J68j07J53
$$ -61 57 248 -78 190 -174 25 74 -141 135 187 21 -152 -161 -49 -114 -37 205 -32 -143 25 -82 71
5368G1o1j87J6j2M36n21J23K28l05L1R4k5J90j24l2mL07l96L02M0n3J4l24J02
$$ 71 10 -177 -161 -173 263 -258 -135 93 -212 -181 -87 -112 78 -46 -78 -82 225 -171 131 171 118 132 -192 -90
5392i0o0rJ36R8K4J48n58L24P7oj82Q2O8J25k71J61k16Q0j8k22L01Q7l07P1K61
$$ -90 -150 -159 -23 75 99 247 -311 13 90 84 -98 -16 52 177 -94 67 -149 -69 -87 -309 -8 79 -228 -157 104
5417A04L8k19K47R6n00J50K32k60M89j12j52p8N6J58k33O2j61o0K86j10j78L36
$$ 104 142 -77 170 266 -234 -84 148 -112 377 265 113 35 91 249 16 78 -83 -143 143 33 -145 191
5439A91n53M42n3j1r0N8O2r5L9P7k20p6L05q4j67j81K87j26j46O51j44l08l8K86
$$ 191 -362 80 27 16 -74 -16 46 -49 -10 67 -153 -229 76 -8 -175 -356 -69 -195 -341 310 166 -142 -180 106
5463A06j07J15p7j7O9l74K37J59j86K55J1j94o2j75K73j48k40K14K73k12j3j42
$$ 106 -1 114 37 20 89 -285 -48 111 -75 180 191 -3 -65 -240 33 -115 -355 -141 132 -80 -93 -235
5485b35Q9L36j06K17k85J2l94N36l29r9J70L22o3j36J04k45p3L75j80n3L16k30
$$ -235 -146 190 84 301 16 28 -366 170 -159 -258 -88 234 171 35 139 -106 -179 196 16 -37 279 49
5507D9p8n7j84M72l50j22m0K15L26l45J53l06L11q3J71n9j47J92l18J24k2Q2J06
$$ 49 -29 -86 -270 202 -148 -270 -310 -95 231 -114 39 -267 44 -39 132 73 -74 118 -200 -76 -98 -16 90
5530I0r9j32J55J5j84m2L05l3o1NL6j96nJ33K5k74K28mL0j16J7J60J16r3k07L21
$$ 90 -9 -141 14 29 -155 -197 108 75 14 19 55 -141 -146 -13 12 -262 -34 -38 -8 -124 -107 53 169 76 -131 190
5556A90r9r0r7j6J74J34l28K02l78M13o1J14j42K23l08j07J35K31j34L0o0m5k12
$$ 190 91 1 -96 -112 62 196 -132 70 -308 105 44 158 16 239 -69 -176 -41 190 56 86 26 -19 -231
5579b31L08J27k58K12j82pM3J48j18P4j07P0Q5j92J14o9p0k04K52L8M6k40K38
$$ -231 77 204 -54 158 -24 -31 12 160 42 116 9 79 164 -28 86 17 -53 -257 -5 33 79 -161 77
5602G7kj83oP8L3RP1j0j36L8p2j26K71R6k73N2L19j87J6R8k59J03J91l46K93m09
$$ 77 75 -108 -114 -36 -3 6 77 67 -69 -31 -103 -229 42 138 -135 -83 236 49 65 163 -96 7 198 -148 145 -264
5628b64J8LL41j83N2mQ4l2N4q0J11l5k41j48Q7M72j03l20L24j40M3K0pk60M07
$$ -264 -246 -243 98 -85 -33 -37 47 15 69 -11 100 65 -176 -324 -237 235 132 -188 136 -4 39 59 52 -208 199
5653A99j79K6j16L08k25q2K83N6l13K8K1r1P4m3J37k62k76M55P1n8l0P7J35q3
$$ 199 20 46 -70 238 13 -69 214 270 -43 -15 6 -85 -11 -54 83 -179 -455 0 71 13 -17 60 195 112
5677A12l58N34l99O8J61j5K2k62J72j38M0Q4r2o3K89k69p2J94j81R4p0K45N4m76
$$ 112 -246 288 -111 -43 118 103 125 -137 35 -103 -63 21 -71 -134 155 -114 -186 8 -173 -79 -149 96 150 -326
5701c26M74j96j39K26l76N81J00l45n7J87o5ko8l0K93k83LP5k27L24p9j47QK54
$$ -326 148 -48 -187 39 -337 244 344 -1 -58 129 64 62 -6 -36 257 -26 -23 52 -175 149 70 -77 -69 185
5725A85p5k80p9K59k75K44N3J98k02p1L0N2L4m22M46r8K80l14K55r0k7j86R1l6
$$ 185 110 -170 -249 10 -265 -21 32 230 28 -43 -13 39 73 -349 97 -1 279 -35 220 130 103 -83 8 -28
5749b8q0K17j67J18r7K18j69J59j48K96q2j69k27J47j8L2O8k50K57j62J37O4m4
$$ -28 -108 109 -58 60 -37 181 12 171 23 319 237 68 -159 -12 -30 2 70 -180 77 -85 52 116 72
5772G2n4o8K77l52J17k29M47J23o2k91n7J97p9j58%M17k44k98qJ45l7K99l08K56
$$ 72 18 -50 227 -125 -8 -237 210 333 271 -20 -77 120 41 -117 -117 300 56 -242 -250 -105 -142 157 -151 105
5796A05m11L57R5r1l65M25l39M38k30J17j93J84lP3m20J87N3R0l4O9K1l96K55
$$ 105 -306 51 146 55 -310 115 -224 214 -16 101 -92 92 89 162 -258 -71 -18 72 38 107 128 -268 -13
5819a3l7K08j89Q1O3O2J4m65K23L7j21j07L15R7j00l3K21l44J60q0K74j65R4k43
$$ -13 -50 158 -31 50 113 175 189 -276 -53 -16 -137 -244 71 168 68 35 256 -88 72 -8 266 101 195 -48
5843d8k11K85J59l35m0M10j17j7l51K19j19lJ90j23L12j64j79j09M13k18j37R9
$$ -48 -259 26 185 -150 -190 220 103 86 -265 -46 -165 -168 22 -101 211 47 -132 -241 172 -46 -183 -84
5865h4J87k26L0K46j11r4k67K39K10j56k31J24Nl8J47N5L8j58K3n8P0R7J70j39
$$ -84 103 -123 -93 153 42 -52 -319 -80 130 -26 -257 -133 -128 -166 -19 36 74 -84 -61 -119 -49 48 218 79
5889G9l05K18j7Pj09L58o3j44M2j07Q1q3K04k54N5q8Q2J8p0L8k4J61k54L29k7
$$ 79 -226 -8 -25 -18 -127 231 168 24 66 -41 40 -43 161 -93 -38 -126 -44 -26 -96 -58 -82 79 -175 154 127
5914A27L3Qj21j32P5j19K05j62L62k01j03N8Q7j78K62l48K75k05q5K01J31k21
$$ 127 160 168 47 -85 -10 -129 76 -86 276 75 -28 30 117 -61 201 -147 128 -77 -162 39 170 -51
5936e1KJ1k17L83j21j15M9Qj54P1M3k8J94k5K5j40K09k59O5P5J51j15J47j14J3
$$ -51 -49 -38 -255 128 7 -108 -59 -51 -205 -134 -91 -119 75 50 75 -65 144 -115 -50 25 176 61 208 94 107
5961A07J40l15J97p5k55K66k18J66l3k12J74Kj41M73j08l0q4j90J68M0L35k62
$$ 107 247 -68 129 54 -201 65 -153 13 -20 -232 -58 -56 -197 276 168 138 54 -136 32 72 407 145
5983A45j35L0Q3j66P7j23M7j06K2K84K6k57j62J87J60j65J43L06l23Q2Lk28J1
$$ 145 10 40 123 -43 34 -89 -42 -148 -126 158 184 -73 -235 -48 112 -53 90 396 73 155 158 -70 -59
6006e9O8J38k24r6R1mj56K76jj72J04K14j89j77J40M0p3N8J33j57J27K6r2P4k73
$$ -59 9 147 -77 -173 -82 -86 -242 34 33 -139 -35 179 -10 -187 -47 -7 -80 -22 111 -46 81 107 15 89 -184
6031a84K40J44k08K2p7k0P6J1o4J79q0j60K38k76K31j34m0M3j19Q6N08j03l04
$$ -184 56 200 -8 14 -63 -83 -7 4 -60 119 39 -121 117 -159 72 -62 -102 -59 -178 -92 416 313 9
6054Ij22P6J08k16J18Q0K24M4j85k38J05j8M5j49J80Pp1M7j23J86j35kJ71j2L0
$$ 9 -113 -37 71 -145 -27 53 277 321 136 -102 3 -15 30 -119 61 68 -3 44 -79 107 -28 -30 141 129 159
6079A59k6k45J25k1j85K36N8n1P4k09J18j71o2L44r6K6j36R6rR5M7k49K61k19
$$ 159 133 -112 13 -8 -193 43 101 50 124 -85 33 -138 -200 144 48 74 -62 34 25 120 167 -82 179 -40
6103d0N0Q8m3j75N9K70k73pJ08J39M7l30J34J35p3o0k41J86k2Rr6L24l54K81l68
$$ -40 10 98 55 -120 -61 209 -64 -71 37 176 223 -107 27 162 89 29 -212 -26 -48 -39 -135 189 -165 116 -252
6128b52N56l70j53J61J04k0j07J46mj3l1K21j40p2j05J20j03J59j08K20k12j18
$$ -252 304 -66 -219 -58 46 26 -81 65 61 48 17 238 98 26 -79 41 -62 97 -11 209 -3 -121
6150a21M5J24R6l8qJ26j00j38j86K22l9q3j4J31J57j06lK21r9k1j76K85l95K37
$$ -121 -76 48 144 106 98 224 124 -14 -200 22 -17 -100 -114 17 174 68 65 286 187 166 -10 275 -120 117
6174A17r4k07K73n5k0Q9j01p4J01j2j44J97k24K40q9P0K6N6j68J15l26M15m16
$$ 117 23 -184 89 34 14 103 2 -72 29 17 -127 70 -154 86 -3 67 93 149 -19 96 -230 185 -231
6197b31J93L3P7l6K4M7j12n2j56L79n9jr1m7J48j5j20lo0O1M0j21lK8K33J5K0
$$ -231 -38 -5 72 36 60 107 -5 -57 -213 166 107 106 15 -32 116 101 -19 -22 -82 -21 19 -102 -105 -77 156 171 191
6224A91l39K56P9k41m2j07K00r4kQ3M8o3L8k02J76j15J15O1J90j76j97l7L20j38
$$ 191 -148 108 187 -54 -96 -203 -3 -97 -99 -16 32 -31 7 -195 -19 -134 -19 42 232 56 -141 -178 142 4
6248Dj06M6j88J48r0Q9J94K07m15j67M03k19L8o3K87m04J95K41j06J5k02J42m2
$$ 4 -102 -56 -244 -96 -186 -97 97 304 -111 -278 125 -94 -56 -119 168 -236 -41 200 94 109 -93 49 7
6271Gq3J41j38k25J55l7J69J62j08K13k22J32k45M10m41o3K4J13kN7r4J8J63o5
$$ 7 -76 65 -73 -298 -143 -180 -11 151 43 256 34 166 -79 331 -110 -173 -149 -36 -38 19 -75 -57 106 41
6295D1j87K32J41p5j7p1N9q5j50J46k1M3j39j60L06o1n7K04j95K7K42l39K04r5
$$ 41 -146 86 227 152 135 64 123 38 -112 34 13 56 -83 -243 63 2 -55 149 -46 -19 223 -116 88 -7
6319gP8p1L13j21k71L9j5J41l8k3k19M49k44M09m82p2J7O3n4J49k16J35M6M1k17
$$ -7 71 0 313 192 -79 -40 -55 86 48 25 -194 255 11 420 -62 -134 -117 -54 -108 41 -175 -40 6 47 -170
6344a70R7rR2KP4q9n2k01L55Qk35RK30o6l6k94M28j69P1k7r2R1J12l9j33L53o95
$$ -170 -73 -82 10 12 86 -3 -55 -256 99 107 -128 -119 111 45 9 -285 143 -26 45 18 -74 17 129 90 -43 310 -385
6371c85N41o2r1j64J96j57J69J69n1k27J88m9j8Q2M4j76j75QJ33j37J27K89k62
$$ -385 156 94 3 -161 35 -122 47 216 165 -62 126 77 59 141 185 9 -166 -158 -25 -162 -35 254 -8
6394hL6j07R5K24k09r3J92j47j2J29j70%l0L82m28K41j08J15R2j95j2K52k43k35
$$ -8 28 -79 16 240 31 -62 130 -17 -29 100 -70 -70 -100 282 -146 95 -13 102 194 -1 -13 239 -4 -239
6418b39J64N0Q2k68J79j31J1K59n7r6r3J48j0O8J04l42K23n0O7j64k00L33pk8
$$ -239 -75 -25 57 -211 -32 -163 -152 107 50 -46 -139 9 -1 67 171 -171 52 2 69 -95 -295 38 31 3
6442CJ96k52J83k36m9J92r9NK25j42j33j33J57L48n08L39j71Q8p2N1k7J13M5j58
$$ 3 199 -53 130 -106 -155 37 -62 -57 168 26 -107 -240 -83 265 -243 96 -75 13 -59 -8 -35 78 123 -35
6466c5QJ37j19k33P9J89O7j15J41k37J49n9M9J45ln1j02j70K04j54k2J91J69J7
$$ -35 -27 110 -9 -242 -163 26 93 -22 119 -118 31 -28 21 166 163 112 10 -160 44 -110 -132 59 228 245
6490B45m0r4J21j29J51k35P3k23O7J07q3J52k07l8K28k6J43k4k62K20l79J55O
$$ 245 205 111 232 103 254 19 92 -131 -64 43 -40 112 -95 -133 95 69 212 188 -74 146 -233 -78 -72
6513g2K27k29O1J92j63mJ81j46M6p6l3J36M9J16n19N26k01o9N2j43Kj20J9J87
$$ -72 155 -74 -13 179 16 12 193 47 93 17 -16 120 169 285 -234 292 91 22 74 -69 -67 -187 -168 19
6537A9l2L6J05j01j3k68k2K65j0N4k17J1J90k27M54k37k43L35j69O7o8J19j78
$$ 19 -13 23 128 27 14 -254 -276 -11 -21 33 -184 -173 17 -210 244 7 -236 99 -70 -3 -71 48 -130
$$ [...]
8191A71
##END NTUPLES=NMR FID
##END=
