##TITLE=1H_51-2023
 CDCl3
 8 sc, 
 11.8.2023
##JCAMPDX= 6.0         $$ Bruker NMR JCAMP-DX V2.0
##DATA TYPE= NMR FID
##DATA CLASS= NTUPLES
##ORIGIN= UXNMR, Bruker Analytische Messtechnik GmbH
##OWNER= root
$$ XWIN-NMR		Version 3.5
$$ Fri Aug 11 13:57:30 2023 Russian Standard Time (UT+4h)  she@DPX200
##.OBSERVE FREQUENCY= 200.13135
##.OBSERVE NUCLEUS= ^1H
##.DELAY= (6, 6)
##.ACQUISITION MODE= SIMULTANEOUS
##.ACQUISITION SCHEME= undefined
##.AVERAGES= 8
##.DIGITISER RES= 18
##SPECTROMETER/DATA SYSTEM= spect
##.PULSE SEQUENCE= zg30
##.SOLVENT NAME= CDCl3
##.SHIFT REFERENCE= (INTERNAL, CDCl3, 0, 15.7039)
##AUDIT TRAIL= $$ (NUMBER, WHEN, WHO, WHERE, WHAT)
$$ ##TITLE= Audit trail, XWIN-NMR		Version 3.5
$$ ##JCAMPDX= 5.01
$$ ##ORIGIN= Bruker BioSpin GmbH
$$ ##OWNER= she
$$ F:/spectra/data/she/nmr/H-F/1/audita.txt
$$ ##AUDIT TRAIL=  $$ (NUMBER, WHEN, WHO, WHERE, WHAT)
(   1,<2023-08-11 13:56:08.35 +0400>,<she>,<DPX200>,
      <created by zg, POWCHK disabled, PULCHK disabled
       configuration hash MD5:
       00 E9 B6 7A A2 85 ED C7 34 08 36 98 17 FE 4E 26
       data hash MD5: 16K
       E6 E2 0B 7F C9 98 86 0A 25 00 1B 20 F0 37 84 E1>)
$$ ##END=
$$ 
$$ hash MD5
$$ 21 9A E6 2A 7D 9A E9 FF F1 A8 FF A5 CA C7 F6 B6
##$RELAX= 
##$RELAX= 
##$RELAX= 
##$RELAX= 
##$RELAX= 
##$RELAX= 
$$ Bruker specific parameters
$$ --------------------------
##$DU= <F:/spectra>
##$EXPNO= 1
##$NAME= <H-F>
##$PROCNO= 1
##$TYPE= <nmr>
##$USER= <she>
##$AMP= (0..31)
100 100 100 100 100 100 100 100 100 100 100 100 100 100 100 100 100 100 
100 100 100 100 100 100 100 100 100 100 100 100 100 100 
##$AQSEQ= 0
##$AQ_mod= 1
##$AUNM= <au_zg>
##$AUTOPOS= <>
##$BF1= 200.13
##$BF2= 200.13
##$BF3= 200.13
##$BF4= 200.13
##$BF5= 200.13
##$BF6= 200.13
##$BF7= 200.13
##$BF8= 200.13
##$BYTORDA= 1
##$CFDGTYP= 0
##$CFRGTYP= 5
##$CHEMSTR= <none>
##$CNST= (0..31)
1 1 145 1 1 1 1 1 1 1 1 1 1 1 1 1 1 1 1 1 1 1 1 1 1 1 1 1 1 1 1 1 
##$CPDPRG= <>
##$CPDPRG1= <>
##$CPDPRG2= <>
##$CPDPRG3= <>
##$CPDPRG4= <mlev>
##$CPDPRG5= <mlev>
##$CPDPRG6= <mlev>
##$CPDPRG7= <mlev>
##$CPDPRG8= <mlev>
##$CPDPRGB= <>
##$CPDPRGT= <>
##$D= (0..31)
0 1.2 0 0 0 0 0 0 0 0.06 0 0.03 0 0 0 0 0.0002 0 0 0 0 0 0 0 0 0 0 0 0 
0 0 0 
##$DATE= 1691747767
##$DBL= (0..7)
120 120 120 120 120 120 120 120 
##$DBP= (0..7)
150 150 150 150 150 150 150 150 
##$DBP07= 0
##$DBPNAM0= <>
##$DBPNAM1= <>
##$DBPNAM2= <>
##$DBPNAM3= <>
##$DBPNAM4= <>
##$DBPNAM5= <>
##$DBPNAM6= <>
##$DBPNAM7= <>
##$DBPOAL= (0..7)
0.5 0.5 0.5 0.5 0.5 0.5 0.5 0.5 
##$DBPOFFS= (0..7)
0 0 0 0 0 0 0 0 
##$DE= 6
##$DECBNUC= <off>
##$DECIM= 32
##$DECNUC= <off>
##$DECSTAT= 4
##$DIGMOD= 1
##$DIGTYP= 9
##$DL= (0..7)
0 120 120 120 120 120 120 120 
##$DP= (0..7)
150 150 150 150 150 150 150 150 
##$DP07= 0
##$DPNAME0= <>
##$DPNAME1= <>
##$DPNAME2= <>
##$DPNAME3= <>
##$DPNAME4= <>
##$DPNAME5= <>
##$DPNAME6= <>
##$DPNAME7= <>
##$DPOAL= (0..7)
0.5 0.5 0.5 0.5 0.5 0.5 0.5 0.5 
##$DPOFFS= (0..7)
0 0 0 0 0 0 0 0 
##$DQDMODE= 0
##$DR= 18
##$DS= 0
##$DSLIST= <SSSSSSSSSSSSSSS>
$$ [...]
##$SUBNAM2= <"">
##$SUBNAM3= <"">
##$SUBNAM4= <"">
##$SUBNAM5= <"">
##$SUBNAM6= <"">
##$SUBNAM7= <"">
##$SUBNAM8= <"">
##$SUBNAM9= <"">
##$SW= 18.05172834244
##$SWIBOX= (0..15)
0 0 2 0 0 0 0 0 0 0 0 0 0 0 0 0 
##$SW_h= 3612.71676300578
##$TD= 16384
##$TD0= 1
##$TE= 0
##$TE2= 300
##$TE3= 300
##$TEG= 300
##$TL= (0..7)
0 120 120 120 120 120 120 120 
##$TP= (0..7)
150 150 150 150 150 150 150 150 
##$TP07= 0
##$TPNAME0= <>
##$TPNAME1= <>
##$TPNAME2= <>
##$TPNAME3= <>
##$TPNAME4= <>
##$TPNAME5= <>
##$TPNAME6= <>
##$TPNAME7= <>
##$TPOAL= (0..7)
0.5 0.5 0.5 0.5 0.5 0.5 0.5 0.5 
##$TPOFFS= (0..7)
0 0 0 0 0 0 0 0 
##$TUNHIN= 0
##$TUNHOUT= 0
##$TUNXOUT= 0
##$USERA1= <user>
##$USERA2= <user>
##$USERA3= <user>
##$USERA4= <user>
##$USERA5= <user>
##$V9= 5
##$VALIST= <valist>
##$VCLIST= <CCCCCCCCCCCCCCC>
##$VD= 0
##$VDLIST= <DDDDDDDDDDDDDDD>
##$VPLIST= <PPPPPPPPPPPPPPP>
##$VTLIST= <TTTTTTTTTTTTTTT>
##$WBST= 1024
##$WBSW= 4
##$XGAIN= (0..3)
0 0 0 0 
##$XL= 0
##$YL= 0
##$YMAX_a= 565156
##$YMIN_a= -597111
##$ZGOPTNS= <>
##$ZL1= 120
##$ZL2= 120
##$ZL3= 120
##$ZL4= 120
##$ABSF1= 10
##$ABSF2= 0
##$ABSG= 5
##$ABSL= 3
##$ALPHA= 0
##$AQORDER= 0
##$ASSFAC= 0
##$ASSFACI= 0
##$ASSFACX= 0
##$ASSWID= 0
##$AUNMP= <proc_1d>
##$AZFE= 0.1
##$AZFW= 0.1
##$BCFW= 1
##$BC_mod= 2
##$BYTORDP= 1
##$COROFFS= 0
##$CY= 11.3945322036743
##$DATMOD= 1
##$DC= 2
##$DFILT= <>
##$DTYPP= 0
##$F1P= 15.7292609196834
##$F2P= 12.9074282941183
##$FCOR= 0.5
##$FTSIZE= 0
##$FT_mod= 4
##$GAMMA= 1
##$GB= 0.15
##$INTBC= 1
##$INTSCL= 1
##$ISEN= 128
##$LB= 0.24
##$LEV0= 0
##$LPBIN= 0
##$MAXI= 10000
##$MC2= 0
##$MEAN= 0
##$ME_mod= 0
##$MI= 1.114404
##$NCOEF= 0
##$NC_proc= 0
##$NLEV= 6
##$NOISF1= 3.799351
##$NOISF2= 2.8
##$NSP= 1
##$NTH_PI= 0
##$NZP= 0
##$OFFSET= 15.70392
##$PC= 1
##$PHC0= -21039.22
##$PHC1= 10.65272
##$PH_mod= 1
##$PKNL= yes
##$PPARMOD= 0
##$PSCAL= 0
##$PSIGN= 0
##$REVERSE= no
##$SF= 200.130013532006
##$SI= 16384
##$SIGF1= 3
##$SIGF2= 2
##$SINO= 400
##$SIOLD= 16384
##$SREGLST= <1H.CDCl3>
##$SSB= 0
##$STSI= 0
##$STSR= 0
##$SW_p= 3612.71676300578
##$SYMM= 0
##$S_DEV= 0
##$TDeff= 0
##$TDoff= 0
##$TI= <>
##$TILT= no
##$TM1= 0
##$TM2= 0
##$TOPLEV= 0
##$USERP1= <user>
##$USERP2= <user>
##$USERP3= <user>
##$USERP4= <user>
##$USERP5= <user>
##$WDW= 1
##$XDIM= 8192
##$YMAX_p= 0
##$YMIN_p= 0
$$ End of Bruker specific parameters
$$ ---------------------------------
##NTUPLES= NMR FID
##VAR_NAME=  TIME,          FID/REAL,        FID/IMAG
##SYMBOL=    X,             R,               I
##VAR_TYPE=  INDEPENDENT,   DEPENDENT,       DEPENDENT
##VAR_FORM=  AFFN,          ASDF,            ASDF
##VAR_DIM=   8192,          8192,            8192
##UNITS=     SECONDS,       ARBITRARY UNITS, ARBITRARY UNITS
##FACTOR=    0.0002768,     1,               1
##FIRST=     0,             0,               0
##LAST=      2.2672688,     0,               0
##MIN=       0,             -597111,         0
##MAX=       2.2672688,     565156,          0
$$ Real data points
##PAGE= N=1
##DATA TABLE= (X++(R..R)), XYDATA
$$ [...]
2743A139l247J577J661l640L702k66k211L795l130N77K047l887L438r07k089L401
2759A960l270O56J640l275K952p67j676L495k789P10K120k841K684o62k274L476
2775B139k858QK782l809K482Jl382L874k563L31K435l371K445L98k834L603k351
2792f70k44L212l772J899P68k988L426j690n81K278l048J805P89l040L225j836
2808d67q42K983l579J738J345l213L548j948q33L451l831J722J431l197L006j060
2824B54j178K867l024J599O71k941L068j367j775L447l180J331J529l351L181
2839A131n95j868L260k642M78J780l488K972j046j566L110l035J061J574l244
2854b118K755k7k356L740k791J99K153l280K840m58k425L544k250j78K638l488
$$ y = [1139, -2108, -531, 1130, -2510, 1192, 926, -1285, 2510, -620, -43, 2004, -1883, 1555, 648, -1441, 1960, -1310, -654, 986, -2289, 663, -104, -1780, 1715, -1074, -364, 1756, -1085, 1599, 937, -1337, 2139, -719, -711, 2071, -1738, 744, 745, -2637, 1237, -1326, -995, 1440, -1931, 514, 912, -1922, 1681, -670, -914, 2298, -1474, 425, 1193, -1795, 1631, -59, -640, 1638, -1410, 395, 1184, -1856, 1369, -467, -1309, 1674, -1905, -167, 1178, -2035, 1513, -435, -1268, 2183, -1648, 74, 1505, -1692, 1314, 254, -924, 1943, -1081, 518, 1189, -1752, 1316, -51, -1826, 1621, -1559, -228, 1301, -2050, 1131, 536, -1332, 1928, -714, -236, 1544, -1944, 1028, -18, -1584, 1526, -1509, -448, 1126, -2118, 637, 610, -1746, 1994, -797, -598, 1555, -1725, 1115, 657, -1768, 1776, -474, -652, 1986, -1502]
2870a502J895N02k310L194k195n83K860l691K247K03k743L678k618j8K304k910
2886a687K072N49k985M018k209j13K732l208J357O92k483K962j766j326L313l505
2902a587J312J017l329L666j367j445L612l104J822J163l679L008j186j069K801
2917A635l360J496J640l511K956r41j742L675l072J190J487l002K711q77j563
2932a278L175l104R14J576l071K560o16j865L717k738J02K176l267K702o94j524
2948a235L076k635L69K020l365K029K80k383L574k224n7K060l076K396j4k281
2964a466L357k107m93K332l191K350N4k683K914j701o06K840l589J890J261l143
2980a981L366j784m96L182l321J297J305l087L417j828j082K718l125J663J357
$$ y = [-1502, 393, 895, -1415, 1779, -416, -999, 1861, -1830, 417, 620, -2123, 1555, -1063, -1081, 1223, -1687, 385, 934, -2051, 1967, -242, -355, 2377, -831, 526, 1218, -1265, 1697, -69, -1395, 1918, -1587, -275, 742, -2587, 1079, -288, -1733, 1879, -1225, 597, 1760, -1919, 1089, -97, -1166, 1635, -1725, -229, 1411, -2100, 856, -85, -1827, 1848, -1224, -34, 1453, -1549, 1162, 285, -1278, 1897, -1207, -293, 1283, -1788, 772, 156, -1709, 2008, -730, -628, 1548, -1719, 983, 289, -1235, 1841, -794, -425, 1595, -1770, 259, 539, -1844, 1730, -494, -551, 1509, -1567, 829, 815, -1466, 1891, -216, -709, 1623, -1568, 782, 836, -1847, 1067, -634, -1240, 1600, -1989, -99, 1162, -1981, 1385, -399, -895, 2287, -1034, 263, 1568, -1519, 1898, 70, -1012, 1706, -1419, 244, 1601]
2995A601l565K778j059j222L332k981J191J447k961L003j407j364K937l061Q84
3010d47J540l153L007p57j487L338l217Q23J939l325K885p20j393K839k967N77
3026e18J650l123L227j201j459L100k157N3K531l420K357j18k554L306l073Q70
3042e29K178l636K491K58k415L042k209j44K660l215J780P52k662L294j981k69
3058f05K666l451J656L53k416L134j596j017K786l214J835Q58k796L146j598q02
3074a061K610k697J266J192l243L177j365j515L512l377J358J067k847L282j558
3089a99j039K969k732J197J039l000L080j061j399L117l067N74J958l695L023
3104G65m67j764L193l222N38K498l367K499q6k531L711k441K17J943l312K657
$$ y = [1601, -1964, 814, -245, -1467, 1865, -1116, 75, 1522, -1439, 1564, 157, -1207, 1730, -1331, -447, 1093, -2060, 947, 190, -1297, 2041, -1176, -353, 1586, -1739, 1146, 426, -967, 1872, -1095, -518, 1132, -1991, 1236, 35, -1424, 1676, -481, -428, 2103, -1317, 1040, 922, -1632, 1674, -1399, -529, 1649, -1987, 504, 762, -1653, 1389, -820, -964, 1696, -1519, 261, 1013, -1649, 1645, -336, -605, 2061, -1390, 266, 619, -1797, 1337, -259, -1276, 1510, -1704, 131, 989, -1807, 1339, -259, -1061, 1549, -1148, 118, 1310, -1933, 1244, -121, -1636, 1876, -1501, -143, 924, -1923, 1359, -199, -1238, 1731, -1001, 196, 1235, -1765, 1315, 254, -1145, 1972, -1095, -521, 1437, -2258, 765, 298, -1466, 1727, -1495, -957, 1541, -1826, 673, 587, -1944, 1767, -674, -457, 1486, -1826, 831]
3120H31J34k271L208k629J6K281k998K409k72k549L101j778m36K712l329J920
3136C50L56k296L604k424n18K665l099J746Q69l025L184j953R9K233l370J536
3152d3Q03k381K977j520p60K844l387K144O51k989L032j184j568L162l328J110
3168d37J266k711K917j242r74K498k613J482J374l375L266j259j953L874l421
3183a308J130J277l070K897n78k001L247k618Q42J591l190K462K52k023K512k209
3199g87J11K152l682K993k80k537L106j739l81L026l524K241j22k075L265j911
3215a44o41K462k517J668l40k173L294j820o73K131k619J435Q56k665L283j748
3231b11j66K016k721J997O10k907K449j651k64K165k992K026M68k157L223j563
$$ y = [831, 965, -1306, 1902, -727, -711, 1570, -1428, 981, 709, -1840, 1261, -517, -953, 1759, -1570, 350, 706, -1590, 2014, -410, -928, 1737, -1362, 384, 1253, -1772, 1412, -541, -442, 1791, -1579, -43, 760, -1621, 1356, -164, -924, 1920, -1467, 677, 1328, -1661, 1371, 187, -1381, 1781, -1547, -437, 829, -1882, 1035, -207, -1181, 1317, -1296, 186, 1560, -1815, 1451, 192, -1761, 2113, -1308, -178, 1099, -1971, 926, 348, -1653, 1594, -1024, -182, 1409, -1781, 681, 933, -1090, 1422, -787, -676, 1476, -2206, 787, 507, -2030, 1076, -663, -1044, 1982, -1542, 699, 577, -1498, 1767, -144, -785, 1677, -840, 828, 488, -1685, 1609, -211, -884, 1247, -1372, 63, 919, -1746, 1537, -211, -377, 1639, -1082, 915, 1525, -1382, 1067, -584, -848, 1317, -1675, 351, 819, -1338, 1885, 322]
3247C22j120L185l795K095J099l345K963j432j049K873k823R06R67k475K250p78
3263a57j190L115l014J277J119k583L032j387j128K252j851M9J334k043K392j314
3279i7j335L081j979J62J658k995K122M2j651K453k270L80K377l760K510n7j938
3296a297K887k071N2J152k616K554Q5k233K460j817M56J179k148J187Q25k412
3312a757L365j457j492L121k505J469L98k642K296m94j190K838l137J039P25k013
3328a436K501j617n49K568k324Q07Q74k298K300p61j041L025l059O75J996k607
3344i46K149j390o32L093l407J006J092k926K788r00j038K471k223Q91J196k959
3360a735K215o03j401K881k479Q69J027k475K663p13j787L222k370O48J268k378
$$ y = [322, -798, 2387, -1408, 687, 1786, -1559, 1404, -28, -1077, 1796, -1027, -121, 846, -1629, 621, -157, -1347, 1768, -1246, 31, 1150, -1433, 1599, 212, -916, 1336, -515, -466, 868, -1175, 1217, -97, -1432, 1649, -330, -168, 1490, -1505, 617, 659, -992, 1461, -809, -429, 1948, -1812, 698, 641, -1297, 1590, -481, -429, 723, -1893, 661, 746, -1487, 973, -844, -388, 791, -1357, -170, 655, -1757, 1608, 151, -1341, 1780, -725, 744, 1142, -1500, 796, 302, -888, 1950, -1187, -148, 577, -1436, 1065, -552, -1101, 1467, -857, -50, 824, -1474, 826, 65, -976, 2049, -1010, -335, 1661, -946, 1203, -187, -819, 2274, -1133, -127, 965, -1961, 827, -73, -1111, 1360, -863, 28, 1224, -1735, 480, -123, -1524, 1357, -1122, -253, 774, -1701, 962, 249, -1538, 1684, -686, -38, 1230, -1148]
3376a148J700m2j277K248k100O70J661l480K383r1k009L234k771M46J712k195
3392a059J233R12k093K756j839n05J511k177J156P59k081K799j578l83K254l287
3408a622J634P43k070K375j253j08J912k940J911P59k730K706n22k121K866k592
3424a052O43J510k472J843o41j105K710k402Q66J177k699K465l24j715K177j776
3440g95M13J851k816J972k11j206J785j676k11K072l085K866q96j687K824k283
3456a083M33K198l313J884R68k849L531k034j10J389k464J501L58k464L348k071
3472g78O6J594j666J452k18j810L072k136j94K244k709J182K16j778K488j795
3488g70q92K957k472J044j63j175K504q57o78J774k291J656J60j752K245j214
$$ y = [-1148, 552, 510, -767, 1481, -619, 51, 1712, -1768, 615, 524, -1485, 1749, -1022, -576, 1136, -1059, 174, 1086, -1007, 1749, -90, -595, 916, -1261, -105, 654, -1427, 1372, -206, -589, 1665, -1622, 12, 755, -1315, 1060, -193, -301, 1611, -1329, 582, 1341, -1389, 1317, 795, -1326, 1540, -1052, -409, 1101, -1371, 472, -169, -1274, 1436, -966, -100, 1077, -1622, 843, 519, -1196, 981, -795, -382, 1469, -1347, 625, 414, -792, 993, -683, -894, 1178, -1907, 959, 63, -1624, 1200, -1083, -650, 1548, -1765, 119, 1087, -1762, 1769, -265, -375, 1014, -1450, 51, 409, -2055, 1293, -778, -712, 882, -784, 668, 450, -1360, 1712, -424, -618, 1626, -1083, 99, 315, -1463, 1025, -770, -1662, 1295, -1177, -133, -296, -1471, 1033, 176, -502, 1272, -1019, 637, 797, -955, 1290, 76]
3504G6j568K465j624N65J337k387J885o14p70K384l223J154J862l051K079m72
3520I8j172K184k193N98J071j957J916o50j261K299j750L92J428k304K532n96
3536F35j561K264k039L78J876k736J525L7j505K685k257P6J287j913J579K25k074
3553a518L128j913K57Q55j672J204J65k172K334k46q53J412k716J756K83j628
3569a324K452j462k81J342j674J032J028k634K757j449j245K652j619j08J985
3584A452k595K392j381q54K400k504R83N67o93Q38k86j099J605j041N96m17j798
3601a835K568l46j858L235k158M57J173j872J888q03j551K530j927K3J118k178
3617a536K036l79j006K230j574k84J246k176K021r74q02K330j476j82R51j818
$$ y = [76, -1492, 973, -651, -86, 1251, -1136, 749, 135, -635, 1749, -1474, -320, 1542, -1509, 570, 98, -1074, 1110, -1083, -485, 586, -1371, 545, -105, -1366, 933, -817, -425, 1003, -1301, 1231, 635, -926, 1338, -701, -323, 1553, -1183, 342, 379, -1126, 1559, -698, -622, 665, -1248, 331, 556, -1518, 1610, -303, -46, 809, -863, 341, 506, -1666, 668, 422, -431, 981, -1735, 21, 304, -1324, 1128, -334, -615, 727, -947, 85, 1113, -1521, 1236, -213, -1458, 1194, -425, -533, 1452, -1143, 1249, -132, -986, 1414, -1090, -107, 460, -233, 605, 319, -780, 825, -216, 380, -37, -1835, 733, 387, -1471, 1764, -394, 63, 1236, -636, 1252, 449, -1102, 1428, -499, -476, 642, -1536, 500, 121, -885, 1345, -229, -513, 733, -1443, 578, -396, -1198, 1132, -344, -526, 425, -1393]
3633a393K150l23j716K810k349J31J603k032J379o2j305J892j768N14J575k224
3649a118J531o0k178K938j556q1J619j905J077K88j155J404p36p31J589k366J985
3666E45M16j901J634r75m44J504j568M56P19j763K592q89r12K145k070K64J110
3683H63k099K028r07j208J936j533M72Q39p28R94r47o24J877j634L38J762j915
3700d86J435q03q57J616j448K70J037k006J616k37j062K127j486k12J488j268
3716b76R68k5j213J472j303K8J526k193J527M2j734J906j379l5J566j916J730
3733F91J3j705K224j284m04J635j826Q31M14j720J710p04o54J495j885J419K99
3750E49j743J994j173n32J876j842P56Q35j806J645m38q10J713j713M88J115k181
$$ y = [-1393, 757, 434, -1282, 1528, -821, -690, 913, -1119, 260, 198, -1107, 785, -983, -469, 1106, -1118, 413, 353, -1825, 1113, -443, -524, 1095, -810, 267, 555, -600, 804, 68, -663, 926, -1440, 545, 961, -940, 694, -281, -725, 779, -789, -333, 386, -1377, 1215, 326, -586, 1559, -511, -247, 863, -1236, 792, -115, -1323, 613, -920, -448, 391, -337, 657, -290, -914, 963, -671, -333, 1429, -486, 949, 146, -711, 905, -543, -273, 764, -1242, 374, 137, -925, 1202, -284, -496, 992, -276, 692, 667, -546, 926, -377, -349, 1177, -1016, 511, 553, -1181, 725, -654, -689, 877, -1039, 691, 704, -1001, 1223, -61, -465, 1170, -656, 175, 589, -1131, 579, -125, -779, 716, -1169, 250, 549, -1194, 800, -373, -905, 971, -871, -115, 720, -1086, 559, 121, -689, 1024, -689, -201, 914, -1267]
3767a267J846m78j088K123j729K38J067j235Q80k70p04J836j799L84R82j904J314
3784A96J26j061J155j022L83J286j646J194j69j727K269j293O8J073j757J112
3800A87J05j274J676j140J4J069j564J350p3j245J700j376K10J240j685J205j25
3817B74j262J648r97n01J657j979J262L05j334J538r49l18J709j698Q61M96j664
3834i52J609o48n38J583j814Q42M59j541J736q79m67J431j329J65Q09j386J668
3851G48p21p03J454j190K06J202j660R29k28o63J444j390N18Q02j646J226k45
3868H3o98J685j528K38Q66j307Q78K04j237J313o77j00J314j702J326k75j083
3885g00J620j120k49J086j105J195k52j419J887j482K18J226j538J186O2j328
$$ y = [-1267, 579, 101, -987, 1136, -593, -355, 712, -523, 357, 87, -617, 1219, -580, -196, 786, -1118, 196, 322, -739, 416, -606, -223, 1063, -583, 611, 442, -1285, 984, -309, -241, 832, -925, 187, 292, -982, 694, -446, -432, 637, -927, 423, 350, -895, 805, -571, -361, 879, -806, 399, 274, -988, 660, -337, -838, 819, -1160, 102, 407, -927, 611, -338, -656, 1053, -645, 216, 712, -952, 657, 9, -529, 1054, -760, 82, 541, -1000, 736, -143, -610, 821, -508, -343, 466, -920, 748, 27, -676, 778, -412, -206, 996, -664, 265, 37, -626, 818, -572, -54, 748, -898, 328, 83, -615, 1070, -458, -220, 646, -661, 217, 421, -816, 497, -180, -280, 1034, -668, 658, 383, -700, 920, -200, -449, 637, -468, 727, 475, -944, 943, -539, -321, 905, -633, 553, 615, -713]
3901g13J630j179j65J442j505R10L94j680J614j059n69J577j596O72N65j194J323
3918D67o21n38J437j243O03N48j568J671o45q69J606j319O27O09j489J357n45
3935H8o62J052j123L71R89j542J220j82r64J527j351L92J057j632J205m49l19
3952c23J333j423M02N90j344J290o54o47J339r96r5J058j318J079Jq26J420j409
3970e23L22R16j490J259k47p02J127r15J56R65j669Q55Q9r17J530j257k66J444
3988F77j514J074l3q62J314q27k00J323j265O97L53j062J248j120k00J066j508
4005h39R58Q9j107J146m56j41R46j173O67L70r41R20n03k40R50j161Q56M01j446
4024g04J055l61n35J119j074J49K91j006J503n31n05J216q96m9P21o91P72j12
$$ y = [-713, 917, -262, -427, 1015, -490, 420, 814, -866, 748, -311, -880, 697, -899, -227, 338, -856, 467, -154, -692, 745, -498, 105, 653, -915, 756, 111, -758, 848, -471, 156, 765, -724, 633, 88, -574, 478, -645, -274, 715, -827, 393, 211, -753, 774, -577, -185, 872, -760, 445, -4, -323, 1010, -413, -11, 579, -765, 525, -129, -776, 563, -433, -528, 530, -788, 291, 292, -534, 886, -523, -201, 715, -775, 484, 237, -465, 662, -253, -97, 868, -801, 54, 143, -774, 756, -501, -767, 677, -837, 237, 204, -658, 656, -171, -371, 952, -313, 384, 737, -325, 923, -197, -397, 669, -839, 119, 208, -899, 247, -209, -350, 596, -577, 90, 460, -481, 439, -64, -304, 646, -515, 341, 742, -704, 351, -10, -545, 574, -500, -351, -60, -1066, 437, -94, -599, 617, -279, -328, 393, -298, 474, 362]
4042C62p66J026r66L41N17j290J130k99p43J073q65L00R55j115R22P6j313J658
4060A003j392J74Q70j129P44k89n98Q72n20k58J341j571Q82r3q38J272p02J30
4078a02N61j222J151n39l59J139o31j61Q63j092O56m3r24J269q75j05R11r22L67
4097e8K96p91J109o17k97R02j145R75m8q61J042o27O1O09j177Q35K46j199J044
4116B99n64k40J096r24L79K30q74J092m06p22J371j133K38R52j468J104l02p43
4134f15J127p01p2P36r60O37o6o05J052j076M50N80j163J184O6j121J253r58M72
4153B20L17p76M59j21p10J143o88j22Q68j366Q23J24q00R71o70K17O86j120Q62
4172C17m80m33J229p48o7Q25j234Q27J59p79Q39n92k44R86j003M20K46j128J356
$$ y = [362, -404, 622, -344, -3, 514, -776, 354, 55, -688, 385, -480, -180, 775, -340, 582, 658, -655, 1003, -389, -215, 655, -474, 270, -19, -617, 255, -265, -523, 818, -753, 129, 36, -802, 470, -232, -102, 459, -763, 388, -151, -510, 629, -2, -163, 700, -392, 264, 221, -703, 566, -309, -414, 497, -425, -58, 238, -553, 556, -61, -358, 544, -601, 374, 326, -535, 507, -120, -59, 550, -627, 208, 454, -745, 299, -265, -505, 591, -333, 46, 276, -598, 494, 88, -634, 737, -396, -158, 794, -674, 430, 128, -615, 512, -189, -261, 475, -485, 152, 86, -519, 533, -543, -93, 487, -676, 508, 574, -547, 706, -252, 220, 537, -239, 220, 99, -611, 532, -156, -278, 590, -776, 47, 171, -629, 342, -328, -111, 575, -545, 317, -163, -596, 633, -115, -182, 643, -591, 236, 395, -384, 455, -137, -381, 605, -398, 22, 268, -860, 496]
4191D96o31l51J031q84L38N70j199R29k76m03J021r31L21L41r97J223p83k89J055
4210E81j352Q24L90q86Q75m34j61P35q49M02N75j234R27k42n27R53p63j12P77
4229D79j110Q06m67J9R07j101M84N16j006P73j59n39Q38o01J55J73q63J350p52
4248i8p70J444p91N8Q51j100Q77k59n58J263q32k21P61j003M41j11l87R61q99
4267c73RP61r48Q77k48m92J054p01m7O07p77O45j65o02P92n74J26L60j056Q53
4287A01L07j089J128p94P4P57j206J025J73r48J096o02l37P05j038M92L39q51
4305f68J119o44k49Q86r42O64J02p25R11k97l58Q17r72L71K46o96O25N2q91J161
4325E12p32L10M81j193Q83k22l28Q15q21J40Q03j257Q06k52m05R63o55O2N63j077
$$ y = [496, -135, -486, 545, -339, -1, 569, -630, 299, 23, -380, 641, -290, 31, 372, -625, 598, -185, -474, 581, -771, 53, 443, -443, 432, -2, -163, 572, -277, 125, 700, -534, 393, 151, -376, 577, -186, -298, 479, -631, 175, -292, -273, 634, -467, 17, 533, -473, 300, 141, -398, 440, -161, -6, 167, -696, 654, -98, -868, 576, -215, -157, 694, -406, 471, 212, -346, 917, 85, -136, 625, -378, 63, -48, -435, 526, -373, -364, 397, -551, 326, 78, -414, 640, -61, -108, 499, -278, 367, 202, -400, 392, -182, -56, 304, -752, 101, 408, -681, 447, -347, -273, 484, -722, 303, 476, -472, 624, 22, -315, 390, -648, -156, 183, -668, 451, -193, -442, 444, -498, 166, 268, -457, 454, 157, -201, 616, -356, 15, 261, -435, 190, 242, -649, 512, -220, 90, 571, -622, 261, 39, -289, 526, -295, -155, 648, -609, 197, -55, -460, 503, -152, -90, 473, -604]
4345f04J034k49m10Q45o68q5O69r36Q71l33m70P21p30K85M86j077O32qm13J014
4365E74q38J6M28o30R00p2o60O47n45K23L38q11M59Kp11R93k53l49Q98j072P23
4386B60j51m90P89k81j82P03q68M33J87q47R48n65K1O05j128P80N8q53O89l92
4406b84n3O84o23P43l11o40J207o92l49Q63q68M64K86r20P24k04l98P61j008P35
4426A17J99o50N53j64m99J014j055N09K58q71Q79k01n37J050o87J03L93o95N95
4445C11j29p15J233r71J40O20p97R67p18j63Q41q27K89K66o62O24j13n55J104
4464G45q27j5O19r44M91M1m82P87p19j5P11q90O29L2k30N72p01J94M77j007R32
4485D00j73o92O73k23mK72o74N52K05q28O04j32l00P96p15L78P7l09R11p72l12
$$ y = [-604, 430, 181, -229, 616, -52, -137, 532, -404, 467, 134, -336, 385, -345, -60, 426, -651, -19, -27, -440, 574, -264, -248, 180, -450, 450, 378, -282, 365, -180, 43, 381, -430, 29, 31, -680, 313, 60, -289, 609, -463, 260, 109, -381, 408, 127, -55, 648, -220, 213, 400, -447, 501, -64, -43, 562, -566, 214, 272, -581, 108, -284, -337, 347, -276, 467, 156, -484, 723, 31, -318, 545, -323, 141, 427, -493, 231, 27, -371, 390, -618, 117, 316, -334, 219, 55, -444, 570, -485, 24, 282, -589, 290, 89, -448, 602, -85, 18, 411, -284, 311, 182, -533, 700, -271, -131, 489, -308, 659, -59, -222, 619, -208, 81, 347, -315, 309, 196, -359, 745, -82, -97, 522, -422, 69, 110, -372, 415, -304, -319, 392, -498, 131, 163, -67, 505, -196, -2, 475, -532, 400, 227, -465, 208, -15, -19, 253, -421, 131, 336, -492, 112, -20, -320, 476, -239, 139, 216, -93, 818, 46, -266]
4506b66P02p87M78l9n76J031n81l77R21j039Q18l4p41J298r62m7M88n99K42M33
4526C63r40R83n43o31J347q74L86J69n99Q18m12l78M99m08K04M97r28P26k65l82
4546c68P40p97L25L2o24R44q2l60R77j010K42N43q89R14l02o14O80q39M19N72
4566E03j223O02P7n72J144p69K09L64o92P59j41l35R52r80J69J39n93L38J11n61
4586d99Q57o94l14J134j006N22J08m99O63m36k81J048o12j28K17n94Q95o48K00
4605f7J47p23P88J21p16J097n55L4L15o98L95R9n40N88l86j38P38p87K90J40p94
4626f52J053m73k94J050j016L32O27p95Q10r36K2P34q15M15L39r32P56K1q35J133
4646E44j027N68K83p19Q95m08l35O86r14M66K72r20R43j62n74Q38q68L03L73p20
$$ y = [-266, 436, -351, 127, 88, -488, 543, -38, -415, 506, -533, 285, 251, -490, 808, -154, -201, 287, -312, -70, 363, -577, 406, -137, -768, 579, -295, 91, 260, -339, 479, 67, -311, 188, -220, -16, 481, -447, 279, 14, -368, 372, -425, -100, -68, -692, 252, 170, -190, 787, -223, 19, 562, -327, 587, 285, -329, 351, -488, -69, 503, -720, -118, -41, -613, 531, -238, -29, 335, -357, 402, 261, -74, 878, -102, 67, 206, -387, -49, 62, -499, 358, -336, -650, 484, -522, 0, 108, -391, 272, -164, -445, 603, -9, -137, 80, -514, 381, -267, -67, 80, -643, 145, 266, -450, 647, 92, 126, 441, -257, 138, 237, -303, 285, -101, -239, 499, -288, 2, 142, -652, 401, -72, -366, 684, -332, 0, 627, -168, 642, -294, -272, 462, -353, 62, 401, -531, 225, 246, -589, 544, -483, 85, 368, -351, 544, 136, -199, 487, -427, 39, 311, -609, 334, 172, -402, 436, -432, -129, 244, -476]
4666d76P59j60p40J081p09J61O69j075J044k89n33R26q25L7O50j245R25k88j61
4685b49P18q97N14L61p80M01n2m44P45p10M32L22o83O37J76o13M99k71k05O37
4705E38o71L08r4m65P13n63j83R39r01M22N00j022J004m86l10P61j081O38K94
4724C41n96N83q62J88Q25r23N89J50n86J071p35l65Q14p72K74K56p85R50m18n18
4744e19Q70p87N10L46j146P31J10n87Q75p51M42K27p84P50j24m43N09n60K31L92
4764B92q99J042k94m91J004p70J39L60p98P15j73l63N22o46K37O20q83O86j00
4783B00p67R71p79M10K82p50P53j07o61R56p30pP62r03P19k26o44R78n85rN61
4804D24p61O21q3n94Q42l05l08M59p72N58M35j124J063o39l0O13o98L93M5r87
$$ y = [-476, 283, 123, -617, 464, -245, -84, 585, -490, 554, 265, -268, 658, -167, -130, 520, -725, 200, -88, -249, 469, -428, 86, 447, -333, 68, 16, -428, 317, -393, 39, 361, -322, 315, 491, -122, 377, 106, -99, 538, -133, 175, 81, -384, 329, -234, -417, 522, -379, 43, 543, -479, 525, 39, -271, 490, -591, 47, 341, -255, 328, -534, -346, 479, -444, 145, 295, -291, 780, 45, -320, 494, -278, -4, 252, -533, 417, -1, -519, 351, -436, 74, 420, -726, 5, 115, -472, 403, -348, 94, 321, -463, 287, 163, -280, 229, -331, -100, 292, -607, 435, 141, -350, 654, -116, 23, 383, -415, 300, 127, -236, 286, -360, -123, 497, -386, 300, 200, -567, 404, -375, 35, 317, -433, 320, 213, -448, 508, -222, -229, 533, -370, 349, 123, -521, 457, -128, -137, 424, -337, 284, 201, -393, 449, 144, -164, 295, -477, 81, 516, -608, 455, -184, -214, 399, -299, 94, 139, -848]
4824h48J479l87n94R64j042N86K99p78O83l95l78P48q28N79N9p07O33j30j64P68
4844E47q83K97L64o49M29j08l97Q96j008L26N41q59R21o33j15R26q87K87P51j259
4864e13O52k2n22P12o58J66Q63r80M99j85l63Q50p44L74M64j436J075m3n56J086
4884G19j214L49O19q26N74j21m22Q20p00l1P07j059R70k41o65J096o91j25P05
4903D64r45M66J72n72P61o60L8P72q07P63k74q74J214r06J83O63q82P44qq65P08
4924A55l14k53R52r36M72K07j046J086j81l90Q15q65M34P2o37Q41m84k49Q58p18
4944a81J80L59o88M53j44o78J333r07K87N34j276J080k26n56P67q87M56N62q45
4963c77P76l26k95J023j043J94N74j094R79l18n35R42o80J28M82j168J082l4p41
$$ y = [-848, 631, 244, -350, 614, -428, 158, 457, -321, 362, -33, -411, 337, -491, 88, 147, -560, 73, -57, -221, 547, -336, -39, 325, -324, 105, -3, -400, 496, -512, -186, 355, -504, 417, -216, -331, 595, -292, -5, 746, -513, 139, 117, -405, 307, -351, -185, 678, -302, 197, 12, -351, 499, -245, 129, 593, -843, 232, 189, -367, 719, -495, -146, 473, -353, 221, 100, -322, 498, -202, -233, 474, -585, 385, 144, -521, 575, -116, -241, 464, -481, -15, 157, -415, 346, -314, -276, 496, -311, 452, 178, -696, 518, -388, -205, 458, -424, 320, 312, -553, 155, -159, -412, 540, -396, 76, 283, -763, 323, 142, -248, 567, -298, 136, 208, -429, 412, -72, -321, 537, -181, -1, 358, -330, 123, -21, -699, 634, -273, 14, 548, -728, 352, 126, -430, 337, -550, -94, 468, -377, 399, 73, -222, 801, -242, -48, 526, -568, 411, 93, -442, 500, -180, -52, 430, -738, 344, 310, -431]
4982d31R76o50j99P60q79M90j42l86J085q01j86J144j223O68Np75J138p41l34
5001d81J005r49P34k02p01Q94n85k97J029q44L38J70q80J043m80k52R13p96K28
5020a13N02o36O03m58o1P44p77O8O28j079Q29p7p44J063p80M32L46j018J144n64
5040E2m38Q79q93L78L42p51O42j70n15J006j085L30O94j181N92L37m39O78n08
5059e0Q4N05j237J099m6r90J292q88J66O33j054Q26j98m50Q16q57O4P54r17P26
5079B78r0p71R31n02j65N43o89Q40n9q24J213o24k9O56j134M80J34p29P95o57
5099d03J10Q16q87O80J43p32P36k72m92J065j240O67M65j354J648o92o08Q07r67
5118e10O01K19p26J070p97l80J122r85M31L44j167J325n77l42J232r46K56K37
$$ y = [-431, 545, -105, -304, 456, -423, 67, -75, -461, 624, -177, -363, 781, -442, 226, 231, -544, 594, -147, -481, 524, -425, 309, 107, -594, 300, -285, -582, 447, -397, -59, 111, -769, 274, -206, -458, 455, -341, -113, 389, -247, 356, -102, -163, 581, -196, -128, 500, -579, 250, 173, -571, 492, -288, 144, 490, -528, 616, 52, -386, 493, -400, -22, 320, -431, 211, 41, -474, 532, -553, -223, 471, -710, -118, 219, -220, 458, -50, 34, 539, -698, 401, 355, -635, 657, -231, -65, 568, -486, 340, 142, -308, 508, -349, -285, 469, -448, 278, 188, -583, 348, -154, -319, 224, -465, 375, 316, -508, 705, 81, 52, 708, -426, 54, 188, -541, 254, -403, -293, 523, -364, 316, 459, -273, 463, 191, -301, 764, -476, 191, 656, -698, 950, 258, -350, 457, -510, 91, 310, -416, 654, -143, -523, 599, -386, 45, 389, -778, 547, -30, -372, 860, -86, 170, 407]
5136D07p82Q05m07m76J004q73J33O24j165O93j55k70J034r43L41K73r22R65Mo67
5156c77P13o59n4P67j081R07K39r79J239r41n4P24j088P63N0q35J147o51k29J177
5176G78j371N64M52r97R91n98R4N80r10N28K96j198J138l61l53P63p97P10L8q89
5196e42Q23m46m59R50q05M68K69o97J123p73l23J088q34J34N16r65J137l08j034
5215f78J434j201M03M70q02P30j45p84J288j025L81L50q84R49m08o56J081p68
5233b65K25O43j308J061k36p04J125m95l13Q42j029Q65k46r20J339j029K77O98
5251E30j131N36K39o99Q56m39j75N49o96L88M01q53J118q39q5P10q99M97K78p95
5271e09Q61m48k41O50p25P69m2r86J339p21j34P84j057N73L45j006J320j025j43
$$ y = [407, -375, 430, 23, -453, 551, -322, -189, 435, -730, -37, -192, -462, 572, -371, -30, 243, -679, 286, 290, -377, 336, -323, -377, 390, -691, 216, 455, -524, 715, -226, -280, 444, -644, 119, 169, -666, 481, -170, -399, 778, -593, -29, 423, -574, 417, -181, -87, 493, -417, 111, 407, -791, 347, -14, -367, 396, -401, 309, 347, -542, 281, -165, -624, 326, -479, -11, 258, -439, 684, -89, -412, 676, -158, -24, 492, -473, 664, 356, -678, 756, -445, -42, 428, -374, 356, 211, -573, 715, -310, 71, 421, -463, 486, 78, -578, 503, -265, -40, 603, -705, 356, 120, -584, 541, 46, -267, 575, -454, 411, 165, -755, 584, -445, -168, 530, -601, -65, 174, -525, 331, -108, -283, 266, -430, -42, 359, -494, 624, -215, -300, 410, -489, 8, 286, -509, 352, -96, -337, 313, -412, 357, 315, -671, 668, -53, -187, 597, -460, 113, 458, -548, 772, -253, -396]
5290c96J062j376N11O94j270J147m99k22J073q41k32R87j255J167l84m85R22q23
5308b20R4N21j096J284m10p92J185j011O03M08r92R67l27m78Q68n84j49N92j032
5327e69O47m8n32J237r82N8J136j508N63O4n06P98p90M55O28j214N35J09r99J316
5347C98o21q1Q76j015O52J78r52J042o65L36J33o20N50M12j100J196m94j001J228
5366D52r59Q31m7p12Q78m49q38J345m05l65Q92j159J046l74p33J347j291N88J38
5385A85n61O03l55n85J204q26JP57j154J130j55p51J718j796M91N31j081J111
5403D67j31q40J073r19k9P46r04J143r53n16J505q43j68Q93j037J190k34j202
5421g59J193p41M15Q32j394n1N95r87J154j37m18J194j168O84r4j054J297n12
$$ y = [-396, 666, -710, -199, 495, -775, 372, -127, -349, 724, -117, -349, 638, -617, 550, 166, -319, 603, -220, -126, 395, -701, 583, 173, -619, 566, -445, 158, 566, -426, 541, 214, -264, 604, 20, -129, 463, -569, 78, 30, -502, 735, -247, -189, 947, -561, 2, 66, -440, 358, -432, 23, 651, -563, -28, 81, -918, 398, -223, -304, 572, -443, 209, 387, -565, 477, -188, 148, 281, -339, 211, 623, -477, 719, 225, -776, 452, -507, 324, 277, -435, 443, -6, -844, 501, 96, -269, 623, -536, 510, 136, -597, 750, -541, 47, 185, -376, 227, -128, -713, 491, -335, -334, 423, -731, 399, 244, -507, 1211, -585, -94, 437, -644, 467, 336, -504, 569, -350, -379, 367, -537, 606, -347, -863, 642, -201, -369, 524, -513, 677, 443, -759, 434, -307, 108, 940, -454, -505, 90, -897, 257, 120, -298, 896, -272, 412, 318, -736, 561, 49]
5439D9j12O49j276O88N76j212J063n29k39R37p15K61L14j220J114k38r99J760
5457H71j006J87L05j033J299o91n90J222q59L61P7p91R11n9p68R36o56L96K11
5476C23q78J121k19j073J581j358L67O54j108J045o49k52O70l98q1J048j626J082
5494B49K19o52Q25p59j56P79j091R63N6j164J476n64p07J206j044M40J0p68R60
5513B78n91M08L87q93O24M29j247J235j217N30N86j128R42n6r59R78k55q23J251
5532D79r99Q57R9q08P23k89n91J166j218N65M90j514J457n73l83J141j060k3Q77
5551C96r84J201o12o51J297j330P64L11j098J091nr26Q44m36K14q1m78J024o83
5570a42l06Q63p21N0Q50j351J105l50l60R38q00J44R69j618O64M29q55J071o40
$$ y = [49, -63, 586, -690, -2, 574, -638, 425, -104, -343, 594, -121, 140, 454, -766, 348, 110, -889, 871, -135, 52, 357, -676, 623, -68, -658, 564, -295, 66, 143, -648, 263, 204, -564, 372, -284, 112, 323, -555, 566, 347, -726, 855, -503, -136, 518, -590, 455, -194, -446, 224, -174, -255, 793, -833, 249, 468, -184, 641, -118, -274, 505, -586, 377, 433, -731, 745, 181, -526, 680, -364, 76, 86, -682, 278, -313, 95, 482, -411, 213, 642, -605, 630, -587, -57, 529, -599, 343, 287, -672, 306, 51, -772, 479, -520, 337, 436, -372, 351, 62, -529, 637, -581, -16, 474, -1040, 417, -156, -539, 602, -458, -481, 396, -588, 613, 1, -650, 647, -683, 81, 392, -706, 385, 380, -546, 298, -138, 76, -5, -483, 541, -142, -448, 415, -306, -256, 594, -757, 348, -2, -362, 576, -224, -80, 889, -729, -65, 364, -491, 580, -60]
5589f0q9O59j425J049o1m12J004j235J07R28p57J20K95o25R59p97k79R57q73L44
5609a91L26o54R89p23j54J056r80O46J55j440J636o46o93J035r27P92o4o18O45
5628A90m52l54J178r71O11K22j144J028m68l25Q94n74j64O70j225J250j08m57
5646a99Q69p49m3P03m00J74j1m74O06p89J16P26j217J101j25n63O42l82k24M88
5666B49o63N02L12r83J226o76r36J622j391J181k4n29J052j123q76J384o97M32
5684F2L13p95R19o69j81R65j189M42P47j157P11K43n06K23o60J064l11j188J315
5703C48j60p48J356r01k42P49q09P78r30J70J389j440j37J200j116N45m4k19K28
5722A7l78m29J306j014P74m9o53O72o10L30P52j365J111k60p13J192q54K23l86
$$ y = [-60, -149, 510, -915, 134, 73, -339, 665, -570, -463, 465, -292, -172, 123, -502, 457, -340, -619, 338, -535, -191, 135, -519, 470, -253, -407, 649, -331, 315, 470, -970, 666, 20, -673, 362, -565, 227, 163, -455, 190, -262, -616, 562, -409, 202, 424, -720, 308, -160, -485, 409, -165, -329, 341, -884, 366, 258, -199, 670, -79, -122, 581, 181, 355, 344, -130, 476, -313, -197, 529, -688, 413, 288, -275, 367, -15, -239, 249, -414, 88, 400, -583, 643, -33, -969, 653, -738, 443, 419, -110, 942, -181, -1057, 327, -370, 62, 375, -420, 499, -170, -351, 614, -575, -133, 614, -543, 168, 411, -95, 128, -532, 532, 221, -967, 348, 188, -560, 796, -105, -347, 402, -407, 371, -559, -389, 1000, -440, -577, 623, -493, 52, 8, -211, 17, -361, -790, 516, -498, 276, 227, -426, 246, -364, -34, 718, -647, 464, 204, -509, 683, -171, 52, -334]
5741c34k37P67K97j433J455r87J1J411j919J046J02n85J024j011J91O64o56k60
5759d54K17k86Q52n31P6P09r88M83M02j192R20jp53P19m16N4P88r24P77n04p1
5780a23R20j376R64m9p37O08k89n04J281j030L33O09j237R78j36n91O61o68N34
5799A48M99j109P89l57o48J499j169L90M01j063P39k24l10N37p47N96K13q10R76
5818C50j96p01J083l84p1L13r13P94k07k27J042r96K00J80p61M46N12p74R18q09
5838b01k40R58q98M39qo06Q62m12j45K71n53O89k9m44P17m87k37N93m58M66N8
5859C35q17J108q65M6N61p67M92K47m99N29k96l52R23q37N7K20j193J521j06o66
5879c59O77p56M55K91j347J456p4j016J103q00l5O01n45Q73l16o20J209j244L84
$$ y = [-334, -571, 196, 493, -940, 515, -472, -461, 950, -969, 77, 179, -406, 618, -393, -202, 462, -194, -454, -237, -523, 329, -202, -126, 583, -405, 78, 480, -712, 208, 207, -546, 173, -243, -189, 599, -325, 452, -52, -123, 797, -579, 385, 336, -401, 207, -82, -586, 695, -335, -2, 607, -630, 348, 212, -379, 282, -386, 148, 647, -462, 327, -30, -678, 821, -348, 42, 443, -620, 119, -105, -415, 122, -625, -29, 184, -626, 350, 154, -547, 536, 152, 81, 394, -519, 275, 68, -159, 883, -113, 87, 267, -494, -48, 464, -310, 608, -201, -441, 517, -381, 58, 50, -556, 306, -106, -251, 20, -533, 156, 127, -317, 400, -87, -324, 269, -189, 277, 335, -482, 626, -239, -193, 368, -399, 93, 340, -159, 370, 74, -278, 645, -192, -135, 85, -1108, 413, 307, -359, 318, -438, 17, 308, -1039, 417, 343, -673, 430, -370, -405, 196, -349, 524, 208, -412, 797, -447, -63]
5898f3M98p19N94K55r28O35j21n8L90q36K68N44q40J035p88k62J034q40L85J16
5918B99j038J280l89j43L01q00N40L55o29M50k97o6N97r58N82K14q82R73n51l25
5938d87J191q10N9L22j179Q59Q7n01J152r69K10M08p57O67o13K8L91o47P61K67
5958D39p30K16L00k94K60o24K14N20j288J487k93q61J135q51k14Q38p26P93k19
5977A02m17R87p05l16P36p52M99k13j21P67j137M9J128q15L82O4r4K03l61j86
5997b00P25r90P73k37q8L96o04LQ43p14K33N91j447J175l14k03M52q00M82J00
6017A76n36P48j091K63N38j405J603q8n14O60n43p7P10n27M69J00j024R42n64
6036a60k11Q00p62O43K22p39M37J4o18P70o51J16J088j453N94r8r4P69j069L41
$$ y = [-63, 435, -284, 310, 565, -363, 272, 151, 93, 483, -353, -85, 459, -381, 654, -134, -396, 638, -202, 183, 299, -739, 541, 152, 9, 310, -490, 50, 405, -224, 226, -71, -137, 460, -498, 84, 298, -584, 389, -162, -487, 704, -106, -47, 275, -904, -45, 42, -459, 693, -276, -66, 342, -415, 252, -361, -333, 58, -589, 172, 439, -291, -75, 225, -69, 191, -433, -219, 301, -987, 500, 207, -654, 481, -370, -584, 254, -472, 321, 102, -315, 672, -33, -349, 387, -365, 134, -79, -200, 567, -570, -521, 607, -208, 174, 238, 144, 347, -14, -200, 525, -465, 308, 71, -17, 379, -225, -222, 621, -93, 140, 731, -716, 459, 145, -58, 394, -406, 76, 176, -360, 388, -703, -440, 98, -1307, 296, 208, -306, 354, -189, -266, 444, -83, 386, 486, -538, 404, -160, -371, 429, -333, 310, 532, -207, 230, 244, -374, 396, -255, -139, 949, -504, 90, -8, -102, 667, -402, -61]
6056f1M63o68L37J21n36J306j401m2J078j469M60M25j40M45p66L21M38m89p04
6075h82J536j450J338j343O17P16p89O9P26p47N86l47n15J256j095N14J29j160
6093h41J033Q4J49K38p92j96P38m67L33o06q7O01q83R73p75m85Q74kp42J345j056
6114e64R08k74q89J188m30M1K54o93J8O51q19J091j74o61J036j124M96P89o70
6133A74J67n67m56R28o11M69j22l45J091K89j925N30R4J33O76q17P93m92r75J581
6153F15o45K38Q5q49M07N30q64O45q37K53J038j049N2Q71j128J038j21l91M73
6172C61k14l48O51m38J76l00j08Q74j157L92N96j297Q05l08N73j38J89j78l64
6191b33j02N75l45k42J572j588R8M15j066N80K23n30J114m02k6N55j171P36J0
$$ y = [-61, 402, -266, 71, 192, -344, 962, -439, -481, 597, -872, -412, 13, -127, 318, -448, -127, 311, -178, -882, 654, -796, 542, -801, -184, 532, -257, -188, 538, -209, 377, 30, -485, 771, -324, 190, 319, -841, 192, 276, 425, 663, -129, -325, 413, -54, 279, -327, -414, 187, -696, 277, -498, -983, -109, -111, -853, 492, -564, 344, 70, -819, 369, -61, -20, 234, -459, -441, 210, -609, 482, 308, -353, 683, -441, 55, 844, 174, 341, -226, -682, 246, -365, 104, -18, -363, 728, 1017, -908, -378, -284, -151, 525, -292, 501, 9, -966, 615, -30, 208, 293, -556, -149, 381, -483, 162, -675, -422, 616, -433, -381, 490, -638, 400, 279, -112, 361, 147, -201, 450, 12, 188, -112, -220, 654, -503, -111, 485, -812, -7, -315, 258, 120, 309, 131, -233, -335, 240, -105, -347, 1225, -363, -265, 150, -916, -336, -113, -643, 471, 69, 43, 598, -573, 163, 173]
6210A73l00O16p63j96P87j020M34R08p81L21j79K13L20j080Q16n0l49J20l60J77
6230a93O54p26O26o15j096J570r27N02N8o39M47N97j224J792k139N86J108m33
6248e2K59R6q03O49J53j790K001o70L06p18P7M33L71p17M29k48K44k21m1O50p92
6269c84K49N29n95N77m46l32Q12p57m20J543r19N40j9p44Q08q41m70Q73p70L97
6289c69P22o1p2l54Q3l68M79m02N01p72J252j86n60L57o04PJ053r97Q83K1j272
6310f59J335j874Q62Q03o92Q63l53o99L46k96r7J049p60O67k15n96P44l18j09
6329AJ57n94O29k07n21O54k96o47R78m97O94m79m17O82k44J22N94q34R4Q80m04
6350C45j32o96N07M73p51L36K8m95R87p94J11K55m38O3O0k64L79j3o09O88J6M90
$$ y = [173, -127, 489, -274, -470, 317, -703, -269, 639, -142, 179, 0, 213, 533, -547, 269, 219, -130, -10, -370, -193, 461, -265, 361, -254, -1350, 220, -707, -205, -147, -786, -339, 258, -966, 826, -1313, -727, 381, -52, 207, 303, -500, 149, 302, -1488, 513, -157, 149, -569, -492, -59, 312, -405, 24, -224, 20, -201, -242, 408, -384, -135, 394, -201, 376, -70, -402, 410, -347, -767, 776, -143, 397, 378, -366, 442, -399, -869, 4, -766, -369, 353, 292, 220, -134, -51, -419, 60, -342, 159, -613, 639, 453, -107, 250, -354, -347, 706, -291, 592, 613, -659, 676, -1198, -336, 467, -225, 638, 285, -414, -68, -364, -461, 588, -172, 495, 280, -316, 428, 110, 1, 158, -436, 193, -14, -535, 119, -177, -824, 154, -343, 351, -128, -545, 137, -107, 15, 609, -225, -131, 749, 345, 213, -483, 24, 497, -254, 82, 110, -385, 602, -192, -81, 174, -264, -201, -141, -405, -26, -39, -648, 40, 56, 546]
6372E46K3p90O38l92n85Q39n85K74M80o23M52p96J75M56j14m99P29q87Q96l07
6392g0k47P06m96O77R6r10R14m90j056J411o04J47J92q45N21K95o70N85n43n77
6412i64J194k48N85k79o01Q67j228N29j01K87l72k44K89Q21j824N44R83j067Q84
6431E5L41o90Q95r41r4O29r71N6N49m18J156q02K95O92p27l69P6K6L96r7l37O37
6453C57j56K6R9n68jM1j80R64j093O49k21L0K44J47p24J513j612O56L08j219J331
6474E91n06o52M34k68L86O46m99l01L01l35N92q00K77M87n28M82j84q56J289k18
6494C38o33N98j383P08O42p74J032l21L88o95k38O04k54j90K34J81j7M00p25O95
6514E90n05J01L08p78q2P3q8Q07m10l89L43k20l52J258j202R52l52o02Q28m70
$$ y = [546, 569, -221, 417, 25, -560, 279, -306, -32, 448, -175, 277, -519, -344, 112, -2, -501, 228, -659, 237, -70, -317, 389, -107, 570, 666, -244, 670, 180, -876, 535, -69, 78, 270, -575, -54, 241, -429, 156, -387, -964, 230, -18, 567, 288, -313, 554, -674, -145, -246, 41, -331, -575, -286, 535, -1289, -745, 238, -829, 55, 396, -294, 601, -340, -434, 195, -776, -720, -171, -589, 567, -235, 60, 752, 25, -344, -268, -242, 154, 57, -280, 357, 201, 227, 326, -242, -243, -202, -382, 582, -511, 138, -83, -53, 191, 338, -386, 1127, -485, 171, 479, -740, 591, 85, -567, -133, -401, -15, 631, 132, -169, 132, -203, 389, -411, -134, 353, -175, 307, 123, -733, 556, 338, -295, 303, -1080, -372, 270, -504, 528, 207, 595, -100, -338, 266, 12, -178, 56, 237, 220, 620, -105, 590, 85, 186, 494, -284, -366, -293, -381, 426, 16, -373, -30, -250, -602, 656, -546, 406, 54, -548, 280, -190]
6534a90o95J484r51M29K62p45P68n55P6O3j24l71J411j381R38m1p72N72l17O6
6554g3nn63R91q06J64J048j305M31L29q5Q6j86p36R85m36L90m43k41N04l20J86
6575h5K70p6p37O96j96J73K72p94J031r05N81J42r68O23P12q83N10k31M8N37n15
6596B05o75M97o52Q16l36M58o21K18l06K66k90P9J3L33N59j051L34k71L11j02
6616b15n9N4R09n42R5j51k67k4O13n00j02J1J54P44j559J082l30l75J191j232
6636e03L06J77j83O36n65N12m07j74R4R9M7K3m96m6M10J07l51Q48m11J48k48m8
6658b5J121j493L63M7l57m6J87K78P9o6m58Q13o17M10K85m23K50l20m13R01r39
6679d23L29L53n97O72k15o33N08p02Q99K06n13k18K37k23J87k07K38K83k76J16
$$ y = [-190, -885, 599, -352, 77, 339, -406, 362, -193, -117, -54, -178, -549, 862, -519, 419, 378, -394, 178, -139, -73, -78, -641, 350, -456, -292, 756, -549, -118, 211, 126, 212, 26, -710, 275, -161, 229, -214, -455, 49, -271, -85, 185, 109, -628, 68, -128, 45, 317, -477, 554, -351, 230, 372, -596, 27, 739, -144, 366, 135, 183, 720, 205, -470, 27, -625, 191, -145, 313, -308, -90, -396, -130, -420, -341, -328, 5, 564, -487, -153, -424, -113, -215, -274, -220, 689, 147, 242, 91, -176, -200, 413, -87, -189, -178, -24, 720, -839, 243, -87, -462, 729, -503, -197, -20, -203, 433, -132, 380, -27, -201, -107, -8, 39, 62, -434, -480, -70, 37, -314, 534, 123, 271, 23, -25, 1096, -397, -34, 13, -344, -390, -203, 75, 154, 88, -370, 443, -174, 236, 521, 98, 348, 28, -385, 516, -423, -94, 259, -338, 334, 119, -514, -6, -708, 191, 397, -116, -334, -97, -320, -133, -340, -102, 181, -95, 21]
6699B1M60p60l83P48j14M73l89N91o69j67M96l45L89j53o59M24J85o49N69j87
6719a19R21r55O8P00o47n47M28J42K32J53j008L19J68l20L91n54M06L14q77J245
6739D60r72K54J14K15j106Q12L25j74M64j091O29L57j042N86o1J45k67K92N08
6758D48R7p99P42j113L39R0j92K19N60l00N9l41J78j02l22J225q86L80L39r26
6778c05j4K38k35P76n06j76k9K40j00K89k66J29k17n4J72N9L6m17j7L64j65K31
6800C3K80k11m78M12k48L93l22J77K31q09N97M86o21J85l96j97P31p74L80Q83
6820G32j190L67O75n84O19o39K15Q1m63o1Q0M14o66M42J01k61n85P55m87Q2L37
6841c6L22k16K41J23k89L5p99J114q98L00k61j05J141j185M85N2P5n20Q91q38
$$ y = [21, 481, -279, -662, 86, -28, 445, 56, 647, -22, -189, 307, -38, 351, 198, -461, -37, 148, -501, 68, -119, 802, -153, -85, 615, -32, -579, -151, -9, 223, 376, -632, -313, -145, -465, -74, -628, -222, 92, -785, 460, -512, -258, -144, 71, -1035, -223, 102, -72, 392, -699, -70, 287, -755, -169, -230, -85, -352, -60, 448, 545, -254, 488, -625, -286, -196, -388, -169, 391, 91, 150, -191, -13, -115, -437, 788, -98, 282, 621, -305, -319, -81, -316, 460, -46, -222, -251, -11, -111, 178, -88, 41, -176, -230, -58, 1, 37, -380, -397, -33, -198, 33, 313, 102, -376, 36, -212, 181, -141, 36, 267, -542, 55, 541, -80, 105, -291, -488, 243, -531, -151, 732, -458, -91, 584, 0, 619, -20, 195, 276, -187, -248, -168, 246, -420, 22, 123, -138, -723, 32, -455, -373, -36, 286, 70, 311, 434, 145, 180, -619, 495, -403, -103, -364, -469, 672, -513, -28, 24, 99, -421, 470, -368]
6861c68L56L8o44Q83k51P0m01J66L17o36n4P48k39l20p0K52k4N01k50K80k16Q2
6883B20n02N10j44M95p60L84k89n4k14j12Q25j04q55M75J56k35M58K9l62M68q09
6904d20L41J2Q0L28m17P3k15K05J35n6p5R8k67q5o9J19j72O29k09o6j67K10N98
6927F10n43J61l79m02O51l02N6O43q41Q20l26m63M42M09m11k30m74J048k2l80
6947F7k6l55L26r5j18L03L58n83j14o9L88K50o11m21R50J4J38j58m06P9k3M21
6969C15K75o49M40l86m1M60k84l11M38l78M03O3L7l70k70M18l2J30j83J68L1j92
6991H2l69P73l40M89j83n85J31O7K44l49K04m51J01o9k2M05j46Q4Kk29K13K85
7013C37o37N61j86j53J88l63J12L19n06J52L38l03K29l95P82k42n27P60n44k2
$$ y = [-368, -12, 26, -618, 265, 14, 84, -317, -151, 166, -470, -524, 224, -15, -335, -405, -153, -177, 324, 74, 354, 138, 220, -282, 228, 84, 579, -181, 203, -86, -140, -354, -466, 359, 255, -600, -125, 31, -204, 254, 283, -79, 389, -420, -79, -67, 13, 341, -76, -3, -218, -13, 122, 66, -9, 89, -178, -263, -332, -213, -385, 244, 35, -31, -198, 12, 610, 67, 228, -151, -553, 98, -204, -148, 495, -346, 474, 148, -315, 127, 536, 125, -105, -579, 469, 447, 67, 41, -314, 12, -83, -201, 102, 460, -123, -237, -306, 82, 332, -279, -700, 250, 264, 402, 244, -162, -83, -106, 315, 590, -59, 381, -5, -46, 414, 130, -181, 257, -121, 282, 345, 382, 12, -258, 160, 128, 258, 75, 243, 274, 82, -287, 486, 146, 635, 452, -133, -2, 65, 309, -40, 164, -287, -186, -255, -277, 128, -18, 66, 68, -161, 52, 337, -300, 261, 75, -78, 110, -253, -141, 178, -328, -176, 162, -141, 88, -307, 475, 233, -294, 466, -78, -100]
7033a00M54o53n5L00m30L19p5N40P2n71L71q4o3J58p9J54Q1m20j15k29q2M09j74
7056b72j17J81j45Q23P9k60j39J23m09j51n2M70M8l35j5O7L6O0n22Q53r8J74j6
7079C83l47K01m9o46N24K71j98L02l99j30l34L02n2K19j98J88n8L57m60N2m73
7100e45J213q02k05P75p10L31j49K3J40k90P7j72J28K69J29l88N74m53N28m87
7120a4k91P66k40j29J30m89N12N1o13K45n9n2L64l58L77j70M1O4J70k03M80j033
7142d51M07J95l88O87m45J35j27m5k21R27q68lK90p2J36k12k3l70L56J71mK34
7164C09M6l03k23N71j088Q35k12j78N94l93N14k03l89K4m45O84m67L99j0j16O8
7185A7J26L57q13L25k84K02j47M40l97j38j41P11j18o17Q29p5m15q7m8O26l10
$$ y = [-100, 354, -299, -354, -54, -484, -165, -240, 300, 372, -199, 172, 88, 25, 183, 104, 258, 339, -81, -196, -425, -507, -98, -272, -389, -208, -353, 470, 549, 289, 150, 273, -136, -287, -339, 131, 179, -156, -171, -104, -68, -8, -530, 323, 225, 399, 383, 36, 237, 188, -458, 66, 337, 139, 441, 42, -88, -422, -120, -172, 47, -151, 37, -21, 336, -124, -72, -545, 668, -134, -339, 436, -274, 57, -92, -69, 71, -219, -142, -314, -186, 83, 212, -176, 398, -55, 473, -14, -305, 461, 221, 92, 222, -267, 245, 296, -317, -72, -131, -183, 181, -177, 200, 30, 71, 135, 305, 102, 582, -451, -44, 151, -237, 450, 5, 140, 13, -32, -253, 674, -194, -197, 93, 21, 157, -55, -78, -448, -92, 79, 75, 309, 355, 52, -171, 400, -688, 147, -65, -243, 351, -42, 472, 269, -120, -96, -541, 143, -324, 75, 65, -51, 17, 143, 500, -313, 12, -272, -70, -217, 223, -174, -312, -453, 258, 140, -477, 352, 277, -138, -225, -273, 353, 43]
7206D3l12k69K43J21K98l8k02N59m70K1n21J067m45K53j63J43p0m00P7MJ03l73
7228c31Q32q72L42k37J74o2N38l10j23k12N27J44m66k62J79l11L44O9L09j32k09
7249f9m02M24k70L25O7k41l7k7N92l62N6L9l50k36Q76p77q7Q19L88l35p92N44
7271A45m50m33N54L87l72Q82m08l96J59n70O44j91M6n36O31n73Q67n86K60J55
7291B15r2j78j11j29Q51m25j11J31k37K57K33r34K84j93L85K81o54Q40m56M56
7311D13k50k02K41K59o49P00p20o8N41m54J15j69L43O23o66K03J99p5n60p5N0
7332b01M05K65r60J010o86K59o13M93J5j53l68O43j5j79N67j021L13N50j90k35
7352a01J44j23j44KO96m72j41K8k28M78r4Mo5K53j44j12l46Q27p89R8K32j49k51
$$ y = [43, -269, -538, -295, -174, 124, 86, -116, 443, -27, -6, -527, 540, 95, 348, 185, 328, 258, -142, -65, -61, 42, -331, 501, -371, -29, -266, -92, -154, 384, 74, -49, -261, 266, 410, -56, -318, -139, -450, -106, -37, 272, 140, -69, -471, -47, -317, 8, 75, -166, -203, -230, 362, 0, 56, 95, -255, -491, 385, -392, -479, 340, 728, 393, -399, 145, -305, -738, -184, 203, -169, 713, 305, -91, 68, -502, 142, -49, -3, -539, 92, -481, 386, -200, 60, 215, 123, -55, -166, -295, 556, 131, 20, 151, -86, 171, 404, -530, -246, -439, -54, 227, -427, 413, -43, 413, 163, -39, 202, 461, -188, 512, -208, -276, 265, -189, -74, -243, 100, 723, 57, 260, 459, 384, -176, -251, -201, 204, 469, -491, 519, -167, 92, -521, -28, -13, -166, -534, 109, 94, -85, 482, -539, -226, 324, 134, -101, 43, -80, -224, -222, 474, 2, -139, -111, -339, 139, 45, 49, -16, 237, 93, -19, -365, 462, -327, -229, 3, -146, -397]
7375c97J84N0N08r32K89j78N52j49L62J15m20lJ38j5J52n60Q07r22K45N38l80
7396a6P8K84r79P68j37j34J13O6q3J86l12q6L31j31K47m02P4K98k45L84m74r2
7418b62L04l81N15M6m68M03K82o90O98k85l82O9m33P28Mn80N77j84kK88p88Q08
7440B67j20k94P26m30J08n7K01p35N01R2j68j84K87L71m05L5n89N30j16J14Q7
7461B21n36k32J32N21j42K13k88j61M56k8k3o70M22Q9J27J54J17m41J46M00m05
7482G2L12k52j73j29M12J16j019P89J52n14k3Q60q65R7J49K58k85J33j58K3l4
7503g9J85J23l51n31O56p1KJ70J05k51j85O93n67L0J44k5R8n50j34P01l57J33
7525f1J25j85O65L31q91k08J80lL54m97J11r9O24j167Q25l76L60n3m87L36O1m
$$ y = [-397, -213, -163, 345, -587, -298, -476, 76, -73, 289, 404, -16, -19, 119, 104, 256, -304, 503, -419, -174, 364, -16, 62, 346, -633, 135, -2, -136, -23, 43, -40, 146, -166, -252, 79, -52, 195, -207, -133, 165, -80, 304, -170, -262, 42, -339, 176, 222, -246, 157, 439, -251, 447, 162, -220, -151, -584, 144, 148, -432, 145, -39, -41, 247, -541, 267, 147, -147, 579, 149, 257, 200, 401, -334, 167, 259, 91, -93, 194, 565, 160, 195, -394, 136, 20, 134, 221, -315, -547, -415, 106, -36, 177, -111, -272, 184, 156, 133, -537, -115, -26, 101, 255, 372, -69, 77, 477, 72, 384, 132, -41, -170, 242, 358, -661, 128, 280, -234, -257, 603, -262, -165, -16, 242, -43, 90, -68, -45, -79, 106, 229, -122, -653, 3, -68, -66, 104, 209, -42, -227, 466, -101, -71, 73, 48, 146, -404, -538, 163, -194, -61, 64, -121, 544, 875, -16, -224, -44, -47, 307, -190, -79, -178, 446, -721, 104, -272, 88, 35, -452, -116, -55, -59]
7547e9k3j61N78o35N18j4o00L09K25m81K75j64m0N84n52L34l44j9k9l64M1J045
7569D24k38o20J20k04L10K19M5L68r72O48k0p57P25O33q23O57p34k83P26q24L85
7590b15j8n94N52N4N62K63r30P56j79m64Nj41K3L83m27P34l64k8r6L52m52K04
7612b0j40k45O1R60o87n3J67M97m83k31k83O7N81n83j7M08m40P85k54m47N33o23
7634d47O42k4k58O62k23j18o1k29K96j08Q8o49J39K78m6L29om00J74J64k98k56
7656c51K27M20p59K54L01l10L31j26K56r08P30o62O52m69L55k81P17n02J57q7
7676e5l10M87m66J95J67n88O40j41K2L25M3l15N86j034NQ37m61M33n06l8K37j90
7698a27r9O61k09k13L61m18J07N0Q1N5q75N12j39j61L55J50n12K43L75r7j46j80
$$ y = [-59, -82, -243, 335, -300, 218, 204, -396, -87, 138, -343, -68, -232, -272, 312, -240, 94, -250, -269, -298, -662, -621, 424, 186, -434, -314, -518, -208, 11, 56, 424, -548, 100, 80, -677, 48, 681, -142, 515, -219, -502, 224, -600, -215, -233, -827, -275, -221, 341, 604, -326, 430, 251, -213, -208, -349, -326, 57, -370, 364, 0, -28, -124, 228, -224, -20, -160, -405, -344, 616, -71, -124, 43, 540, 57, -174, -457, -390, 191, -392, -409, -1, -441, 344, 90, -357, 176, -447, 195, 171, -87, 575, 352, 234, 173, -56, 240, 132, 220, -429, -290, -12, -58, 271, 265, -135, 39, 203, -95, -351, -124, 296, -463, -209, 92, -218, 113, -13, 243, -665, 65, -597, 55, -414, -59, -340, 377, -125, 32, -55, -365, 122, -344, -149, 18, -570, 70, -71, -49, 276, 319, 4, 590, -444, -439, 398, -63, 370, -136, -174, 63, -127, -226, 435, 226, 13, 374, -44, 63, 113, 194, 249, -626, -114, -253, -414, -59, 91, -421, -178, 197, 100, -46, -226]
7720b26Q0L98n0J05k63l05L90m02O14n5m91Q72q13K59K09l23j2L48n78K35j62
7741a70J61J82J62j61k01N9K43J49r92P43qk13J15j32M90l03JK56k46M12j00n94
7763a47pk25N97o6k4R7K00j285J036p29J44M36o0N90k57j131N64K72N0N6o57M31
7785a15L17l68M15j91n70N06o0K70M70p47m70j02J84M96p5k89K56J26J48o11K01
7806b09O36q59j9Q48n77M80m19K58J29k25R3k8l88K13J46k69K53o30J83R0p7M40
7828F9q2m27J37O04J65q21Q4P67k50p15N56J11l44M52n16Q47j59l39Qm24j09K16
7850a70K52j20Q19q37J82j75j23M54q70n0o1J077p17O44o1j45j058N87N00m54
7870c26K81K53m40r7J72j96Q60j084N04k32O3R81q89j99P50o87l7P49n18O35o09
$$ y = [-226, -146, 252, 202, 307, 44, -261, 129, -273, 341, 286, -205, 667, -146, 113, 322, -1, -13, 335, -243, -8, -170, -9, 173, 335, 174, -27, 32, 275, 424, -568, 175, 167, -46, 69, -63, 427, 124, 125, 381, 135, 547, 447, -147, -154, -379, 218, 152, 128, 225, 425, -860, 176, -553, -409, 27, -33, 557, 300, -831, -267, 5, 55, 111, -546, -115, 202, -166, 249, 58, -512, -6, -66, 204, 674, -73, -543, -645, -461, 35, -40, -329, -73, 53, 201, -410, -209, 427, -432, -451, 397, -180, 300, -119, 139, 268, 43, 136, 108, -280, -67, 79, -190, 63, -567, -384, -294, -371, 69, -13, -440, -303, 301, 466, -355, -271, 496, 246, -469, 87, 198, -146, 306, -210, 637, 478, 139, 147, -277, -386, -170, 82, -38, 781, -56, 126, -49, -172, 282, -588, -638, -699, 378, -339, 305, 244, 99, -959, -372, 128, -326, -45, 208, -232, -329, -157, -353, 507, -577, -73, -305, -242, 739, -150, -349, 401, -286, -323, 426, -92, 543, -66]
7891f6o26J068n75K62R8RJj01k06R38r26J25j10l93N53k86K22K11N2p62R20j010
7913f02Q72r29L46J084o06j93M41j112R17n19j04Q10o26lN92n38L15k32N02l6
7933C79l30m30R31p26k1M67k55p1K49j44K33K1N23o19n02R4l4O42j49L52n05m81
7955c76K16j40M04o3l08K54P50n90j064J207r23k33J261l43J54r53P85M44m76
7974FL35j94j49o81O76k46R85j622K30R50p29O8N23J52l84O07j88k3r11Q39p84
7995e40O74L81q41K32O39j273P36J27m83R46l30l71m6o50J131o27R51p23L3K59
8015B25r4L10j449R58q25J271j463J079Kn57M55O98j326K48L55l1K79q70N97L92
8035B54j428J481m48O27o65l03L56k30l63J896q19m39R16j213Q11o70l55R13m72
$$ y = [-66, -692, 376, -199, 63, 161, 170, 171, 70, -136, 802, -124, 1, -109, -502, 51, -235, -13, 198, 250, -512, 408, -602, 270, -659, -313, 771, 165, -28, 413, -699, 218, -301, -405, 405, -221, -224, 368, -170, 145, -87, 415, 379, 49, -381, 550, -176, -197, 270, 15, -56, 193, 49, 282, 303, 826, 207, -295, -201, -235, 407, 258, 610, 105, -376, -160, -300, 104, 41, -267, -13, 737, 147, -917, 290, -633, -866, 395, 52, 206, -747, 38, 482, 6, 341, 147, -2, -683, -7, -253, 732, -890, -660, 290, -439, -371, 152, 304, -80, 527, 339, 316, -595, 244, -540, 134, 515, -326, -94, 545, -728, 8, 135, -348, 598, 268, -103, -149, -799, 332, -295, 656, -67, -34, 225, 131, 441, -1008, -50, -875, 396, -1067, 12, 14, -543, -88, 610, -716, -468, -113, -144, 135, -735, -138, 254, -1174, 307, -141, 486, -179, -482, -126, -356, -719, 1177, 358, -81, 835, -378, 433, -237, -592, 321, -151]
8054a51Q38k52q23M57P23q06N14J31p42N32n49N6j37JO85n53l70M41l17K47K32
8075A57K5l73O53o37N73q0r87O43k45J68J17J38k0k02J24Q2n93L08N28J10j78
8096C11o38L24M11M53q14Rk32N84l69l49N31o30M19j28j22R09j191O55j99l65
8116d31M20K74n59J47J68k54r3J97K89m31m22L05O43M7q0l34N67o26L40K81q68
8137d20J40N27n82J66K49q8K15J76j125Q66m59M53Jj72P19q60p1J067r81j87R12
8158E46q30o3M0K12J72m92L39P69j561J91j26O00K45J47p94J013m20Q03k31k14
8178C46k01j72L63l26k31J051p02J59m3o61M37L85q72
$$ y = [-151, 687, 435, -388, 69, 792, -14, 500, 631, -111, 421, -128, -72, -209, -208, 477, -76, -446, -5, -322, -75, 157, 182, -191, 462, -175, 398, 318, -669, -26, -271, -103, 14, 152, 132, -70, 54, 136, -457, -149, 379, 489, 311, -327, -3, 408, 861, 47, 56, -176, 408, 39, -310, 221, -409, 10, -118, -240, 669, -522, 133, -66, -431, -11, 263, -296, -149, 19, -235, -328, -131, 158, -273, -695, -390, 253, 300, 220, -114, 453, -173, 167, 448, -420, -280, 247, -335, -169, 80, -8, 207, 383, -742, 124, -335, 118, 119, -53, 666, -194, -265, 802, -179, -366, 546, -284, -347, -307, -95, 77, -415, -76, 693, -868, -677, -803, -203, 42, 189, -605, 408, -12, 791, 560, 346, 145, -27, 336, 10, -221, 830, 128, 287, 244, -417, 20, 405, -467]
8191d67
$$ Imaginary data points
##PAGE= N=2
##DATA TABLE= (X++(I..I)), XYDATA
0@%%%%%%%%%%QqQj6J6k2L0l5M3n5O3p2Q7j04J24j45J68j93K25k59K97l39L86m40
34b33M96n59O27p04P90q83R83j093J216j349J492j649J822k009K215k442K692
51A412k966L266l601L975m396M872n412O036o767P634q682R982j1646J3862j6989
66i420K1791l0254M9944j88617k63713j65258l770P8360q6174K05366J7417J07403
78b66925K69674O3998K20552J66595o2564J26881j02444j04985L9199k01466o4034
89H4481p6793k42724J0459j13055o8273J27983p4053P7268R8567n8844J79454
100e5530N1952K8725J72053p4376K5268L7498j32476Q6332l3080p6205P9507j36055
112b6387j8075M1415j13468J03321o468p1367Q8573j13549k980O8701r4423R9082
$$ y = [0, 0, 0, 0, 0, 0, 0, 0, 0, 0, 0, 8, 0, 8, -8, 8, -14, 16, -19, 24, -31, 32, -40, 47, -57, 67, -78, 90, -103, 122, -137, 160, -179, 207, -233, 263, -296, 331, -373, 417, -466, 517, -576, 640, -709, 783, -866, 956, -1053, 1162, -1280, 1412, -1554, 1712, -1889, 2086, -2310, 2562, -2850, 3186, -3581, 4053, -4629, 5353, -6293, 7569, -9420, 12371, -17883, 32061, -156556, -420269, -585527, -589297, -510937, -597111, -391745, -374328, -266925, 2749, 66747, 287299, 453894, 391330, 518211, 415767, 310782, 349981, 148515, 84481, 7688, -235036, -224577, -337632, -405905, -277922, -351975, -274707, -176140, -234984, -55530, -3578, 25147, 197200, 122824, 148092, 185590, 53114, 139446, 106366, 30161, 109668, -26387, -44462, -3047, -116515, -13194, -19662, -91029, -2456, -116005, -118985, -50284, -144707, -45625]
124d5625j638p1377J05840o7373M0302J22955n5255J14234J7240p1577J00885
135A88611p2097k195O3519j35496J4144o0850j36186O0136q1693j1733P9686r3605
147a87759O8068L8326l1115J60305J5475M1763J15131q0928N3929J5167q5206
158A23156P8003p7976p3429J6911j49382j405K188q5703Q8978l8740k5306R2179
170e0526n8496Q1195Q2074l5541J11596k5446l5645Q0073p8747L4444L1768j02226
182C4523M3603o6849o9306O6415p8426K5766L7371r3402O3052k4854l0362J04312
194A1843m6638L5606N0737q3607O9826n780k9584R4798o0666K342K8783r8499
206c0839N1104j1528n0512P1768p6996j5653L2738q2648O6410J4082l6673Q3397
$$ y = [-45625, -47263, -118640, -12800, -80173, -39871, 83084, 27829, 142063, 159303, 87726, 188611, 116514, 114319, 177838, 42342, 56486, -4364, -140550, -80414, -162107, -173840, -94154, -187759, -119691, -81365, -112480, 47825, 63300, 105063, 220194, 139266, 193195, 208362, 123156, 201159, 123183, 49754, 66665, -82717, -84122, -81934, -167637, -78659, -117399, -142705, -50526, -109022, -27827, 54247, 18706, 130302, 104856, 69211, 149284, 70537, 104981, 136749, 34523, 78126, 11277, -58029, 8386, -70040, -44274, -6903, -100305, -37253, -62107, -92469, 11843, -34795, 811, 51548, -32059, 37767, 31987, 2403, 97201, 36535, 38877, 67660, -30839, 20265, 8737, -41775, 29993, -47003, -62656, -29918, -112566, -46156, -32074, -68747, 14650]
218A4650n2300L500O3507n5278P3009J5806n4697O0531o7260j9296M8736p5003
230d4095M1675n200p5884N4635n1948j795P5133n2470N5110J5946n6852P5235
242B9490k8227J142P1424o9729K4620k556p7210O1043l5575j5136N9100p5191
254e6805K3605J7245n3746Q2319j2224r764O3744o8080K3331K5149n6616O8925
266D7083k5198l5728M6263p4295J7754L3109n1108O6274j9627l3993N8448n4063
278b5081K9721M4132n2923N4302k5258m4832N5191n1871J9152L8568o4050M3680
290B0731j9474l8069O8907l7908K0014M1637o4864M0798j1062l7235O7935m2309
302I101J510L0516p4703L6548k622l5621O9934l9165k500L7479o1954M6644J3805
$$ y = [14650, -37650, -34150, 29357, -25921, 47088, 62894, 8197, 68728, 1468, -17828, 30908, -44095, -2420, -7620, -83504, -28869, -80817, -82612, -7479, -59949, -4839, 11107, -45745, 29490, 1263, 2405, 73829, 4100, 28720, 26164, -51046, 9997, -25578, -40714, 18386, -56805, -33200, -15955, -69701, 12618, 394, -9370, 54374, -13706, 9625, 34774, -21842, 47083, 21885, -13843, 32420, -41875, -24121, 8988, -42120, 24154, 4527, -29466, 28982, -25081, 4640, 48772, -4151, 50151, 24893, -19939, 35252, -16619, 2533, 41101, -22949, 20731, 1257, -36812, 32095, -5813, 14201, 55838, -9026, 31772, 20710, -16525, 51410, 9101, 10611, 41127, -33576, 2972, 350, -35271, 34663, -4502, -7002, 30477, -31477, 15167, 28972]
315B8972l2341O4952m2859j2960L6978o1926M0084R448m6411M9323m8496j8834
327c4070M2934n2546M1542J4937m6289N0741l4844q556N6517m2581L8353J4171
339D0309n2960M5725l1627j4378N2121n2292J8719M084o2865M3438k3565j2168
351d5459N4924m8256J9727J7671m6817N9502n973r479N6556n0592J1339J6320
363B9463n2395M8198j6699l1805L7416o1413J892K3324m6788N2816n986k5822
375d7799N3075l9669J9583M4883l6018N1473q008l6582M1684m6088M062L0156
387C0752n6059K7409j8470m5235M4907l2171J0341M2790m3769L7041K230k7317
399b7551O0324k1287P358L7032n4512K3395l464l8656M7903l1343j0022K7474
$$ y = [28972, -3369, 61583, 18724, 5764, 42742, -19184, 20900, 30348, -16063, 33260, -15236, -34070, 8864, -43682, -2140, 12797, -33492, 17249, -17595, -26151, 30366, -12215, 26138, 40309, -12651, 33074, 1447, -12931, 39190, -13102, 5617, 9701, -53164, -9726, -33291, -45459, 9465, -38791, -19064, -1393, -48210, 11292, 5319, -4160, 52396, 1804, 13143, 29463, -22932, 25266, 8567, -23238, 14178, -47235, -45343, -22019, -68807, -15991, -21977, -47799, 5276, -34393, -14810, 30073, -5945, 45528, 37520, 938, 42622, -3466, 596, 30752, -25307, 2102, -16368, -61603, -16696, -48867, -38526, 4264, -39505, -2464, -234, -27551, 32773, 11486, 18844, 55876, 1364, 24759, 21295, -17361, 30542, -801, -10823, 16651]
411A6651n6472K4620R338l0070N4746k3583p718L6356m5659L0672J7889l1857
423e087M7137k8490j8043L5687m5028K7402J7666l9222M0776k7823j9382M1670
435B7263m0038K4570J6168m6466L4310k5142j8693M5847l6234K0640J8256m4795
447b4314L9927j1232j1884N2386l2278J3474J6181m7961L4073j1269k1068L8915
459C4950m2587k144J3390m7567L6033l370j9801M3647l5122N661K7780l4271M2859
472A9458M241k3764L9091l6721n03K7916l9782L2812m986l4706L1699l6514j496
485b3255L1905l8482K8309l181l5805L7571k6063L200L7485l5901K7060K721l1043
498b5479M4071j6645K597L6622m0927J6851N48l8281L7134k3622j2599K4417m7400
$$ y = [16651, -39821, -15201, -5863, -35933, 18813, -4770, -12488, 23868, -21791, 8881, 26770, -5087, 42050, 13560, -4483, 31204, -13824, 13578, 31244, -7978, 32798, 4975, -14407, 27263, -12775, 11795, 27963, -18503, 15807, -9335, -28028, 17819, -18415, 2225, 20481, -24314, 15613, 4381, -7503, 44883, 12605, 26079, 42260, -5701, 28372, 17103, -3965, 34950, -7637, -9781, 3609, -43958, -7925, -11295, -31096, 12551, -22571, -16910, 10870, -23401, 19458, 23699, -65, 39026, 2305, 1802, 29718, -10064, 22748, 17762, -16944, 14755, -21759, -23255, 8650, -29832, -1523, -4704, -40509, -2938, -29001, -25801, 11684, -24217, 2843, 5564, -25479, 18592, 1947, 4544, 41166, 239, 17090, 17638, -20643, 16491, -7131, -19730, 4687, -42713]
511d2713R966O275l0021M4575j0686m320L8762l1410K5498K2959k2098M2822j5737
524C3872j9530K5076m5472P486Q489m1520K4200k3455k3386L1217k8605K2257
536b9371K9481k4742L9773l359j0064M2893k3490J4844J7008m3555J8278j9886
548G810k8599K9696l3955K921J5735l9485K8618N11r848M8215j7881J0590K4542
561C8870l5089K8391j777k3018L1196l4815r548J3306m0808K3803K794k0589L6725
574I441k1108K018L0924k5356L1737Q976k4929K9664k9368r394K1507l5904J5221
587C429q23l3606K5919k0667j997L4896k3340K4713J0831k4870L4312j3491l034
600A2272K9269l4165Q901j097l7388K5807j7757j0332K8019l2163J1965J2387
$$ y = [-42713, -32747, -26472, -56493, -11918, -22604, -26924, 11838, -19572, 5926, 28885, 6787, 49609, 33872, 14342, 39418, -6054, 1432, 9921, -31599, -7399, -30854, -54240, -23023, -51628, -29371, 110, -24632, 15141, 11782, 1718, 44611, 21121, 35965, 52973, 9418, 27696, 7810, -20789, 8907, -25048, -22127, -6392, -45877, -17259, -16748, -26596, 21619, 3738, 14328, 38870, 3781, 32172, 30395, 7377, 38573, 3758, -5790, 7516, -33292, -9489, -6695, -27284, 9441, -11667, -9649, 21275, -4081, 27656, 36632, 11703, 41367, 11999, 2605, 24112, -11792, 3429, 2606, -31000, -5081, -25748, -27745, 7151, -16189, 8524, 19355, -5515, 28797, 15306, 12272, 41541, 7376, 16277, 15180, -22208, 3599, -14158, -24490, 3529, -28634, -16669, -4282]
612d282k4215L8507l598o110L2430l0650Q868J1269k9398K7743j4176k0243K0577
625F722l4180N607J5741k5737L0722n429j4792L1331k2112J2712K1395k4715K4191
638B1456j0373k2135K4713k6786L931J5966l2129J8942o332j8959L2584j6076
650a5198Q676K2900k7853K1939j330j7661L0896k0213j564J4809l5128J3953j664
663g438k0412L1107j8259j938K0678k6718K2862Q660j5583L1612j7665m903K0727
676B2730k9992J6541M743k4450K3566k0712j0463K1956k6071J8430Q906k2286
688a7102K6027j3547n733K7497k1158J6109P786k6549K3096j3853q223K4880k4085
701d855R834N927k7336K2849q399p499K7007k2996P500R264k5215K5145n544r292
$$ y = [-4282, -28497, 10010, 6412, 302, 32732, 2082, 10950, 22219, -7179, 20564, 6388, -13855, 6722, -27458, -21851, -6110, -31847, -1125, -6554, -21346, 9985, -12127, 585, 21980, -2735, 21456, 11083, -11052, 13661, -13125, -9194, 6772, -25357, -6415, -12747, -31706, 878, -15198, -6522, 16378, -11475, 10464, 9134, -8527, 22369, 2156, 592, 15401, -19727, -5774, -7438, -27850, 3257, -15002, -16940, 3738, -22980, -118, 8542, -7041, 24571, 6906, 2003, 22730, -7262, 9279, 14022, -10428, 13138, -7574, -18037, 3919, -22152, -3722, 5184, -17102, 8925, -4622, -10355, 17142, -4016, 12093, 19879, -6670, 16426, 2573, -5650, 19230, -4855, 4979, 10906, -16430, 6419, -1980, -9479, 17528, -5468, 2032, 11296, -13919, 11226, 5682, -3610]
715c610K5132k4765M565J0492k3750K4307m511j3748K3681k4843L487J3964k4234
728a3833K3395l224j6176K2566k1939M093J7236k2291K1666l478j6947K3455j9584
741e061L807J8388k4566J7326l637k0551K3540j7467K015J7788k4481J4349r22
754E28j8328K5447j3046N75J8809k4969J3059J871j7576K5883j3283l613J6850
767A2207k6084J2516M010j7369K4799j3247n923J7910k4209J3631P752j8292K3197
780A0898j2793q494J8905k1954J1598R019k0463K1049j2267r081K0496j9228J1005
793a310R507k1438J8633q961q753K3269j8419Q704R665k2602J7934o589r834K3321
807A3127j8385M902R127k2735J7799m016j0676K3172j8601K856J0854k1007J8354
$$ y = [-3610, 21522, -3243, 1322, 11814, -11936, 12371, 7860, -5888, 17793, -7050, -3563, 10401, -13833, 9562, 6338, -9838, 12728, -9211, -5118, 12118, -10173, 11493, 8015, -8932, 14523, -5061, -1254, 17134, -7432, 9894, 6257, -14294, 9246, -8221, -6206, 11582, -12899, 1450, 528, -17800, 7647, -5399, -4824, 13985, -10984, 2075, 3946, -13630, 12253, -1030, -4643, 12207, -13877, -1361, 2649, -14720, 10079, -3168, -9091, 8819, -15390, -1759, 5993, -12299, 10898, -1895, -10389, 8516, -13438, -1840, 7179, -13284, 7765, -4502, -13583, 6913, -12315, -1310, 8197, -13241, 5392, -3569, -12322, 10947, -7472, 1232, 10897, -11705, 6229, -360, -10194, 13127, -5258, -356, 8771, -13964, 3835, -181, -10857, 12315, -6286, -3430, 7424, -13583, 4771]
820D771j269j1281K1926j8290J741J2521k0821J7794J2j4542J9711j7585q8J5227
834I827j9030J6507O80j5962J9746j4423L2J6523j8304J3490n4j7983J9038j3465
848c378k370J7600k0600J0831J825j7836K0963r866j476J8595j9279J0705L705
861I419j7094K0703r027m733J5917k1833Q150L888j7685J9756q663o555J6759
874I002j9876Q447R180j5992J9597n915q347J6928j8549O718R036j8353J6509
887H385q426j1432J7415j7029O318J0627j7789J6008m961r664J9982j3859N517
900A092J1273j9465J3939m182j2070J9141j4583J538J0354k0553J3778k136j0894
913a2768K0204j3280J162J1705j8931J3940L59j1719J9024j3465j576J1852j8846
$$ y = [4771, 3502, -7779, 14147, -4143, -2402, 10119, -10702, 7092, 7104, -7438, 12273, -5312, -5400, 9827, -9203, 7304, 7984, -7978, 11768, -2655, -2623, 13900, -4404, 9086, 9032, -8951, 10087, -3378, -5748, 11852, -8748, 2083, 3908, -13928, 7035, -2831, -4307, 14288, -4991, 5714, 9419, -7675, 13028, 4001, -732, 15185, -6648, 1502, 5390, -12295, 7461, -1202, -7757, 9002, -10874, -2427, 6753, -9239, 10358, 4443, -3904, 13024, -5525, 1193, 10229, -8124, 8385, -41, -11473, 5942, -11087, -4769, 5858, -11931, 4077, -884, -10548, 9434, -4425, 1092, 12365, -7100, 6839, 2657, -9413, 9728, -4855, -3317, 7037, -13516, 262, -1874, -12768, 7436, -5844, -4682, 7023, -11908, 2032, 2391, -9328, 9696, -3769, -5345, 6507, -12339]
926a2339J3910J863j2739J8272j2666k189J4201j6891J2693K809j4260J6432j2258
939c162l859J4630j7102J0199K682j5665J6163r560l065J6290j4870R521M674
952F876j5558J6836p393m219J6266j6257O592L641j6344J5463o603n686J5516
965I130j6308N227O498j5296J6962m601o167J5964j5482M695Q264j5282J5613
978I217m731q803J4485j5502L590Q833j5365J3674l570j0115J5387j3672L771
991b801J0618j4889J3319k472r879J5523j1645K906J1439j6157J0954j995j1416
1004f495J5661j1157L21J0188j7110R576p10j1259J6045r718J92J1285j5950J0151
1018A020K760j0774J6888q699k051J1439j5896R016K285j1762J4242r940m129
$$ y = [-12339, 1571, 3434, -9305, 8967, -3699, -5888, 8313, -8578, 4115, 6924, -7336, 9096, -3162, -7021, 7609, -9493, 706, 3388, -12277, 3886, -5674, -8739, 7551, -7319, 2202, 6876, -8682, 8154, 761, -3458, 12808, -3449, 3143, 6784, -9560, 5903, -700, -6386, 9130, -7178, -1951, 4547, -10749, 6213, 1612, -4555, 11409, -4073, 622, 8886, -6396, 9217, 4486, -4317, 10168, -5334, -1744, 7089, -8276, 5398, 1828, -8287, 7100, -6572, -2801, 7817, -7072, 6247, 3775, -6104, 9419, -2226, 680, 12119, -4038, 6916, 4921, -6495, 9166, -1991, -1670, 8518, -8592, 984, 274, -10985, 5060, -4658, -4466, 6819, -9131, 1020, 3780, -6994, 9894, 1195, -856, 10583, -5313, 3703, 5988, -5774, 8468, -1472, -5601]
1031e601J1030j5011Q441L706j2399J4426q365m039J3708j3356Q628M860j2803
1044f775J3448p173m882J3318j3079O612M117j3981J2162o121n193J3687j2957
1057f817N314N286j4095J3066m221n018J4304j2175L670O474j3442J2321k800
1070A867o512J3502j2374J755O822j3424J1375k452p938J2674j1661J737Q038
1083C409j2485J1402n75q654J3360r899J478R557j2156J0450o07r837J2788j0235
1097b004N44R809j3683Q591r82j0240J2442q854o4J0250j3273Q403Q81r644J3877
1112F053p110p85J0853j2962P000K463j0218J3364p196k763R893j3247N990K895
1126D230j0800J2509o814l988R969j2172O444M251r975J2162n436l915J0877j0803
$$ y = [-5601, 5429, -9582, -1141, 2565, -9834, 4592, -3773, -7812, 5896, -7460, 1168, 6028, -6775, 6673, -500, -5382, 7936, -5143, 1469, 5586, -8395, 3767, -2354, -7547, 6140, -6817, -1503, 3783, -10312, 2754, -1467, -6485, 7819, -4356, -686, 5788, -7654, 4667, 1867, -4645, 8857, -3517, -1762, 5060, -8364, 3011, 559, -7379, 5295, -6366, -4629, 3409, -9076, 2326, 1751, -6903, 6457, -3442, -1964, 7593, -4563, 5887, 5280, -4557, 8231, -2004, -1460, 8349, -5334, 3257, 2275, -7965, 4477, -4377, -4441, 5809, -7464, 939, 1820, -7824, 6053, -1057, -1842, 9011, -3951, 3049, 5512, -4706, 8658, 1462, -1301, 8592, -4655, 1335, 4230, -6570, 5939, -875, -4863, 5106, -7066, -622, 3629, -6346, 5816, 380, -3535, 7342, -3461]
1140c461N786N205j0824J0566n593n662J0748j1340M177M639j2172J0156m481
1153b256n234J2192j0288M639O156j1219J0526k612n055J2613r930K685N264j2676
1167e195R268k757o815J1092j0419J101N786j1855R380n82o075J1824r089J188
1181c148Q143j0865R207J31o787J0559q804k0P281j1037Q194m61q748J0640p874
1196c589p14Q595j0839P475R12q940J0540o720p25R303j0183N957J501q766J0452
1211D259n572j409R144j0417N097K199r557J1101n552k081Q051j0149N057K372
1225B543q929J0280l697l858R690j0456M468L703q687R514l992m159R068r616
1239d128L693M171r226R604l793m756R294q475L150N437r105Q187k818m968R542
$$ y = [-3461, 2325, 7530, -3294, 7272, 1679, -3983, 6765, -4575, -398, 4241, -7931, 2225, -2256, -7490, 4702, -5586, -947, 5209, -6010, 4516, 1904, -3151, 9462, -468, 2217, 7481, -5195, 4073, 1316, -5499, 5593, -4826, -3725, 2061, -9794, -414, -996, -7071, 4753, -4336, -3148, 4995, -5870, 3337, 3468, -3319, 7240, -1564, -1584, 5697, -5340, 2854, 2393, -6355, 4285, -3589, -4303, 4292, -6547, 928, 1840, -7100, 3440, -3280, -4005, 5298, -4885, 1072, 2573, -6193, 4259, -1313, -2722, 6422, -3995, 1102, 3301, -6256, 4845, -707, -2788, 5263, -4886, 171, 2543, -6386, 3894, 197, -3661, 6029, -4427, 41, 3744, -4943, 4571, 579, -3580, 5488, -4128, -435, 3736, -5490, 4114, 321, -4435, 4859, -3616, -466, 4971, -4134, 4053, 1235, -3733, 5809]
1254E809p865K303N339r898P319j730n429R675p883J738N823j0132Q083j732n460
1269d040R831p149O84N801j0063P143n67o246R645o368o62O614r999P718J89o542
1285d011R841o767p09P457r852P251N88p408Q333n258j844O877q655N195J527
1300B565p784Q339n482j313P631q249M427K344q167R571m876k306Q475q196L917
1315H96K329q276Q212k866k657P772q397L566L067q019P621l039l375Q108r035
1330d093K026L985p946Q254l491l559P709p597K491M894p378Q143j305m960Q078
1345E251p281K323N031q126O210k235n801P340o800J500M983q726O669o12n028
1360e302Q505m907J091O199q501O176m32n472Q632n779q17N264q700M753n89n735
$$ y = [5809, -2056, 247, 5586, -4312, 3007, 1277, -4152, 5523, -2360, -622, 5201, -4931, 3152, 1420, -4040, 5791, -1358, -674, 5127, -4936, 2207, 1640, -4606, 5039, -1329, -1991, 4623, -5376, 2342, 2531, -4011, 5830, -937, -1646, 5811, -4041, 3210, 3798, -3610, 4723, -535, -2379, 4498, -4157, 1038, 2565, -5219, 3120, -2362, -3675, 3956, -4293, 134, 2478, -5689, 3882, -994, -3300, 5175, -3021, 896, 3225, -5051, 3161, 295, -2362, 5410, -2987, 579, 3646, -4373, 3248, 209, -3166, 4942, -4093, -2067, 1918, -6028, 2226, -1265, -4824, 2885, -4712, -2221, 2673, -4705, 3438, 2133, -2827, 5251, -2030, 293, 5324, -2802, 3408, 1173, -4628, 2712, -4088, -2588, 2395, -6331, 338, -274, -5302, 3203, -1704, -613, 5586, -2915, 3261, 2829, -2643, 5989, 210, -607, 4657, -4043, 710, 121, -5614]
1376e614P651n249n77O812p803N318K206n964R219n421q25O605p981M758R87o239
1392b117O923n696j961O049p800M260J646n859O572l720p32O429p231M212K704
1407C679o860P087l755k841P310o821K751K771p196P274k652k628P782p035J956
1422H22L316p863P373k872l569O567p411K048L246p853O824j099m056P765o061
1437b823K037M177n788O005p88m230P108o711M58M373p821N146p00o037P177n146
1453c563L6N654p038N359K97m069P370l832L44N016o816L770J68o046O587m704
1469a467j122N274q266M430O36n340P566l479m40N654o612N026R67m632O306l178
1485A323j502N295p512L537J583n507N422l044l488N480o419L235K497n662N979
$$ y = [-5614, 2037, -3212, -3789, 3023, -4780, 538, 2744, -3220, 5999, 578, -247, 6358, -1623, 3135, 4122, -2117, 4806, -890, -2851, 3198, -4602, -342, 1304, -4555, 2017, -1703, -2435, 3994, -3237, 975, 3679, -3181, 3906, 151, -2690, 4620, -2201, 550, 3321, -3875, 3399, 747, -1881, 5901, -1134, 822, 4138, -3725, 3648, 776, -2793, 3774, -3637, -1589, 1657, -6196, 628, -471, -4527, 3238, -2823, -786, 3391, -2397, 3608, 2820, -1410, 5698, -1013, -555, 3818, -4003, 1143, 443, -5594, 1583, -3563, -3527, 2127, -4911, 448, 745, -3324, 4046, 214, 558, 5574, -1242, 2528, 2696, -3350, 3237, -1467, -2589, 2685, -5581, -1151, -515, -5855, 1711, -1768, -2208, 3446, -3166, 1860, 2827, -1805, 4501, 1323, -179, 5116, -2396, 1141, 2724, -2783, 2639, -405, -3893, 1587, -4832, -1597, 900, -4762, 1217]
1500A217k405k260O334n352K971K977n647O129l035k022N707n321K196K341o558
1515b728M886k332l457O046n661J008L605o427O017q96l254P406n311J739L178
1530C819n769N463k127j788M886m742o1L393o763M939j87n413O210m590O34M346
1546B250o018N592J9m376P024m487J63M144o076M394K68n582N484m361o15M532
1562B355o664L898J216n225N356l244RM756n039K516J894n309P096l348p29N193
1578D731n098J800J611n777O434l374j698N140p446L149J728n603N590l175k380
1593d368N517o081L337L527n205N614j498k791O770m466J584K465o107N320k317
1608A301m065N165n070Q29K783n125L811j440k942O306l911K222L744n360M733
$$ y = [1217, -1188, -3448, 2886, -2466, 505, 3482, -2165, 3964, 929, -1093, 4614, -707, 1489, 3830, -2728, 2158, -174, -3631, 2415, -3246, -2238, 1367, -5060, 957, 61, -3193, 4213, -1098, 641, 3819, -1950, 3513, 1386, -402, 4484, -258, -319, 3074, -3689, 1250, 1063, -4350, 1860, -2730, -2096, 2250, -3768, 1824, 1843, -2533, 4491, 4, 167, 4311, -1765, 2629, 2897, -2685, 2799, -1562, -2177, 2355, -4309, -411, 805, -4420, 936, -2308, -2299, 2457, -2582, -66, 1828, -3481, 3615, 267, -462, 4731, -367, 1433, 3044, -2733, 3701, 327, -1371, 3769, -3677, -528, 1200, -4403, 1187, -1988, -4368, 1149, -4932, -1595, 1932, -3273, 2341, 843, -1948, 4822, 356, 1940, 4405, -1702, 3618, 1301, -2764, 2401, -2669, -1840, 943, -4182, -371, -1811, -4753, 1553, -2358, -136, 3608, -1752, 2981]
1623B981k31m108O273m027l67K101n778L180o92m124N217m597R15L632n034N207
1639E48O09k991N831l686M22M057n898M532k63m423L621l240j181L284o367M034
1655a111M40l131M398k384j055N470m433L251J729m937M457j611q84M167n774
1670a408K464O13n031N107k704j435M466m303J793K394l973M422j580j958N681
1685D548o011K501J832n050M599l167j250M504n437J617K119m286M657o91k934
1700b449M963l932J291L571n101M405j768l070N256l733P30K545n094M112p83
1715I43l382L941l601R00L628n563L521k24l646N891l931Q75L166n650L790l98
1731B60k743N305k134r84L027m567L669k59l721N241k953j972L880n551L255O73
$$ y = [2981, 2750, -1358, 4915, 888, 521, 2622, -3156, 24, -668, -4792, 425, -4172, -3257, 375, -4659, 548, 1157, -1834, 3997, 311, 733, 4790, -1108, 3424, 3161, -1262, 2359, -881, -2062, 1222, -5145, -1111, -671, -3802, 596, -1788, -2843, 2627, -1806, 1445, 3174, -1763, 2694, 1083, 199, 4366, -1408, 1056, 1669, -3362, 1745, -959, -2394, 2072, -2231, -438, 1956, -2017, 2405, 825, -1133, 4548, -1463, 1038, 2870, -2180, 2419, -748, -1998, 2506, -2931, -1314, 805, -3481, 1176, 485, -2449, 2514, -1418, -127, 3444, -1657, 2748, 980, -2090, 3166, -567, 163, 2708, -2386, 1726, 943, -2439, 1502, -2099, -1199, 2429, -3134, 387, 163, -3483, 2408, -1523, -648, 2518, -3132, 658, 260, -2483, 2822, 688, -296, 2731, -1836, 1833, 1574, -2147, 3094, 141, -1831, 2049, -3502, -247, 426]
1747D26m560N405k674j064M528m156K548J833m118M881k172j935M408m812J976
1762E14J527m924M215k396k206M722m057J893J646m908N307r13k180N776m419
1777d03J027K744m755L990j166k648N116m840R3K442n196M019j019k578N013m564
1793b725N54L832m519M831j005k466N576m668J252L072m678L247j11l550M766
1808C408l880k87L141n227L175n43l900M849l294M40L651m576L544Q24l092N212
1824C445k558p7M100n854L730M2m756M659l727n63K375n098K553R35l131M751
1840H26k011m53N028l724K212J587l475M757k942k202M166o108R63J216m847M708
1856b99k727j269M723l858K762K658m143N484j837n41M248m993J544K272o118
$$ y = [426, -4134, 1271, -1403, -2467, 2061, -2095, 453, 2286, -1832, 3049, 877, -1058, 3350, -1462, 514, 2041, -2883, 1332, -1064, -3270, 1452, -2605, -712, 934, -3974, 1333, 420, -1760, 4016, -403, 624, 3368, -1387, 2603, 1437, -1211, 3905, -935, -842, 1600, -3596, 423, -596, -3174, 1839, -2725, -2171, 1661, -2858, 1973, 968, -1498, 4078, -590, 662, 3734, -944, 2303, 2192, -1358, 3408, -472, -759, 2382, -2845, 330, -213, -4113, 736, -2558, -2118, 1533, -3043, 501, 1325, -1767, 3445, 887, 810, 4910, -944, 2786, 2828, -1928, 2731, -996, -1559, 816, -4282, -1729, -794, -3925, 826, -1185, -1638, 3390, -334, 1878, 3465, -10, 4747, 1805, -397, 3769, -2339, -1376, -160, -5007, -299, -3026, -4295, 428, -3430, -668, 1990, -2153, 3331, 1494, 953, 5201, 208, 1752, 4024, -2094]
1871b094L260j343l720M881m728J046L098l977M096o88k084N834l534O67K792
1886C506m946L385j157l113M287m364L29K285m981M963J02k902N699l966J106
1901B33L637m673L586j41m225L987l674n41L077n133L582o50l023M784k452N97
1917a029L973l846L409L17l293L814k560j448L475n162J729m66l547M600k654
1932b688m29M988m406L558J645l449N067j241j738L708n363J808J183n759L735
1947F19k284k433M273n254K766K095m257N785r07j694N756m009J554K669m726
1962d7M117l056k106M211n492J170J942m834M374k165j906N441l381J551L061
1977B880m724M430o93k819M852m462M95K101m934L575p36k776M399l073K43L374
$$ y = [-2094, 1166, -177, -3897, 984, -3744, -2698, 400, -3577, 519, -169, -2253, 3581, 47, 714, 3506, -1440, 1945, 788, -2325, 1962, -2402, -2073, 212, -4769, 194, 296, -2606, 3093, -873, 233, 3870, -803, 2783, 2642, -1583, 2404, -1270, -1811, 1266, -3867, -285, -935, -3958, 826, -1626, -1029, 2944, -902, 2507, 2824, -469, 3345, 785, -663, 2812, -2350, -621, -1087, -4634, -34, -2688, -3117, 1871, -2535, 1023, 2668, -781, 4286, 3045, 1307, 5015, -348, 1460, 2643, -3116, 619, -1665, -4098, 175, -5079, -2313, -218, -4475, 1310, 403, -1291, 4465, 456, 2010, 4679, -47, 4070, 1014, -1092, 3119, -2373, -1203, 739, -4095, 279, -1886, -3792, 1649, -1732, -181, 2880, -1844, 2586, 1893, -926, 3926, -536, -41, 2060, -2874, 701, -35, -2811, 1588, -1485, -1242, 2132]
1993B132m888L420P05l372M668l449R7L275m976L228L51l546M958l353n89M008
2009B669m667L323J37l478M215l653o70L919m948K800N08l891M612k293n46M276
2025B313m149K631J585m296N206k049j593L994m329J269J614m609M360k700k195
2040b948M418m984K423J535m189M885j583j746N143m040J482L290n562M795j765
2055A154k310L893l887N81K430m774L813j091k816M459l756P31L087m403M052
2070A163k38l069M980l986R20L913n319L705l65l495M994l789N6K532n062K960
2086a00M93m413N494l322r1L906n019M679j97l162N305k664l37M064n524L430
2102B542P8m548M590l804q96K961m457K294J460m647N350k934m21M617m039L108
$$ y = [2132, -2756, 664, 1369, -2003, 2665, -784, -687, 2588, -2388, 840, 1191, -2355, 2603, -750, -1339, 2669, -1998, 1325, 1462, -2016, 2199, -1454, -2124, 1795, -3153, -353, 155, -3736, 876, -1417, -1963, 2313, -1836, 795, 2380, -1916, 3290, 1241, -352, 3642, -687, 582, 2196, -2413, 1947, -753, -2948, 1470, -3514, -1091, 444, -3745, 1140, -443, -2189, 2954, -1086, 396, 3686, -1876, 2919, 1154, -1156, 2737, -1150, -569, 1861, -2913, 900, -191, -3007, 1452, -2304, -1573, 1514, -2889, 1163, 925, -2144, 2836, -1150, -230, 3683, -1636, 2069, 1704, -1791, 3203, -586, -530, 2002, -3060, -100, 393, -4020, 1474, -1848, -1939, 1967, -3052, 1627, 1430, -1732, 3573, 909, 572, 4636, -888, 2542, 2620, -1928, 2662, -1142, -2038, 923, -3534, -1240, 220, -4427, 923, -2011, -2432, 2185, -1854, 1254]
2118A254J288l615N094k872j582M291m900J983J231m767L896k460j653M230m606
2133c188K290J616m357M865j650j805N303m248J707K462m958M345j026k783M937
2148C510m563L58K336n103M633j040k995M097l677M86L533m260M344l96l385N469
2164C347l724M68L117n061M026p33l929M653l647j59L441m576K830P9l333M456
2180A255k299m55M593m726L284M72m194M915k515r24L960n886L140Q59m914N552
2196B117k994j222M793m848K545J334m507N447k266j601L971m991K332J770m988
2211c108M744k071k158M228m203K538J808m783M367j087k017M909m266J718J432
2226B051m490M129j611k569M792m287J823K304n058M565j436j718M570m033J85
$$ y = [1254, 2542, -1073, 4021, 1149, -433, 3858, -1042, 941, 2172, -2595, 1301, -1159, -2812, 1418, -3188, -898, 718, -3639, 1226, -424, -2229, 3074, -1174, 533, 2995, -1963, 2382, 1356, -1427, 3510, -1053, -695, 1641, -3462, 1171, 131, -2864, 1233, -2444, -1958, 1575, -2685, 1659, 1263, -2122, 3347, -377, 91, 3208, -1853, 2173, 1440, -2489, 2164, -1483, -1642, 1799, -2777, 53, 132, -3201, 1255, -1044, -1499, 3094, -1632, 1652, 2124, -2070, 2845, 330, -594, 3366, -2520, 620, 1479, -3435, 2117, -877, -2099, 2694, -2154, 391, 1725, -2782, 2665, 399, -1202, 2769, -2222, 110, 1880, -3108, 1636, -435, -2593, 1635, -2568, -30, 1778, -3005, 1362, 275, -1742, 3167, -1099, 619, 2051, -2439, 1690, 79, -2490, 2302, -1985, -162, 2142, -2916, 1649, 213, -1505, 3065, -968, -783]
2241g83K656m481L748n67k863M933l990q1L179m656L857k50l149N436l447P04
2257B46L156n018L355K06l908M674l540q78L818m427K433k67l427N132k877o39
2273a961M197m174L084P85k953M484l488j032L855m227K305Q56l907L986k837
2288a027j408M063m003K075J496l829M382k038j499M264l972K437O19l303M040
2303B297j660j858L362m098J329K388m803M238j851k031M476m211J639J861l978
2318b900L858p80k235M870l713J379K833m368L780j697k270M397m509M47K508
2333A600m683L509j456k427M186k890P48L642n205M271K43l200N115l608N2K916
2349B813m957L156o94l020M273l328J87L438m340L008R16l270M404k386j130L830
$$ y = [-783, 1873, -2608, 1140, 573, -2290, 2643, -1347, -1428, 1751, -2905, 952, 702, -2447, 2989, -458, 246, 3402, -1616, 1739, 1945, -1963, 2711, -829, -1707, 2111, -2316, 117, -150, -3577, 1555, -1322, -1961, 2236, -1938, 1146, 1931, -1022, 3462, -26, -1058, 2797, -1430, 875, 1731, -2176, 1810, -1027, -2435, 1628, -2375, -300, 1196, -2633, 1749, -289, -1788, 2476, -1496, 941, 1560, -1743, 2297, 637, -1221, 2141, -1957, -628, 1760, -3043, 1195, -656, -2687, 1789, -2422, -783, 1078, -2900, 958, 178, -2057, 2813, -900, 479, 3312, -1056, 2724, 1027, -1243, 3154, -1355, -908, 1600, -3083, 426, -1030, -3457, 729, -2161, -1413, 2229, -2976, 1295, 1538, -1662, 3453, -155, -103, 2813, -2144, 1012, 318, -2702, 1571, -1757, -1570, 1868, -2472, 536, 1452, -1818, 2586, 200, -930, 2900]
2365B900m165K854N47m694M104k492p22L170m158K411J227l694M771k059j293
2380a293M385m345J888J956m516L699j417k226L285m017J652J755m221M364j403
2395d54j374M096l828K404J335l782L731j534j964L669l360J58K259m500L500
2410C56r88j920M365l746J863K439m943M587o35k182M162l389J80K493n046L328
2426I24j145l606N131k724p24L878m277K928J96k905M711k231l10K971m694K538
2442F61O73m036M908l053m91L254m414K728Q64l395M754k459p44L616m365K282
2458G83J113m330L806k310j102L977m917K163J835m519M487j781r78M739l984
2473a018K594J193m192L914j911j653L359m451J713J381m439M986k350q09L431
$$ y = [2900, -1265, 1589, 2136, -2558, 1546, -946, -1668, 1502, -2656, -245, 982, -2712, 2059, 0, -1293, 3092, -1253, 635, 2591, -1925, 1774, 357, -1869, 1416, -2601, -949, 806, -3415, 949, -454, -1828, 2268, -1560, 844, 2179, -1603, 2128, 594, -1370, 2299, -1061, -903, 1356, -3144, 356, -632, -2552, 1813, -1933, -70, 2369, -2574, 2013, 1378, -804, 3358, -31, 149, 2642, -2404, 924, -221, -3827, 1304, -1420, -2144, 1734, -2543, 385, 581, -2324, 2387, 156, -154, 2817, -1877, 661, 1334, -2702, 2206, -847, -1338, 1916, -2498, 230, 1094, -2301, 2453, -6, -750, 2866, -1499, 783, 1896, -2434, 1372, -938, -2040, 1937, -2980, -817, 1018, -3501, 986, -795, -1773, 2966, -1018, 1576, 2769, -1423, 2491, 580, -1073, 2286, -2165, -452, 929, -3510, 1476, -874, -1683, 1748]
2488A748l467J167L047m365L964j314k323M277l587O77K366m292L512j364k264
2503b218M006l455Q07K742l889L021p6k894M938l744R75J952l622K537p7k597
2519a594M394k939l17K495m987L833k49l035M296l011K9L212m451K958L12l303
2535b357M051k509m5L411m788L024P59l289M173k295j113L605m168J959J338m193
2551b437L918k049j461L669l927K241J278l621M236j932j262L231l273J364J550
2566A525k950L260j664k198M504m164J257J882m178L851j384j539L820l197R83
2581a92J916l923L185m22k140M080l539Q16K435l892K944n37k202L793l444N42
2597e80K222l779K810m93k210L630k699M61K195m312L458J62k996M160k315J32
$$ y = [1748, -1719, -552, 2495, -1870, 2094, 780, -1543, 2734, -853, -176, 2190, -2102, 1410, 46, -2218, 1788, -1667, -860, 1882, -2007, 1014, 938, -1956, 2982, -762, 213, 2165, -1457, 1080, 1003, -1594, 2800, -139, -456, 2039, -2948, 885, 636, -2399, 1897, -1114, -1085, 2127, -2324, 634, 946, -2357, 1694, -815, -860, 2551, -2237, 787, 1546, -1743, 2430, 135, -978, 2627, -1541, 418, 1756, -2437, 1481, -568, -2029, 1640, -2287, -46, 1232, -2389, 1847, -85, -1347, 1884, -1389, -25, 1525, -1425, 1835, 171, -2027, 2477, -1687, -430, 1452, -2726, 1125, -259, -1798, 2022, -1175, -192, 1724, -2199, 986, 564, -1576, 2504, -1035, -219, 2216, -1676, 1268, 731, -1471, 2322, -1122, -580, 1642, -2137, 673, 180, -2030, 1600, -1099, -638, 1557, -2755, 703, 865, -2131, 2029, -286, -154]
2613a54K801l935K316M01k927L722k793l98K808m006L229K95l693M028k794l86
2629a486L365l441J990K36k380L325j934j023L529l766J692J253l318L951j829
2644A64j161L585l899J418J250l287L408j688j771L471l438J129K456m047L635
2659A225j284j463L665k983J146J720l934L632r73k322L451l856J506J794l636
2674b312L034r51k103M360l201P71K570l600L126l54k570L712l037J65K498m591
2690b483L068n50k456L750k792J25K848l768L178K34l149M233k704O5K534l724
2706a591K530K80l156L697k393m27K758l265J602J216k840L222k129k52K949l665
2722a464J997O96l326L584j766j382L029l398J646J247l085L568r69j411L445
$$ y = [-154, 2647, -1288, 1028, 1429, -1498, 2224, -569, -967, 1841, -2165, 1064, 1359, -2334, 1694, -1100, -1486, 1879, -1562, 428, 664, -1716, 1609, -325, -1348, 2181, -1585, 107, 1360, -1958, 1993, 164, -997, 2588, -1311, 107, 1357, -1930, 1478, -210, -1981, 1490, -1948, -819, 1637, -2410, 1225, -59, -1522, 2143, -840, 306, 2026, -1908, 1724, 751, -1571, 1880, -1976, -470, 1324, -2312, 722, -229, -2332, 2028, -1173, -402, 2168, -1432, 1694, 1340, -1230, 2482, -555, -390, 2108, -2483, 585, 35, -2421, 1329, -1463, -1338, 1510, -2258, 920, 1154, -1995, 2238, -466, -401, 2133, -1591, 939, 1219, -1937, 1760, -633, -1060, 1698, -1567, 35, 1251, -1589, 1633, -496, -748, 2201, -1464, 533, 1229, -2097, 1487, -279, -1661, 1368, -2030, -384, 863, -2222, 1346, 377, -1034, 2411]
2737B411l314J575J548l448L051j790j572L140l313J210J845m120L582q85j540
2752a620L598l170J342J884l636L284q05j983L471l247N44J759l875K958q87j738
2768b121L453k672M59K340l335K956K15k542L557k345k44K542l972K532j92l044
2784b413M100k622o2K373l530K684k73k471L325j564m83K824l428J977Q03k885
2800a645L333k211l63K879l361J917O88k552K901j977m69L148m020J784R63k836
2816a821L443k081r64L302l703J690J434l419L758j612j428L586l101J029J713
2831A826l784L246j207j515L924m075R57J946l204K868n49k339L562k985J131
2846a98J916l822L216n45k070L353k715K87J867l322K755l10k223L362k477N6
$$ y = [2411, -903, 672, 2220, -1228, 1823, 33, -1539, 1601, -1712, -502, 1343, -2777, 805, -80, -1620, 1978, -1192, 150, 2034, -1602, 1682, 877, -1106, 2365, -882, -338, 1421, -2454, 504, -383, -2121, 1332, -1340, -881, 1459, -1876, 1080, 1295, -1247, 2310, -35, -279, 2263, -1709, 823, 631, -2413, 1687, -935, -997, 1376, -2154, 530, 257, -2214, 1111, -453, -936, 1888, -1540, 437, 1240, -1645, 1688, -523, -886, 1993, -1368, 549, 1237, -1315, 1586, -391, -860, 2288, -1732, 52, 1015, -1821, 1622, -459, -1423, 1879, -1824, -134, 1300, -2119, 1639, 27, -1401, 2185, -916, 113, 1826, -1958, 1288, 81, -1434, 2490, -1585, -628, 1318, -1886, 982, 433, -1906, 1656, -1329, -198, 1718, -2104, 1112, 567, -1503, 1850, -865, -578, 1289, -2033, 722, 412, -1811, 1551, -926, -870]
2862h70K719l951K716L2k034L308k936P64K119l908K870L69k756M003k904m22
2878h81L119l560J845J57k111K980k211k98K246l510K070N17k624L453j302j030
2894a140L233l764K176Q96l003L247j648q80L265l998K066O74k924L190j823r17
2910a350L419l421J268J489l023K913r58j214L071l277J380J246l753L331o54
2925D67j981K794k327N61K187l683L167p00k037L315k120M8J729l237K852n32
2941E03k093L381k941N36K037l100K758k90k503L647k776N69J744l687K679R7
2957E61k254L333k330k38K594l488K142M93k398L201k023l17K839l550K080K72
2973I17k714L530k135m88K528l545K186Q05k984L704k358m22K978l574K134P75
$$ y = [-870, 1849, -2102, 614, 646, -1388, 1920, -1016, -252, 1867, -2041, 829, 1198, -1558, 2445, -459, -881, 2238, -1322, 523, 680, -1431, 1549, -662, -960, 1286, -2224, -154, 363, -2261, 1192, -110, -1140, 2093, -1671, 505, 1401, -1602, 1645, -3, -883, 2382, -1616, 450, 1124, -1800, 1390, -433, -1350, 2069, -1352, -84, 1405, -1618, 1295, 337, -877, 2194, -1083, 297, 1543, -2210, 1121, 467, -1514, 1280, -1047, -486, 1701, -1982, 1185, 485, -1552, 1763, -357, -309, 1420, -1817, 1035, 503, -1590, 1791, -1150, -614, 1423, -1677, 1081, 791, -1712, 1935, -841, -272, 1472, -2215, 464, 561, -1693, 1640, -690, -928, 1666, -1822, 320, 813, -1585, 1616, -407, -724, 2115, -1435, 645, 917, -1797, 1733, -402, -890, 1638, -1907, 279, 1084, -1900, 1804, -554, -976, 2002, -1572, 562, 1337]
2989A337l124L139j229j230L152l198J162J235k678K612j516j283L789l255J201
3004A14J543l592L157q01j801L195l261J219J294k911K768p74j721L211l233J180
3020d13J931l206K848j096j361L351l317O36K261l431K646m03k153L463k333j08
3036f85K329l512K422L99k416L575k669j56K572l478J831L48k453L203k042L4
3052f98K020k620J852j5k190L322j942l25K373l223J819Q51k532K693j729p05
3068a049L125l411J517L37k276K963j085j368K992k795J326J032k926L107j639
3083a50j381L023k773J409J509l536L068j510q81K728k623J195J089k798K782
3098A151p12k050L401k497M96J644l094K452o20j786L598k800K81K320l102K125
$$ y = [1337, -1787, 1352, 123, -1107, 2045, -1153, 9, 1244, -1434, 1178, -338, -1621, 2168, -1087, 114, 1657, -1935, 1222, 421, -1380, 1815, -1446, -227, 1067, -1844, 924, 150, -1571, 1640, -1593, -413, 1518, -1688, 1160, 64, -1297, 2054, -1263, -627, 1634, -1797, 849, 446, -1707, 1756, -577, -685, 1644, -1868, 554, 953, -1463, 2112, -557, -713, 1859, -1619, 212, 560, -1893, 1310, -732, -698, 1322, -1298, 554, 539, -1651, 1671, -271, -596, 1777, -1446, 373, 1224, -1308, 1385, -344, -1049, 2076, -1335, 182, 519, -1757, 1206, 121, -1247, 1745, -1050, 276, 1308, -1618, 1489, -150, -1531, 1492, -1281, 128, 1637, -1899, 1169, -341, -1222, 1506, -1117, 78, 1167, -1631, 1151, 439, -1611, 1790, -707, -211, 1433, -1661, 791, 171, -1615, 1983, -817, -536, 1784, -1318, 807]
3114H07o96j946L093k175N3K593l522K600o51j565L084k289J1K428l320K187K32
3131I24k374K853j631k12J786k736J618M52k378L269k124n73K622l042J739M83
3147F76k455L352j721q84K630k980J404Q67k414K425j112q05K987k974J220J032
3163A248k989L109j260j214K697l076J593J119l026K889j336j051K923k702Q30
3178b46J991l075K765j434j147L325l076O92J780l589K865q41j053K665k319L84
3194c13K032k993J820K35k025K945k333K22J957l144K452j09k632L191j928P9
3210e44K291k852J777k76k060L102j814k58K510l276K205L85k413K709j670p77
3226i61K526k844J478P89k535L075j337j090K604k868J248R56k763K600j370r70
$$ y = [807, 111, -1835, 1258, -917, -864, 1729, -1793, 807, 156, -1409, 1675, -614, -603, 1825, -1495, 692, 924, -1450, 1403, -228, -440, 1346, -1390, 228, 680, -1698, 1571, -553, -1126, 1496, -1546, 193, 676, -1779, 1573, -148, -1032, 1598, -1382, 22, 889, -1525, 900, -212, -1017, 1970, -1004, 216, 1248, -1741, 1368, 108, -1106, 1591, -1485, 108, 1227, -1799, 1090, -246, -1297, 1626, -1076, -246, 1745, -1330, 1435, 1, -1146, 2179, -897, -205, 1575, -2014, 851, 10, -1043, 1622, -697, -313, 1719, -1274, 546, 781, -1244, 1701, -632, -410, 1547, -1597, 855, 746, -1886, 1305, -623, -544, 1747, -1105, 672, 396, -1664, 1438, -376, -634, 1876, -1400, 805, 1190, -1223, 1486, -184, -961, 1565, -1279, 199, 988, -1547, 1528, 191, -899, 1705, -1163, 85, 1041, -1722, 878, -492, -1462]
3242a462K720k638N82J650k711L151j028j439K631k646J582R90k988L155j585
3257c6j85J637k393P62R92k305K432o79j860K955k428P93J761k985K507o43k088
3274a763L552k653J242N11k599K608j183j177L029k713J185J434k781J778M30
3289I00j788K572k699Q97K617l687J005Q26j859K442j531m06K279l149J890P98
3305A107k211K833k210l90J651k298K098N42l128K930j927J80K064k276J004J098
3321A067k744K921j168r00K399k598R38J083k964L571j634j130K866l281P46K092
3337A264k686K000m88j754K965k243R67P68k197K627r33j491K806k330N14J168
3353I57k394K247o49j328K560k496Q74J701k588K053l57k174K990j985K78J380
$$ y = [-1462, 1258, -1380, -798, 852, -1859, 1292, 264, -1175, 1456, -1190, 392, 1382, -1606, 1549, -36, -221, 1416, -977, -215, 777, -1528, 904, 225, -1635, 1320, -1108, -315, 1446, -1539, 968, 325, -1763, 1789, -864, 378, 889, -1710, 898, -285, -1462, 1567, -1146, 39, 1473, -1308, 470, 900, -888, 1684, -1015, -118, 2499, -1188, -183, 643, -1216, 1226, -305, -711, 1568, -1581, 309, 1107, -1104, 1729, -481, -871, 780, -1518, 580, 1122, -2006, 924, -1003, -823, 1241, -1035, -31, 1067, -1677, 1244, 76, -824, 1575, -1023, -85, 998, -1966, 1605, -29, -1159, 1707, -1574, -828, 1264, -1422, 578, 90, -1664, 1301, -942, 25, 793, -1404, 1223, 290, -1201, 1605, -725, -211, 957, -1437, 810, 161, -1167, 1393, -1103, -229, 1472, -1116, 937, 580, -1594, 1396, -589, -311, 1069]
3369A069k499K367o3k333K750j537o39K590l208J879m9j689K739j720j09J862
3385A410k597J655l4j630K377j290j82J897k765J936q2k253K985j702j173K611
3401A163j827O75M17k043K988j991k71K795l117J722o8j835K575j428p74J979
3417I60j825L86J115k134K280j67j272K182k119Q17R04k434K353j019j249K546
3433A324k326M64J426k556K541j029j556K698j801O67J281k208J874k95j457K723
3449A770k341Q6K119l121K110k99j498L038k405k82J440j820J659q1j560K473
3465A288j783M37J478k768J278M81k427L097j663l21J921j805R25O40k073K630
3481A335j440j32J246j731O39J313k517J778p43j030K981k783J396N67j944K114
$$ y = [1069, -1430, 937, 874, -1459, 1291, -246, -885, 1705, -1503, 376, 327, -1362, 1377, -343, -452, 1410, -1187, 468, 434, -1196, 1181, -109, -291, 1606, -1159, 777, 695, -1558, 1427, -275, -1448, 1163, -664, 11, 428, -1615, 1373, -618, -889, 1906, -1211, 511, 443, -1392, 1183, -245, -1019, 960, -865, -479, 636, -1498, 782, 615, -657, 1525, -594, 223, 1127, -1307, 1046, 27, -1222, 1324, -1002, -538, 888, -1668, 873, -156, -1712, 986, -815, -148, 1133, -1075, 799, 504, -953, 1770, -571, -485, 1634, -1487, 623, 324, -1174, 1864, -541, -823, 617, -1203, 456, 375, -1185, 1288, -495, -58, 1420, -1348, -70, 411, -2016, 1081, -582, -903, 1018, -787, 138, 778, -1295, 1335, -105, -237, 1009, -722, -83, 1230, -1287, 491, -252, -1282, 1699, -1084, 312, 879, -1065, 1049]
3497A049j091j079K357k176O81J313k780K688l14j455K424l181J179J265k465
3512a585K118n58j078K333k330Q72K013k624K099j005o71K483k529Q59J059k561
3528a105J203r0j182K205k336K42J769j820J511J29j277K353k184P34J127j830
3544e51R23M2k035K680j369J38J506k340J435k57j855K784j499L88J463k521J749
3561F81m14j586K901j984n76J824k180J099P87j425J792j714M12J553k208J617
3577E79L10j775K076j194q91J946j794J177l04j550K066j012l57J653j693O08
3593a55J038j786J395k21p96J850j657KJ709k169J850o80j569K579k019J051N40
3610I62j896J644m82j126K372j844K05J225j753J045k92n13J719k040M47J514
$$ y = [1049, -42, -1121, 1236, -940, -259, 1054, -1726, 962, 648, -807, 1617, -1564, -385, 880, -1585, 533, -25, -1103, 1230, -1100, -228, 1785, -839, 1260, 255, -416, 2067, -462, 397, 1456, -1105, 98, 8, -1174, 1031, -1305, -1063, 706, -1114, 397, 526, -751, 1602, -582, 152, 1279, -551, 372, 414, -1621, 1059, -310, -172, 1334, -1006, 429, 172, -1683, 1101, -398, -10, 1453, -1068, 681, 267, -1319, 1582, -402, -978, 846, -1334, -235, 552, -873, 919, -795, -383, 1170, -1038, 579, 889, -886, 1190, -4, -895, 1051, -743, 434, 130, -1420, 646, -366, -723, 930, -763, -155, 883, -903, 492, 271, -525, 1325, -332, -330, 1379, -790, 1060, 380, -1189, 1390, -629, 422, 962, -934, 710, 228, -898, 1474, -370, -165, 1060, -693, 352, 60, -453, 1266, -774, -327, 1187]
3626A187k249J200O02j681K760k021j11J491k401J413M71j701K099j326p36K817
3642A814k836J352N85j872K060q67j814K656k252P90N42j702K540j452l47K035
3658A232j642K92N03j367J456n26n22J993k025J085N43k372K677j596q66K469
3674A334k361q1K093j593J309K09j491J979j541j22J503k503J827n05j058K110
3690A109k041L90J241k330J585Q1p67J501j075J99R08j285J212j43j026J634j543
3707c50l68J808k526J668l34q86J791j384k90J757j556J390l23j512K275j549
3723c89j36J510j989J151M49j324J519j198j39J023j410J062N17k012K311j484
3739e39k07J947k028J195J26j433J812q88q27K012j922R79R2j562J932q18p89
$$ y = [1187, -1062, 138, 740, -941, 1819, -202, -313, 1178, -1223, 190, 661, -1040, 1059, -267, -1003, 1814, -1022, 330, 915, -957, 1103, 236, -1578, 1078, -1174, -384, 158, -1544, 996, -456, -803, 1232, -410, -118, 385, -982, 474, -52, -574, 1419, -606, 479, 1022, -1350, 1327, -269, -1135, 1334, -1027, -1108, 985, -608, 701, 910, -581, 1398, -143, -265, 1238, -1265, 562, 57, -1001, 1109, -932, -542, 699, -1631, -46, 35, -732, 769, -306, -107, 801, -484, 728, 585, -441, 1193, -350, -718, 1090, -1436, 232, -102, -988, 803, -581, -871, 886, -670, 720, 397, -1115, 1160, -389, -525, 985, -1004, 147, 596, -728, 791, -407, -546, 477, -933, 129, 646, -1366, 945, -539, -746, 1201, -827, 368, 494, -939, 873, -15, -842, 1170, -752, 227, 319, -1243, 689, -129, -918]
3756i18J750j852J050L10j339J629n40n79J357j603P15P59j819J484l88j046J767
3773G37j311P83O23j701J284j61o66J749j400m2P45j377J306n7j676J963j442
3790f43M10Q02j797J444J36j321J893j144nJ195k044J584k52j138J531j202L25
3807b26R78j716J224J47j460K020j128j61J100j105P25K51j506J486r19MJ114
3824H28j674J013K72j614J814q63n23J569j557O99N21j420J727o71n29J419j774
3841g63Q23P78j527J359r67k84J424j534M78Q99j594J587n53j073J588j590R76
3858B7N03j464J406k96p29J312j246L40R59j260J212p31n68J233j050k5R01j179
3876f55J132l64j028J742j083K78Q77j704J295l47m92R28o65J03P64j538P12K35
$$ y = [-918, 832, -1020, 30, 340, -999, 630, 90, -489, 868, -735, -20, 739, -1080, 404, 16, -1030, 737, -574, 209, 832, -869, 415, 254, -412, 1337, -63, -105, 640, -737, 569, 512, -1164, 799, -643, -233, 569, -1228, 216, 352, -969, 924, -220, -225, 970, -1074, 510, 258, -880, 651, -551, -226, 752, -964, 260, 407, -1053, 967, -161, -322, 778, -327, 398, 649, -857, 629, -290, -286, 828, -846, 167, 439, -1175, 639, -224, -747, 822, -735, -36, 485, -935, 792, 121, -408, 1011, -763, 60, 838, -689, 670, -297, -581, 843, -691, -213, 686, -908, 679, 126, -947, 641, -949, 27, 530, -934, 472, 176, -553, 759, -487, -147, 812, -448, 764, 33, -535, 698, -352, -377, 524, -655, 477, 113, -915, 827, -256, 22, 899, -805, 490, 143, -349, 579, -86, 17, 781, -757, -45, 190]
3894A90j131J594j093l09J331j330R73J82j426J699p30k40J224j670J113P3j239
3911g89J492q22k56J035j437O42M24j214J535r21m63J222j206J001J45j078J422
3928G32p79j77R57j273N08Q23j789J353l50o01J021j223M27J069j589J205m96
3945a82m14J318j336L91Q26j614J484k31j128J932j467P70N93j623J236m59q27
3962g31J637j404J10J012j370J020m5r97J401p94J64Q20j641J079L01j169J414
3979H07j345L37J081j270P64J22j121J312q63l71J109j089L31K25q86J432q02
3996b27l57J429j244O41K55r39J156l15m75R07j302Q58K93j060O74m21o9P97j222
4015f21P75O1j042J391o85m72J118j082O41M47j243J011k19p02J426j450J82J018
$$ y = [190, -941, 653, -440, -749, 582, -748, 225, 407, -1019, 680, -50, -290, 934, -736, 377, 450, -789, 703, -119, -375, 660, -777, -135, 289, -925, 610, -311, -774, 448, -758, 243, 388, -690, 732, -47, -224, 733, -540, -32, 791, -998, 355, 5, -596, 425, -798, -371, 698, -891, 314, -182, -596, 722, -614, -223, 603, -1011, 473, 242, -886, 1046, -421, 349, 942, -681, 555, 96, -731, 906, -498, -388, 624, -746, 274, 229, -768, 633, -161, 3, 823, -818, 261, 562, -607, 807, -538, -201, 880, -390, 374, 496, -625, 687, -176, -547, 562, -527, -196, 29, -857, 575, -227, -584, 845, -399, 242, 497, -442, 714, 399, -76, 831, -471, 387, 680, -380, 294, -127, -196, 601, -621, 154, 215, -827, 564, -121, -593, 525, -557, 84, 531, -712, 299, 80, -622, 804, -646, -464, 554]
4033E54j512J295l94o96J379j317M85P70j240J342l75r25J566j161J80P03j205
4050e51R87o54m83J319j147K33R64j446R54n7r15J739j383J96J062j320P43P3
4068C14p72J395j234J07P62j193J014Rr14J117j116n1J099q69L78J13o42J005
4086E22j038L62P64j317J140m20o11J052n62l29J087q19K88N33j374R91l65m82
4104e78J208j167O52L29r13R33q91O2J245j452P14L31j116J126j78q66J320j218
4122d59L83N52j315J214l1p97Q35r49M50Q15j242Q22j57n00J092q90j76Q81j133
4141f05J115l95l65O72q73N9J012j230P33N3q96J469q91K28N41j043R20k54q04
4160e54Q94o01J72N31r75P72K75j068J291r54k00J034j465R63j7o70J120j041
$$ y = [554, -958, 337, -57, -753, 626, -691, -206, 564, -676, 666, 291, -634, 932, -229, -49, 654, -551, 436, -218, -701, 618, -529, -296, 668, -778, 176, 119, -796, 943, -440, -244, 818, -502, 241, 314, -458, 937, -297, -190, 572, -621, 393, 402, -512, 605, -511, -562, 537, -332, 46, 159, -483, 522, -516, -154, 610, -707, 433, 13, -598, 454, -108, -437, 650, -169, 119, 652, -722, 269, -96, -578, 630, -537, 115, 444, -469, 464, -427, -365, 880, -572, 142, 473, -643, 483, 305, -561, 759, -459, -76, 476, -839, 375, 344, -453, 382, -567, -117, 698, -544, 278, 121, -379, 713, -177, -353, 528, -605, 510, 115, -250, 422, -451, -392, 620, -610, 123, 176, -720, 749, -142, 86, 627, -416, 504, 250, -554, 340, -261, -89, 442, -533, 239, 514, -554, 737, -217, -417, 617, -848, 115, 98, -572, 548, -493]
4178d93J02Q66q67M65J58p22J288q70k31O72o40N31K93j492J523r78m4R64j067
4197e42L84N80j229J143n86r4J325j423P39N5q77J116q73j3J032j242N23K95r32
4216f19J056o69j69J265j193J90P77j192J033n74k87J060j180O89L62r55M19p9
4234f6q00J224q75L82O76j241J203q4p67J128j157K92L88q64J034l04o75P52m93
4253b47j00R26j207Q63J12o17O83l15P9N59j154Q74j52r60J214q04k91Q57q24
4272e04L37K68o36J230q85j01P88q67N71J89j112J043n61j37R27j307P10K14p85
4291f18P90j41n89P92n66N95J02q73J050m79k01P02r17L04M51q65P46m59l45R36
4311D15q17J17M49o26Q10k56p34J232q65N07J47p81P04n16l31J143o37pM11q27
$$ y = [-493, -391, 475, -392, 73, 231, -491, 797, -73, -304, 368, -272, 259, 552, -940, 583, -395, -439, 525, -542, -158, 422, -807, 336, -250, -344, 981, -442, 297, 352, -525, 591, -282, -295, 737, -505, 18, 313, -619, 437, -232, -401, 864, -329, -139, 638, -554, 479, -95, -382, 678, -502, 187, 549, -406, 13, -66, -866, 358, -517, -135, 541, -700, 503, 419, -348, 780, -377, -85, 303, -561, 473, 169, -506, 246, -247, -347, 579, -628, 235, 347, -270, 413, 98, 177, 736, -418, 456, 304, -656, 558, -246, -537, 320, -504, -167, 101, -535, 695, -190, -291, 497, -370, 201, 390, -722, 321, -240, -377, 550, -757, -47, 167, -618, 172, 31, -558, 234, -332, 263, 365, -508, 542, 63, -138, 564, -353, -49, 402, -463, 283, -176, -521, 415, -402, -285, 164, -462, 348, 92, -642, 590, -275, 232, 379, -402, 302, -214, -545, 598, -39, -46, 365, -462]
4331d62P96k7p88R60r99N13K86o99P45j17l43N02o68L10L60r19Q56l45n03Q00
4351B58m97J02P93j328J057j36o98J020p90nM32q25J104l93p90J296r58J96N67
4370D05r13N90j28m83J083m95j60K57m49L98O9r19J146o19n8O79r89O50O8n28
4390c96P56l47k14P71p04J11P5n27R42n79m00J160r94M29J02p81Q49l56k08P17
4410D06r40P19L1r20J012l36m11R99r09M79J88p70R31n28k91P49j044N42N70r26
4430d49P59n43L6O69o86K12K84r30R65n05l44J017p32J02N41q27M52O2k78N63
4450C68m36L33J02o76N05k25l71Q53n89r4M34o15N89k74n25R10m89K03M39j160
4470g18R84r6o27R15j079L76N81p83M43J15l86O81o60N7Q47j010P05n2o21P68
$$ y = [-462, 334, 307, -481, 479, -520, -7, 279, -420, 325, 208, -135, 367, -301, 9, 369, -550, 306, -39, -542, 258, -239, -137, 656, -672, 385, 249, -449, 571, -219, -224, 208, -617, 487, 94, -696, 600, -358, -162, 405, -508, 82, -46, -529, 554, 59, -101, 156, -293, 105, 174, -745, 401, -218, -276, 403, -586, 64, 132, -396, 360, 13, -201, 570, -134, -23, 52, -475, 467, -112, -512, 648, -346, 83, 185, -596, 253, -103, -311, 406, -534, 185, 216, -704, 308, -28, -439, 560, -349, 130, 318, -452, 479, -49, -340, 409, -635, -93, 477, -449, 310, -233, -197, 472, -214, -2, 282, -648, 317, -188, -532, 485, -247, -145, 396, -431, 21, 83, -195, 368, -68, 265, 367, -309, 196, -29, -400, 453, -136, -230, 204, -411, 178, -96, -621, 289, -200, 3, 442, -718, 266, 170, -457, 458, -621, -245, 336, -447, -4, 111, -275, 406, -254, -197, 650, -360, 345, 293, -328, 440]
4490D40m26k69O15q69N34R8o05J092r43K0Q40j070N14K82n36N64j75m59O24q19
4510e48Q29Pq16P37m58O6P55j172P18J71n11N88j06n35P57q62N57R2j019J026
4530B76n57j08M15n55L14M35n98R13o69k3O12p37N66P6q06Q04j42l80N12p64L45
4551g1K16m15L99l63l77R39m40Q3M08r61J133k40m68N71m50LM56j102P02j90m12
4572e79J012p30J70M22p93O96q0o71J211o42K34M12q27K10P8o74J039r61oJ103
$$ y = [440, 14, -255, 360, -509, 25, 123, -482, 610, -333, -313, 527, -543, -29, 253, -283, 281, 106, -353, 271, -548, 281, 288, -528, 209, -249, -183, 572, -600, 118, 289, -222, 366, 260, -275, 482, -380, 177, 269, -750, 276, -281, -389, 26, -529, -215, 220, -378, 535, -134, -157, 455, -282, 284, 360, -446, 358, 216, -164, 348, -416, -71, 145, -270, 129, -234, -611, 328, -112, -29, 379, -582, 551, 311, -157, 414, -36, -33, 423, -679, 23, -167, -579, 433, -297, -127, 295, -498, 198, 118, -553, 658, 16, 250, 662, -165, 45, 123, -551, 488, -473, -479, 624]
$$ [...]
8191C74
##END NTUPLES=NMR FID
##END=
