##TITLE=1H_51-2022
 CDCl3
 8 sc, 
 28.07.2022
##JCAMPDX= 6.0         $$ Bruker NMR JCAMP-DX V2.0
##DATA TYPE= NMR SPECTRUM
##DATA CLASS= NTUPLES
##ORIGIN= UXNMR, Bruker Analytische Messtechnik GmbH
##OWNER= root
$$ XWIN-NMR		Version 3.5
$$ Thu Jul 28 14:11:17 2022 Russian Standard Time (UT+4h)  she@DPX200
##.OBSERVE FREQUENCY= 200.1313499994
##.OBSERVE NUCLEUS= ^1H
##.ACQUISITION MODE= SIMULTANEOUS
##.ACQUISITION SCHEME= undefined
##.AVERAGES= 8
##.DIGITISER RES= 18
##SPECTROMETER/DATA SYSTEM= spect
##.PULSE SEQUENCE= zg30
##.SOLVENT NAME= CDCl3
##.SHIFT REFERENCE= (INTERNAL, CDCl3, 0, 15.7667)
##AUDIT TRAIL= $$ (NUMBER, WHEN, WHO, WHERE, WHAT)
$$ ##TITLE= Audit trail, XWIN-NMR		Version 3.5
$$ ##JCAMPDX= 5.01
$$ ##ORIGIN= Bruker BioSpin GmbH
$$ ##OWNER= she
$$ F:/spectra/data/she/nmr/H-F/1/pdata/1/auditp.txt
$$ ##AUDIT TRAIL=  $$ (NUMBER, WHEN, WHO, WHERE, WHAT)
(   1,<2022-07-28 14:09:53.89 +0400>,<she>,<DPX200>,
      <created by zg, POWCHK disabled, PULCHK disabled
       configuration hash MD5:
       00 E9 B6 7A A2 85 ED C7 34 08 36 98 17 FE 4E 26
       data hash MD5: 16K
       EA 1A E2 94 F7 AA 8C 3D 0C 34 9A 85 23 D0 5C 0C>)
(   2,<2022-07-28 14:09:56.32 +0400>,<she>,<DPX200>,
      <Start of raw data processing
       efp BC_mod = 2 LB = 0.24 FT_mod = 6 PKNL = 1 PHC0 = -18042.41 PHC1 = 17.40068 SI = 16K 
       data hash MD5: 16K
       8E 49 8D 4A 1B E8 46 BB C8 6A 1E 40 5C 3C 6F 67>)
(   3,<2022-07-28 14:10:15.90 +0400>,<she>,<DPX200>,
      <pk PHC0 = 2.745826 PHC1 = -5.2 
       data hash MD5: 16K
       72 AC EB A4 6F F6 91 AF BB C5 BE A3 9F 15 A8 03>)
(   4,<2022-07-28 14:10:19.78 +0400>,<she>,<DPX200>,
      <abs ABSG = 5 
       data hash MD5: 16K
       CB BF 58 E9 02 CA 55 19 82 FF E9 52 36 00 1E DB>)
$$ ##END=
$$ 
$$ hash MD5
$$ 1B 25 86 8B 5D 3B 2A 04 21 63 0D 4B B2 AE F8 F8
##$RELAX= 
##$RELAX= 
##$RELAX= 
##$RELAX= 
##$RELAX= 
##$RELAX= 
$$ Bruker specific parameters
$$ --------------------------
##$DU= <F:/spectra>
##$EXPNO= 1
##$NAME= <H-F>
##$PROCNO= 1
##$TYPE= <nmr>
##$USER= <she>
##$AMP= (0..31)
100 100 100 100 100 100 100 100 100 100 100 100 100 100 100 100 100 100 
100 100 100 100 100 100 100 100 100 100 100 100 100 100 
##$AQSEQ= 0
##$AQ_mod= 1
##$AUNM= <au_zg>
##$AUTOPOS= <>
##$BF1= 200.13
##$BF2= 200.13
##$BF3= 200.13
##$BF4= 200.13
##$BF5= 200.13
##$BF6= 200.13
##$BF7= 200.13
##$BF8= 200.13
##$BYTORDA= 1
##$CFDGTYP= 0
##$CFRGTYP= 5
##$CHEMSTR= <none>
##$CNST= (0..31)
1 1 145 1 1 1 1 1 1 1 1 1 1 1 1 1 1 1 1 1 1 1 1 1 1 1 1 1 1 1 1 1 
##$CPDPRG= <>
##$CPDPRG1= <>
##$CPDPRG2= <>
##$CPDPRG3= <>
##$CPDPRG4= <mlev>
##$CPDPRG5= <mlev>
##$CPDPRG6= <mlev>
##$CPDPRG7= <mlev>
##$CPDPRG8= <mlev>
##$CPDPRGB= <>
##$CPDPRGT= <>
##$D= (0..31)
0 1.2 0 0 0 0 0 0 0 0.06 0 0.03 0 0 0 0 0.0002 0 0 0 0 0 0 0 0 0 0 0 0 
0 0 0 
##$DATE= 1659002993
##$DBL= (0..7)
120 120 120 120 120 120 120 120 
##$DBP= (0..7)
150 150 150 150 150 150 150 150 
##$DBP07= 0
##$DBPNAM0= <>
##$DBPNAM1= <>
##$DBPNAM2= <>
##$DBPNAM3= <>
##$DBPNAM4= <>
$$ [...]
##$SUBNAM2= <"">
##$SUBNAM3= <"">
##$SUBNAM4= <"">
##$SUBNAM5= <"">
##$SUBNAM6= <"">
##$SUBNAM7= <"">
##$SUBNAM8= <"">
##$SUBNAM9= <"">
##$SW= 18.0517283424941
##$SWIBOX= (0..15)
0 0 2 0 0 0 0 0 0 0 0 0 0 0 0 0 
##$SW_h= 3612.71676300578
##$TD= 16384
##$TD0= 1
##$TE= 0
##$TE2= 300
##$TE3= 300
##$TEG= 300
##$TL= (0..7)
0 120 120 120 120 120 120 120 
##$TP= (0..7)
150 150 150 150 150 150 150 150 
##$TP07= 0
##$TPNAME0= <>
##$TPNAME1= <>
##$TPNAME2= <>
##$TPNAME3= <>
##$TPNAME4= <>
##$TPNAME5= <>
##$TPNAME6= <>
##$TPNAME7= <>
##$TPOAL= (0..7)
0.5 0.5 0.5 0.5 0.5 0.5 0.5 0.5 
##$TPOFFS= (0..7)
0 0 0 0 0 0 0 0 
##$TUNHIN= 0
##$TUNHOUT= 0
##$TUNXOUT= 0
##$USERA1= <user>
##$USERA2= <user>
##$USERA3= <user>
##$USERA4= <user>
##$USERA5= <user>
##$V9= 5
##$VALIST= <valist>
##$VCLIST= <CCCCCCCCCCCCCCC>
##$VD= 0
##$VDLIST= <DDDDDDDDDDDDDDD>
##$VPLIST= <PPPPPPPPPPPPPPP>
##$VTLIST= <TTTTTTTTTTTTTTT>
##$WBST= 1024
##$WBSW= 4
##$XGAIN= (0..3)
0 0 0 0 
##$XL= 0
##$YL= 0
##$YMAX_a= 789041
##$YMIN_a= -689067
##$ZGOPTNS= <>
##$ZL1= 120
##$ZL2= 120
##$ZL3= 120
##$ZL4= 120
##$ABSF1= 15.74909
##$ABSF2= -2.302759
##$ABSG= 5
##$ABSL= 3
##$ALPHA= 0
##$AQORDER= 0
##$ASSFAC= 0
##$ASSFACI= 0
##$ASSFACX= 0
##$ASSWID= 0
##$AUNMP= <proc_1d>
##$AZFE= 0.1
##$AZFW= 0.1
##$BCFW= 0
##$BC_mod= 2
##$BYTORDP= 0
##$COROFFS= 0
##$CY= -3
##$DATMOD= 1
##$DC= 0
##$DFILT= <>
##$DTYPP= 0
##$F1P= 0
##$F2P= 0
##$FCOR= 1
##$FTSIZE= 16384
##$FT_mod= 6
##$GAMMA= 0
##$GB= 0
##$INTBC= 1
##$INTSCL= 0
##$ISEN= 128
##$LB= 0.24
##$LEV0= 0
##$LPBIN= 0
##$MAXI= 10000
##$MC2= 0
##$MEAN= 0
##$ME_mod= 0
##$MI= 1.114404
##$NCOEF= 0
##$NC_proc= -5
##$NLEV= 6
##$NOISF1= 3.799351
##$NOISF2= 2.8
##$NSP= 0
##$NTH_PI= 0
##$NZP= 0
##$OFFSET= 15.76672
##$PC= 1
##$PHC0= -18039.66
##$PHC1= 12.20068
##$PH_mod= 1
##$PKNL= yes
##$PPARMOD= 0
##$PSCAL= 0
##$PSIGN= 0
##$REVERSE= no
##$SF= 200.130000963957
##$SI= 16384
##$SIGF1= 3
##$SIGF2= 2
##$SINO= 5.538805
##$SIOLD= 16384
##$SREGLST= <1H.CDCl3>
##$SSB= 0
##$STSI= 16384
##$STSR= 0
##$SW_p= 3612.71676300578
##$SYMM= 0
##$S_DEV= 0
##$TDeff= 16384
##$TDoff= 0
##$TI= <>
##$TILT= no
##$TM1= 0
##$TM2= 0
##$TOPLEV= 0
##$USERP1= <user>
##$USERP2= <user>
##$USERP3= <user>
##$USERP4= <user>
##$USERP5= <user>
##$WDW= 1
##$XDIM= 16384
##$YMAX_p= 315203677
##$YMIN_p= -227129
$$ End of Bruker specific parameters
$$ ---------------------------------
##NTUPLES= NMR SPECTRUM
##VAR_NAME=  FREQUENCY,     SPECTRUM/REAL,   SPECTRUM/IMAG
##SYMBOL=    X,             R,               I
##VAR_TYPE=  INDEPENDENT,   DEPENDENT,       DEPENDENT
##VAR_FORM=  AFFN,          ASDF,            ASDF
##VAR_DIM=   16384,         16384,           16384
##UNITS=     HZ,            ARBITRARY UNITS, ARBITRARY UNITS
##FACTOR=    0.220516191357247, 1,           1
##FIRST=     3155.39365239784, 0,            0
##LAST=      -457.323110607938, 0,           0
##MIN=       -457.323110607938, -227129,     0
##MAX=       3155.39365239784, 315203677,    0
$$ Real data points
##PAGE= N=1
##DATA TABLE= (X++(R..R)), XYDATA
$$ [...]
6451g9596O4394m0402m9055N4590J9381O8330K9622m4959L3887R3689l7223k3372
6439H9286j1880m7775l6217J0432L6198m9250O0386j4290n2629Q15M7942j12890
6427g9872R1697M4632o7728L9273m9268J1807k0097k2355k4908L275K6496k2955
6415g0003l6603P5252O4548J1055k6789o8207K914P9612j986m2141r072l7701
6403e9121K9844o4013m433P7814j7175M7800k9805l2075N3104m4119J0714P451
6391b4014l9911K7392L1935J07511n1559j6789p9067r607O4347k8878J11418K2575
6379A15353q0340p436M0294n2721K7468j1587j0007J4977j935j2031K1160m1071
6367B124j8710m840L0873o793q868J2528K5243M2721L9249M0458p5876n5648m39
$$ y = [-79596, -15202, -55604, -104659, -50069, -30688, 37642, 67264, 22305, 56192, 149881, 112658, 89286, 77406, 29631, -6586, 3846, 40044, -9206, 51180, 36890, -15739, -14924, 33018, -79872, 11825, 56457, -11271, 28002, -21266, -9459, -29556, -51911, -76819, -73544, -47048, -70003, -106606, -31354, 33194, 44249, 17460, -50747, -47833, 31779, 29793, -12348, -21420, -59121, -29277, -93290, -97723, -19909, -37084, 10716, -19089, -51164, 1940, -42179, -31465, -24014, -63925, -36533, -4598, 102913, 51354, 34565, -44502, -54109, 10238, -18640, 92778, 115353, 35013, 27577, 67871, 15150, 42618, 31031, 21024, 36001, 34066, 22035, 43195, 2124, -16586, -21426, 9447, 2654, -6214, 6314, 31557, 74278, 113527, 153985, 78109, 22461, 22022]
6354B2022n0823J09368K8005l3963K3661n8622P4989P1143o4821q578O7010k2449
6342A56942N3239M5795M5215j358l8010j6786j08626J15249K2390o8745L9176
6331B44481r9514j6733L574p9281P1003J0883n0197K869j2173l5145M4775k5927
6319E8615J7935k2513k3698L5088r5681J04436m9995r1316L1574Q5808p385p0473
6307b7605M2705P7265n1536J1346k8673J1037m6172k9825p43J8751P715p993Q5206
6294F1478m0000k1488O619k239M8106J7754l9495O5027P997p0727j3754j0542
6282H736n1970l4574M3203Q0967o1664o3513J26820k238J4030L6598j7803q9460
6270a0868m4572o894k1306M1502K5985Q563J8175J4722n254K1938L3380m8312
$$ y = [22022, -28801, 80567, 108572, 74609, 98270, 39648, 114637, 185780, 120959, 112381, 179391, 156942, 210181, 255976, 301191, 299833, 261823, 245037, 136411, 251660, 274050, 205305, 244481, 144967, 128234, 131808, 52527, 123530, 134413, 84216, 87085, 74912, 39767, 84542, 58615, 76550, 54037, 30339, 65427, -30254, 74182, 24187, -67129, -35555, 50253, 42868, -27605, 15100, 92365, 40829, 52175, 23502, 34539, -11633, -41458, -42201, -23450, -15735, -23728, 61478, 21478, -10, 6609, 4370, 52476, 70230, 30735, 95762, 103759, 33032, 19278, 8736, -43234, -77808, -34605, 46362, -15302, -78815, 48005, 45767, 59797, 96395, 78592, -10868, -55440, -62334, -83640, -42138, -16153, -7590, 10585, 25307, 20053, 41991, 75371, 27059]
6258B7059m6655m06O7340M9702r2402j6447l6896N8036L2341l8749j7873n9408
6246g4358J18817J9874l7661J5328Q637n4871l0983K6701M5004j3951Q671j0807
6234B0401J3468m8132j7004L7799K4713J2330l3449p5879M9281O5432K5914J15452
6222A90326j09900k1813o4197L4740k6756j7806o3818J7431J05524l0463n9889
6211d6621L9505N9023L7208J2907m2917j7377K6844o7063K7176M7956J8087n032
6199H9696k6791j2902n7099m7141R787Q3967j9796l8014J8014L8058l2382j3800
6187h403M7152k3246k7032l5070J7775M0514K3667L0329p8152P8965J8395l2352
6175E2542o7338k0684Q0374N3611k5249L0761p0761l2418P2938n1374l5889n9065
$$ y = [27059, -19596, -20002, 47338, 97040, 4638, -11809, -48705, 9331, 41672, 2923, -14950, -74358, 44459, 64333, 26672, 42000, 50637, -4234, -35217, -8516, 36488, 22537, 31208, 20401, 33869, -14263, -31267, 6532, 31245, 43575, 10126, -65753, -16472, 48960, 74874, 190326, 80426, 58613, -5584, 29156, 2400, -15406, -79224, -61793, 43731, 13268, -46621, -7116, 51907, 89115, 102022, 59105, 41728, 68572, 1509, 28685, 76641, 94728, 89696, 62905, 50003, -7096, -54237, -44450, 39517, 19721, -18293, -279, 37779, 5397, -8403, 38749, 15503, -11529, -46599, -28824, 11690, 35357, 65686, -12466, 66499, 84894, 52542, -14796, -35480, 44894, 98505, 73256, 104017, 33256, 838, 73776, 22402, -13487, -72552]
6163g2552N8692L7493p6479o742Q6571O1579k9520m4610j0027n8844j7711N1003
6151b1147O9956q131k3381k848N1750o653j4132K0041j20787j6025J28532r475
6139D7700j1327m9698j0187O499O9143k9989M743J550o9517K9653M6558l2527
6127B601j7126P5618P657j4697O422M976M912o3107k6316K3927n5596j2025M1703
6114b1051J3732L6178K1163l2999k6654q3345J05904k8586r9802N0143j2857J9654
6102e8520j0722O9081N1562k7870O8531j8801o5539j7268P0251l7357K4091l7780
6090I659K984j6699L2008P6624r9627r0321Q355J02709k4227k6120M7414j9570
6078C189M133n4106P870r482O1996j8993k2240K0518P694N7062m8785k7747R1676
$$ y = [-72552, -13860, 23633, -52846, -59588, 26983, 88562, 59042, 14432, 4405, -54439, -72150, -21147, 48809, 40678, 17297, 14449, 66199, 59546, 45414, 65455, -55332, -71357, 57175, 47700, 36373, -13325, -23512, -17013, 52130, 22141, 26884, 28434, -41083, -11430, 35128, 2601, -14525, 61093, 68750, 54053, 60475, 65451, 70363, 7256, -19060, 4867, -50729, -62754, -21051, -7319, 28859, 50022, 17023, -9631, -92976, 12928, -15658, -115460, -65317, -78174, -58520, -69242, -161, 51401, 23531, 92062, 73261, 7722, -9546, 60705, 23348, 47439, 9659, 12643, -4056, 27952, 104576, 4949, -85372, -77017, 25692, 1465, -24655, 22759, 3189, 7322, -46784, -38914, -48396, 13600, -5393, -27633, -7115, 579, 57641, 8856, -18891, 72785]
6065G2785P57o563N9057l4105l8398j3645k0781r6736M5352M3435L0628j869K1496
6052F1413l3904p1876J42506k4731l0026K7824M9574J4415r515j15311n7077P0018
6040B3310j9262L238n193N2600k5718q0581M0542L6331p2968J31752J3317m9270
6028D8098p2717j8652M0427k9850M4068j8478k1138l8170R4058J18698j08045
6017C8299l331p6067K743J8160j2302N5052m658l4955j9284K6132N4589L3891
6005G8269n4086p3435L0489L4845L3378L3899N5641m6576n6840l6820n1178O6562
5993A4148l6064J9867j3787L7422k5841j0552L2717n2173k8696P2873N7558k0450
5981D7022n1448k5360m5974J13840J8923m0937j3130r8164K7027J9227L3850O9027
$$ y = [72785, 73542, 66979, 126036, 91931, 53533, 39888, 19107, -77629, -32277, 11158, 41786, 39917, 61413, 27509, -44367, 98139, 73408, 43382, 71206, 120780, 135195, 125680, 10369, -46708, 23310, 4048, 7286, 2093, 54693, 28975, -51606, -11064, 25267, -47701, 84051, 97368, 48098, -24619, -43271, -2844, -32694, 11374, -7104, -28242, -66412, 27646, 146344, 38299, 34968, -41099, -38356, -20196, -32498, 22554, 17896, -17059, -36343, -10211, 44378, 78269, 24183, -49252, -18763, 16082, 49460, 83359, 139000, 92424, 35584, -1236, -52414, 14148, -21916, -2049, -15836, 21586, -4255, -14807, 17910, -34263, -62959, 9914, 67472, 47022, -4426, -29786, -75760, 38080, 57003, 16066, 2936, -95228, -68201, -48974, -15124, 53903]
5969E3903l9102M1462P944k6077J7434o4818J8846M767N0191q3705q6160J4235
5957i1080Q8517M2799j512o4226Q756l2062j6152Q9941M362j12389k6429Q9616
5945a9859k5361L7299O9741j5001j0390K5844j21222j7111K3080P4300R6467k2142
5933I5645k3000q2758J6422M5430l2411J1923M5249j7550n7062m9621K0444J28317
5921A01028L8296o4755J5512m2477j6703K9469J5882q9967L2769L7371k4179n2680
5909b0434o4613M0080N3842k9912j0903n4397M6844N9150n0299k2441J407j3945
5897f5621k1277J17878L6842l5847n4729K8844J11560n8781j00814M6044J34001
5886A38100K4849k3994n4265n9934J8712m1767k2560m4435N2495J9752M6978j403
$$ y = [53903, 14801, 56263, 64207, 38130, 55564, -9254, 9592, 14359, 64550, -19155, -105315, -91080, -2563, 40236, 38724, -25502, -16746, -48808, -64960, 24981, 29343, -83046, -109475, -19859, -45220, -7921, 61820, 46819, 36429, 62273, -58949, -76060, -52980, 21320, 117787, 95645, 72645, -10113, 6309, 51739, 19328, 31251, 76500, 58950, 1888, -47733, -27289, 101028, 139324, 74569, 90081, 47604, 30901, 60370, 76252, -13715, 19054, 56425, 32246, -20434, -85047, -44967, 8875, -21037, -31940, -86337, -39493, 19657, -30642, -53083, -51676, -65621, -86898, 30980, 67822, 31975, -22754, 6090, 117650, 58869, -41945, 4099, 138100, 162949, 138955, 84690, 24756, 43468, 1701, -20859, -65294, -12799, 6953, 53931, 52528]
5874E2528n9501j9253K7335r253K5232K5571k6822p185q286M4365k0075k071K2542
5861D5127l2235m9747l8000j8902k168R4413j1071m0841l6821q861M5224J0962
5849d2920J1728P531O471m9380Q5270J3577l1610q571k0410K9696N477N0381P5615
5836A32855j16820n3702Q0463L6294j7150p0923k0930N1888R5988k6673j3300
5825G7990k3738Q224m3435M2205J904J9048n8535j4501R15N3433O5126N840j09168
5812B5308m6937j452o9436O886L8359M608K0367K2582n421P9894J6581L528K4155
5799A19022k6712m006p836M5229j8140o6386p1997o939K0201j6963L9287o9257
5787f4497O1576j0566M9245K2827j3051j0642L8494L3000K5375m2717J9588j7324
$$ y = [52528, -6973, -26226, 1109, -8144, 17088, 42659, 15837, 8652, 366, 44731, 24656, 22585, 45127, 12892, -36855, -74855, -93757, -95925, -1512, -12583, -53424, -90245, -99106, -53882, -42920, -31192, -23661, -17190, -66570, 18700, 32277, 667, -7904, -28314, 1382, 6859, 57240, 132855, 16035, -37667, 42796, 79090, 61940, -8983, -29913, 21975, 117963, 91290, 77990, 54252, 62476, 19041, 61246, 63150, 82198, 23663, 9162, 10077, 63510, 128636, 134476, 25308, -21629, -23081, -92517, -85631, -47272, -42664, -22297, 285, -5136, 74758, 91339, 94867, 119022, 92310, 88304, 80468, 125697, 107557, 41171, -30826, -37765, -17564, -34527, 4760, -64497, -2921, -13487, 35758, 58585, 45534, 34892, 73386, 106386, 131761, 89044, 108632, 91308]
5775I1308J7674K6961J2157o4076o1740N4016j9891q6360l669M0556J5668k8928
5763f324J10944J8106o09N1779r3222m8982K0472N122j5711j3159k7565o927j603
5750g679M9648L3258q1828L1633J6386m1183K4957o9413J5616j4243L3873L2627
5738B3652Q040J2068j0634j0731J9871M527k725m1168q3480J14334K9042p004
5726E5792K9782j7116Q985o6742Q2255n40j25700l0381M7103O2065N6204m7637
5714E4070O546j0891l075K5385p2079j0953R0093L8497o5038n9273k1122J4060
5702a3780O2857L4108j5775j05486O9941M4285j9536j4453L974L4418j8762L8252
5690A00043o1019m6695N5340K0061m2467R1255n6042n0650j2670O8657o494l9156
$$ y = [91308, 108982, 135943, 148100, 84024, 22284, 76300, 56409, -29951, -33620, 6936, 22604, -6324, 104620, 122726, 122117, 173896, 80674, 31692, 52164, 57286, 41575, 28416, 851, -6076, -7679, 41969, 75227, -6601, 25032, 41418, 235, 25192, -44221, -28605, -42848, -8975, 23652, 31692, 43760, 33126, 22395, 42266, 46793, 44068, 2900, -80580, 33754, 62796, 55792, 85574, 68458, 77443, 10701, 92956, 92416, -33284, -63665, -16562, 45503, 101707, 54070, 60616, 49725, 46650, 72035, -44, -10997, 79096, 117593, 52555, -6718, -27840, -13780, 49077, 83185, 67410, -38076, 31865, 76150, 56614, 42161, 46135, 80553, 61791, 100043, 39024, -7671, 47669, 67730, 25263, 116518, 60476, 9826, -2844, 65813, 59319, 20163]
5678B0163J3758M9189k0188j2193N5636l3720j645r650J8842J6942p1815K198
5666B7517M3619P7035l6188q6995q347N0302o7117Q589L91k3042L1564J3294J5411
5653D6033k5041K4565R828o111n1000N8160O5668m8649n5811L4574J5831m6996
5641B1051J2841M196m5372j576l6031N0712K6239l8160J1036O6564k8406P985
5629E1079P194L7668n481n1411K1716j3216q7436k211K5185N2250K4375N637m3837
5616B1512L3944K7951k9360j3022K8512N2722k1962m7648l5848O7808M9824n06
5604A33927J018n6557o9641K1032L6489r0894k5095l540j050N4656J21147n288
5592A16204l2462m5272J02299l7555p6762o8017K5154J60351k9656o4981l0265
$$ y = [20163, 33921, 83110, 62922, 50729, 106365, 72645, 71000, 61350, 80192, 97134, 25319, 27517, 71136, 148171, 111983, 24988, 16641, 66943, -174, 8415, 8806, -14236, 17328, 30622, 46033, 20992, 45557, 55385, 49274, -1726, 56434, 122102, 73453, 17642, 52216, 68047, 21051, 33892, 38088, -7284, -8860, -44891, 5821, 32060, -6100, 4936, 71500, 43094, 51079, 58273, 95941, 90460, 39049, 60765, 47549, -39887, -42098, -16913, 35337, 59712, 65349, 21512, 55456, 83407, 54047, 41025, 69537, 122259, 100297, 52649, 16801, 84609, 134433, 133927, 134945, 78388, 8747, 29779, 66268, -24626, -49721, -53261, -54311, 345, 121492, 116204, 83742, 38470, 140769, 103214, 26452, -41565, -16411, 143940, 114284, 49303, 19038]
5581A9038k4375m010J230Q169P1136m8872N825J3350J6753o181o7360J8512M3655
5568D6870Q758K7750m8511j1735N8508q325m6459j0596N3902M4287k5404l4672
5556E4373k320m1423j1181R9065j8577P3157r2534K8875K0651o790k6185K2860
5544I9971K1536J3315N3135q1408q6528j4594J6628M2490n5045L325L3157K4058
5532G0040k8262p727K3955p801l3721L1321P5685l4288m588m1820k1764l2435
5520a1405J269O9161Q9229l9304o8097J5679p527K4314k9364L1141k4707l7845
5508A2544N8284J8361k2485k048M9196k2726k3932M0585K8575p187j9918L2848
5496A42097K6576q1623n9095L4504N2181k6860K2454j3778J4540O7991O6611p0836
$$ y = [19038, -5337, -9347, -8117, 52, 71188, 22316, 28141, 41491, 58244, 52063, -15297, 3215, 46870, 55628, 83378, 34867, 23132, 81640, 73315, 26856, 16260, 70162, 114449, 89045, 54373, 52053, 10630, -551, 98514, 79937, 153094, 60560, 89435, 110086, 103296, 77111, 99971, 121507, 134822, 187957, 106549, 20021, 5427, 22055, 64545, 9500, 12825, 45982, 70040, 41778, 34051, 58006, 50205, 16484, 47805, 123490, 89202, 84614, 42794, 21030, -11405, -10136, 59025, 148254, 108950, 40853, 56532, 49005, 73319, 43955, 75096, 50389, 12544, 70828, 89189, 66704, 64656, 113852, 91126, 67194, 107779, 136354, 129167, 109249, 142097, 168673, 87050, 27955, 62459, 114640, 87780, 110234, 96456, 110996, 178987, 245598, 174762]
5484A74762q8077m4068J6687K4473M079P3529N4059k5674q7546k674L4798n6164
5472G8184Q658K8524J3308J2619l3083o954K7953j412n6117k5694K316j2661M3370
5459G9011k4853K3075Q41L9696p6235M6485J5957l9378J3166L746l7825j0174
5447C3512O6271K4539j0787K3559L2056m8678l8790o286k9651M0936j9245P505
5435G4941M6613l9183P746N1736L5293o1851J18002j7253m9955o0823j3807k0397
5423G1062M3073j1116j6023k9452M8247M0071L1506k7842K289m7438K3773N1903
5411A80053K1021n682o0342O521k1051J9370k7830J21152k2145p9485N1016L2424
5399B15022o9118k7955j837K180j967Q0999m5011r5354P3587m063q8839R2253
$$ y = [174762, 86685, 42617, 59304, 83777, 87856, 161385, 215444, 189770, 102224, 99550, 134348, 78184, 86842, 115366, 128674, 141293, 108210, 101256, 129209, 127797, 71680, 45986, 48302, 35641, 79011, 54158, 77233, 78074, 117770, 41535, 88020, 103977, 64599, 77765, 81511, 43686, 33512, 99783, 124322, 113535, 137094, 169150, 120472, 81682, 75396, 45745, 86681, 67436, 74941, 121554, 82371, 90117, 141853, 177146, 115295, 233297, 216044, 166089, 105266, 91459, 71062, 114135, 103019, 86996, 57544, 105791, 145862, 177368, 149526, 151815, 104377, 128150, 180053, 201074, 195392, 135050, 141571, 120520, 139890, 112060, 233212, 211067, 131582, 182598, 215022, 145904, 117949, 116112, 118292, 116325, 197324, 152313, 56959, 130546, 126483, 37644, 129897]
5387A29897N7701p6936m2321m9102J70488J2719q7499j198O0762N0829m5521N726
5375A85545j15893L3136J3430K6893J05534R0673r2776n1146j1464j7558R5628
5364B62002o8915n2920L6462L3472m7547N341R256M9508N778l9789k7454n7194
5352A08000N9741J6122J3091P450R9462k4101j04014J5910J6859o2920j9888M141
5340A29853Q60N0673N867L0081n3244N0588m1670p6535P9854L8712J4202o2439
5328A66802k7882N1389L5922j8677q9770K8408L5387N5222m1640j8380K7766o3956
5316A40591P7509q600o9958O0665j9023j7212J10905o0533l8360k9096j9601m261
5304A23026L0695j3817l4463M527K1291l3757L2201N9279J0246j7329k1607j4830
$$ y = [129897, 187598, 110662, 68341, 19239, 189727, 202446, 114947, 113749, 174511, 225340, 179819, 185545, 69652, 102788, 116218, 143111, 248645, 339318, 246542, 195396, 183932, 166374, 262002, 193087, 140167, 176629, 210101, 162554, 167895, 177151, 226659, 232437, 192648, 165194, 108000, 167741, 183863, 196954, 204404, 303866, 279765, 175751, 191661, 208520, 145600, 125712, 129853, 130713, 181386, 187253, 217334, 164090, 214678, 173008, 96473, 176327, 215039, 229241, 166802, 138920, 190309, 226231, 207554, 117784, 146192, 181579, 236801, 195161, 176781, 204547, 140591, 218100, 209500, 139542, 200207, 181184, 163972, 274877, 214344, 175984, 146888, 127287, 123026, 153721, 139904, 105441, 109968, 131259, 97502, 129703, 188982, 199228, 181899, 160292, 145462]
5292A45462K1685O5185n1776p6701Q7665O9109p1265J5614K5778r470l7434l287
5280A80565n544P9518p4144m3022J5027l837N779N7789K1241M3471N83j1207o2831
5267B03388M3668o4185o2984Q2863j1245l3827J11052O956l8374j02691K5854
5256A60475P243p245Q667l7879J22081p4742q982P111r90N6598o0267R939N0193
5243B32202o4137m1046L4359j1193J10471J3062p6926O2811M9726p48l6350L224
5231B75455n3333j04623j1774M6220M9217k6025L9241M4726j03582j5773N4900
5220A94649N0780k7442L0965l0609M8390j9203J4068l8884K503m1781J2119J428
5208A96983K7284L9278j6795m619O3506l4019l4924K2846l4851K9316K6715r4065
$$ y = [145462, 167147, 232332, 180556, 103855, 191520, 260629, 189364, 204978, 230756, 221286, 183852, 180565, 175021, 254539, 180395, 137373, 152400, 148563, 154342, 212131, 233372, 276843, 277426, 266219, 203388, 247056, 182871, 119887, 202750, 191505, 157678, 268730, 275686, 237312, 134621, 160475, 167718, 160473, 169140, 131261, 253342, 178600, 169618, 176729, 175739, 232337, 172070, 182009, 232202, 168065, 127019, 161378, 150185, 260656, 273718, 196792, 259603, 309329, 308581, 272231, 275455, 222122, 117499, 105725, 151945, 201162, 175137, 214378, 259104, 155522, 139749, 194649, 245429, 217987, 248952, 218343, 266733, 247530, 261598, 222714, 225217, 183436, 195555, 196983, 224267, 263545, 246750, 242131, 305637, 271618, 236694, 259540, 224689, 254005, 280720, 186655]
5196A86655l1200J03932n3158j5750O1872l3639l4439O7260k3680j09630M4735
5185A62958O2101J00388o4179j6271K7466N1125j23995L988O2157J6970n5744
5174B26964j0968j9544N038R4472j7123O0187o4810j1092k3262J5823l6518J05032
5162C24199k2559j7449k2226k2708j6226l569M2172N1899o9788n2538L2002k9232
5150A93977L7845J958N8914M0088j4519L0908j4492j0417k1806l913n8767N170
5138B44946L5650j6193J7396J3040m0043P630L8783l295J6321P630p2002L8111
5126B87974N0803q1150j4359J14595j02260k569K3928j231L7515q261q2345M4327
5114B66967J5163J264M0599L4565l0357j36271M4085K6652K7870K8183J4409o346
$$ y = [186655, 155455, 259387, 206229, 190479, 252351, 218712, 184273, 251533, 227853, 118223, 162958, 225059, 325447, 261268, 244997, 272463, 323588, 199593, 203581, 265738, 282708, 226964, 215996, 196452, 201490, 295962, 278839, 339026, 274216, 263124, 239862, 255685, 219167, 324199, 301640, 284191, 261965, 239257, 223031, 219462, 261634, 313533, 243745, 191207, 223209, 193977, 231822, 233780, 292694, 332782, 318263, 349171, 334679, 324262, 302456, 298543, 239776, 244946, 280596, 264403, 281799, 294839, 254796, 262426, 301209, 297914, 314235, 321865, 249863, 287974, 338777, 257627, 243268, 357863, 255603, 253034, 276962, 275731, 313246, 304985, 222640, 266967, 282130, 283394, 323993, 358558, 328201, 191930, 236015, 262667, 290537, 318720, 333129, 326783]
5102C26783k6216l0706J1303n352l2432K9893M61m719O7329m774J9898k8664O566
5089C29370M6535N1203l7586r358j1139K0867n735n3111j0970R0073K5585k7796
5077D07938K9871O214K2168q6548l1948P5663j8131K3578Q7738j2423n4489J6531
5065D66162J3029j0258j11O5732M0925L5485l6021n3098K5220J0590m7656N989
5053E15988N3232N7114q638l6521J8984o9706r954M2737Q744j6076m3782K6588
5041E38710Q3087l1874J2480M4592l5302q172O381r2105K6276L3711M2816K6113
5029F46713l2373m8751N2718o6734K0999L773K1010J4944k0464l6901m459J40172
5017F90647o7207j4660k2116L3854m6435K815O7803k2560O5443k2462l8467J3856
$$ y = [326783, 300567, 269861, 281164, 275812, 243380, 273273, 273734, 269015, 336344, 331570, 351468, 322804, 329370, 375905, 427108, 389522, 380164, 369025, 389892, 384157, 331046, 320076, 410149, 435734, 407938, 437809, 444023, 466191, 379643, 347695, 423358, 405227, 428805, 516543, 504120, 449631, 466162, 479191, 468933, 468822, 534554, 575479, 610964, 574943, 521845, 547065, 557655, 509999, 515988, 569220, 626334, 617696, 581175, 600159, 530453, 520499, 563236, 571980, 555904, 512122, 538710, 621797, 589923, 602403, 646995, 611693, 603521, 609902, 517797, 544073, 577784, 620600, 646713, 614340, 565589, 618307, 551573, 572572, 576345, 597355, 612299, 591835, 554934, 550475, 690647, 623440, 608780, 586664, 620518, 574083, 576898, 644701, 622141, 687584, 665122, 626655, 640511]
5005F40511j2226P218k687p6933J4336L2042L8878O0748K2688J2788M806r8876
4993F43293O9783R4310q4937L7830m6292o8558n7594O0274P6248r8947k2741J07753
4981G10422m8047o598K9743M2403j05367M1227o7704L0784M4699j3749l9845J1929
4969F29897J9189j3621J3851M5136N0651l4662m266k5459m6269M9097K110m6820
4957F38834J02110q2092N551k075Q9744J1950p3219K505l874j4455j1164O9857
4945G33672O107K0115j48m9444J283m4916k330R345N303L2143M9592m1947p5012
4932F43763Q4327Q0436m4580K2008j8880k6062J0037J6237L947N2026Q227r588
4920H21898Q3100k9339k1732j32L2477n522m0985J3808P1244N5188n6161J0943
$$ y = [640511, 628285, 635503, 632816, 555883, 570219, 602261, 641139, 701887, 724575, 737363, 742169, 643293, 713076, 807386, 722449, 760279, 713987, 645429, 587835, 648109, 724357, 625410, 602669, 710422, 662375, 655777, 685520, 727923, 622556, 663783, 596079, 626863, 671562, 657813, 617968, 629897, 649086, 635465, 649316, 694452, 745103, 710441, 706175, 680716, 634447, 683544, 685654, 638834, 740944, 658852, 664403, 662328, 752072, 764022, 690803, 693308, 689434, 674979, 663815, 733672, 739779, 759894, 759746, 710302, 711585, 666669, 664339, 673684, 678987, 711130, 760722, 718775, 643763, 728090, 808526, 763946, 785954, 767074, 741012, 751049, 767286, 771233, 823259, 831486, 821898, 904998, 875659, 853927, 853795, 886272, 880750, 839765, 853573, 924817, 980005, 923844, 934787]
4908I34787k1258J9102l9339n456m1514Q4505L2554N6121M5852K1738j9673N2724
4896A120143Q017r475M8150K0676n2644o8512M2305J8523R2239J9781L831n50
4884A242484Q437k7883N7203J1014J3359J2566m2916J8982J5618m978J3727O3293
4872A380906Q4717K5667M399L7340J11975k8505L1622p176K4284N1114J3267n4380
4860A675230N9419R0895L6015N9459j3232M1545J6763O5660K7333Q4761M200K2770
4848B170818L8787k5419N1828Q3817J21837l1651R664P6041R5710R2931P0188
4837B754551J9831L3955K9500R8917P6112R3881L0874J4058J49452R0263P5464
4826C466858Q2711Q8330M671Q9945J38276M4491Q2644Q3923Q4353R1026J90521
$$ y = [934787, 913529, 932631, 893292, 887836, 846322, 930827, 963381, 1019502, 1065354, 1087092, 1067419, 1120143, 1128160, 1118685, 1166835, 1187511, 1134867, 1066355, 1108660, 1127183, 1219422, 1239203, 1243034, 1242484, 1250921, 1223038, 1280241, 1291255, 1304614, 1317180, 1274264, 1293246, 1308864, 1303886, 1317613, 1380906, 1465623, 1491290, 1495689, 1533029, 1645004, 1616499, 1648121, 1640945, 1665229, 1716343, 1729610, 1675230, 1734649, 1825544, 1861559, 1921018, 1907786, 1949331, 1966094, 2031754, 2059087, 2143848, 2148048, 2170818, 2209605, 2184186, 2236014, 2319831, 2441668, 2410017, 2419681, 2495722, 2591432, 2684363, 2754551, 2774382, 2808337, 2837837, 2936754, 3012866, 3106747, 3137621, 3151679, 3301131, 3391394, 3466858, 3549569, 3637899, 3642570, 3732515, 3870791, 3915282, 3997926, 4081849, 4166202, 4257228, 4447749]
4815D447749J44247N986Q2851J53084J61784J69446J78609J48497J02823J80687
4805E775763K30562J37624K26092K37856J94672K49207J91032K19052K30454J87725
4795G880039L25680M02148L95235L70191L52009M34774M51732M62602M66448N47543
4785A2088401O50000O47682P01942O54963P84618P98970P79256P47910O63439
4776A8517181O67282O39574O38901N56295L95531L64547K90792L70041L26779
4767B2766923L15776N28537N30529N26674O32131Q26261Q87346R04991R54743
4758B8873911J058563J144827J153415J100497J152358J192462J030891R37911
4750C7644835R29407R80212R21882P72368P14538O54272N14246N26205M33863
$$ y = [4447749, 4591996, 4597982, 4680833, 4833917, 4995701, 5165147, 5343756, 5492253, 5595076, 5775763, 6006325, 6143949, 6370041, 6607897, 6802569, 7051776, 7242808, 7461860, 7692314, 7880039, 8205719, 8607867, 9003102, 9373293, 9725302, 10160076, 10611808, 11074410, 11540858, 12088401, 12738401, 13386083, 14088025, 14742988, 15527606, 16326576, 17105832, 17853742, 18517181, 19184463, 19824037, 20462938, 21019233, 21414764, 21779311, 22070103, 22440144, 22766923, 23082699, 23611236, 24141765, 24668439, 25300570, 26126831, 27014177, 27919168, 28873911, 29932474, 31077301, 32230716, 33331213, 34483571, 35676033, 36706924, 37644835, 38574242, 39554454, 40476336, 41248704, 41963242, 42617514, 43131760, 43657965, 44091828]
4741D4091828N25802N20720L56327L77625L17789L39052L40952M83326M28474
4732D7781895N65089N97317O88075Q75170Q19185P56609Q15810P25874N77545
4723E4202569N55882M08750L84855K58051J03541J60180R2122n9711Q901P8023
4713E6193163l4880o8361j0371p4177p521m5405j09433j04351o5643j11439J9371
4702E5580953o1085J7274J10536K3188l4321r7706j20716l06965m35420m54518
4692E4221220o13549o34654o12519p15038o99260o61317n76853n87336n42445
4683D8578249m26091l97036m75150m21589m46768m77579m69706m77580o27342
4674D4359408n81767o24515p88683q19545q41017r63743r83372r49648j113847
$$ y = [44091828, 44617630, 45138350, 45494677, 45872302, 46190091, 46529143, 46870095, 47353421, 47781895, 48346984, 48944301, 49632376, 50507546, 51326731, 52083340, 52899150, 53625024, 54202569, 54758451, 55167201, 55552056, 55810107, 55913648, 56073828, 56165950, 56106239, 56115140, 56193163, 56158283, 56089922, 56079551, 56005374, 55997853, 55952448, 55843015, 55738664, 55673021, 55561582, 55580953, 55519868, 55537142, 55647678, 55670866, 55636545, 55538839, 55418123, 55111158, 54675738, 54221220, 53607671, 52973017, 52360498, 51645460, 50946200, 50284883, 49708030, 49120694, 48578249, 48152158, 47755122, 47279972, 46858383, 46411615, 45934036, 45464330, 44986750, 44359408, 43777641, 43153126, 42364443, 41544898, 40703881, 39740138, 38756766, 37807118, 36693271]
4665C6693271j170412j163227j114143j270618j219012j009895j081287j072760
4657B7591917q91896q04666o60379n26400n77483m91338l89862k97645l57893
4648B2594355m19054l18509l27987m93612n39634o58709p51283p83119q24836
4639A7477612j017015q69632p12461p66596o79182p52477o98269m76228n95886
4630A0909866o42238m93090l40196l54448l79718l69214l56225k48314l47913
4621G378510j85422j85198k53423j97059k15875j05762j95482j88591j90447k70602
4611E390649j37452r8318r8992j42173j06676j16924Q5329j70667j66365p5097
4601D363314r2550o7024p1388j09966j09335p1502j32357l5844n7468p4166n8547
$$ y = [36693271, 35522859, 34359632, 33245489, 31974871, 30755859, 29745964, 28664677, 27591917, 26700021, 25895355, 25234976, 24708576, 24131093, 23639755, 23249893, 22952248, 22594355, 22175301, 21856792, 21528805, 21035193, 20495559, 19836850, 19085567, 18302448, 17477612, 16460597, 15590965, 14878504, 14111908, 13432726, 12680249, 11981980, 11505752, 10909866, 10267628, 9774538, 9434342, 9079894, 8700176, 8330962, 7974737, 7726423, 7378510, 7193088, 7007890, 6754467, 6557408, 6341533, 6235771, 6040289, 5851698, 5661251, 5390649, 5253197, 5154879, 5055887, 4913714, 4807038, 4690114, 4775443, 4604776, 4438411, 4363314, 4270764, 4203740, 4132352, 4022386, 3913051, 3841549, 3709192, 3673348, 3615880, 3541714, 3483167]
4590C483167j64604j22205j6089n3190p3973n5618r711l8341m7922j03075R5093
4579B893532j00908j11568j07336k2292j2279j07048J5107o6475m1100J8092m4804
4568B312921q2088r3779j13081p7813n056l1011O556Q8255l9097o5829j07667
4557A792311O1982K5416j81290J5506n3783o6503m8326l3286q020l4784N9497
4546A528720j7914L37n8512n1761k8105J6179q192P235o7605j4990L4571j7072
4534A322891n0961q4850L2462K4100n1111J2451j15435l3881M1854L9678j3554
4523A123644K0776o9236J011k0918j42100j6008m8903N0424k4703J9182k6708
4512H66461M4298k6364m6819K6022o0831l3288l3304P1679q1138K0905P4374K2278
$$ y = [3483167, 3318563, 3196358, 3180269, 3127079, 3053106, 2997488, 2987777, 2949436, 2901514, 2798439, 2893532, 2792624, 2681056, 2573720, 2551428, 2539149, 2432101, 2447208, 2380733, 2339633, 2357725, 2312921, 2230833, 2137054, 2023973, 1946160, 1941104, 1910093, 1916649, 2004904, 1965807, 1899978, 1792311, 1854293, 1879709, 1698419, 1713925, 1660142, 1593639, 1545313, 1512027, 1504007, 1469223, 1528720, 1510806, 1511143, 1452631, 1400870, 1372765, 1388944, 1380752, 1387987, 1320382, 1305392, 1339963, 1322891, 1271930, 1187080, 1219542, 1243642, 1192531, 1204982, 1089547, 1055666, 1097520, 1137198, 1123644, 1144420, 1075184, 1076195, 1055277, 913177, 897169, 848266, 898690, 873987, 893169, 866461, 910759, 884395, 837576, 863598, 802767, 769479, 736175, 807854, 726716, 747621, 821995, 844273]
4500H44273r9553q5595J6181K9391L0718o4794q30L544M3214l5970L4744M5719
4488G61042q0062l8010J3892o4425K9813j657j9262L7429K9027o4974O5980q1888
4476E86905l8641N2980K9897m7452n087K8681o539j3328k2007K9537m593p170
4464E83183Q7146l9643l8892R811k7214p8292K5181M178N6883n2463J0111N4748
4452E94737n1003J799J5565Rk0699P312m5134N7753K7822J127P28l561j12n2502
4438E33841j0467K7916o37J7242k7235J1783j03286J02417J9988R2j7511M513
4426E58656M6717L0573p9112m2034J3513O5546l0826J0475J12352j3547j06365
4415E65948R0035o5151m6877l182M2182K1270j3884o6316R053M4920Q399K990
$$ y = [844273, 744720, 659125, 675306, 704697, 735415, 670621, 669791, 673335, 716549, 680579, 715323, 761042, 680980, 642970, 656862, 592437, 622250, 620593, 601331, 638760, 667787, 602813, 668793, 586905, 548264, 601244, 631141, 583689, 578602, 607283, 600744, 587416, 565409, 594946, 590353, 583183, 670329, 630686, 591794, 601605, 574391, 496099, 521280, 525458, 582341, 529878, 539989, 594737, 543734, 545533, 561098, 561107, 540408, 547720, 502586, 560339, 588161, 589288, 590016, 586455, 586343, 533841, 523374, 551290, 550653, 567895, 540660, 552443, 449157, 551574, 571562, 571654, 554143, 558656, 605373, 635946, 556834, 514800, 528313, 593859, 563033, 573508, 685860, 672313, 565948, 655983, 590832, 543955, 540773, 582955, 604225, 590341, 524025, 533078, 577998, 586397, 589387]
4403E89387k7322P5321J7745l6150n6923K2073L6690P9654p7273j0383N0137r0156
4391E72800p701J05483p7502j5023j8953O6179J9783p672K2834l8396n2615l9826
4379E29391O2999J0528k6234K3645j534m5581K5520k924j8521J0040l4208K3652
4367E56773k8793K4256M4527j5171K2410k0598L355r1535M4206J5296o4520M3239
4355E33445O925l4136m1335k9540P1747Q6218L398k5148o6082k724p474p4341
4343D20953J8006K4913l5174P0868o4646J1746n9623M153M3760l9299k2604O3893
4331D36946m0064M5247N2755n6361j3952N4513J1598l6380n3608l4762Q8127Q19
4319D54878m4099j6257m0795K1189M663p3785K7747P7742q054j11048o3231O9439
$$ y = [589387, 562065, 637386, 655131, 618981, 562058, 584131, 620821, 700475, 623202, 612819, 662956, 572800, 565099, 670582, 593080, 578057, 559104, 625283, 645066, 637394, 660228, 621832, 569217, 529391, 592390, 602918, 576684, 600329, 598795, 553214, 578734, 575810, 557289, 567329, 533121, 556773, 527980, 552236, 596763, 581592, 604002, 583404, 586759, 495224, 539430, 554726, 490206, 533445, 540370, 506234, 464899, 435359, 507106, 593324, 596722, 571574, 505492, 502768, 495294, 420953, 438959, 463872, 428698, 499566, 434920, 446666, 387043, 391196, 434956, 395657, 373053, 436946, 396882, 442129, 494884, 438523, 424571, 479084, 490682, 454302, 400694, 365932, 454059, 454878, 410779, 394522, 353727, 374916, 379579, 305794, 333541, 411283, 403229, 292181, 228950, 298389]
4307B98389Q145j5326L8011l5220J7475M0528o6923Q01o6857J0856K5509N2426
4295C07814Q8851m2315l1751O0437O5682m7536o8511l3347L7372j11k850L1013
4283C64748M6426o2690l4598q400N8132l2418q0223O8285j2961O449N8559o7391
4271C03918o0012M4290K8160j01152O8792L6048p4162J7638Q7885L7742l4636
4260C54511l1745N5947m8655l5326q7528M6410J12898l2113Q9420k1583j09990
4249B92246k8769R1530M2739r6935m7767m1114O3063L7100J7202J7884r034N589
4237C43734L0872J39l1756k4688l911J6814j1153J5887m7104P9698m7418p3046
4225B48068M4203J8479L3304O5906M5519k4744q59k7657k236K657O0907r1244
$$ y = [298389, 306534, 291208, 329219, 293999, 311474, 352002, 285079, 285880, 219023, 229879, 255388, 307814, 396665, 354350, 322599, 383036, 448718, 401182, 332671, 299324, 336696, 336585, 333735, 364748, 411174, 348484, 313886, 305486, 363618, 331200, 250977, 319262, 306301, 312750, 371309, 303918, 243906, 288196, 316356, 215204, 283996, 320044, 245882, 263520, 351405, 389147, 354511, 322766, 378713, 330058, 294732, 207204, 253614, 366512, 334399, 423819, 402236, 292246, 263477, 355007, 397746, 300811, 253044, 211930, 274993, 312093, 329295, 347179, 338145, 343734, 374606, 374745, 342989, 318301, 314390, 331204, 320051, 335938, 288834, 368532, 321114, 248068, 292271, 310750, 344054, 409960, 455479, 430735, 429876, 402219, 399983, 402640, 463547, 372303]
4213C72303R175q1907j04654O1339O5040O1707k3475L4597l894j7566p3754J30405
4201D29316N8709p2442m352l1408q424J3590o182r1138N7514L4459m6663j9412
4189C13567P0062J6233K2288M1704m6856L39o3054L4960O4932l9227j8984N8021
4177D53985K002n4278P5633j5482K5969k861m9548J32666o7078o691J7963R5513
4165F07793m3865L4530l9800j3725L2721O0800L6436q0771O1l9367k4203L3352
4153E63962P5701n1546J8891j9421L4855L8122M4132k3728K079j1155P7694k2064
4141G27522o6068K2255j5049K9073p162M707j4794M8973N5815J709J5980J09511
4129I12472j6812P014M4169m1007n6936O2978M1650J0424l543P4252J15802k1875
$$ y = [372303, 381478, 299571, 194917, 256256, 321296, 383003, 359528, 394125, 390231, 372665, 298911, 429316, 488025, 415583, 411231, 379823, 371399, 384989, 378807, 287669, 345183, 379642, 332979, 313567, 383629, 399862, 422150, 463854, 416998, 417337, 354283, 389243, 454175, 414948, 395964, 453985, 455987, 401709, 477342, 461860, 487829, 484968, 435420, 568086, 501008, 494317, 512280, 607793, 563928, 598458, 558658, 544933, 577654, 638454, 674890, 594119, 594180, 554813, 530610, 563962, 639663, 588117, 607008, 587587, 622442, 660564, 704696, 680968, 683047, 671892, 749586, 727522, 661454, 683709, 668660, 697733, 690571, 695278, 680484, 729457, 785272, 786981, 802961, 912472, 895660, 902674, 946843, 905836, 848900, 911878, 953528, 963952, 960409, 1034661, 1150463, 1128588]
4117A128588j19103Q583Q1192l3408N2337j1554l1041K5054K8047O0999l9323
4106A150371L1895K3425M4256P6958n110J3096K3555j358K4307N2947k5889l2482
4094A375971M9321O9813k0213j4271L5989J3815J05365N206O3302J4547L1337
4083A730182N1186P1621O6445L1066J4919K1857P7532K2603j242O8460L1016M2501
4071B228146J17761L6684J6899J4493P4876O5241Q0777J8878Q1751O4360J11298
4060B911164J17596J47536K1290J22528J11077J56904J25583J47755J13717J13256
4050D088406J89247J42693J85831K99387K31021K60384K17494K52487L79333K73728
4040F520011L75179L59495L17324M66887M65787L82677L55801L60778L94884L52188
$$ y = [1128588, 1009485, 1018068, 1099260, 1065852, 1118189, 1106635, 1075594, 1100648, 1128695, 1189694, 1150371, 1182266, 1205691, 1249947, 1326905, 1321795, 1334891, 1358446, 1357088, 1381395, 1434342, 1408453, 1375971, 1425292, 1495105, 1474892, 1460621, 1496610, 1510425, 1615790, 1620996, 1684298, 1698845, 1730182, 1781368, 1852989, 1919434, 1950500, 1965419, 1987276, 2064808, 2087411, 2086169, 2154629, 2185645, 2228146, 2345907, 2382591, 2399490, 2413983, 2488859, 2554100, 2634877, 2653755, 2735506, 2799866, 2911164, 3028760, 3176296, 3197586, 3320114, 3431191, 3588095, 3713678, 3861433, 3975150, 4088406, 4277653, 4420346, 4606177, 4905564, 5136585, 5396969, 5614463, 5866950, 6246283, 6520011, 6895190, 7254685, 7572009, 8038896, 8504683, 8887360, 9243161, 9603939, 9998823, 10351011]
4030A0351011K65814J19630Q8787p3421j49155j67977l67084k80289m00328m40610
4020H946378m52806l96522m67589m03754l97697l76784l41833l33175j83136k57825
4010E335257k88936k84248j93133j88965j50099r7142j75530j17775j21925j10036
4000C607468r7230j53486k21658j69542M4718r8651j3948p3510o4194q8058o0632
3989B611277J2557j2684k6096J5479l7996p9425n8976Q814j01938k5806L0385
3978B335591M6005l4872j7269m0797p0186L3571J8509J5612j385l459J8107L4063
3966B333490j1086l6543j0088K793L3652N9967n1714n923J144M1851M63M0542
3954B398548N8115L080j3956L6626O5993j7381P7940M8810l9878k0449R0667L8123
$$ y = [10351011, 10616825, 10736455, 10825242, 10751821, 10602666, 10434689, 10067605, 9787316, 9386988, 8946378, 8493572, 8097050, 7629461, 7225707, 6828010, 6451226, 6109393, 5776218, 5593082, 5335257, 5046321, 4762073, 4568940, 4379975, 4229876, 4132734, 3957204, 3839429, 3717504, 3607468, 3510238, 3356752, 3135094, 2965552, 3010270, 2911619, 2897671, 2824161, 2759967, 2671909, 2611277, 2623834, 2611150, 2585054, 2600533, 2562537, 2483112, 2424136, 2432950, 2331012, 2305206, 2335591, 2381596, 2346724, 2329455, 2288658, 2218472, 2252043, 2270552, 2286164, 2284779, 2281320, 2299427, 2333490, 2322404, 2285861, 2275773, 2278566, 2312218, 2372185, 2320471, 2314548, 2315692, 2357543, 2358006, 2398548, 2456663, 2459743, 2445787, 2482413, 2548406, 2531025, 2608965, 2657775, 2617897, 2597448, 2688115, 2726238]
3942B726238O114O4992N7294N0117J6336j9268J5566M7576J37368l1022P2874
3931C144185O1439O6361J0762J16153P0192J8810N1015P6734J38037p271O5806
3920C812223Q9090J21738M0874J30839P9725R0552j255O7224J51632Q4059R9776
3909D766477J11592J46397J28925R0177J13876J11370J47548J49655J65204J64983
3899F096204J68386J47783K27848K54403J18380J67274K23811L24965K65437J55920
3889H150411L58224K54045L48204L84945K43092L41064L37791L59262M06356M48461
3879A1631855N18494M72330N24996O19383M68065N97910P26083N33173N94227
3870A6686516P10567N16989M36438N71934O05360N22912N08617N42037M77006
$$ y = [2726238, 2732352, 2797344, 2854638, 2904755, 2921091, 2901823, 2917389, 2964965, 3102333, 3071311, 3144185, 3205624, 3271985, 3282747, 3398900, 3469092, 3487902, 3538917, 3615651, 3753688, 3746417, 3812223, 3901313, 4023051, 4063925, 4194764, 4274489, 4365041, 4363786, 4431010, 4582642, 4666701, 4766477, 4878069, 5024466, 5153391, 5243568, 5357444, 5468814, 5616362, 5766017, 5931221, 6096204, 6264590, 6412373, 6640221, 6894624, 7013004, 7180278, 7404089, 7729054, 7994491, 8150411, 8508635, 8762680, 9110884, 9495829, 9738921, 10079985, 10417776, 10777038, 11183394, 11631855, 12150349, 12622679, 13147675, 13767058, 14235123, 14833033, 15559116, 16092289, 16686516, 17397083, 17914072, 18350510, 18922444, 19527804, 20050716, 20559333, 21101370, 21578376]
3861B1578376N50926O36157M98657N64726O52300O16302O75777P00604P90505
3852B7264330Q04385P75932Q93966R76780R35220R89401R83632J028941J001639
3843C5654226J004368R43348R06178R49163Q60983P43349P65919O81586N99482
3834D3108602M48106L86142L58257K93173K93531J99053L77366L43535J23894
3825D5931659L09071M18811L63551M76783N01479M66628N83181N87529N84540
3816E0223232N66080N88686N81381M96285M80483M57216L79410M61957L98883
3807E4633613L29065J91487Q8570K79484J55152p388O9147q9937j95489j41279
3797E5312425j90243k15393l00237k85255l45704k85680k82610l68933l15258
$$ y = [21578376, 22129302, 22765459, 23264116, 23828842, 24481142, 25097444, 25773221, 26473825, 27264330, 28068715, 28844647, 29738613, 30715393, 31650613, 32640014, 33623646, 34652587, 35654226, 36658594, 37601942, 38508120, 39457283, 40318266, 41061615, 41827534, 42509120, 43108602, 43556708, 43942850, 44301107, 44594280, 44887811, 45086864, 45464230, 45807765, 45931659, 46240730, 46659541, 47023092, 47499875, 48001354, 48467982, 49051163, 49638692, 50223232, 50789312, 51377998, 51959379, 52455664, 52936147, 53393363, 53772773, 54234730, 54633613, 54962678, 55154165, 55242735, 55522219, 55677371, 55669983, 55739130, 55649193, 55453704, 55312425, 55122182, 54906789, 54606552, 54321297, 53975593, 53689913, 53407303, 53038370, 52723112]
3788E2723112l14280m15154k89491k45148k86337l79158l78946m52542m66558
3779D9495498m94147m49253m77813n17453n13247m73857l99255l49969l59979
3770D5460525l85318l46064l66940m10685l52730m51065m63106o54027o59499
3761D1371091p24449q47347q74159r13532q47740r93665r97716j003930r31379
3752C3237174j007691r79076r68670q77814q53410q52031q57652q23127p15838
3743B5301865o38814n46710n71891n41548n44160l41375l70744l58932k96523
3734B1091168l50099l80426l38003m33222m30527m80909n14486n90152o56551
3725A6916793o85904p12121o57781o28186n61364n24638n82785n99805m87456
$$ y = [52723112, 52408832, 51993678, 51704187, 51459039, 51172702, 50793544, 50414598, 49962056, 49495498, 49001351, 48552098, 48074285, 47556832, 47043585, 46569728, 46170473, 45820504, 45460525, 45075207, 44729143, 44362203, 43951518, 43598788, 43147723, 42684617, 42030590, 41371091, 40646642, 39799295, 38925136, 38011604, 37163864, 36170199, 35172483, 34168553, 33237174, 32229483, 31250407, 30281737, 29403923, 28550513, 27698482, 26840830, 26017703, 25301865, 24663051, 24116341, 23544450, 23002902, 22458742, 22117367, 21746623, 21387691, 21091168, 20741069, 20360643, 20022640, 19589418, 19158891, 18677982, 18163496, 17573344, 16916793, 16230889, 15518768, 14860987, 14232801, 13671437, 13146799, 12564014, 11964209, 11476753]
3716A1476753n09194l60636l91953l71906l50280k80299l34979j96004k40377
3707H441125l46318k23252j78259l16287k47468j72803k05718j32205j66374k60823
3697F191618j33122r0230j39029j83664r6671q4282j88505m3300o6953j79568
3687D986294j28035q1489q3798j44187j46505k7173k7665p8810j80352p1422m9172
3676C967686j1666j62908n3455p9258m0136k5046r6474j2405j04365r5268L944
3665C290649j3204o8206j00559l8773N1312j7132o3835n3346L2002l0010l0115
3654B958783r1815r4050K6321k8914p4492p7229o1647m3339m1126N6859j06088
3643B423263J70m1687p5426O310M209l047L9412R989j3677o8604j3733l5826l2784
$$ y = [11476753, 10967559, 10606923, 10214970, 9843064, 9492784, 9212485, 8877506, 8681502, 8441125, 8094807, 7871555, 7693296, 7377009, 7129541, 6956738, 6751020, 6618815, 6452441, 6191618, 6058496, 5968266, 5829237, 5645573, 5548902, 5464620, 5276115, 5232815, 5165862, 4986294, 4858259, 4776770, 4692972, 4548785, 4402280, 4375107, 4347442, 4268632, 4088280, 4016858, 3967686, 3956020, 3793112, 3739657, 3660399, 3620263, 3595217, 3498743, 3486338, 3381973, 3286705, 3290649, 3277445, 3209239, 3108680, 3069907, 3121219, 3104087, 3040252, 2986906, 3018908, 2988898, 2958783, 2866968, 2772918, 2799239, 2770325, 2695833, 2618604, 2556957, 2513618, 2472492, 2529351, 2423263, 2423433, 2381746, 2306320, 2312630, 2316839, 2313792, 2353204, 2363193, 2349516, 2280912, 2267179, 2231353, 2198569]
3630B198569l2484M3270j7669J1683K4322p9403N719k8351l0076n107P021J5232
3618B112726Q0439j8813n4656k7892p1216K5606K9702j84N8648m0226l8751j1938
3606B043445J7285l1763J2305Q2125k0706P1627N7384j46394r7774N8368Q2422
3595B128324l5695n0966n865L8267L9642M4219M3789o6120j174R4373m2721m16
3583B185657N4454J6985J2876P3396N4221J4794J4840O520o8036Q0323j7043n1786
3571B377201j3413P9452j0154L0873L5756k8211L373K8037O7899m7237K076M0584
3559B566236L9272N9468m8057J0896K9496l3670J5241O6748M5925k0355P6612
3548B807812O5303q862Q8365O0584l3421k8842O511L1948k701M3095N4755J9874
$$ y = [2198569, 2166085, 2209355, 2191686, 2203369, 2227691, 2148288, 2154007, 2125656, 2095580, 2090473, 2097494, 2112726, 2193165, 2174352, 2119696, 2091804, 2020588, 2046194, 2075896, 2075712, 2134360, 2094134, 2055383, 2043445, 2060730, 2028967, 2041272, 2123397, 2102691, 2174318, 2231702, 2085308, 1987534, 2045902, 2128324, 2092629, 2041663, 2035798, 2074065, 2113707, 2157926, 2201715, 2135595, 2134421, 2228794, 2186073, 2185657, 2240111, 2257096, 2269972, 2343368, 2397589, 2412383, 2427223, 2433743, 2365707, 2446030, 2428987, 2377201, 2363788, 2443240, 2433086, 2463959, 2499715, 2471504, 2474877, 2502914, 2570813, 2523576, 2525652, 2566236, 2605508, 2664976, 2616919, 2627815, 2657311, 2623641, 2638882, 2705630, 2751555, 2731200, 2807812, 2873115, 2864253, 2952618, 3013202, 2979781, 2950939, 2957450, 2989398, 2986697, 3029792, 3084547, 3104421]
3536C104421J1816R921l236O0200m4490m6400L8770N3683N2770k3647P6687l462
3524C287033p4170K1903K4132J55774J3982N4636J21193m887j970J6867K9057
3513C643550k657j3844J3587M2829N2311p984N1449J3123m803j0438L6539j8893
3501C794769k0635p7067M4884L8848l7715m124j4712R6130j610R1746J3340K8630
3489C952484j1676J3038Q9934l7678O6277Q0405k4731M079m292o4237O867J04032
3477D174502K1225k4345K6468k9288k856J2681o796P3532J8060M0063j5870J9672
3465D307048m3219N251K0710o0141J38673J21009n0370j343J10726K3320P9553
3454D651217n2652m3544N09J19164j7666n9501j3215R4945J10481j1856K6481
$$ y = [3104421, 3116237, 3126158, 3122922, 3183122, 3138632, 3092232, 3131002, 3184685, 3237455, 3213808, 3290495, 3287033, 3212863, 3234766, 3258898, 3414672, 3428654, 3483290, 3604483, 3599596, 3597626, 3614493, 3643550, 3640893, 3627049, 3640636, 3683465, 3735776, 3727792, 3779241, 3792364, 3787561, 3777123, 3813662, 3794769, 3774134, 3697067, 3741951, 3780799, 3743084, 3738960, 3724248, 3820378, 3818768, 3910514, 3923854, 3952484, 3940808, 3953846, 4043780, 4006102, 4072379, 4152784, 4128053, 4132132, 4127840, 4063603, 4070470, 4174502, 4195727, 4171382, 4197850, 4168562, 4165706, 4178387, 4171591, 4245123, 4263183, 4303246, 4287376, 4307048, 4263829, 4269080, 4289790, 4229649, 4368322, 4489331, 4438961, 4437618, 4548344, 4571664, 4651217, 4598565, 4555021, 4555530, 4674694, 4657028, 4597527, 4584312, 4679257, 4789738, 4777882, 4804363]
3443D804363O1416Q1901N7105l8980Q2062Q7646k4387O8053N0831k0938P8514
3432E287586J23868Q4127O5603q456O4560R836J04960R0493L9429J14185O3233
3421F039424N3919M8781J28556J53286J3673J17838J38606J17827J16604J58013
3411G086527J77917P5836P0128J54742J29535J94238J50969J01052J30564J37328
3401H408836J48995K29101J73888J41491K08454K99539K18406J76001K96673K70400
3391A0571784K66307K14878K18033L69072K57411K56294L17537K59300L77747
3382A3108363L71589L19222K37459M13619L45187K87432M10907L78572M57014
3373A6329364M52139M00496M75776M97351M71129N85720N27820M94584O23138
$$ y = [4804363, 4865779, 4947680, 5004785, 4965805, 5047867, 5135513, 5111126, 5179179, 5230010, 5209072, 5287586, 5411454, 5495581, 5561184, 5552728, 5617288, 5627124, 5732084, 5822577, 5862006, 5976191, 6039424, 6093343, 6142124, 6270680, 6423966, 6437639, 6555477, 6694083, 6811910, 6928514, 7086527, 7264444, 7340280, 7410408, 7565150, 7694685, 7888923, 8039892, 8140944, 8271508, 8408836, 8557831, 8786932, 8960820, 9102311, 9310765, 9610304, 9828710, 10004711, 10301384, 10571784, 10838091, 11052969, 11271002, 11640074, 11897485, 12153779, 12471316, 12730616, 13108363, 13479952, 13799174, 14036633, 14450252, 14795439, 15082871, 15493778, 15872350, 16329364, 16781503, 17181999, 17657775, 18155126, 18626255, 19211975, 19739795, 20234379, 20857517]
3364B0857517O13911N67446N85969O22580O19291O59609O29581O19011P04778
3355B6479693P20702Q27017P29573P84359Q30186Q79169R54692R61395J060422
3346C4227208J075139J078163J183352J233031J340909J328335J363249J371908
3338D4201294J349887J472396J442042J478975J475349J467281J338597J345188
3330E5571009J361224J362018J288411J296993J270838J240633J324598J272359
3322F5988083J348251J421103J540181J505803J542657J682252J700069J763341
3314G8491740J798073J865562K031942K125629K139931K195685K203895K324068
3306I5176525K390392K371224K416739K596880K708961K795062K902198L108456
$$ y = [20857517, 21471428, 22038874, 22624843, 23247423, 23866714, 24526323, 25155904, 25774915, 26479693, 27200395, 28027412, 28756985, 29541344, 30371530, 31250699, 32205391, 33166786, 34227208, 35302347, 36380510, 37563862, 38796893, 40137802, 41466137, 42829386, 44201294, 45551181, 47023577, 48465619, 49944594, 51419943, 52887224, 54225821, 55571009, 56932233, 58294251, 59582662, 60879655, 62150493, 63391126, 64715724, 65988083, 67336334, 68757437, 70297618, 71803421, 73346078, 75028330, 76728399, 78491740, 80289813, 82155375, 84187317, 86312946, 88452877, 90648562, 92852457, 95176525, 97566917, 99938141, 102354880, 104951760, 107660721, 110455783, 113357981, 116466437]
3298A16466437L173877L291176L358888L525943L623991L621858L752735L761096
3290A44576001L787451L860415L789604L726171L730164L697071L671111L628514
3282A74466502L663032L542796L496108L562682L406400L342100L339756L246948
3274B02066324L345125L384273L488827L616781L822353L994044M217054M521506
3266B32456287M708669M696581M728992M633093M271662L915982L388059K886174
3258B65685499K427461J900437J463462R30763M41444R130m82468p51785j065412
3249B70558531j075603j098814r16579p36554m70545k46895J17356O50143J152354
3240B67933394J636888J920166K144226K247481K276739K161820K014957J881944
$$ y = [116466437, 119640314, 122931490, 126290378, 129816321, 133440312, 137062170, 140814905, 144576001, 148363452, 152223867, 156013471, 159739642, 163469806, 167166877, 170837988, 174466502, 178129534, 181672330, 185168438, 188731120, 192137520, 195479620, 198819376, 202066324, 205411449, 208795722, 212284549, 215901330, 219723683, 223717727, 227934781, 232456287, 237164956, 241861537, 246590529, 251223622, 255495284, 259411266, 262799325, 265685499, 268112960, 270013397, 271476859, 272407622, 272849066, 272858196, 272375728, 271623943, 270558531, 269482928, 268384114, 267467535, 266730981, 266260436, 266013541, 266130897, 266781040, 267933394, 269570282, 271490448, 273634674, 275882155, 278158894, 280320714, 282335671, 284217615]
3232B84217615J923753J997092K340279K432038K673697K896264L027492L069386
3224C04577616K993684K727499K286717J755167Q62994n8879j108486k268715
3216C11767597l682097n129088o355953p660255q757060r613019j0284348j0505462
3208B49780315j0427344j0035655r576969r090142q346141p853520p475741p065146
3200A79909657o630927o166571n861103n579180n293546n222424n058186n127588
3192A34970132n252938n159858n285297n221651n149798n013762m788755m455867
3184I4642206m241898l951934l642820l472835l119300k912920k778646k583165
3176F7938688k364235k181831k193443k005279j843965j764123j655674j670475
$$ y = [284217615, 286141368, 288138460, 290478739, 292910777, 295584474, 298480738, 301508230, 304577616, 307571300, 310298799, 312585516, 314340683, 315203677, 315144798, 314036312, 311767597, 308085500, 302956412, 296600459, 288940204, 280183144, 270570125, 260285777, 249780315, 239352971, 229317316, 219740347, 210650205, 202304064, 194450544, 186974803, 179909657, 173278730, 167112159, 161251056, 155671876, 150378330, 145155906, 140097720, 134970132, 129717194, 124557336, 119272039, 114050388, 108900590, 103886828, 99098073, 94642206, 90400308, 86448374, 82805554, 79332719, 76213419, 73300499, 70521853, 67938688, 65574453, 63392622, 61199179, 59193900, 57349935, 55585812, 53930138, 52259663]
3168E2259663j601889j479717j489445j384462j321371j388075j362950j322626
3160D0909128j130882j120378r41327j018443j024325r61041q44875q78016p64410
3151C2225431o79330q00880o86686p85105p54264o45896p64612p27518o85849
3142B5695291p13806o25617o12396n12735n52842n32252n13387o01376n34615
3133B0496265m78012n37007m06759m10072l99819l76684m56963l82598k72382
3124A6775969m38883m67516m17139k72243l04519l46506l08496k97095k63671
3115A3659901l20238l11351k11679k06822k67975k56920k05824k37898k01213
3106A1439981j46745k12877k70108j51077j66309k29590j17861j82406j69098
$$ y = [52259663, 50657774, 49178057, 47688612, 46304150, 44982779, 43594704, 42231754, 40909128, 39778246, 38657868, 37716541, 36698098, 35673773, 34712732, 33867857, 32989841, 32225431, 31546101, 30745221, 30058535, 29273430, 28519166, 27873270, 27108658, 26381140, 25695291, 24981485, 24355868, 23743472, 23230737, 22677895, 22145643, 21632256, 21030880, 20496265, 20018253, 19481246, 19074487, 18664415, 18264596, 17887912, 17430949, 17048351, 16775969, 16337086, 15869570, 15452431, 15180188, 14875669, 14529163, 14220667, 13923572, 13659901, 13339663, 13028312, 12816633, 12609811, 12341836, 12084916, 11879092, 11641194, 11439981, 11293236, 11080359, 10810251, 10659174, 10492865, 10263275, 10145414, 9963008, 9793910]
3097I793910k35501k11944m8049j10553k18484j91810j27113r8476k55429j19419
3087H177132r8806m2901j59420j53754p6168j36588j26352r4886l5397j01606
3077G151254q2256j13492j56919k6396L0678q5249j12890j77716m7470j11438
3067F268106p6967L7005j02507q5052n7856k1388j7466j15064k5722o1844n382
3056E735863o4203r4712P6723n2568n7559j49215m6631N498m4872k3710J9222
3045E303836k6149j6492K113o8423n1666j9146J7553r1929J9q6923m454l8040
3033D920299k5075k7660Q8558r424j7660m5063M114Q640k5993J23012l2498o2200
3021D899050j7322j4407K4893o2q575M8141k9090J37116L3842K068J7064j5873
$$ y = [9793910, 9558409, 9346465, 9298416, 9187863, 8969379, 8777569, 8650456, 8551980, 8296551, 8177132, 8078326, 8035425, 7876005, 7722251, 7646083, 7509495, 7383143, 7288257, 7252860, 7151254, 7068998, 6955506, 6798587, 6772191, 6802869, 6717620, 6604730, 6427014, 6379544, 6268106, 6191139, 6228144, 6125637, 6040585, 5982729, 5961341, 5943875, 5828811, 5803089, 5741245, 5735863, 5671660, 5576948, 5653671, 5601103, 5543544, 5394329, 5347698, 5353196, 5308324, 5284614, 5303836, 5277687, 5261195, 5263308, 5194885, 5143219, 5124073, 5141626, 5049697, 5049716, 4962793, 4958339, 4920299, 4895224, 4867564, 4956122, 4946698, 4929038, 4883975, 4888089, 4896729, 4870736, 4993748, 4961250, 4899050, 4881728, 4867321, 4892214, 4892152, 4883577, 4931718, 4902628, 5039744, 5073586, 5075654, 5092718, 5076845]
3009E076845j5768j779J27713j5578l264N1517R639K9417P0899J16001n1240Q8960
2997E483362J10363O3129l3887K9380J24350L5087P0723M5913J80202J00090L5521
2986F244233Q6975P3524R9001R1157P2793L1597J18402J11100J36551Q3110R2065
2975G240508J66900J60340P1358J78159J31739P9225K08545J74141J40833R6951
2965H648699J71235J88640K41341K31524J26855J69648K25318K57010K36227J91330
2955A0687827K98651L27383J49616M14162L37603K32813K76883K93437K55292
2946A3273667L89103K96013L16680L25722K91482M20984M61372M20674L90335
2937A6586032N09362L50036N03283M97936M98078N02429N71833N61337N47980
$$ y = [5076845, 5061077, 5059298, 5187011, 5171433, 5168169, 5219686, 5229325, 5258742, 5329641, 5445642, 5394402, 5483362, 5593725, 5656854, 5622967, 5652347, 5776697, 5811784, 5882507, 5928420, 6108622, 6208712, 6244233, 6331208, 6404732, 6503733, 6594890, 6667683, 6699280, 6817682, 6928782, 7065333, 7148443, 7240508, 7407408, 7567748, 7639106, 7817265, 7949004, 8028229, 8236774, 8410915, 8551748, 8648699, 8819934, 9008574, 9249915, 9481439, 9608294, 9777942, 10003260, 10260270, 10496497, 10687827, 10986478, 11313861, 11463477, 11877639, 12215242, 12448055, 12724938, 13018375, 13273667, 13662770, 13958783, 14275463, 14601185, 14892667, 15313651, 15775023, 16195697, 16586032, 17095394, 17445430, 17948713, 18446649, 18944727, 19447156, 20018989, 20580326, 21128306]
2928B1128306P76477P35580P73867Q20497Q00575R58299R64792J070710J144156
2919B9173259J167677J360095J500404J535220J677568J739105J897670K073358
2911D2124356K299276K336322K535180K787882L023426L186601L436585L752545
2903F5482173L969748M041959M166683M062597L744366L329173K558958J892281
2895I3247938J265460Q16132N84190O24331N70551N02525L65278L03229K75677
2886I8555311L61792O64369R40345J182774J466972J756093K160804K714124L286103
2877A13088687L956393M903610N627967O597630P840917Q531337R184764R108424
2869A68839729P386790K367406o156307j2984190j4570150j3079189j0947299
$$ y = [21128306, 21904783, 22640363, 23414230, 24234727, 25035302, 25993601, 26958393, 28029103, 29173259, 30340936, 31701031, 33201435, 34736655, 36414223, 38153328, 40050998, 42124356, 44423632, 46759954, 49295134, 52083016, 55106442, 58293043, 61729628, 65482173, 69451921, 73493880, 77660563, 81723160, 85467526, 88796699, 91355657, 93247938, 94513398, 95329530, 95913720, 96538051, 97108602, 97611127, 97976405, 98279634, 98555311, 98917103, 99581472, 100521817, 101704591, 103171563, 104927656, 107088460, 109802584, 113088687, 117045080, 121948690, 127576657, 134174287, 142015204, 150546541, 159731305, 168839729, 176226519, 178593925, 172437618, 159453428, 144883278, 131804089, 120856790]
2862A20856790r118149p547605o198620n028461m236292l559355l112829k602051
2854G9453428k183916j869153j560393j125750q68465n37835k38206P1825L83269
2845G1524804N75938P78543Q78010J039787J017058P84083L30571l21798j351959
2836G5255037k416510l196735l816062m219054m206905m182570l784070l551932
2828D5881199l168607k762998k605586k353782k135825j917732j800256j601691
2820B7534722j437898j406363j262732j089128j063429r50189p71315p45599p97611
2811A8010458o69062o19122o68741n88923n11513m66732m46248n04888m73487
2802A3061742k98999m23148l94776l83340k94933l00308l31075l57956k32476
$$ y = [120856790, 111738641, 104191036, 97992416, 92963955, 88727663, 85168308, 82055479, 79453428, 77269512, 75400359, 73839966, 72714216, 71845751, 71307916, 71069710, 71141535, 71524804, 72100742, 72879285, 73757295, 74797082, 75814140, 76598223, 76928794, 76606996, 75255037, 72838527, 69641792, 65825730, 61606676, 57399771, 53217201, 49433131, 45881199, 42712592, 39949594, 37344008, 34990226, 32854401, 30936669, 29136413, 27534722, 26096824, 24690461, 23427729, 22338601, 21275172, 20324983, 19553668, 18808069, 18010458, 17341396, 16722274, 16053533, 15464610, 14953097, 14486365, 14040117, 13535229, 13061742, 12762743, 12339595, 11944819, 11561479, 11266546, 10966238, 10635163, 10277207, 10044731]
2793A0044731k22811l36374l05421k31881k55940k80525k39788j88977j24705
2784G858309j13239l15790j61005j45893l3046j61015j94758j26362j79346n0444
2774F377411j60980j26241j52908n7847r5657j40427j21710j54846j29451p5243
2764E162101m7216q9414p2214j10808r7581m3675j36904j50636j35545j66499
2754D111609j50200l5442l2112j1998o2728q5761j05649n6314j10798M034n6949
2743C407692l0870p8279l4178j05014o4619m8375m6886q701j2317n3378j7100
2732B907975p7804q0431p5790p0670o2062o3209J8672q5105K2560K6992n6330
2721B404798j01405l9716l3392J4104Q20p2586l0819l7088K3034k0764k5102j200
$$ y = [10044731, 9821920, 9485546, 9180125, 8948244, 8692304, 8411779, 8171991, 7983014, 7858309, 7745070, 7429280, 7268275, 7122382, 7089336, 6928321, 6733563, 6607201, 6427855, 6377411, 6216431, 6090190, 5937282, 5879435, 5783778, 5643351, 5521641, 5366795, 5237344, 5162101, 5114885, 5025471, 4953257, 4842449, 4744868, 4701193, 4564289, 4413653, 4278108, 4111609, 3961409, 3925967, 3893855, 3881857, 3819129, 3733368, 3627719, 3571405, 3460607, 3464641, 3407692, 3376822, 3298543, 3264365, 3159351, 3094732, 3046357, 2999471, 2990770, 2978453, 2925075, 2907975, 2830171, 2749740, 2673950, 2603280, 2541218, 2478009, 2496681, 2411576, 2434136, 2461128, 2404798, 2303393, 2263677, 2230285, 2244389, 2245209, 2172623, 2141804, 2104716, 2127750, 2106986, 2081884, 2080684]
2709B080684j24663j970l3951o6793r381k3064l1538p6961l8549L6212m3339n2204
2697A614483o8736L1888l2464o1079J0968n4858k3520K897o6741j2944M7018O0075
2685A446987q8030q1387N0835n4043m9072R213l3009j2853L1253O708q1710J4019
2673A158911M6245q1155m7925N2248R067M3217q3987n2502M4770k8846n8611q2486
2661I18946J9934l805M4519m2457L4097p7315L592j9564l1856K7793P862L5629
2649I17375K162k3426j13032j2136L9131M5703l4591K5397K4801Q8238k9606j10076
2637H19940k9717M3405p4495L208O3652k929L0023k8187n0969J9622J3849P572
2625H14974M1387N8113n9530p127Q7053l0719K4211k1197M5942J05643J1178q2725
$$ y = [2080684, 1956021, 1954051, 1920100, 1853307, 1843926, 1820862, 1789324, 1712363, 1673814, 1710026, 1666687, 1614483, 1545747, 1577635, 1545171, 1484092, 1495060, 1440202, 1416682, 1419579, 1352838, 1339894, 1386912, 1446987, 1358957, 1277570, 1328405, 1274362, 1225290, 1234503, 1201494, 1188641, 1219894, 1226602, 1144892, 1158911, 1205156, 1124001, 1076076, 1128324, 1137391, 1180608, 1096621, 1044119, 1088889, 1060043, 1001432, 918946, 938880, 935075, 979594, 937137, 971234, 893919, 897511, 877947, 846091, 873884, 881746, 917375, 919537, 896111, 783079, 770943, 810074, 855777, 821186, 846583, 871384, 959622, 930016, 819940, 790223, 833628, 759133, 762341, 825993, 823064, 853087, 824900, 773931, 793553, 807402, 814974, 856361, 914474, 854944, 847817, 934870, 904151, 928362, 907165, 953107, 1058750, 1069928, 987203]
2613I87203q682J645M2948N0042R913p1842R754r791l1152M1045m0486p9060J44393
2600A045930N0945l7652j6014N5747M5844n1778r341k0624l4919M0459Q7696M5381
2588A201674O5742q694M36Q8360N0123l5522n032p8878o3527n169r4376j13679
2576A001458j9789j38228K1670O5959l7562j4059j02997j4093M3414K7066o2633
2565G70206k4021o313M7929Q628n8804J0155O3580O6633n5685K8069N328n5759
2553G99946L4624m0991p1395L2444j0252q5146l2740n8191m1749K8871k2844o3669
2541D68908Q4520P0108p9667o7172m7889j2750K7609Q215n4115K3409L1688n506
2529D47358k9770k4137p106N4429Q192J4807l1170r8618n4455L9591N2762j5012
$$ y = [987203, 978521, 980166, 1023114, 1073156, 1083069, 1011227, 1020981, 1011190, 980038, 1021083, 980597, 901537, 1045930, 1096875, 1059223, 1043209, 1098956, 1144800, 1093022, 1083681, 1063057, 1028138, 1068597, 1156293, 1201674, 1267416, 1258722, 1259158, 1347518, 1397641, 1362119, 1357087, 1278209, 1214682, 1209513, 1115137, 1001458, 981669, 843441, 865111, 931070, 893508, 879449, 776452, 762359, 805773, 832839, 770206, 746185, 739872, 787801, 796429, 737625, 747780, 811360, 877993, 822308, 850377, 855705, 799946, 834570, 793579, 722184, 754628, 744376, 659230, 626490, 568299, 526550, 555421, 532577, 468908, 553428, 623536, 543869, 476697, 428808, 416058, 443667, 451882, 397767, 421176, 452864, 447358, 417588, 393451, 386345, 440774, 448966, 463773, 432603, 333985, 279530, 319121, 371883, 356871]
2517C56871k5792P7865k3207o1204n204k4392n3505N6050M9254J1903q2509k4584
2505B51546M5734q9948N0434q13J1797P7991P5600j06118l2476K4877L6580r53
2493C44251r0443J1048p0830L8080K1762O0255p3400J7596n3838n5148R3328k3284
2481B19377L1298L2483L810j12430l7818o558K7275J8737p0157K3584O4808o5901
2469A28508J22290L1313p1993k8902M4321L682m7299J9478K5521Q329k0497l6406
2457A78345P3289j9280m882M3388o9039M2579k4271j2736j7643l7405j6215P6704
2445B12834O789j2621l6468j1103P574M2973k757n2969j2671P4671J32196l9519
2433C08929k8698p1068m8860L1284j8598n8098R1021J3430L43l4673l1634O3569
$$ y = [356871, 331079, 408944, 385737, 324533, 319329, 294937, 241432, 297482, 346736, 358639, 276130, 251546, 297280, 207332, 257766, 256953, 268750, 346741, 422341, 316223, 283747, 308624, 345204, 344251, 253808, 264856, 194026, 232106, 253868, 314123, 240723, 258319, 204481, 149333, 242661, 219377, 250675, 283158, 286968, 174538, 136720, 130162, 157437, 176174, 106017, 129601, 194409, 128508, 250798, 282111, 210118, 181216, 225537, 229219, 181920, 201398, 226919, 235248, 214751, 178345, 251634, 232354, 227472, 270860, 201821, 244400, 220129, 207393, 189750, 152345, 136130, 212834, 219623, 207002, 170534, 159431, 167005, 209978, 207221, 154252, 141581, 216252, 348448, 308929, 280231, 209163, 160303, 191587, 172989, 114891, 205912, 219342, 219685, 185012, 153378, 216947]
2421B16947K4243r3303r268L6079l8302R684M6513r1999N6769Q6322L635o0712
2409A86608r2015j4049P3365k1586l0975K1141K6755l729K7853o3196K5020N9904
2397A95096k6031j1011l3880k8145q222M4941L1442J5524j21222Q0459r801J1315
2385A40465l4600J2221L6385O3625q0903J9080O8533m6607K999J481N277J1359
2373A99315J1628N6065k1482l2933M3437m1092n4641M1267P7632N829j6899p5509
2361A92617J9367q675R1827L3544o3442k5022Q7478j4850r617M5300p917L9206
2349C79816O5754K6011J9221q560R8920J32302K2425N7306n747l5698n4493r0699
2337F06558r4612j2150o4608J420o3636p196l567o544m298k0963J9171k88k4051
$$ y = [216947, 241190, 147887, 138619, 174698, 136396, 146080, 192593, 100594, 157363, 243685, 247320, 186608, 94593, 80544, 153909, 132323, 101348, 122489, 149244, 145515, 173368, 110172, 135192, 195096, 169065, 158054, 124174, 96029, 87807, 132748, 164190, 179714, 58492, 138951, 129150, 140465, 105865, 118086, 154471, 218096, 137193, 156273, 224806, 178199, 181198, 182679, 187956, 199315, 210943, 267008, 245526, 212593, 256030, 214938, 160297, 201564, 279196, 285025, 268126, 192617, 211984, 203309, 295136, 328680, 265238, 240216, 327694, 312844, 303227, 348527, 340610, 379816, 445570, 471581, 490802, 482242, 581162, 713464, 735889, 793195, 787448, 751750, 697257, 606558, 511946, 499796, 435188, 436608, 372972, 365776, 362209, 355665, 351367, 330404, 349575, 349287, 325236]
2324C25236o1810Q0523M5789n0374L757l6697m7985J7201M9798l1684k8670J7060
2312B82144K5701m8423P972M614Q2981m9256J777J7703n0735m3142K5472M6698
2300C03506l9176O9940p042o7290n55N9537J2260J3947J6404o7829n5239L6153
2288B74616M4675O775j00963j8832N1859J34578k7719J471n9238m6887q444O8981
2276C20872O725o2042J8128J6022L6045L992q804k1018j0926R744O675M4345J381
2263C61139l9709Q9121k4441n298j5502o9215N7039L913L3479L7489o9735n4691
2251C03589J288P0150k9759k3751J9947o8409O5597J7440J284K2875j201j7378
2239C61672K986O2106R233m8485N0922j1345J2255L2836m4621J0686K6712J0506
$$ y = [325236, 263426, 343949, 389738, 339364, 343121, 306424, 258439, 275640, 325438, 293754, 265084, 282144, 307845, 259422, 267394, 272008, 354989, 305733, 307510, 325213, 274478, 231336, 256808, 303506, 264330, 334270, 327228, 259938, 259383, 318920, 331180, 345127, 361531, 293702, 238463, 274616, 319291, 326066, 225103, 206271, 258130, 392708, 364989, 366460, 307222, 260335, 251891, 320872, 327597, 265555, 283683, 299705, 335750, 339742, 330938, 309920, 298994, 308738, 315413, 359758, 361139, 321430, 410551, 386110, 380812, 365310, 296095, 353134, 357047, 390526, 428015, 358280, 303589, 304877, 375027, 345268, 321517, 341464, 273055, 338652, 356092, 357376, 380251, 379050, 361672, 364658, 426764, 435997, 387512, 438434, 427089, 439344, 472180, 427559, 438245, 464957, 475463]
2227D75463m4713M2403K3767j3286n8620O535J6423J08854L6575N010K0447n2393
2215E66465o201J8107L0822j8366J8414n4745M0806N0842M1041l5599j4080N4430
2203F91936J5428Q2582j45045K2044K6799P663L8209O0446R996p1268L5026P6578
2191H50394L2685O242K7454o385k4413K183r214l2194M9108L4453N2173N455o7972
2178I19969K8298K8468K6146o470l931n487N3113l2757M9548Q6792O4118M2078
2166A249885O7680N3338P0071L8196N2610P3140O834J35510k4985O7116J18165
2155A907560J6236j0950J25201K126j6945J44900P5451o427Q7849L6607Q3547
2144B445155Q9508N6543J66612R713R5480J07744L1813J69680R9382J65859L9222
$$ y = [475463, 430750, 473153, 496920, 483634, 425014, 431549, 447972, 556826, 593401, 598411, 618858, 566465, 560264, 578371, 609193, 590827, 609241, 554496, 595302, 646144, 687185, 651586, 637506, 691936, 707364, 789946, 644901, 666945, 693744, 701407, 739616, 800062, 810058, 738790, 773816, 850394, 883079, 889321, 916775, 910390, 885977, 888160, 878946, 846752, 895860, 930313, 982486, 987941, 919969, 948267, 976735, 1002881, 996411, 992480, 986993, 1040106, 1007349, 1056897, 1143689, 1207807, 1249885, 1317565, 1370903, 1440974, 1479170, 1531780, 1604920, 1611754, 1747264, 1722279, 1789395, 1907560, 1923796, 1912846, 2038047, 2040173, 2023228, 2168128, 2243579, 2237152, 2325001, 2361608, 2445155, 2534663, 2591206, 2757818, 2767531, 2863011, 2970755, 3002568, 3172248, 3271630, 3437489, 3476711]
2133C476711O8572O6879R7121J76129J39785R6215J84789R9331Q6352J16383J46830
2122D755097J73489J75333R4597J64125O8548J84724J65353L00150K79402K36765
2112F597583L07320L30103J86807K49630K58164L34636M41586L25035M46495M88523
2102I965882N60912O05074O29283Q11908P88197Q96493R73325R24700J154308
2093A7310082J339237J462268J549612K051683K122134J652978J814679K475818
2085C1778491L192293L940634N102599N966159O760358Q777705R857188J1235202
2077H6610629J3705690J3970514J3793810M677134j9024472k5181016j7757207
2070G0795082j2275151q744562p125505n576098m504423l405493k766461k035755
$$ y = [3476711, 3545283, 3612162, 3709283, 3885412, 4025197, 4121412, 4306201, 4405532, 4491884, 4608267, 4755097, 4928586, 5103919, 5198516, 5362641, 5431189, 5615913, 5781266, 6081416, 6360818, 6597583, 6904903, 7235006, 7421813, 7671443, 7929607, 8264243, 8705829, 9030864, 9477359, 9965882, 10526794, 11131868, 11761151, 12573059, 13361256, 14257749, 15231074, 16155774, 17310082, 18649319, 20111587, 21661199, 23712882, 25835016, 27487994, 29302673, 31778491, 34970784, 38911418, 44014017, 49980176, 56740534, 65518239, 75375427, 86610629, 100316319, 114286833, 128080643, 132757777, 113733305, 88552289, 70795082, 58519931, 49775369, 42649864, 37073766, 32569343, 29163850, 26397389, 24361634]
2062B4361634j801794j304730j174541j106333j648415j629198j350963j037148
2054A3308512r73181p16960n75704m95685n19996m19545m91071m98819m69915
2045H147636l38796l43295l45232l39686l06027l71673j75102k63221k36164k11622
2035E216818k10193k53841m8707j62546j77043o7568k36814j46473j7438p6686
2025C819509o4104j24573p7225j48276p1339j55234m5276j35972o4459o4384O181
2014B874848J9067q5409m5886l2648n0088n7652p0731k2037o756m918o8570p3569
2002B375651l5403j12029r3812r9431j2035q3502j42770j19218k6812M6446r6884
1991A600201l1815L3670k3097M8444l9790n7557M1861m1979n5200m6634j09142
$$ y = [24361634, 22559840, 21255110, 20080569, 18974236, 17325821, 15696623, 14345660, 13308512, 12335331, 11618371, 11042667, 10546982, 10026986, 9607441, 9116370, 8617551, 8147636, 7808840, 7465545, 7120313, 6780627, 6474600, 6102927, 5927825, 5664604, 5428440, 5216818, 5006625, 4752784, 4704077, 4541531, 4364488, 4296920, 4060106, 3913633, 3896195, 3819509, 3755405, 3630832, 3553607, 3405331, 3333992, 3178758, 3133482, 2997510, 2933051, 2868667, 2874848, 2893915, 2808506, 2762620, 2729972, 2679884, 2622232, 2551501, 2529464, 2522708, 2517790, 2449220, 2375651, 2340248, 2228219, 2134407, 2034976, 2022941, 1939439, 1796669, 1677451, 1650639, 1697085, 1600201, 1568386, 1602056, 1578959, 1627403, 1587613, 1530056, 1571917, 1529938, 1474738, 1428104, 1318962]
1980A318962M0318o5006l1507J397l1973J1928l6075o2294n6592j8998J0629K7259
1968A108048K9487l8181j1504p6748l515o2512j1117K1165K3577J2331n1069r3720
1956H46242L019Q174k1268k9066k1831j7397o3980p3767L5865Q0898Q736k2891
1944G32734m4152j13571M0527M433j7970K2268l5706l603J8582k7965l1721l2827
1932E11029k0988L6212J2580n165M4942k1686O4376K6127r057r1502l4799k5241
1920D86828l8038k9528K3201M2636k8726m2571j482L8094n3145N3735J2767j5500
1908D48271j6802j4726P720J282r1937l5415O2712l7734k1036L191K9167k3892
1896C10801n4725P5759o159O6505n9871L4797J9575n2770o0923k8069k1913L8592
$$ y = [1318962, 1359280, 1294274, 1262767, 1264164, 1232191, 1244119, 1208044, 1145750, 1089158, 1070160, 1080789, 1108048, 1137535, 1099354, 1087850, 1011102, 1007587, 945075, 933958, 955123, 978700, 991031, 939962, 846242, 849261, 857435, 836167, 807101, 785270, 767873, 703893, 630126, 665991, 746889, 755625, 732734, 688582, 575011, 615538, 619971, 602001, 624269, 588563, 584960, 603542, 575577, 543856, 511029, 490041, 526253, 538833, 533668, 578610, 556924, 621300, 647427, 638370, 546868, 512069, 486828, 448790, 419262, 442463, 485099, 456373, 413802, 412320, 450414, 397269, 451004, 463771, 448271, 431469, 416743, 424463, 425745, 333808, 298393, 361105, 323371, 302335, 305526, 334693, 310801, 256076, 331835, 325676, 392181, 332310, 367107, 386682, 333912, 272989, 244920, 223007, 261599]
1884B61599M754n339K019j3087M8074j0755Q31k5128j6457J9687L0060j8796K6428
1871C03890m3533k8319K2426m120k4350k9974k7188p1580J14440l413j1351Q1517
1859B78445p1022k8038l277K0654k7723k0288k9899L7019Q1612n608k4077J6134
1847B23932n0697K3623J8820n3371p246o9207M7864L4325Q177K3452L0427n039
1835B25060r2382O0203J7758L0514P334M6707j00306m6622N5068O6011j7021o8378
1823A83946N9112R0386m4753l4722K3594J7687n611o3520R1841M3693n2940j6231
1811B92482J41999K8432N2846L7346J05617K6972K1218m7677j06711l3417j11420
1800D07687m50p9559k9999L4468l7854J9137k3441r3498l3632P7519m2276J4759
$$ y = [261599, 266353, 261014, 263033, 249946, 298020, 287265, 288096, 262968, 246511, 266198, 296258, 277462, 303890, 260357, 232038, 254464, 250344, 225994, 196020, 168832, 97252, 211692, 208279, 196928, 278445, 207423, 179385, 176108, 196762, 169039, 148751, 118852, 155871, 237483, 231875, 207798, 223932, 173235, 196858, 215678, 162307, 155061, 85854, 133718, 168043, 176220, 199672, 230099, 225060, 132678, 192881, 210639, 241153, 248487, 295194, 194888, 148266, 203334, 269345, 252324, 183946, 243058, 333444, 288691, 253969, 277563, 295250, 289639, 226119, 317960, 361653, 308713, 292482, 434481, 462913, 515759, 553105, 658722, 685694, 706912, 659235, 552524, 519107, 407687, 407237, 327678, 297679, 332147, 294293, 313430, 289989, 196491, 162859, 240378, 198102, 212861]
1788B12861J2049O049r3342o68M8021K4534K3372k1608m625o3745n1525k7565
1776F3808P6844N025J1138k8179l3166O7364j5054j9543K8700K485j5030j6795
1764A27597J06503l3739j43047r547L0421M589k532o4563L2627J9666j6381K3178
1752G4772N4755l5783k0398j9152Q767M9630P5447m2391m4035p2000K5706M9074
1740A04392K6521o4399j2294J0854R0432K6339p7225q1091q6898R3158P2684K1199
1728A23672j08497O5276Q458n504K8412p5399j2165P6508n0425O3338L1124m5415
1716I9383r5222J36L8962P35o0266J6767K7159o263q6376M6837N8321N061R0186
1703A35420J6674r3836J516M8523o4285k1294M4073N4510M369l4614o519L6793
$$ y = [212861, 224910, 230959, 137617, 136949, 184970, 209504, 232876, 211268, 206643, 142898, 91373, 63808, 140652, 145677, 156815, 128636, 95470, 162834, 147780, 128237, 156937, 159422, 144392, 127597, 234100, 200361, 57314, 47767, 78188, 82777, 80245, 15682, 48309, 67975, 51594, 74772, 129527, 93744, 73346, 54194, 62961, 112591, 188038, 145647, 101612, 29612, 55318, 104392, 130913, 66514, 54220, 65074, 155506, 181845, 104620, 23529, -63369, 29789, 102473, 123672, 15175, 80451, 88909, 83405, 111817, 36418, 24253, 100761, 50336, 113674, 144798, 99383, 4161, 4297, 43259, 43994, -16272, 495, 27654, 21391, -64985, -18148, 40173, 45234, 135420, 152094, 58258, 59774, 108297, 44012, 22718, 66791, 121301, 125670, 91056, 84537, 121330]
1691A21330m3892j589L9375M3515k1331p6565K1978l7734J762J6870K2247J9354
1679A05320j3002n2716M6854J1792J727k2572K629n0891n7280P1184K2591O2584
1667A28220m4580l5889K4560j6558Q254M0518p3624l2125p09r478M9732J2273
1655E0594o9673n80k5436K1611r50N835j2429R9172n7902l2028Q9800K8078Q403
1642A04495K3059n7657m0015n5205M0494P6024o7767J354J1007l0693J7764p134
1630A5726K2035l0777K1331k3582M4614N332j8629k1523L425M294p3779J3920
1618c7613N7828N0324p751l180j079o4232O5863K0661p401J5608K1016q9784p1551
1605e1291M8728L4113m4181n5553J9088l8166J1225M5480k0693k1480L6140j1865
$$ y = [121330, 77438, 75849, 115224, 158739, 137408, 60843, 82821, 45087, 46849, 63719, 85966, 105320, 92318, 39602, 86456, 98248, 99975, 77403, 80032, 29141, -28139, 43045, 65636, 128220, 83640, 47751, 72311, 55753, 64007, 104525, 30901, -1224, -1933, -11411, 38321, 50594, -19079, -19659, -45095, -23484, -24434, -18599, -31028, 68144, 10242, -21786, 68014, 96092, 104495, 127554, 69897, 29882, -25323, 15171, 91195, 23428, 24782, 35789, 5096, 22860, 15726, 37761, 6984, 28315, 4733, 49347, 54679, 36050, 14527, 17952, 22246, -51533, -37613, 20215, 70539, 62788, 59608, 58529, -5703, 60160, 80821, 73420, 89028, 110044, 20260, -51291, -2563, 31550, -12631, -68184, -49096, -87262, -76037, -30557, -51250, -72730, -36590, -48455]
1593d8455O9222K7924j4197j2693n907K1671p7198l7091K5760Q6178J6523p9421
1581b7684L4216k4647m461P0009P7500q6903R5131n126o3753j1195M3746l6800
1569F0033Q509k7775Q7905p637j28605m211j7274k7420Q0423n513n0657J790K2498
1556g934Q59O0991k1614k5723K6666l535l267k2369L8899N0070k8063n7574o6448
1543e9042m520N7486M9146K8689K5942l0954m7160m9527K8151K1471k9572n8761
1531f8651k3842P3901n972M5021L4111j217o3773k6666L0243M3774q1006j0160
1519e4237P0941j7738Q5900o2067m6932J0480r550P9249k2962j0765j9428O1493
1507F4384m8414P713m8528j3560m034j2532M8195P5902m5655k2310k9154k6312
$$ y = [-48455, 20767, 48691, 34494, 21801, 15894, 37565, -39633, -76724, -50964, 35214, 51737, -27684, 6532, -18115, -22576, 47433, 124933, 38030, 133161, 128035, 64282, 53087, 96833, 60033, 68542, 40767, 128672, 121035, -7570, -11781, -29055, -56475, 23948, 18435, -32222, -30432, -7934, -7075, 53916, 32302, 6579, 33245, 29710, 26443, 4074, 42973, 93043, 64980, 7406, -59042, -63562, -6076, 43070, 71759, 97701, 66747, 19587, -29940, -1789, 19682, -9890, -68651, -92493, -18592, -24564, 20457, 54568, 53351, -10422, -37088, -6845, 36929, -44077, -54237, 16704, -1034, 84866, 22799, -24133, -13653, -23203, 56046, 33084, 22319, 2891, 64384, 15970, 23683, -24845, -38405, -42439, -54971, -6776, 69126, 23471, 1161, -27993, -54305]
1495e4305n866M5099O302m2882l2696L8037o935m2807P2111P881O7595J5901n2065
1482A5370M1813O3189j06137N60m4011m9588k042L4171K5855j4643M674j7691
1470d8480m2116J1960N3859J6997L7791M7532L2295J2287K5947j10841j10317
1459g3086m315O1646O8796k2957q7128K2643o5948Q8325j7387L6840M0432M5071
1447I2932k1300j2986N9797m6247J0221r5014p4043M5133P1231j06477o5679Q8728
1435e3704P273n1698n224r931J3351L4686k5449L0811P9971M5713J4105N87l3160
1422D7331j8997O9769n9760k5378k8422J0967p55m3809p610R5036l6634o5814
1410f4076j0524M8017J9428n9705j4844k2791P3205O847p939K7652l2249L338
$$ y = [-54305, -60171, -15072, -8770, -51652, -84348, -46311, -53246, -96053, -23942, -16061, 51534, 67435, 15370, 57183, 120372, 14235, 14795, -29216, -78804, -80846, -46675, -20820, -35463, -30789, -48480, -90596, -78636, -24777, -7780, 30011, 77543, 109838, 122125, 148072, 37231, -73086, -77401, -15755, 53041, 30084, -57044, -34401, -100349, -12024, -29411, 7429, 47861, 92932, 71632, 58646, 118443, 72196, 82417, -12597, -86640, -41507, 29724, -76753, -142432, -53704, -46431, -98129, -103353, -113284, -99933, -65247, -90696, -59885, 20086, 65799, 79904, 80491, 47331, 28334, 98103, 38343, 12965, -15457, -4490, -5245, -49054, -56664, 38372, 1738, -64076, -74600, -26583, -7155, -66860, -81704, -104495, -31290, -24443, -32382, -4730, -36979, -33641]
1398c3641j7743Q1429m848o3567Q409m9032q8998M4615Q8490M961O7443l0598
1386F920m1449J3417K4336l7523m8220P0390P5571k9988l4540L8843Q293j9734
1374B6316k8881j1426K6910j7660j582Q0354n9684l6N989O7021q0359k7565j1444
1361c2047j5841o534L3001J1660R964J7619J4158j47875L2205j671m02J11818
1349B6055q6435L5486L3116M6417j6099p642n3258L6950k7554p6937o289L7793
1337e8397K7584q396n5850M8905r706M5798k0780N1731j0798o3015j417j0885
1325f5226O2965r956m286L5714J8471o011j6317K933k6470K5766N1927q914n1975
1312H621l0272N1776O5294o7230n7542l1513P638R791j72o6807N4947K5466j5126
$$ y = [-33641, -51384, 30045, 25197, -38370, -29961, -78993, -167991, -123376, -34886, -29925, 37518, 6920, -34529, -21112, 3224, -34299, -82519, -12129, 63442, 33454, -1086, 37757, 46050, 26316, -2565, -13991, 12919, -4741, -6323, 74031, 14347, 14311, 20300, 87321, 6962, -20603, -32047, -47888, -54422, -21421, -9761, 203, 17822, 31980, -115895, -83690, -85361, -85763, 26055, -60380, -24894, 8222, 54639, 38540, 30898, -22360, 14590, -12964, -89901, -96190, -58397, -30813, -39209, -95059, -46154, -55860, -10062, -30842, 20889, 10091, -52924, -54341, -65226, -2261, -12217, -16503, 19211, 37682, 31671, 15354, 18287, -8183, 17583, 69510, 60596, 8621, -21651, 30125, 95419, 28189, -29353, -60866, -53228, -43437, -43609, -110416, -55469, -30003, -45129]
1299d5129J3170k7578j805l3974N6902L5363N5709m5746k5025M7627q0132O0943
1287A0325P4806l4750K3915R073n1216j9082J6202J4391R083N981o1032M0826
1275C8522r4310j9116J7718n3770J8877k7492j7264r805N9964K0640K7889K3952
1263a4195J0409m3228O2882K9227O939n654R879K6015k3583j4001P6644o3016
1251E8318p4759L6931P8099l1092l8431j0851m6130l0943K823J5182k101l237
1239d6191O9644J8875j31238l575l8891R8515k281m4475M2568m4061Q544M3039
1227b9527N0159p0843K4098M5573k2601m5140L4021o3474Q8797Q2672k8698m138
1215F0899n4106n512p7396n480N5278l4500M3412q2539O259J04032K817k7414
$$ y = [-45129, -31959, -59537, -61342, -95316, -38414, -3051, 52658, 6912, -18113, 29514, -50618, 10325, 85131, 50381, 74296, 83369, 32153, 13071, 29273, 43664, 52747, 58728, -2304, 38522, -55788, -74904, -57186, -110956, -92079, -119571, -136835, -146640, -86676, -66036, -38147, -14195, -3786, -47014, 15868, 45095, 52034, 46380, 56259, 82274, 58691, 44690, 121334, 58318, -16441, 20490, 98589, 67497, 29066, 18215, -27915, -58858, -56035, -40853, -42954, -46191, 23453, 42328, -88910, -92485, -131376, -32861, -35142, -79617, -37049, -81110, -72566, -29527, 20632, -50211, -26113, 19460, -3141, -48281, -14260, -77734, 11063, 93735, 65037, 60899, 6793, 1281, -76115, -81595, -26317, -60817, -17405, -99944, -93685, 10347, 13164, -14250]
1203a4250l7272M8748N0202p787J4341k4088j4059j3741J7714L8100J6327r8347
1191b4112L8125O307p991J2194l7680m1038l267L8214k1074Q9664n5075J9381
1179A3648N361R687p6159J6047L4736K013k8750L2301R487J8638j18106K5303
1167e5794O1641j7865J9568j6794K4969l2488j9818k7803P2303J1713q0036J6743
1155d3661N5906K9354k5551M5940k5413m2551M3869l0999J4159k5713O0985k2250
1143C4075k1943R138l0493l1355M879K778l5793N9235l4079K8160L4258R189N9399
1130H7448p3763o8291p8342L714N6337J45033N834p6982m620r291J3126n1436
1118e1233R2140j07966m4388M8023N2481M3877n1223O6838j0299m1515O9009o8874
$$ y = [-14250, -51522, -2774, 47428, 39641, 53982, 29894, 15835, 2094, 19808, 57908, 74235, -24112, 14013, 20320, 12329, 24523, -13157, -54195, -57462, -19248, -40322, 49342, -5733, 13648, 19009, 28696, -47463, -31416, 3320, 5333, -23417, 8884, 18371, 37009, -81097, -55794, 5847, -12018, 7550, -9244, 15725, -16763, -36581, -64384, 7919, 19632, -60404, -43661, 12245, 41599, 16048, 61988, 36575, -5976, 37893, 6894, 21053, -4660, 56325, 34075, 12132, 21270, -9223, -40578, -35699, -32921, -68714, -9479, -43558, -15398, 18860, 28049, 87448, 13685, -54606, -132948, -129234, -72897, 72136, 77970, 988, -3632, -12923, 203, -51233, 40907, -67059, -111447, -63424, -10943, 32934, -18289, 48549, 38250, -3265, 65744, -3130]
1106c130l0710Q457p50n95R2496o8386j579J1574n6539m7182K9626L0261m578
1093d1035k6398J1019N7675q581l0685J049J751n0318j6386O8749J6771k6970
1081d3359N730K4541J507l4084O000n8006M8012l7464N7024L1279R0339k9499
1069F2020r9028l5060J7262K9350j7317k2729k6001K4472O3896m7313K7248l9421
1057f2621M199R1548K0845K7398K9624j13812K1205O418m4000J0181l2734k0988
1045f2737K2398l3270j02n144l5971R9762R3607o8767K404M4308P0350j5409n0712
1032F0717k8135k6155N143Q911M5859n4934l6920l299l2035K6186L8499n244j5921
1019a7328J390j9095L4175M1549k5659j8708l5535J5185K5463K9017J8459l3175
$$ y = [-3130, -33840, -25383, -26133, -26728, 65768, -2618, -4197, 7377, -49162, -96344, -66718, -36457, -41035, -67433, -56414, 1261, -7320, -38005, -36956, -35205, -85523, -101909, -33160, -16389, -43359, -37629, -13088, -11581, -45665, -39665, -97671, -49659, -87123, -30099, 1180, 91519, 62020, -37008, -72068, -54806, -25456, -42773, -65502, -91503, -67031, -3135, -50448, -23200, -62621, -58422, 33126, 53971, 81369, 110993, -2819, 18386, 24804, -19196, -9015, -41749, -62737, -40339, -73609, -73711, -78855, -114826, -15064, 78543, 9776, 12180, 56488, 126838, 111429, 60717, 32582, 6427, 11570, 20481, 66340, 11406, -25514, -28813, -60848, -34662, 3837, -1407, -17328, -15938, -35033, -858, 40691, 15032, -3676, -39211, -24026, 1437, 30454, 48913, 15738]
1007A5738l7787P730L6111N1628k8855k364m0152l6134M935n645l1651J2791N9546
994E891K4344l5004l3673O4341P5943l6616o2977k4259P4537M3084o8721r996
982A6894R794m5464m8124L3562P468L6597l66p1990N9422J0004L0856k8925n5306
969d5578l4007J7679j4573R6557q946k2194J15325q2782p5050m623l936Q0873
957A8745m4191j1296l0145O6708j7776J9481L5344L7673n6515k8419O333K0434
945A6376R2297j1503p3699n932k935j0862L5567r2853j1023m5056j713O9675K3309
932a8352j7847L3124k2225r880R4137k2857j5747M2870o0973R67J1996L035k4990
919f742K961j9074l4898L2502j8362L1380N1748m6711q5772L6852k1425J03333
$$ y = [15738, -22049, -14319, 21792, 73420, 44565, 42201, 2049, -34085, -29150, -34795, -66446, -53655, 5891, 30235, -4769, -38442, 25899, 101842, 65226, 2249, -22010, 52527, 95611, 26890, 16894, 26688, -18776, -66900, -33338, -25870, 10727, 10361, -61629, -2207, 7797, 38653, 9728, -45578, -79585, -61906, -76479, 20078, 11132, -11062, 104263, 21481, -53569, -58192, -62128, 18745, -25446, -36742, -66887, -179, -17955, 1526, 36870, 74543, 18028, -10391, -4058, 16376, 108673, 97170, 23471, 17539, 14604, 3742, 39309, -53544, -64567, -109623, -111336, -41661, -18352, -36199, -3075, -25300, -35180, 58957, 36100, 20353, 63223, 2250, 3217, 15213, 18248, -6742, -3781, -22855, -57753, -25251, -43613, -12233, 39515, -7196, -92968, -56116, -77541, 25792]
907B5792j4510J3542K0148j0687K346J6526O5610j41073o9928o6187l32N0556
895a08197N1631p9977M2853J4955J5593N1047M2719k061j3471k3580K8665O88
883B0865K6890r108L9367r6757l7775m1696O3020R6863J9596o305o1470k4434
871a0944n2042J3389l3006L8667M9838k2268M3971k2151l9438n350J5783R051
859a4500L951J08002J621m3971l7261J1475J8090m0449K5852j0714k3949J5746
847A3893P173K5403j0773j5321n2042J7877R3434l8689j2079L6572o6160J0270
835I558K697N3971j7898j5318q5572L9866J1190k5129j208R6040j2856o5515L2730
822B2556P5782L7363n2753j3192o1324j2303N7499p3483r1863R4400P881l5841
$$ y = [25792, 11282, 24824, 44972, 34285, 36631, 53157, 118767, -22306, -92234, -158421, -158753, -108197, -56566, -136543, -93690, -78735, -63142, -12095, 30624, 28563, 15092, -8488, 20177, 20865, 47755, 38647, 78014, -18743, -56518, -98214, -35194, 61669, 81265, 74960, 13490, -10944, -62986, -49597, -82603, -43936, 5902, -16366, 27605, 5454, -33984, -39334, -23551, -14500, -10549, 97453, 99074, 55103, 17842, 29317, 47407, 6958, 32810, 22096, -1853, 13893, 21066, 46469, 35696, 20375, -31667, -13790, 79644, 40955, 28876, 65448, -712, 9558, 12255, 66226, 48328, 33010, -52562, -12696, -1506, -26635, -27843, 68197, 55341, -10174, 22556, 98338, 135701, 82948, 69756, 8432, -3871, 53628, -19855, -111718, -17318, -9437, -45278]
810d5278N5032K6525p6992K087o0790M2587K6366Q1531j05149K265R3828r6242
798e4230m4031Q5777P8300p8503R905K6057o681K2348p6658N9570L6463l5660
786B2657K9427n1546l3101l1544R2954N8609o9084n4098M9103K0499j4666J44938
774A64148n5550j30290L7289K6049j969o7727Q0880k5285M1219m1729q2850p144
762f2959P4430n0974p6010J9919m5442M5331L9767p091N2471k2985k4629J4953
750d3219l0486J29258o6253n8792q4139M5965K5114J3726J05371l1344K3029J2861
738D1091K9779l4209Q590J0991K8858L7462j663k7869p8584j1838n6371l4724
726h8487L5084L0142K4996k9400n1347N6924L7894k6572P762k3280O922j3536
$$ y = [-45278, 9754, 36279, -40713, -38626, -99416, -56829, -30463, 51068, -54081, -51816, 42012, -54230, -98261, -12484, 65816, -12687, -2782, 23275, 16594, 38942, -37716, 21854, 58317, 22657, 52084, 538, -32563, -64107, 28847, 87456, 18372, -35726, 13377, 33876, 19210, 164148, 108598, -21692, 15597, 41646, 39677, -28050, 52830, 27545, 68764, 27035, -55815, -62959, 11471, -39503, -115513, -95594, -141036, -95705, -55938, -63029, -10558, -33543, -58172, -43219, -73705, 55553, -10700, -69492, -153631, -107666, -82552, -68826, 36545, 5201, 28230, 41091, 70870, 36661, 45251, 56242, 85100, 122562, 120899, 93030, 14446, 2608, -53763, -88487, -53403, -23261, 1735, -27665, -79012, -22088, 15806, -10766, -3004, -26284, -19362, -32898]
714c2898J6876m9392l153Q2996j278N969j9992o526L8306n5705J4794M3954o6054
701c2103l9335o0810J01635O5191p6589J04693k6484k3789m8034k4217j7405R7017
689A9770j6153o4065j6088l8919P0498L7225L3359N4048r500l7737n683l5194
677h439O6978L734N353n2844j1586J9734p4369q244L4431L0583j1655j666l0553
664c8543m4337j322O398L8311L4353K9764l1497o7316m90J7592J05496M5473j18347
651b4465N1137O9360j04645r4181L765O7288N4378p6317j2703m305K5782M487
639d0419P5249K4474j15989K232O8459P2925p9039o8700N175J985l7620O7528
627b3740Q3620m4034M4928l2283p4699J6809O7128k6803m1013L1914o038L380
$$ y = [-32898, -16022, -65414, -68567, 14429, 13151, 19120, -872, -7398, 30908, -24797, -10003, 33951, -32103, -71438, -132248, -30613, 34578, -42011, 62682, 36198, 12409, -35625, -59842, -77247, 19770, 3617, -60448, -76536, -115455, -44957, -7732, 25627, 79675, 70175, 32438, 26755, -8439, 58539, 62273, 67626, 14782, 3196, 22930, -51439, -59683, -25252, 5331, -6324, -7990, -38543, -82880, -84202, -77804, -39493, -5140, 24624, -6873, -74189, -74679, -57087, 48409, 93882, -24465, 26672, 96032, -8613, -102794, -99029, -31741, 22637, -53680, -66383, -70688, -44906, -40419, 34830, 59304, -56685, -54453, 14006, 86931, 7892, -60808, -55633, -53648, -91268, -23740, 59880, 15846, 60774, 28491, -46208, -29399, 37729, 10926, -30087, 1827, -4211, -831]
615h31J7580l6138P2856j2996n9012K982m2507O0374K6884o8148Q2494J6620n3314
602F844p5288l6901M1032j7634L8218P474J2841M1367R3030O1114q7016j48j16475
589c1542p0171P2482L7478n167K3423L4216K5831K0754j07532n4280R768L760
577d0980n441n5918O3352R6577m9415l4528L948P348J15604n2891R717N7048n933
564A08488k9199l1668P2644K8732m9218o6237J441K5982m1913O099k3576n8345
552e6770J9340J6290O3892j2823L0743J9550j5140l0114N9421n0811q8900M8K5849
539a9425N9541k2256m6654N4937N1860P6273q1647n7857M0145J7402m1548m7590
527a6819Q888L7945j1681J9062k272l2369K099l5912O112k400K750P3034l2006
$$ y = [-831, 16749, -19389, 53467, 40471, -18541, -15559, -58066, 2308, 29192, -38956, 43538, 60158, 6844, -68444, -105345, -64313, -81947, -43729, -36255, -23414, 17953, 110983, 172097, 85081, 84933, -31542, -101713, -29231, 8247, 3080, 26503, 60719, 86550, 107304, -228, -54508, -44740, -40980, -46421, -102339, -38987, 57590, 8175, -26353, -22405, -15057, 100547, 47656, 57373, 114421, 108488, 79289, 47621, 120265, 148997, 99779, 33542, 34983, 60965, 19052, 25151, 1575, -56770, -37430, -21140, 42752, 29929, 60672, 80222, 65082, 34968, 94389, 43578, -45322, -45274, -19425, 40116, 17860, -28794, 26143, 78003, 154276, 72629, 14772, 54917, 72319, 30771, -16819, -7931, 30014, 18333, 37395, 35123, 2754, 4853, -31059, -24947, -27347, -24597, 48437, 16431]
514A6431j3627L9065Q330R7776m1443j03320k0155m0778J7979j1539j2820J3652
502e0449K5247Q5000M39p7231j5888O3489K6215N834k6881k8097J3919p4201m317
489e6921M9924P1926q3631m968j040n6832n7676J08957M4500m8460O8771l2228
477B322l8565p1302L5597M9703N9527k7027q0423M5176P772K4130L3637o773L0345
464F4119M35n5765M0143O4038l8014k5926o1900j7778L8529q5121J0315O5953
452i72K259j4840j1271M5600q7389k1147M9215K4475J2484L2896l3514r838N0443
439C8401n118L5486N9633l744j6851j34953r628K2474R436J9274J3585q606o3556
426d4167N1653L1630m4382J9602k5711N5712j23954k753O1176j8822N5785J6767
$$ y = [16431, 2804, 41869, 50199, 147975, 106532, 3212, -16943, -57721, -39742, -51281, -64101, -50449, -25202, 59798, 60237, -16994, -32882, 30607, 56822, 62656, 35775, 7678, 21597, -52604, -56921, -6997, 64929, -18702, -23670, -24710, -81542, -139218, -30261, 14239, -34221, 34550, 2322, -36243, -107545, -71948, -22245, 37282, 10255, -70168, -24992, -17220, 6910, 40547, 33774, 64119, 64554, 8789, 48932, 112970, 74956, 49030, -12870, -30648, 7881, -77240, -66925, -972, 1287, -13553, -24824, 20776, -66613, -87760, -38545, -14070, -1586, 31310, -2204, -12042, 38401, 33283, 68769, 128402, 124658, 107807, -27146, -36774, -14300, -4864, 14410, 27995, 19389, -44167, 7486, 39116, -5266, 14336, -11375, 44337, -79617, -82370, -21194, -40016, 15769, 32536]
414C2536P879j2547J293O4671k4353n4821k6793K7833L2133q9564J25174j1037
402G2404m6064Q103l5283J4185m3441L3629p2145M000P4585O6455J9411m2054
390E3785k5503N7838o1006j7793L7556k5297M6781M1222q1767M9971L7279n4597
378E8469j4534J6715o3418q8921J3620N9803K7535q6275J29174L7580L7783l3561
366I3970j8919J4679l5061j4549N0643j3807k5324O0193L3836r2770j7649j036
354C4206n0813k1878N7095l662j2393K9918l318k5972P4827j0320q2664n3879
342f8853N0856J2466o8896O6171P6902m3225k0935M3891L1525K1278J0117q1960
330B9337m9326Q6232n2357k854n1850J0461K1768K2682O357O969K7597j1448Q458
$$ y = [32536, 40415, 27868, 29161, 93832, 69479, 14658, -12135, 15698, 47831, -41733, 83441, 72404, 26340, 34443, -840, 13345, -30096, 3533, -68612, -64612, 9973, 76428, 95839, 53785, 28282, 86120, 25114, 7321, 44877, 19580, 66361, 107583, 25816, 75787, 113066, 58469, 43935, 60650, -2768, -91689, -78069, -18266, 9269, -77006, 52168, 89748, 127531, 93970, 75051, 89730, 54669, 40120, 90763, 76956, 51632, 111825, 145661, 52891, 35242, 34206, -16607, -38485, 18610, 14948, 2555, 32473, 29155, 3183, 78010, 67690, -14974, -68853, -17997, -5531, -74427, -8256, 68646, 25421, 4486, 48377, 79902, 101180, 111297, 29337, -19989, 66243, 13886, 11032, -40818, -30357, -8589, 14093, 20450, 27419, 55016, 43568, 52026]
317E2026L2857j5602k282M4638K387m3489q8865L2192J6540q053n9065N1273M4962
304E9519K3491k4880j7977k8824o214m9510Q5729J4541j2391r2607J1753P1679
292C4309l4378j2252L2409L6094m4051l2709k665O0079L4975q9892R0115k8369
280D3665j01641J30673k3389Q554L2460k0666p5973J8289K2471N122Q126K2243
268F9934m8364l438n8450N5946K0862J03585L923O7469J4142p9128n8541o0599
256B7341m2264K4427l9251L6968m462K4789Q226n022l257J6114o7863N5077K4903
243E5726L2730n8498k2823L4349m0070L5278K1825K9889l7381L7889j10971m7261
231f9318J19673j6484j02606L0719Q996L5299P863O0024n2505p9709P0557k2199
$$ y = [52026, 84883, 69281, 66999, 111637, 114024, 70535, -18330, 13862, 30402, 22349, -36716, 14557, 59519, 83010, 58130, 40153, 11329, 5115, -44395, 41334, 55875, 43484, -49123, -37370, 34309, -69, -12321, 20088, 56182, 12131, -20578, -23243, 36836, 71811, -18081, 72034, 43665, -57976, 72697, 49308, 57862, 90322, 69656, -6317, 11972, 34443, 39565, 47691, 69934, 21570, 18132, -40318, 15628, 36490, 140075, 143998, 211467, 225609, 146481, 87940, 27341, -14923, 9504, -29747, 7221, 2759, 27548, 35774, 30752, 27495, 43609, -24254, 30823, 55726, 88456, 29958, 7135, 41484, 1414, 36692, 58517, 88406, 51025, 88914, -22057, -69318, 50355, 33871, -68735, -38016, -29020, 6279, 14142, 74166, 21661, -58048, 12509, -9690]
219i690j5575L9769L5056R2899o7711J4981o4490N0833K7480j1395p598J2585
207I7144r58q4761m1863J44398J6352o3572o0494J2913O7919K8060o5638o5494
195a5994o2133P7806N7163m0562M8244K3970k0066k1403M3925l0558J0570M1773
183A12735p5210J9379J0645K2852Q013m3589P958r819m6083j093K9644J8489j09729
170e5808L8711L1709K8188K7797r9432P4908J1127r709j1375M1720N906j0964
158G2778l1099j4972k4262L1320m8977L786J9093J1978m1775m9691N5568Q8584
146G2331j7232l0296O6945n2318k0993K938K5593J244l5359N9171m3422J0918
134C9520K2007M0143q600o296L3964m8271J7588L4667n4069m396j2354k2848J2948
$$ y = [-9690, -25265, 14504, 49560, 142459, 74748, 89729, 25239, 76072, 103552, 92157, 84559, 97144, 96186, 11425, -30438, 113960, 130312, 66740, 6246, 19159, 87078, 115138, 49500, -15994, -78127, -321, 56842, 16280, 64524, 88494, 68428, 47025, 90950, 60392, 70962, 112735, 37525, 56904, 67549, 90401, 98414, 54825, 62783, 52964, 6881, 5788, 35432, 53921, -55808, -17097, 14612, 42800, 70597, -28835, 46073, 57200, 47491, 36116, 77836, 83742, 72778, 41679, 26707, 2445, 33765, -15212, -11426, 7667, 19645, -22130, -71821, -16253, 72331, 55099, 24803, 91748, 39430, 18437, 21375, 46968, 48212, 12853, 72024, 28602, 39520, 61527, 101670, 93070, 86774, 120738, 72467, 90055, 124722, 70653, 66257, 53903, 31055, 44003]
121D4003j1651K666m7866k1815O7639J1678j5021J4254K2940J124K5004r179k0611
108F3165L0625J8958q1680m0502j6827J311K2054p85j0318K8128J4484N244J348
95C5205N4223j0041n2075q809j0217q219L7417k5536j1531j4595m3220O6143N1139
82E9884J4157O841L0119m4159l0346L4209K6927o4956m063J4008l0195J9219j9180
69A2465K7167P3591n385n6395o3396J2418R758J071O8729r497m2426R755J060
56C8915L744O943k3107M8931K0050j10376P0877L6416K6924k7743l9405l8481
44A3688J6801R280J0802O691k2532J2770q329N7820K0826l9431n50j3206J9659
31H4289m9578p113k8066L256L4174m3778K9975j9114L9103N0396J2110l5418j3513
$$ y = [44003, 32352, 35018, -12848, -34663, 32976, 44654, 29633, 43887, 66827, 67951, 92955, 83776, 63165, 93790, 112748, 31068, -9434, -26261, -24950, -2896, -3681, -13999, 14129, 28613, 33857, 35205, 89428, 79387, 27312, 18503, 8286, 67, 37484, 11948, 417, -14178, -57398, 8745, 59884, 74041, 80882, 111001, 66842, 36496, 70705, 97632, 32676, 28613, 42621, 12426, 31645, 12465, 39632, 113223, 107838, 51443, -11953, 465, 10223, 11294, 80023, 70526, 28100, 37855, 38915, 42659, 49602, 26495, 75426, 95476, -14900, 55977, 92393, 119317, 91574, 52169, 13688, 30489, 39769, 50571, 57262, 34730, 47500, 39171, 96991, 117817, 78386, 77836, 64630, 84289, 34711, 27598, -468, 2788, 36962, -6816, 23159, 4045, 43148, 93544, 105654, 70236, 56723]
18E6723n236K2658K3000j7609j6888k5068j9518k9200N2954K9222j9130k5316
6B6592M9499m8115J5051l1312N151M5032
0F1898
$$ y = [56723, 51487, 74145, 97145, 79536, 62648, 37580, 18062, -11138, 41816, 71038, 51908, 26592, 76091, 27976, 43027, 11715, 16866, 61898]
$$ Imaginary data points
##PAGE= N=2
##DATA TABLE= (X++(I..I)), XYDATA
16383b022560J9847j877j786J6804N5974N2689N223j3387K1243J8849M2785M1309
16371a764887O1074L6929J8208j1903p136J05378L2912L4599l5779o774K697M2245
16359a492437M2258J5129L6832M6364K0606j1705M7588K1751L7685L7302Q424
16348a190203M7080o628K1827J7570N7776k9233K6605j3173O7415P2148p316Q6077
16336h50055N7609k7899O209J4680m6208P9041Q2010J6884j7000m7231o675L9272
16324f99363Q411K0429P1137k652O2201K5326K4734l6683L4925j0444M5388O3961
16312c92630k7974N0955L5054N4670J7060j4130K7966N081k5988Q4707K7849K6549
16300a30831Q3573l235J202m0662J0575R1249k8652R287Q1107K0464j6962L646
$$ y = [-2022560, -2002713, -2004590, -2006376, -1989572, -1933598, -1880909, -1875686, -1889073, -1867830, -1848981, -1806196, -1764887, -1703813, -1666884, -1648676, -1660579, -1667715, -1562337, -1529425, -1494826, -1530605, -1537379, -1534682, -1492437, -1450179, -1435050, -1398218, -1351854, -1331248, -1342953, -1295365, -1273614, -1235929, -1198627, -1190203, -1143123, -1149751, -1127924, -1110354, -1052578, -1081811, -1055206, -1068379, -1000964, -928816, -936132, -850055, -792446, -820345, -814136, -799456, -845664, -766623, -684613, -667729, -684729, -731960, -738635, -699363, -690952, -670523, -599386, -602038, -539837, -514511, -489777, -526460, -491535, -501979, -456591, -392630, -420604, -369649, -334595, -279925, -262865, -276995, -249029, -243948, -269936, -185229, -157380, -130831, -47258, -50493, -49291, -89953, -79378, 11871, -16781, -7494, 73613, 94077, 77115, 80761]
$$ [...]
##END NTUPLES=NMR SPECTRUM
##END=
