##TITLE=1H_51-2021
 CDCl3, 8 sc, 
 6.07.2021
##JCAMPDX= 6.0         $$ Bruker NMR JCAMP-DX V2.0
##DATA TYPE= NMR FID
##DATA CLASS= NTUPLES
##ORIGIN= UXNMR, Bruker Analytische Messtechnik GmbH
##OWNER= root
$$ XWIN-NMR		Version 3.5
$$ Tue Jul  6 10:13:59 2021 Russian Standard Time (UT+4h)  she@DPX200
##.OBSERVE FREQUENCY= 200.131506
##.OBSERVE NUCLEUS= ^1H
##.DELAY= (6, 6)
##.ACQUISITION MODE= SIMULTANEOUS
##.ACQUISITION SCHEME= undefined
##.AVERAGES= 8
##.DIGITISER RES= 18
##SPECTROMETER/DATA SYSTEM= spect
##.PULSE SEQUENCE= zg30
##.SOLVENT NAME= CDCl3
##.SHIFT REFERENCE= (INTERNAL, CDCl3, 0, 15.7039)
##AUDIT TRAIL= $$ (NUMBER, WHEN, WHO, WHERE, WHAT)
$$ ##TITLE= Audit trail, XWIN-NMR		Version 3.5
$$ ##JCAMPDX= 5.01
$$ ##ORIGIN= Bruker BioSpin GmbH
$$ ##OWNER= she
$$ F:/spectra/data/she/nmr/H-F/1/audita.txt
$$ ##AUDIT TRAIL=  $$ (NUMBER, WHEN, WHO, WHERE, WHAT)
(   1,<2021-07-06 10:12:42.40 +0400>,<she>,<DPX200>,
      <created by zg, POWCHK disabled, PULCHK disabled
       configuration hash MD5:
       00 E9 B6 7A A2 85 ED C7 34 08 36 98 17 FE 4E 26
       data hash MD5: 16K
       B5 57 C7 EF 81 21 A2 42 A4 CF 32 F4 F2 45 CA CF>)
$$ ##END=
$$ 
$$ hash MD5
$$ 9F EC 66 E0 52 A6 7F D1 18 AC 57 7A FB 59 44 FA
##$RELAX= 
##$RELAX= 
##$RELAX= 
##$RELAX= 
##$RELAX= 
##$RELAX= 
$$ Bruker specific parameters
$$ --------------------------
##$DU= <F:/spectra>
##$EXPNO= 1
##$NAME= <H-F>
##$PROCNO= 1
##$TYPE= <nmr>
##$USER= <she>
##$AMP= (0..31)
100 100 100 100 100 100 100 100 100 100 100 100 100 100 100 100 100 100 
100 100 100 100 100 100 100 100 100 100 100 100 100 100 
##$AQSEQ= 0
##$AQ_mod= 1
##$AUNM= <au_zg>
##$AUTOPOS= <>
##$BF1= 200.13
##$BF2= 200.13
##$BF3= 200.13
##$BF4= 200.13
##$BF5= 200.13
##$BF6= 200.13
##$BF7= 200.13
##$BF8= 200.13
##$BYTORDA= 1
##$CFDGTYP= 0
##$CFRGTYP= 5
##$CHEMSTR= <none>
##$CNST= (0..31)
1 1 145 1 1 1 1 1 1 1 1 1 1 1 1 1 1 1 1 1 1 1 1 1 1 1 1 1 1 1 1 1 
##$CPDPRG= <>
##$CPDPRG1= <>
##$CPDPRG2= <>
##$CPDPRG3= <>
##$CPDPRG4= <mlev>
##$CPDPRG5= <mlev>
##$CPDPRG6= <mlev>
##$CPDPRG7= <mlev>
##$CPDPRG8= <mlev>
##$CPDPRGB= <>
##$CPDPRGT= <>
##$D= (0..31)
0 1.2 0 0 0 0 0 0 0 0.06 0 0.03 0 0 0 0 0.0002 0 0 0 0 0 0 0 0 0 0 0 0 
0 0 0 
##$DATE= 1625551961
##$DBL= (0..7)
120 120 120 120 120 120 120 120 
##$DBP= (0..7)
150 150 150 150 150 150 150 150 
##$DBP07= 0
##$DBPNAM0= <>
##$DBPNAM1= <>
##$DBPNAM2= <>
##$DBPNAM3= <>
##$DBPNAM4= <>
##$DBPNAM5= <>
##$DBPNAM6= <>
##$DBPNAM7= <>
##$DBPOAL= (0..7)
0.5 0.5 0.5 0.5 0.5 0.5 0.5 0.5 
##$DBPOFFS= (0..7)
0 0 0 0 0 0 0 0 
##$DE= 6
##$DECBNUC= <off>
##$DECIM= 32
##$DECNUC= <off>
##$DECSTAT= 4
##$DIGMOD= 1
##$DIGTYP= 9
##$DL= (0..7)
0 120 120 120 120 120 120 120 
##$DP= (0..7)
150 150 150 150 150 150 150 150 
##$DP07= 0
##$DPNAME0= <>
##$DPNAME1= <>
##$DPNAME2= <>
##$DPNAME3= <>
##$DPNAME4= <>
##$DPNAME5= <>
##$DPNAME6= <>
##$DPNAME7= <>
##$DPOAL= (0..7)
0.5 0.5 0.5 0.5 0.5 0.5 0.5 0.5 
##$DPOFFS= (0..7)
0 0 0 0 0 0 0 0 
##$DQDMODE= 0
##$DR= 18
##$DS= 0
##$DSLIST= <SSSSSSSSSSSSSSS>
$$ [...]
##$SUBNAM2= <"">
##$SUBNAM3= <"">
##$SUBNAM4= <"">
##$SUBNAM5= <"">
##$SUBNAM6= <"">
##$SUBNAM7= <"">
##$SUBNAM8= <"">
##$SUBNAM9= <"">
##$SW= 20.0188882624521
##$SWIBOX= (0..15)
0 0 2 0 0 0 0 0 0 0 0 0 0 0 0 0 
##$SW_h= 4006.41025641026
##$TD= 16384
##$TD0= 1
##$TE= 0
##$TE2= 300
##$TE3= 300
##$TEG= 300
##$TL= (0..7)
0 120 120 120 120 120 120 120 
##$TP= (0..7)
150 150 150 150 150 150 150 150 
##$TP07= 0
##$TPNAME0= <>
##$TPNAME1= <>
##$TPNAME2= <>
##$TPNAME3= <>
##$TPNAME4= <>
##$TPNAME5= <>
##$TPNAME6= <>
##$TPNAME7= <>
##$TPOAL= (0..7)
0.5 0.5 0.5 0.5 0.5 0.5 0.5 0.5 
##$TPOFFS= (0..7)
0 0 0 0 0 0 0 0 
##$TUNHIN= 0
##$TUNHOUT= 0
##$TUNXOUT= 0
##$USERA1= <user>
##$USERA2= <user>
##$USERA3= <user>
##$USERA4= <user>
##$USERA5= <user>
##$V9= 5
##$VALIST= <valist>
##$VCLIST= <CCCCCCCCCCCCCCC>
##$VD= 0
##$VDLIST= <DDDDDDDDDDDDDDD>
##$VPLIST= <PPPPPPPPPPPPPPP>
##$VTLIST= <TTTTTTTTTTTTTTT>
##$WBST= 1024
##$WBSW= 4
##$XGAIN= (0..3)
0 0 0 0 
##$XL= 0
##$YL= 0
##$YMAX_a= 191955
##$YMIN_a= -265409
##$ZGOPTNS= <>
##$ZL1= 120
##$ZL2= 120
##$ZL3= 120
##$ZL4= 120
##$ABSF1= 10
##$ABSF2= 0
##$ABSG= 5
##$ABSL= 3
##$ALPHA= 0
##$AQORDER= 0
##$ASSFAC= 0
##$ASSFACI= 0
##$ASSFACX= 0
##$ASSWID= 0
##$AUNMP= <proc_1d>
##$AZFE= 0.1
##$AZFW= 0.1
##$BCFW= 1
##$BC_mod= 2
##$BYTORDP= 1
##$COROFFS= 0
##$CY= 11.3945322036743
##$DATMOD= 1
##$DC= 2
##$DFILT= <>
##$DTYPP= 0
##$F1P= 15.9154993809931
##$F2P= -4.1035820241983
##$FCOR= 0.5
##$FTSIZE= 0
##$FT_mod= 4
##$GAMMA= 1
##$GB= 0.15
##$INTBC= 1
##$INTSCL= 1
##$ISEN= 128
##$LB= 0.24
##$LEV0= 0
##$LPBIN= 0
##$MAXI= 10000
##$MC2= 0
##$MEAN= 0
##$ME_mod= 0
##$MI= 1.114404
##$NCOEF= 0
##$NC_proc= 0
##$NLEV= 6
##$NOISF1= 3.799351
##$NOISF2= 2.8
##$NSP= 1
##$NTH_PI= 0
##$NZP= 0
##$OFFSET= 15.70392
##$PC= 1
##$PHC0= -11917.08
##$PHC1= 15.00099
##$PH_mod= 1
##$PKNL= yes
##$PPARMOD= 0
##$PSCAL= 0
##$PSIGN= 0
##$REVERSE= no
##$SF= 200.130013532006
##$SI= 16384
##$SIGF1= 3
##$SIGF2= 2
##$SINO= 400
##$SIOLD= 16384
##$SREGLST= <1H.CDCl3>
##$SSB= 0
##$STSI= 0
##$STSR= 0
##$SW_p= 3612.71676300578
##$SYMM= 0
##$S_DEV= 0
##$TDeff= 0
##$TDoff= 0
##$TI= <>
##$TILT= no
##$TM1= 0
##$TM2= 0
##$TOPLEV= 0
##$USERP1= <user>
##$USERP2= <user>
##$USERP3= <user>
##$USERP4= <user>
##$USERP5= <user>
##$WDW= 1
##$XDIM= 8192
##$YMAX_p= 0
##$YMIN_p= 0
$$ End of Bruker specific parameters
$$ ---------------------------------
##NTUPLES= NMR FID
##VAR_NAME=  TIME,          FID/REAL,        FID/IMAG
##SYMBOL=    X,             R,               I
##VAR_TYPE=  INDEPENDENT,   DEPENDENT,       DEPENDENT
##VAR_FORM=  AFFN,          ASDF,            ASDF
##VAR_DIM=   8192,          8192,            8192
##UNITS=     SECONDS,       ARBITRARY UNITS, ARBITRARY UNITS
##FACTOR=    0.0002496,     1,               1
##FIRST=     0,             0,               0
##LAST=      2.0444736,     0,               0
##MIN=       0,             -265409,         0
##MAX=       2.0444736,     191955,          0
$$ Real data points
##PAGE= N=1
##DATA TABLE= (X++(R..R)), XYDATA
0@%%%%%%%%%%%Qj6J6j6K4l2M0m9N7p2Q8j04J21j43J67j94K26k59K99l46L95m49
33b39N09n74O48p29Q18r17J024j143J272j411J565j733J915k114K333k573K835
50A486l124L439l789M179m612N100n650O276o999P843q841J0046j1535J3430j5935
65h686J9417k4625L3376n1781J58248j77768o8015L11789k47851j6226K18441
76A46319j28047j61719J68047j971j03631J02335N952j97340R1129J28047o7000
87a7879J0462m392m7663O5330l3212K8559J00191j28565o9660J26063J991k2601
99H624L4658l9988m7453N2117L5767m2550J9831J182r8411N8519Q7430n2563Q839
112B6002m6084o0666J19791j6399p1701J13770m0580j16008J09369O9972q4464
$$ y = [0, 0, 0, 0, 0, 0, 0, 0, 0, 0, 0, 0, 8, -8, 8, -8, 16, -16, 24, -25, 32, -40, 48, -56, 65, -78, 89, -105, 121, -138, 161, -185, 210, -239, 270, -304, 344, -385, 433, -484, 540, -603, 669, -742, 823, -910, 1005, -1109, 1224, -1349, 1486, -1638, 1801, -1988, 2191, -2421, 2679, -2971, 3305, -3694, 4149, -4692, 5354, -6181, 7249, -8686, 10731, -13894, 19482, -32299, 125949, -51819, -119834, 191955, -55896, -72122, 146319, 18272, -143447, 24600, 22629, -81002, 21333, 27285, -170055, -78926, 49121, -17879, -7417, -11809, -59472, 5858, -27354, 1205, 101396, -27169, -96829, 29234, 31225, 8624, 43282, 3294, -44159, 7958, 43725, 1175, 21006, 22188, -76223, -17704, 69726, 17163, 26002, -20082, -80748, 39043, 22644, -49057, 64713, 24133, -91875, 17494, 87466, 3002]
123C002j2917L1028n3584J9532R5196p1236n5460O3610o7806j0837R7523m8138
135a0087k5754k725n3257R6283K7143j11391O4135M6844j04883N1264J18260r1475
147D357o6636J11410l6250o2583J62327m0983j63579J41646K4140j39960J12223
158D6112M7793j35719K0232O7886l4400j0301J7620m2833k2342N5531p808k5777
170b4006L5244m5519k4518N7091j5162J5711J9322o6570L2999M7555m3561J5589
182D175J6395l0988K802J7373J3910q533k2645j0231q92K9133k395j7281K4470
195A5293l2419r341N4678l5605J533M4835o3122J0524O6133m5692j9348L1270
207A8739j6791j4842K8868J5059l3979Q39J4064l5111K9957K4170n4172K3598
$$ y = [3002, -9915, 21113, -32471, -12939, 82257, 11021, -44439, 19171, -48635, -59472, 38051, -10087, -35841, -38566, -91823, 4460, 31603, -79788, -15653, 31191, -73692, -22428, 95832, 4357, -62279, 49131, 12881, -49702, 112625, 71642, -91937, 49709, 73849, -66111, 46112, 93905, -41814, -21582, 46304, 11904, 1603, 19223, -23610, -45952, 9579, 1771, -24006, 11238, -34281, -58799, -1708, -16870, -1159, 18163, -48407, -15408, 32147, -11414, 4175, 20570, -10418, -7616, 9757, 23667, 15134, -7511, -17742, -18634, 10499, 8104, -9177, 15293, -17126, -26467, 28211, -7394, -5861, 38974, -24148, -13624, 52509, 6817, -12531, 18739, 1948, -12894, 15974, 31033, -2946, -2107, 11957, -23154, 6803, 30973, -23199, 399]
219C99J2604m1856L6482l170l8106L1185q922j7596L4667L21k8123J651K4773
232D309q975o705M1863j8771k5086M5605k1027j6065M3923l0643j3315L2780j7538
245A0355m116N263j3410J79k842Q585K203p001P925j7171J263J8187k1789J1681
259f88R091k4805K0577k612j9036K1096j2973m504J9690q926O034n34q744R553
273C219p581O497O661j1672J2673r225r100J6061j8721K449J4409j9219J4836
286A287L015j7365J5532o721l923J4614p161P087m88q005Q944j3225L141Q621
300E353j5878J4118o84j5521J6277j1203m711J6016j1397Q326N556j1381J0437
313E308q103k987R884j1676R884J750j1633J2888j1018l598J3563j2748J0256
$$ y = [399, 13003, -28853, 7629, 4459, -33647, -2462, -11384, -28980, 5687, 6008, -22115, -20464, 4309, -4666, -11371, 30492, 11721, -13365, 32240, 11213, -4852, 39071, 8428, -4887, 27893, 10355, 6239, 11502, -1908, -1729, -4571, 4014, 6217, -784, 7141, -10030, -8767, 9420, -12369, -688, 8403, -16402, 4175, 1563, -17473, 3623, -9350, -13854, 5836, -3090, 2944, 2410, -6334, 3219, -4362, 2135, 8796, -2876, 9797, 572, -8528, 7533, -11188, -8739, 5670, -13549, 1287, 4302, -13063, 2469, -4252, -8175, 6439, -722, 6365, 5877, -2128, 6816, -6409, -3268, 5353, -10525, 3593, 2909, -12612, 3665, -7538, -12249, 3767, -7630, 696, 6252, -5129, 5308, -2795, -5782, 4102, -7574, 2310, 4060, -7573, 5315, -5703, -9301, 4262, -8486, 1770]
326A770O761j2179J3074o576n406J1522j1475P058M356j1712J1575r685o858J1239
340C464j3565O937P438j1599J1939n435o227J1232j0877O721N992j0716J2867
353H171o635p919J2230j3169L955R567j0943J1405j647p142R693q886N132O008
367I820q913J2884o508q539J1820j5482N50R538j4698Q827Q53j1009P902o767
381i722M37N450n497J2234l892m192J2589j4543L803J0937j5190J3289L088j3321
395d530J2208n790m259Q124o476P939J055n090Q411j0567J250N471j2877J1507
409F376k11j1344J1386r681k692Q550j3507R943N750j0599J2561m028o085R132
423E551p703L753N899n263J949o643L284q37j4038J5640l972j3241K1859j1220
$$ y = [1770, 8531, -3648, 9426, 2850, -2556, 8966, -2509, 4549, 8905, -2807, 8768, -917, -7775, 3464, -10101, -3164, 4274, -7325, 4614, -821, -7048, 4184, -6693, 28, 6020, -4696, 8171, 1536, -6383, 5847, -7322, -3367, 6200, -4743, 6662, 5015, -2127, 7566, -1320, 3812, 9820, 907, 13791, 7283, -1256, 10564, -4918, -4368, 5170, -9528, -701, 152, -10857, -2955, -9722, -9285, -3835, -9332, 2902, -990, -5182, 7407, -7136, -3333, 7604, -7586, 5703, 8791, -4530, 7678, 1888, -2371, 5753, -723, 7216, 8271, 3181, 11592, 1025, 2275, 7746, -5131, 6376, 6165, -5179, 6207, -3474, -6166, 2384, -11123, -1180, 4570, -6029, 6532, 2504, -3581, 5551, -2152, 1601, 7500, 2237, 4186, -2457, 827, -10, -14048, 1592, -2380, -15621, 6238, -4982]
437d982p953K0485j8043k308K3178r808l412J0691k221q413K371J1740j1798K162
451A689J5581k3076Q193K1500l4387P638K1689k8061J0126J5212k1901K661L567
464D31j4116K013J3655q348j7172J9447J614k5752K4719M462k6833K6829K168
477C117j6596K8167p518k1005J8272M913n575J517L961k021j2184N553M993m477
491A117M196j0910J946J4767j2984M125J363j6376J8661k628j2077K8135j5192
504D143k5365K4515K918j0996R791j383j0158P352R376j5867N913J6601l5887
517a9047O227M2260l5711p726K8094l6953N414L5219l0690j9K7664k7781j0318
530b3367L9651j81l2488J9686J3626k3026K4999N903l4404K4498k227k9272M2715
$$ y = [-4982, -12935, 7550, -10493, -12801, 10377, 569, -2843, 7848, 5627, -2786, -415, 11325, -473, 1689, 17270, -5806, 2387, 23887, -10500, -2862, 18827, -9234, 892, 16104, -5797, -3136, 431, -13685, -11672, 1983, -6365, -23537, -4090, -2476, -28228, -3509, 953, -25880, 949, 3117, -13479, 14688, 7170, -13835, 4437, 9350, 3775, 5292, 9253, 7232, -4952, 601, 5594, 1117, 5313, -5597, -3651, 11116, -1868, 2257, 3620, -12756, 5905, 3277, -8800, 19335, 4143, -21222, 3293, 6211, -4785, 5006, 3623, -6535, 817, 10193, -5674, 239, 16840, -19047, -12820, 29440, -6271, -13997, 14097, -22856, -17442, 17777, -12913, -12932, 14732, -13049, -23367, 16284, 16103, -16385, 3301, 16927, -6099, 18900, 24803, -9601, 14897, 12670, -16602, 26113]
543B6113j89m0988J9791q67j7734K6293k458l0149J6622J5039l2864J1367L8435
556B8411m7662j9265N4582j8308j6329L6581k7533j7276L3137o528n433J7953
568A2330n568j6368L488K2310J358k0478m92Q152J929n422L619J0963k6771j0060
582b1010L1607j0969j68K0577l9028K379M1470k7861m838L1532k5653j4214L1703
595A5527j361j7708J4034j3959k4636M6168N368n2897L5439J0999o0050M0165
607b911L3863n2389J2331J9525l5884J8864L1505l5855j4109L3967j0381j6517
619a7991L7012n433l1592J7879o11L558K6956k9402q190K8993k4721O48L0819
632B7925k7225j5174K2543r939p902K6277j3297l9364K9095K3158l6437J6282
$$ y = [26113, 25924, -15064, 4727, 3860, -13874, 12419, 9961, -20188, -3566, 11473, -21391, -10024, 28411, -19251, -38516, 16066, -2242, -18571, 18010, -9523, -26799, 6338, -190, -5623, 12330, 6762, -9606, -6118, 16192, 17550, -2928, -3420, 4732, 6661, 1239, 4858, 15821, -10950, -21010, 10597, -372, -540, 20037, -18991, -16612, 24858, -3003, -7841, 23691, -1962, -16176, 15527, 14166, -3542, 10492, -3467, -28103, 18065, 23433, -29464, 5975, 16974, -43076, -2911, 30952, -21437, -9106, 10419, -25465, -6601, 24904, -10951, -25060, 8907, -1474, -17991, 19021, 13588, -18004, -125, -736, 2822, 29778, 376, -7814, 21179, -3542, -2894, 27925, 700, -14474, 8069, -1870, -9772, 16505, 3208, -36156, -7061, 16097, -20340, -4058]
644d058K2351m0162M484K5183j0654O955l129j4127J1944L825k03K483j1620n65
658g293P832r77L171R578r392k3436J8507K0777k5169P446J2765l0651J4336J6684
672A4178k4128J4941L341k9601K1724J9717k2510K12J1685j7366J876K8174j6332
685E911j4450K8301k4173j8247M8515j6840l5674L5715n337k4389K8896j061k4150
698a6983J1773P231j1814J1828J3940k2669m457K0609j1639K244J4579j9888M726
711e20J0839j7844J4514P672k4472Q024J1747q128L466K524q748m730Q366P12
725C422o252R271o428j3069J4708j646o891R547j0416K181J2264j2356O090O896
739G321j6076N665R551n591J140K387o013m841Q910K53j1368J2876m92j6510J8041
$$ y = [-4058, 18293, -21869, -17385, 7798, -2856, 4099, 970, -13157, -1213, 2612, 2409, 4892, -6728, -7293, 539, -438, 2733, 12311, 2919, -20517, -2010, 18767, -6402, 1044, 13809, -16842, -2506, 14178, -9950, 4991, 8332, -21269, 455, 20172, -2338, -2126, 9559, -7807, -5931, 22243, 5911, -8539, 19762, -4411, -22658, 25857, 9017, -26657, 9058, 3721, -20668, 8228, 7167, -16983, -5210, 2021, -9793, 2035, 15975, -6694, -11151, 9458, -2181, 63, 14642, -5246, -520, 10319, -7525, 6989, 14661, -9811, -1787, 9960, 1832, 5298, 7822, -926, -5656, 2710, 3422, -2830, 6441, 13, -13056, 1652, 6, -6885, 2662, -7754, -5573, 6691, -5665, 425, 7321, -8755, -3090, 6461, 870, 2010, 4397, -1616, -6457, 2453, 2706, -8662, 4214, 3722, -12788, 5253]
754E253M32j6597J5575k916j0184J6945l416r528P921j524o787L764O855o251
768d58l371R875q391k594J2552j2081O25J3492j3409L191Q949j3667L368N100
782C181p978L728K868l603k057L133Q64q058O867N400j0566R208K920j1448Q441
797B900o08n736Q058m085q10L616n547K902p66m094L702p09J771L01j722L498
813B671p043J218Q255q785M041M583j0706N188J447n802M837k836m31M463l062
828a962L509j107l987L766j173L821J279m910M962n289k888R980p332j554P004
843D119p307K247L676m014Q56k686K554L291l598M918k710o015N586k221J026
858b78L212n457L293j071l128P585m894k115O636l807K701L104m023R98l447J725
$$ y = [5253, 5685, -10912, 4663, 1747, -8437, 8508, 5092, -4436, 3485, 1961, -4826, -1062, 5793, -458, -3829, 6046, -2345, -4939, 7613, -4468, -3843, 9649, -3760, -569, 8380, -5287, -1919, 3181, -4797, -1069, 1799, -1804, -3861, -728, 136, -7922, -1055, 4345, -6221, 2987, 5907, -5541, 2900, 2292, -3444, 4614, 529, -281, 3335, -2212, 690, -76, -4170, -468, -1177, 594, 895, -827, 2671, -4372, -3154, 5101, -3684, 357, 4940, -5766, -578, 869, -4933, -96, -2932, -3363, 1100, -1962, 1547, 440, -3547, 219, -954, 2867, 4146, -764, 4198, -1091, -3979, 6001, -1331, -2885, 4119, -3188, -941, 2735, -1279, -423, -3109, -555, 2736, -862, 4056, 1346, -4669, 917, -1304, -278, 2934, -2523, 770, -301, -3429, 4156, -738, -2853, 3783, -24, 2677, 5781, 1758, 2756, -691, 1034]
874A034M133n238L929j080o818N682j726j494L586m736L308J070l075N932m782
889b75l096O419l790K526K550n203J577k951K95L958m615L218K95m835N774k332
905d85k165M109m943L077L181m976M587k847m611N223j981Q56K296k885K578k191
921a177Q06M192n830M177K514o415P059j086o455M805l383j027L341k888J428
936F1k477j908K703l666L152J803n148O181j235l701O068m388K18M475m353M130
952A915M41m070L094k735J269L151m124M069M72l958L388k790P36J239l738M430
968B789k099k775M929p009J105N759q156M420N360p276K522J822k754J560P92
983I89J038k241K095J481q588N755K971j1975Q398L333j0650Q016j93p844P417
$$ y = [1034, 5167, -71, 3858, 2778, -4040, 1642, -84, -1578, 2008, -2728, 580, 1650, -1425, 4507, -275, -3371, 3048, -742, 1784, 4334, -869, 708, -2243, -1948, 2010, -2605, 613, 908, -3927, 1847, -485, -2650, 1459, -3484, -407, 2774, -2202, 2385, -462, -5073, 150, -1831, -975, 1321, -1564, 1014, -1177, -371, 3821, -2009, 2168, 4682, -1733, 5326, 4240, -2215, 2590, -793, -1820, 1521, -1367, 61, -2416, -4324, -1621, -5287, -2135, -332, -5480, 701, -534, -4235, 1833, -2555, -2337, 2138, -2215, 1915, 2356, -1714, 1380, -1355, -86, 3065, -1059, 3010, 3482, -476, 2912, 122, 858, 2097, -1641, 2789, 690, -2085, 2844, -4165, -3060, 2699, -5457, -1037, 4323, -2953, -431, 1391, -1363, 197, 989, 2027, -214, 1881, 3362, -5226, 529, 3500, -8475, -77, 3256, -7394, 622, 429, -7415, 2]
998BP7m944N305L521m888k579P980l107o731J1133l230o518J2424p150n843J2773
1014H225p405m798J0366k295m472K146O38k791k008L813l393j229O305q160RP592
1030B543q036P22N070l052M812k367k119P153n486o16O098l503J464R44l875K550
1046B302N79k605k789M207L505r009M461O352j2282M671N874j0843R593K489j3741
1061g236R323M257j1806L700P177o695k377Q412l412n308J0100p523p061J8791
1075A0342q439j1815J8816p992j1825J5061m427p494J0152l895p433J0426K955
1088D432j4274N580J2815j4651K061J6279j4545j004J2214j3201L790J1232j2842
1101b114r95Q936m664m076K930K678n180r91M888j561N87j318n054N640l36k439
$$ y = [2, 79, -4865, 440, 3961, -927, -3506, 4474, 1367, -5364, 5769, 2539, -3979, 8445, 1295, -4548, 8225, 820, -3978, 6388, 4093, -379, 1767, 2405, -386, -2394, 1419, -1974, -3203, 3102, -5058, -5049, 2543, -5493, -4771, 299, -2753, 2059, -308, -2427, 4726, -760, -1376, 4722, 1219, 2683, 3627, -248, 2302, 2881, 276, -2513, 1694, 5199, -3810, 651, 7003, -5279, -608, 5266, -5577, 4016, 6505, -7236, 2087, 6344, -5462, -1762, 5415, -1280, -3657, 4755, 1343, -3965, 6135, -1388, -8449, 10342, 1903, -9912, 8904, 912, -10913, 4148, -279, -7773, 2379, -1516, -8949, 1477, 4432, -9842, -4262, 8553, -6098, -4037, 12242, -2303, -3307, 8907, -4294, -504, 10728, -2114, -3109, 5827, 1163, -2913, 17, 2695, -2485, -3476, 1412, -149, 438, -880, -5934, -294, -630, -3069]
1117c069N248n848J209M595j0277P620O951j3593L991Q867o847J039L972n023
1131a165q03O122k821l819J0523o218j2798J6127o02j3469J4198l299j1321J5137
1145E792l438j0221J3343j883j1934J0090Q124j1814o63Q997j0290M64J2500j2802
1159c735P60J2041j6935K864J5697j5137q74J0905r208J253Q950q209m022R051
1173C401l598q200J3844J040j6910J0016O041j2801R460K969j0736Q126J151n854
1187b051N610k69m224k10J764L333k413k448m42L92P80l018M177K449r045N241
1203c74L551p704P749j052r245J0999k72q320Q445j292p788M762L233m099K341
1218I34L405q009J401J0642j1515r27J4752j3638k216J5761j1831l878J1428q955
$$ y = [-3069, 2179, -3669, -2460, 2135, -8142, -522, 6429, -7164, -3173, 5694, -1153, -114, 3858, -1165, -1968, 4154, 1333, -2486, 8037, 1819, -10979, 5148, 4546, -8923, 5275, 1976, -9345, 5792, 2354, -7867, 5476, 3593, -8341, 1749, 9873, -1941, -2604, 6393, -3897, -3433, 9067, -3735, -2975, 9066, -7869, -5005, 10692, -4445, -5319, 5586, -3622, -2369, 6581, -1628, -5650, 3401, -197, -8397, 5447, 6487, -10423, -407, 5634, -7167, 2293, 5262, -5474, 2652, 3803, -2051, 3559, 3290, -934, -1144, 620, 3953, 1540, -908, -1350, -958, -178, -3196, 981, 3430, -5615, -374, 3177, -4527, 3222, 2170, -7075, 3924, 3652, -4668, 3777, 2485, -5303, -541, 2692, -1407, 934, 4339, -3670, -2269, 8373, -3142, -4069, 10683, -2955, -5171, 10590, -1241, -5119, 6309, -2646]
1232b646k417J0562m302o485O757J427r110N764O143j0088M675M960j0339P277
1246B178K364j1074Q043K220q625O721Q93n983K507J496k202K98L762k386k809
1261b597O208l832l950P319m108j642N993o209J487L524p367M104L088n726L290
1276d18J952k743N44J485r24k515L952J019n271N326j125o703O784j322l892O585
1292B734m819j003N812n023P49L750m243J20L818j13k214R01J489n961L861N358
1308E216p970L306M122r122N159M233p289L673O28l704L684O48k575j565O49j78
1324a085j565N120j759o029N513j706l285Q491l399l772N799k119L99K703k297
1339A009k72j153J543K871k425K80j467k150K775l72J839n80n454M683Ql976O151
$$ y = [-2646, -5063, 5499, 1197, -5288, 1469, 2896, -6214, -450, 5693, -4395, 280, 5240, -5099, 2178, 4542, -6532, 1511, 3731, -4894, 1827, 2720, -3263, -756, 740, -1462, -1164, 2598, 212, -2597, 3611, -221, -4171, 3148, -960, -2602, 3391, -2818, -1331, 2193, -5174, -1070, 2018, -3708, -418, 1534, -1209, -665, 820, -104, -2619, 1333, 2352, -2919, 2407, 1282, -5421, 1363, 41, -3851, 2734, -2085, -3088, 2724, -2299, -1550, 2200, -2043, -1923, 1895, 1782, -432, 469, 1958, -4003, -142, 5216, -2754, 552, 4674, -4448, 711, 4944, -2345, 1328, 1956, -1748, 1936, 2584, 9, -1556, -907, -1085, -2650, 2470, 711, -5318, 195, -1511, -4796, 3695, 296, -3476, 2323, 204, 603, 3306, 1009, 737, -416, 1127, 3998, 1573, 1853, 386, -1764, 1011, 639, 2478, 1898, -3556, 1127, 1135, -2841, 3310]
1356C310k987n203N361J6q16J365k069j258r51L291K928l719J578r51k603M955
1372B247q26q70J298m685K953L177m632K654j727m471M243J577l69q95j478P77
1388a027j391L155L706n292J136J909k838M296j85l234J516k901K388L236m052
1403D22M36j312k836L480R42k03j753k290K543j571L45L878n470o55M150k128
1419b022K419M7l127J300o36K998L067l751R81m20j795L883l42p65j138j964K893
1436A628j020j138K335m885m35M463k239J739k16l579J931o1J281K451l331M80
1452e96L74q27K581j320m84o90j641M432o33l228L542l601j898N780j482j059
1468g50R20k272J55P93J614k84k956K853j10j527M704k470k114L314j660K562
$$ y = [3310, 323, -4880, 481, 497, -319, 1046, -1023, -2281, -3232, 59, 2987, -732, 846, -105, -2708, 2247, 1421, 551, 1849, -2836, 117, 3294, -1338, 1316, -411, -4882, -639, 938, 569, -326, -1804, -1027, -2418, 737, 4443, -849, 287, 2196, -642, 3654, 3469, 235, 1751, -1150, 1238, 4474, 422, 858, -454, -3290, 190, 1132, 929, -824, -3114, -571, -2142, -1797, 2081, -3389, -4044, 106, -2022, 397, 444, -2683, -1383, -2019, 979, 4046, 295, 1276, 856, -939, 2944, 2602, 1837, 699, -1265, 1628, 608, -530, 1805, -3080, -3515, 948, -1291, 448, 232, -3347, -1416, -1477, -196, 2255, -1076, -596, -222, -1049, 1532, 212, -272, -962, -2603, 1829, 1196, -2032, 1510, -2091, -3989, 1791, 309, -750, 170, -2102, -1947, -1154, 460, 176, -2780, 73, -37, -1564, 3140, 670, -1444, 1870, 210, 2772]
1484B772J419l353J399p92j837L132j329j21r37k123K291j308l95J177l505J773
1500a737K104k363K241p45j807J878j218L017M32l467L330p98k291L895j345j685
1516e59K306r40M26K01P44j187k839L949j39l686M795k535m127N369k874j423
1532b519M667l141j256L355l26j781O40K105k636J3M817m415m84M888o968Q80
1548b161O235o158k00M598m199o78K427p27j041J157J390k572J847K719n595K220
1564g38L661m722K339K176l280K088q88j225K567j448L56M27o91J468k181m79
1580e70K034k007l1M36p44J320k588M83J339k736L146n79k187M979k954k608O005
1597B738k192k744M363r36j835J852J58l018J338L066n434J217O502p662n12P891
$$ y = [2772, 4191, 838, 2237, 1445, -392, 2740, 1411, 1290, 353, -1770, 521, -787, -1182, -5, -3510, -1737, 367, -1996, 245, -500, -2307, -429, -1647, 1370, 1802, -1665, 1665, 867, -1424, 2471, 1126, -559, 1747, 807, 1233, 1434, 2178, 991, -1848, 2101, 1962, -1724, 3071, 536, -3591, 1778, -1096, -2519, 2148, -993, -2249, 1106, 780, -1001, -361, 1744, -892, -879, 3938, -477, -961, 3927, -3041, -2161, 4074, -2084, -2284, 2314, -1885, -2563, -136, -863, -1904, -747, 643, -1929, -82, 2637, -2958, -738, 2923, -1799, 540, 2716, -564, 1524, 636, -589, 1978, 530, 886, 1313, 622, 2090, -91, -570, 1464, -543, -574, -138, -882, 438, -2150, -1667, -328, -3064, 82, -497, -2684, 2295, -659, -3267, 2738, 546, -2198, 2165, 1229, -606, 1246, 1404, -1614, -276, 2790, -2644, -1427, 5075, -2587, -3099, 4792]
1613D792p336k26O894o140J67N635n007j938N468j417n070M883K646p126L480
1628b95L725p707M193L493p486M909L056p165K947K913m156p2K126n06j329J641
1644B87m57k357L284j002k860N242r54l138L608j565k17J954l019K095J303l086
1660h82J596J95j273R45j141K95J243j64q12m50K131j825j857M792k648j736M728
1677C137m603K8N005o270M35O074m832j048M974k326k912L872N60m368M452J761
1693C939p967N556L356j0085N318M899r107L592M394o664J883L402m698L47N045
1708C210l094l266O037j593n561O198q82n034O073j646l957N722k353k879M089
1723A064m82j510J264R47r25o51J088o28m90J699k164N54J715l212J509L99k644
$$ y = [4792, -2544, -2770, 4124, -2016, -1849, 3786, -1221, -3159, 2309, 892, -4178, 705, 3351, -3775, -295, 3430, -4277, -84, 3409, -4077, 832, 3888, -3277, -330, 2583, -1573, -1645, 481, -25, -1354, 287, -170, -2527, 757, -245, -3105, 2137, 1183, -1955, 1653, 88, -129, 1825, -1194, 901, 2204, -882, 714, 909, -364, 581, -560, -265, 978, 814, 2, -448, 1683, -142, -1999, 2793, 145, -1591, 3137, -1466, -1438, 3567, -2703, -2268, 3806, -1026, -2074, 2900, 574, -2338, 1534, 2094, -2274, 2178, 3939, -4028, 1528, 4884, -5201, 117, 5016, -4091, -499, 3895, -2769, -886, 2516, -2182, -1835, 3210, 116, -3150, 2887, 1294, -4267, 1931, 1049, -3985, 2088, 442, -3515, 2207, -146, -3025, 1064, 582, -928, 336, 1283, 358, -293, 795, 167, -323, 1376, -788, -234, 1481, -1731, -222, 177, -2467]
1740b467L597j435j978M384k561j931L712j572j047J948k36r67R07M91k506R72
1756f89K648m326J969L722n870J835L644n878K878L044n647K488L002m496K83
1771a393L173k368k233M195j32m119M581m99n045O051k54m616N400r68l784L811
1787A800p00k255J788n35j270J159Q90k324k06K306l009O39L984m087L11L111
1803A602m318K173K758m281J514J721j821J179M75o48r38N27J424j095J333m3
1819A562k688J933k1j347K749k591q78K535k715J098J450l418Q77J759j107J084
1835B82P76j354j009J427J149j592K059J6m190L601J077m056L474q37l632L908
1851A099K73k125J513j058j213R35K122n53j987J818j437r86M260j903j779K519
$$ y = [-2467, 1130, -305, -2283, 2101, -460, -2391, 1321, -251, -1298, 650, 414, -553, 354, 845, -1661, -689, 1959, -2367, -398, 3324, -2546, -711, 2933, -2945, -67, 2977, -2670, -182, 2820, -1676, -1393, 1780, -588, -2821, 1374, 1242, -2877, 1704, 1205, -3840, 2211, 1957, -2659, 2741, 1773, -2011, 1800, 1100, -1155, 633, 98, -1172, -13, 877, -1447, -1653, 653, -2356, -1717, 2267, -1820, -1509, 1602, -2716, -543, 2215, -2066, -552, 1169, -652, 527, 1002, 354, -584, -57, 1367, 272, 1605, 1562, -1126, 807, 786, -561, 2188, -403, -1281, 1254, -1461, -363, 1087, -2331, -1454, 305, -802, 282, 1058, -296, -1305, 122, 1271, -321, 1738, 1754, -2436, 1165, 2242, -1814, 1660, 823, -2809, 1099, 1372, -753, 760, -298, -1511, -576, 1546, 993, -994, 824, -613, -1599, 2661, 758, -1021, 1498]
1867A498k134N27L016k441l08M22j243J954N75q53o14j404L74J91J226l6k762
1884b012P48M33j544L158j021l216L058n75r3L164j711j665Q20K88J445J54j13
1901A318j072j693K503j6o67R59k736K80K282j590J571q67l057K197O20j99J364
1918A197j753j409O12R63J078q31j15k97j395L269K97k394J568j610k33L041q91
1935A097m42l91k468J226J411k83K0j515k03M23R15J718k351j50J269j590K861
1952A547J049l020N05j45p6K459o31j076o51j117J836K87k40J6k256P29J093k80
1970B9R56k017j427K033p10J577N84k931O00M05j13K582r84j076M17k04J614L16
1988A651q52k07j278J094J284j012O91k295j124K960j085J17J425l216J79J985
$$ y = [1498, -636, -109, 2907, 466, 158, 580, -663, 1291, 1866, 1013, 399, -1005, -631, -440, 786, 750, -2012, -1264, -831, -2375, 783, -238, -3454, -396, -971, -1064, 2100, 389, -1276, -456, -168, 1277, 1431, 1318, 246, -1447, 1056, 1040, 373, 1332, -1404, -1124, 1158, -432, 1139, 272, -2785, -588, 32, -167, 1197, -556, -1965, -1353, -390, 688, -143, -258, -555, -1950, 1319, 1616, -778, 790, -820, -1053, 1988, 1097, 655, 264, -2204, -978, 433, 150, 170, -1345, -1548, -1125, -210, 1508, -843, -993, 276, -1314, 1547, 2596, -424, 81, -64, -140, 2319, 1688, 612, -39, -1156, 680, 967, 727, 743, -1513, -784, 309, 29, 985, -1032, -2459, -426, -1136, 441, 1025, -1906, -1306, -901, -1014, 1568, 584, -492, -75, -279, 1335, 1651, 799, 592, -686, 408, 1692, 680, 1371, -924, -2048, 912, -173, -56, 1369, -1847, -1668, 317]
2004C17l35N60j94q91k36P29J934j272j123J325k149J539K139k343J99p1j837
2021a709K299N25j196K60j016N59K81K93M97k035K32J060j027K222k01k737J663
2038c0M2R3J531j120O5m19j77J901j106l31O94k099J111J370j737N3n45k34J50
2057g88K85J356j381j280K047j406M05K286k776M39J705j756Q06J032j705j86
2073i17J013N27n80J40Q49k489J191J944l054J775J180l781J917J522k526R14
2089c75N51j677O08J240j62j631J531L29k327K877P57k991K059Ok193K535n68
2106E69j381J245n86l01K12K94pj417R25P74j127J460o18r83J717j062J12P71
2124E97o62M01m16q5J497j832r2J974k028Q94J278j823N43L68p99Q4Q49j03j573
$$ y = [317, -18, 542, 348, -543, -779, -50, 1884, 612, -511, 814, -1335, 204, 2343, 0, 199, 128, -1709, 590, 1115, -81, 179, -837, -278, 3, 296, 793, -1242, -1010, 50, -977, 1245, 1044, -1693, -30, 12, 105, 1636, 516, 581, 162, -15, 1886, 780, 449, 1143, -956, 155, 1525, -212, -159, -704, -938, -788, -503, 853, -528, -1808, 239, -1167, -762, 1524, -1252, -813, 892, -864, -58, 974, -731, -917, 96, 623, 43, 183, 1032, -1457, -266, 1678, -1376, 399, 1579, -2202, -285, 1237, -1289, -375, 176, -1501, -893, 347, 185, -1446, 85, 414, -1913, 964, 1721, -1270, 789, 795, -1398, 1137, 569, -812, 433, -153, -454, -242, 52, 45, -1372, -447, 327, -800, 660, 42, -941, 776, -286, -174, 597, -65, 336, -80, -165, 1332, -500, -592, 1382, -646, 248, 1526, -297, 246, 614, -185, -101, 748, 645, -928]
2143i28P19J461l115J682J562l463K059J386l148K051J235k992J215J555j389
2158a10n44J841m47k096K482l68k761L340l58l408M035o45l347L241L1k208J740
2175D18N60j360J15J195j293q57K617j526j154K991j699j636K745j333m76J749
2191A056j129j7Q73q28L10p16Q71P6j272J426l42j002Q99l75J67k8m30J330j081
2210b12J32J227k210J283J123k817J779J259k846J280P04j346J63J014m94o23
2226e84J423j86k448K647J80l078L344k91l150L128m05k460K434J3k045J475Q99
2243H96j638j72K044j611r87L115j760j051K987k308r79L096k246n53K369j523
2259c21n04J026l07o24K99Q48j148J85J711k053M38J282k059Q79R36j490J122
$$ y = [-928, -209, 1252, -1863, -181, 1381, -2082, -23, 1363, -1785, 266, 1501, -1491, -276, 1279, -110, -654, 1187, 740, -1356, 1126, 758, -2003, 1337, 979, -2429, 1606, 961, -2386, 855, 886, -1322, 418, 978, -382, -267, 928, -365, -1222, 1395, -131, -1285, 1706, 7, -1629, 1116, -217, -693, 1056, -73, -90, 783, -45, 265, -451, 420, 496, -776, 650, 308, -694, 205, -170, -3, -31, -461, 869, -212, -80, 1147, -1063, 220, 1343, -1474, 305, 1564, -1282, -2, 702, -644, -481, 533, 39, -584, 839, 653, -1795, 852, 1032, -2046, 1298, 1007, -2143, 985, 580, -1880, 554, 567, -1478, -3, 896, -742, -914, 1130, -481, -1468, 1647, -113, -1164, 1823, -485, -1464, 1632, -614, -1167, 1202, -321, -825, 201, -106, -730, -431, 417, -731, -546, 1165, -888, -450, 832, -1227, -348, 588, -902, 220]
2276B20k35o75J080r63L41O54q84R17j20o21Q27l95J23k15J53O80j427N19J100
2295A079k347J334O61k292K056L55k220J950L0j358R75L35n59k11J101n34j141
2312g86J704p51j311K818j461j377K915j708p94K061j752j30J558q33m85M94J94
2329C56j089L90J373j867N20J614k505Q76J600k273J209R09j683J263L07j254
2345b54M92q5k8j12K46L76j323M54J52j067J432l78q56J281q99O9J276j609O32
2364b01M80j234J392J85j023N55j42k16K52N32k4j169R02N66j611J650j15k170
2382a391K080l22j264J740r43j013J058m04M11J33q7l04k97J129l92m82J456j555
2400d47K8J799j601M37O51k005J127O09q90P86p76m66M03M7O52o25q6M03j053
$$ y = [220, -15, -690, 390, -573, -232, 422, -462, 455, 335, -286, 541, 146, 269, 54, 207, 887, -540, -21, 1079, -1268, 66, 727, -1565, 491, 846, -1374, 576, 606, -752, 223, 558, -1, -212, 889, 355, -786, 918, 167, -1144, 1674, 213, -1164, 1751, 43, -751, 1310, -442, -572, 986, 153, -332, 162, 356, -733, -343, 1030, -837, -317, 1297, -1208, -332, 1268, -1005, 204, 1113, -570, 693, 1000, -254, 238, 153, 125, 13, 259, 635, -688, -234, -82, -1149, 283, -95, -951, 330, -569, -500, 776, -833, -201, 279, -955, 437, 622, -401, 154, 12, -204, 48, 580, 556, -613, 289, 855, -756, 894, 779, -1391, 689, 367, -897, 843, -100, -1113, -55, -459, -48, 85, -2, -306, -603, 526, 134, -348, 1108, -447, -419, 1380, -221, 216, 867, -1138, -11, 598, -292, 494, -282, -748, -345, -298, 354, -271, -357, 46, -1007]
2419a007J299K58j574J336p43n50K125j056o22R18j081O08R79m00j52o11L16O0
2437A03k55R11j102o45J335r04M98N07j827P65J63n29J681o94q05Q92o25N87N79
2456F35k75q4j034R78N29q85J047j089p77J921p48j08P99j741M42Q77q34J071
2474G24n03r76N33j79Q21k96l78N18j087Q64J249j522O22R0j514J785K18p86N15
2493F98j027J5O99p2L99q64m36O08l28Q44l39j189J120n10K76J386j340k30L43
2512E3o19J257J23q02L50q08N37O51o15J76n57j97R49k62L60m80j048J088l81
2531b25j16J254j787J81Q65j089J261K08j103K34J09J82N36j65K3r72M28J248
2549A072r79M67J60k015J423M05j036R42n66r18J009Q9L0k95j80K75n69J181K62
$$ y = [-1007, 292, 550, -1024, 312, -431, -981, 1144, 88, -534, 384, -697, -89, 890, 490, 338, -273, 43, 103, -152, 759, -343, -988, 347, -557, -59, 448, -1379, -614, -451, -980, 701, 7, -798, 94, -531, 56, 635, 360, 276, -758, 220, 749, -136, 911, -178, -955, 966, 218, 110, 909, -832, -390, 487, -347, 724, 221, -755, -222, -401, 420, 124, -254, 264, -823, 41, 1290, -232, 390, 480, -1034, 751, 969, 183, 698, -329, -314, 385, 313, 712, -152, -588, 20, -308, 536, 197, -992, 128, -382, -106, 1280, -60, -290, 53, -566, 691, 814, 12, 362, -446, 91, 742, 127, 303, -254, -451, 498, 236, 596, 116, -932, 156, -225, -341, 913, -874, -693, 172, -917, 344, 552, -551, -317, -208, -26, 510, 345, 368, -604, -176, 1072, 93, 560, 720, -1295, 128, 533, -503, 439, -127, -1045, -36, 53, 83, -212, -392, -117, -686, 495, 757]
2568G57j572J153l82q92J897o81n60O35p64L10O80n24K68r20L56P62q51R06l07
2587B71j264J080j13j96N71q39N3P6J37P48q20J29O06j118R33P44j459N85qp08
2607e92R61lm41j82q0M44o01N97L35j669J382L13j519J561r0j618J568q3n87O96
2627C92l04l88k33O44P0q53J353m37j368J944l30j420J862q20n85J294n26n20
2645b25K91k9k02j79Q60j87j034J227q60l87J737j102j77R72p90L40Q3k23R7l91
2665a79N48L1q51R92l46p68J111k64o08Q63l14j90l9J85K46j129J142K07j397
2684g60J446j06j593J502j28j275J415j26q64M47M33o45j99R91n37n39J495n88
2702C69j605K185r06j291K036r93n89J225m29n60M88M12o36mR04p53o68J736j456
$$ y = [757, -815, 338, -44, -936, 961, 280, -280, 355, -409, -99, 581, 57, 325, -595, -239, 523, -328, 578, 271, -993, 87, -26, -222, 349, -490, -437, -361, -224, 524, -296, -167, 439, -679, 254, 998, -461, 124, 116, -592, 369, 366, -75, -257, -337, 107, -494, 103, 438, -1231, 151, 464, -1055, 506, 416, -1202, 366, 283, -304, 392, 88, -300, -533, 111, 181, -672, 681, 244, -1124, 820, 490, -930, 932, 112, -473, 821, 295, -225, 66, 37, -165, -344, 516, 329, -705, 522, -338, -725, 1012, -90, -267, 705, -85, 255, 338, 115, 212, -179, 369, 400, -451, 541, 195, -573, 538, 274, -334, 529, 215, 25, -14, 171, 417, -712, 430, 637, -760, 686, 580, -1013, 489, 361, -914, 501, 375, -489, -42, 391, -254, -453, 538, 1, -538, 957, 369, -1236, 949, 43, -1248, 788, -205, -794, 431, 2, -558, -70, 342, -294, -298, 606, -147, -815, 921, -535]
2721e35l98J823j356o3J206j111J51N33l14j41L7N18n03k64J072q14m50J082q44
2740c71M5R30j175L09J26j76M64q19Q50j65p61J110k76p08J260o10n21R30k18
2759B24k75L9K81j76n49R33m06p95J673o64j081J803j130o20J482q67m58J009
2777D23k67p03K93P20p21k31J356j248m53J925j496k22J714j453R5J108r39l2
2795a31M98l42m14M75J25q39L98P95j132K75R58j302O91N93j158Q22j7n45N37
2814B87j91J15l6k69M76m66j49N16n13M48P9p03Q02m67j51N13o11N60K66j072
2834e66R89m69o87J247p96k71J073m43M2P0J39l27k60Q02k73o55J479j192l87
2853d85J595j495P3R30r08J11Q11q96o0L22J21n62L15O85q80P1Q57j452P83P14
$$ y = [-535, -933, 890, -466, -529, 677, -434, -283, 250, -64, -205, -168, 350, -153, -417, 655, -159, -609, 473, -371, -326, 604, -571, -262, -136, -312, 152, -667, 183, 18, -743, 367, 91, -617, 643, 33, -488, 442, 224, -51, -12, 269, 93, -456, 477, 71, -724, 949, 285, -796, 1007, -123, -743, 739, -128, -586, 423, 156, -547, -254, 466, -255, -486, 870, -378, -831, 1094, -402, -624, 1090, -363, -268, 840, -99, -131, 367, 25, -389, 86, 211, -628, -230, 565, -567, -292, 666, -636, 55, 648, -510, 312, 295, -250, 287, 96, 211, 175, -94, 382, -84, -233, 283, -230, 218, 297, -406, 396, -71, -222, 291, -320, 240, 506, -566, 423, -46, -733, 514, -282, -553, 520, 77, 119, 189, 328, 1, -259, 543, 270, -385, 1094, -98, -485, 1110, -385, -312, 618, -290, -179, 632, -264, -324, -2, 119, -443, -128, 557, -323, -252, 605, -847, -64, 650]
2873F50j288P88L66j090Q00l0o97N31P9r1J75j28J36n52K99J83q56P49l07n06
2893g89J056n86j04O67o19L56M29p77N31r2l37O07n01K76k10l4L93n84K22L96
2913C00r09Q00p6p11J015l78o46J002o88j2M08n19M59k87jK37k12M33k03l25R21
2934F08o51oQ64j238M68N67j066P16o9p09N76q9j01Q2K3Q3k92K37K38n68M61L05
2956D39j084J146l92m48R68p80Q3N77n83K41J33m89L06l10L96m4l59M84m58j26
2976c00Q46p58q3O88j033Q89j73m69P09n46k74R79m58O3J69l31K33j34L59p3p37
2997d34P57k79l58J007q78n4M20p71N65N73j035N10n4k14M86l5j05j60k12N63
3017B92m78L89K18j143P85K96q41R37k21m98O96l89R6K35m95L05k55J02N04p27
$$ y = [650, -638, 150, 516, -574, 226, 196, -501, 30, 109, 18, 193, 65, 201, -351, -52, 131, -725, 24, -283, -789, 267, -319, -423, 244, -375, -19, 410, -367, 164, 72, -265, 342, -159, 117, -93, -127, 266, -318, -96, 300, -609, 191, 115, -596, 419, 41, -605, 397, -291, -303, 105, -414, 45, -242, -243, -6, -218, 215, 12, -313, 608, -43, -49, 815, -423, 45, 612, -454, 262, 193, -516, 60, -29, -130, -48, -25, 58, -234, 3, 241, -327, 134, 439, -645, 501, 109, -339, 629, -151, -68, 509, -74, 167, 300, -189, 117, -193, 203, 159, -200, 284, -174, -300, 546, -212, -295, 393, -640, 249, 76, -393, 316, -230, -504, 475, 17, 80, 249, -82, 151, 17, 376, 303, -434, 323, 44, -314, 693, -185, -239, 181, -590, -25, 548, -487, 23, -31, -245, 241, 206, 101, -59, -271, 292, -186, 203, 421, -722, 63, 359, -482, 455, 234, -264, 432, 43, 139, 374, -121, 184, -71, 31, 535, -192]
3037a92N45n12l89J133q06j85R56j094L16P09q16N03j01m06N88l61K29P3q10P59
3057A39j28j55M46n62k17M91l02N10k58j60L78m45j4P33q69L56J18o65O98om27
3078c39J98j91K75j73J56M64q02M10L59j045J255l03j024J134j91n80P44k89m73
3097d15K44J06K02m08L72m7o83R74o8p97J003m91m65Q92m45p1K33k64L17j37O2
3118A14J32m02L50k54k29Q70o15k49Q28p39K10N10p51K38o6k7Q3l36O92l56o05
3139f02J000J5q36R54n32j50M72k38J71l22L66K6o66Q01j24j003J157l88q16J212
3159D97k97m83N52k97j37J93K38k67m12Q38n53n37J356o44o41J260q05k85J039
3178F15o92k80Q73k97l03j1M26m61k32Q58o89n79J445q34l10J090q98J7N78k76
$$ y = [-192, 353, -159, -548, 585, -221, -406, 550, -544, -228, 481, -335, 168, 67, -339, 249, -112, 117, 190, -620, 139, 11, -144, 302, -260, -477, 14, -288, 222, -36, -196, 182, -263, -277, 456, -413, -57, 61, -604, 94, 88, -339, -141, -332, -57, -230, -74, 390, -412, -2, 357, -688, 567, 264, -760, 374, 183, -397, 347, 58, -415, -171, -65, 137, -271, 101, 54, -629, 345, 277, -520, 483, -8, -473, 419, -26, -97, 136, -128, 189, 52, 114, 246, -156, 194, -60, -289, 581, -34, -283, 545, -194, 16, 526, -225, 13, -53, -80, 3, -333, 359, 3, -602, 398, 413, -423, 531, -1, -151, 321, 83, 254, -68, 298, 324, -342, 459, 335, -668, 489, 101, -715, 497, 200, -283, 269, -28, -165, 28, 266, -1, -413, 425, -128, -665, 691, 47, -594, 666, -139, -424, 615, -77, -357, 516, 219, -84, -95, 331, -130, -362, 496, -193, -772, 673, -161, -471, 619, -279, -262, 316, 40]
3198D0J06o3J5j68j36O87l71n22J170r14R4N62o07k5L38m91M15j68L62k45o09
3219e30P68k79m91Q59m95m04R94o41qL83k48m0J85L86j75n57P24n09n25J423j013
3240a93k16J109j126j06P95o63J08J60l0j18J78J70m73k15J324j071k4J170j382
3259f03J99R80r98L37M19q79N14P2L14o63J86N56p71M2R61j034J13P22j063N17
3279g9M72p51K17n5K45o7k12P58o99r9J026o95M6O28q68J66L37l13K90l86J61
3300A22j78j50O61m90k36O30o53nR74r79J23O61p35K83K19j05j99j0P06q69K54
3321B4P52j069O9R63j197N71K84q50L10N16m49q1J13J21n26K30O21r50N58L84
3341C94j088O87N71j178P68n6l38M12J0j48O8j1Q7m16K60L44p07J42M06n67N65
$$ y = [40, 146, 83, 98, -70, -206, 481, 110, -412, 758, -156, -62, 500, -107, -132, 206, -285, 130, -38, 324, 79, -530, 238, -41, -532, 327, -168, -572, 422, -219, -227, 156, -92, -132, 53, 439, 264, -293, 431, -78, -603, 820, -193, -409, 700, -426, -532, 263, -400, -292, -132, -162, -280, -102, 68, -405, -620, 704, -367, -391, 779, -603, -404, 576, -422, -85, 334, -545, -31, 41, 355, -308, -122, 434, -337, -295, 666, -368, -255, 467, -596, -79, 393, -358, -141, -196, 49, -18, -230, 528, -171, -270, 756, 61, 107, 735, -133, 33, 370, 57, 347, -39, 122, -56, -206, 455, -35, -271, 359, -294, -299, 675, -304, -181, 480, -255, 28, 247, 142, -57, -67, 639, -230, 24, 776, -293, -224, 739, -458, 113, 397, -453, -143, 373, -76, -157, -44, 77, -449, -219, 402, -548, 10, 394, -694, -7, 564, -614, 154, 98, -240, 172, 182, 34, 102, 91, 178, -238, 22, 366, -341, -199, 207, -360, 205]
3362B05j72m03N74l23q9M13n07N73n41k7P02o90J02N21p20L96M6j56K82m16M06
3383A76j51k24O29n06l00Q97q80K17O79r31L60J19l02Q4J3Q8n0r8L31k76q1P36
3405E30q76M63L97q69O15J22r33O73j72l12O91l52N5j73O8L45n89M52p8m75N38
3426A20j31m90R00p67j38Q88o55N6L03k86L37k18K47J10m56L88j49l80M90m01
3446b32J41M55n40L34m5m66P55m61l84Q93p09K87L21m59K12P3k36L01j99K04k11
3467C4k30O04m98Q3N77r05M24M20q39O64k27m96N36j31J40Kj54K15m34L08K83
3488C76o87L75M12p15O09k00l98O40n52J64N76q90M24M9l52L33l01J66J1l17O19
3509C42k08l28N88o81K78L59p02M61mm16O30m33j04M38m11L82r1k29L61m77J40
$$ y = [205, 33, -370, 204, -119, -208, 205, -302, 271, -270, -297, 405, -285, -183, 338, -382, 14, 60, -96, 186, -230, 176, 25, -199, 430, -76, -376, 521, -359, -142, 537, -394, -34, 85, -217, -133, -120, -32, -82, -180, 151, -125, -206, 530, -346, 117, 514, -355, 260, 382, -551, 122, -50, -362, 329, -23, 32, -141, -73, 272, -317, 135, 57, -418, 120, -11, -501, 399, -368, -506, 382, -273, -217, 86, -200, 137, -81, 166, 276, -180, 208, 59, -321, 169, -232, -91, 364, -176, 158, 113, -353, 402, -59, -443, 450, -259, 28, 349, -110, 102, 175, -61, 240, 41, 245, 34, -196, 408, -90, -7, 570, -335, 89, 509, -330, 334, 107, -389, 147, 16, 156, 158, 4, 219, -215, 93, 376, -311, 64, 476, -239, 370, 170, -228, 412, -140, 24, 600, -290, 134, 183, -169, 164, -137, 29, 40, -277, 342, 134, -194, 394, -287, -9, 350, -352, 109, 105, -311, 319, -114, -218, 220, -191, 191, 100, -129, 232, -245, -105]
3530a05J05k31M03J6l89M31n36P5M52n88M88q7n36P67l68j14K97j91J05J04j63
3551f5L26m15J60J73n27M69Q7o27Q35m71l93Q90n56O1J44k74K73J40j74J40o56
3572d60O89k14l26P73o32k58O70n29M4N35o69L16J30l34N55m71K54M1l04N89m53
3593e4J7L09n26K39J65n42O65k80l36M58m04K27Q4m09N68j67m67R84o78j32M32
3614A53o29O03p6k07L71n19M84J23n88N51j80k77Q32q65M5O72p20J7M11j12j58
3635f9KK17j28l68O51l30k64J021r96p4R23o82J00M10k71R1j37j6j80j67O91l71
3657E3l07P97p62l3Q65r32J53M88l63K12o5j19j08n5M22k96j42O07m88n3P85q57
3679a98O2N65n62L14L2j70J62l25L06k90j47P45q86Q3P70q21Q0O62o67J28L73
$$ y = [-105, 0, -231, 172, 188, -201, 230, -306, -231, 221, -367, 121, 34, -502, 265, -103, -217, 80, -111, -6, 98, -65, 261, -154, 6, 179, -348, 121, 208, -419, 416, -55, -448, 442, -114, -53, 91, -183, 90, 230, 56, 196, -460, 229, 15, -311, 462, -170, -428, 242, -287, -243, 292, -377, -61, 69, -265, 290, -181, 73, 114, -190, 399, -54, -37, 272, -254, -15, 150, -392, 273, -7, -343, 115, -289, -62, 22, -387, 181, 14, -453, 531, -147, -279, 153, -476, 127, 51, -156, 215, -304, 180, 303, -285, 266, 86, -191, 641, -224, -179, 493, -227, -210, 201, 89, -69, -67, 150, 22, -346, 305, -25, -289, 732, -264, -338, 585, -97, 3, 413, 142, 233, 96, 80, -100, -267, 424, 53, -254, 543, -219, -252, 613, -319, -166, 322, -41, 171, 106, -13, -121, -176, 246, -50, -192, 415, -73, -126, 659, -198, -136, 429, -133, 181, 213, 43, 205, -120, 186, -104, -251, 494, -392, -309, 461, -360, -280, 382, -285, -157, 216]
3700B16k54J1j25M62l95k98R05n87k59Q48j072K36Q78j026L00K85l47K23j04K08
3720A05l97O5N39p12O1Q54j027J42Q63r81M23L30p55N10J23J3p6l13N28m80J58
3741b7O44q61J23M35r39N28M65o76L64j0k07L03l50L38k59J02L70n48J46M37p37
3762c59M64L66q40O99k09k28K48k69K59j18j16N40p00J07Q78j267M47N33r89M55
3782i9M23n09J41j36J52j65J51O20r05J67P36j003N94M38j085M42M83o95N06p7
3802A79k71n7M5L60m32L28Q7q94O80L35p08M65J14p22O19J48k48J18j41Q8k80
3823a87K31L91o55J25M84r02Q29l3n72M95k49m5K46j43pj33l4O00n59J27L04n74
3845b61M03J36n23O62m55N1J43j18K82l62N0K43p24O12N07j126N79J52p94Q29
$$ y = [216, -38, -27, -152, 310, -85, -383, 522, -65, -324, 524, -548, -312, 566, -460, -160, 125, -222, 1, -103, 105, -292, -227, 312, -400, -339, 515, -512, -370, 493, -488, -65, 265, -490, 20, 143, 156, 80, -233, 295, -185, -27, 617, -244, -121, 314, -625, -97, 368, -308, 56, 46, -161, 142, -208, 130, -129, -27, 343, -205, -59, 378, -359, 105, 471, -369, 330, 121, -107, 141, -128, 131, 13, -103, 437, -263, -156, 722, -545, -98, 435, -554, -99, 324, -185, -44, -180, -28, -193, -42, 578, -327, -160, 576, -427, 167, 605, -480, -38, 445, -250, 256, 179, -92, -149, -104, 256, -176, 152, 239, -655, 25, 360, -348, 117, 231, -491, 128, 276, 28, 146, 5, 93, -187, 44, 435, -220, -95, 389, -513, 316, 283, -289, 206, -43, -88, 158, 15, 8, -125, -159, 441, -118, 9, 313, -261, 142, 278, -245, 417, -38, 13, 156, 38, 320, -42, 8, 251, -473, 139, 646, -480, 99, 251, -543, 286]
3865B86k12l19J08n8J97j73J13J91q19N88M20q69P71J62j076P96J19n08O14n08
3885a77K9Q2m2M00m95N0L01p13N96o9m45O86l31l65O40l90K06Q3n82O50j24LL04
3908B97p27N32L4m01O13k83k92L03j24J62J16m05L95n13N8N68m62J7L37o36N27
3929A16K53o20M83k69k7M23k51J05j79j09L05n17O25J14r08O24J11n62O84k23
3949A78m23K66L3k43L42j96J28l34K25K50n06O77n09m11O96k64j11O10m80J03
3969C1J17j06K19l75Q5L00n27M96p4k23L40n78L33K14l94K62k30O9J60k72M6M01
3991B94n41M44m7k98L80j49k32L67k99K31p0l03O62p77L93M53o92L75J08o02N87
4012B84l31o3L17n01L61J92k78J79k49KK16l52N11k07k74M68m16j56P58l94oL70
$$ y = [286, 74, -245, -137, -195, 2, -171, -58, 133, -686, -98, 322, -547, 224, 386, -690, 106, 225, -283, 331, -177, -148, -66, -108, 292, -203, -153, 148, -565, 31, -38, -483, 203, -128, -493, 147, -243, -37, 46, -536, 114, -10, -7, 297, -430, 102, 136, -265, 348, 65, -227, 76, -48, 114, 230, -175, 220, -293, -235, 333, -129, -112, 225, -411, 116, 369, -251, 232, -37, -64, 359, 108, 213, 34, -75, 230, -287, 338, 452, -456, 168, 279, -283, 401, 178, -245, 21, 54, -189, 153, -43, 85, -249, -24, 226, -280, 397, -112, -523, 173, -91, -202, 408, -72, 31, 148, 42, 261, -114, -29, 271, -256, 240, 166, -57, 283, -295, 38, 252, -142, 120, -110, -41, 119, -153, -107, 294, -247, 197, 150, -148, 232, 83, -149, 218, -81, 150, 80, -223, 439, -338, 55, 508, -184, 191, 299, -303, 284, -47, -110, 207, -294, 67, 259, -19, 160, -89, -87, 129, -223, 288, 81, -193, 275, -141, -297, 461, 67, 61, 431]
4034D31o29L35r3p6K22m06K35L4k81M65m94J2O31p23K28L70o55N08J9m19L96k74
4056a64J87P7l08K63N8l66N83m86J38Q3l18K06J54l67N29m88L2J90m09O02j08
4077H8l52L70k48q0L59m48K94J40l03K23j70pK29l40L92k61j58O98o18m0P01n18
4099d9Q6K00m93K50r4J80P2k67K25k6k72N25m89JO69p81J41M46o31L80RLJ34k60
4123d1Q4J03j31L94l70O7L19p34L71L05o37N94k95j96L20m31L95jj28J67k55l35
4145d35P85n38N1N20o32M47M4l48K26k05J21k3k16M04l32l6M81p08K35L23n27
4166c63L03L03m36K88j61N6kk50N31k25k41N88p51L56M72q11N04L3l86K66J30
4187B04l63L00l36L73m20J58L06n73L09K05n19M15K4m44N08j94K6Jj32L16j08
$$ y = [431, -198, 137, 44, -32, 190, -216, 19, 53, -228, 237, -257, -245, 386, -337, -109, 261, -394, 114, 133, -286, 110, -164, 23, 100, -208, 55, 113, -253, 330, -156, -18, 65, -253, -47, 107, -260, 269, -219, -187, 3, -406, 196, 88, -264, 106, -142, -222, 137, -311, -17, 123, -180, 43, -127, -134, 95, -245, 147, -114, -272, 426, -192, -232, 469, -49, 37, 237, -256, -6, -100, 80, 152, -115, 110, 84, -188, 337, -152, -151, 518, -263, -122, 324, -307, 73, 82, 85, 219, -41, 43, 146, 15, 409, 39, 106, 425, -309, 62, 367, -270, 324, 29, -167, 153, -278, 117, 116, -12, 155, -100, -435, 350, -188, -137, 383, -249, 198, 242, -106, 120, -85, 36, 13, -203, 201, -131, -167, 314, -394, -159, 164, -363, -60, 243, -193, 95, -66, -10, -12, -262, 269, 44, -197, 391, -360, -4, 468, -343, 161, 194, -192, 74, 204, -159, 141, -195, 178, -242, -84, 222, -351, -42, 163, -356, 59, 83, -361, 147, -47, -21, -20, -152, 164, 56]
4208E6j72M10m37J50J57n62M49J24l31N22l09m54N65l33K04r4j30K62n15L26M12
4229C00q28N59J06m64N85j62l36K16j77K47j09j04L77m67K73Ol75L85K16p43M70
4250b5J13l31K94j77r6Q3k1M33l67K50K21o84N50K63r41O90m6n51M13J13k51N0
4272a7O4J96m98L42L40q00N36L8o33O46K43q92O44j82j85L23k29o6K68QJ33m02
4294a23Q9N04r58R11r0n77O37k84k69L15J0j94J06M2Mk03K20Rn83P11o1m39M87
4317B64j82m21N56k26J38j27o2K78n89N98j56m90Q15k00n81P95k70n91M96L7l71
4338b89K62l8O4m44O45r8m87P14k48n47O18j85j33N27m20j82J70lJ75k08J05L1
4360B9k24L76j35k67M16l22j79O27n07o0M40l95J84L6k15L91m65L01Q1m93N87
$$ y = [56, -116, 294, -143, 7, 164, -398, 51, 175, -156, 366, 57, -397, 168, -165, 39, -55, -185, 77, -438, -112, 300, -528, 31, 137, -327, 258, 96, -240, -24, -201, 46, -63, -167, 210, -257, 16, 22, -353, 32, 248, -495, -25, 88, -243, 51, -126, -222, -139, -160, 273, -94, 156, 377, -307, 243, 506, -435, 255, 209, -342, 71, 184, -67, -17, 47, 243, -255, 87, 427, -373, 163, 201, -432, 214, 457, -435, 209, 27, -158, 165, -64, -130, 138, 146, 279, -123, -34, 470, -488, 423, 333, -244, 393, 109, -160, 155, 165, -29, 77, 119, 123, -80, 140, 149, -434, 277, 216, -223, 264, 82, -339, 217, -9, 129, 2, -60, 218, -371, 227, 71, -419, 396, 196, -385, 410, 140, -451, 45, 82, -289, -27, -65, -1, -445, 200, 102, -385, 329, 81, -466, 152, -33, -166, 361, -59, -241, -71, -74, 101, -107, -2, 29, -195, 181, 46, -221, 195, -127, -306, 321, -186, -246, 194, -201, -17, 19, -196, 195, -270, 31, 112, -381, 206]
4381B06j58l82P08m17L0P0k83J99j17J77J0j50J08M7l62N18j38k98O04m97k13
4402c38M79m13J96J17j07K57k96L46q3o26O35j18m02P26n02o9M31l39J10N3j14
4423e7J06l13M24Km30O31m09l68P06k29j60L44n91K33L01k07K29k47j22K70j79
4444f6L09k02l23O45m23J8M36m47J46J04n21M86rj58J77l33K53L0l55N76k27l28
4466b12N02m34J94K7l13J46Q6K15J08n20L87q1l24N39l80J88J31l77p9M79m22
4487a40J45j00j13L50k58L00k28j19M58l70PN15p34J49L09o07N36j38k06L89j88
4508d3J07l9m12O31l68l8L67n10K76J62l03K22nk22L76m04J56K66m29K66J77l56
4530a23K06k15O7J02l23L55k09k13O42n35L04L1k36J51N6l33M13j59j10K29l22
$$ y = [206, 48, -334, 374, -43, -13, 57, -226, -27, -144, 33, 43, -107, 1, 48, -314, 204, 66, -232, 372, -125, -338, 141, -272, -76, 41, -66, 191, -105, 241, 158, -468, 167, 49, -353, 373, -129, -198, 233, -106, 4, 57, -57, 49, -264, 160, 162, -268, 363, -46, -414, 292, 63, -97, 247, -344, -111, 190, -17, 212, -35, -157, 113, -66, 243, 41, -282, 363, -60, -42, 394, -53, 93, 197, -324, 162, 153, -5, 172, -161, 92, 122, -233, 343, 116, -212, 290, -144, 50, 77, -236, -90, -4, 211, 319, -201, 186, 105, -219, 320, -60, 128, 259, -118, -197, 282, -140, 5, -95, -208, 142, -116, 184, -44, -163, 295, -75, -68, 447, -287, -138, 171, -436, 100, -38, -244, 145, -43, 64, 25, -387, 244, -124, -162, 205, -305, -29, 133, -170, 52, 47, -175, 201, -203, -47, 219, -210, 56, 233, -123, 83, -132, -65, 37, -286, 69, -140, -353, 289, -246, 58, 89, -147, 4, 60, -273, 140, -19, -129, 100, -222]
4551b22K76Rj87K55j17m4K98l36K15j55k40O17l14k38O78p92N09R3o31L52L0k37
4573a81K03k33M64l16j66M75n29J59L78n63L12L2l79O07j47k05L04m00K60k0l40
4594b85M10j72j19N96n41K44J10n17N11k88j38L42j19j52K35k99K57j71p1M72
4614C05n03K13J11k02K89j57j44L13k27Nm4j7J49n9j1K84p30L81K97l83L24r8
4636I6k75N10k43j40R3qJ92l04K4L91l44J32J79m84K79K9k33L10lk18K39k34J40
4659A28K2k03K83k58N1J91m00L24j96n8K58k11m0L29m56K90j54j5K33j70J48k9
4681F7n25O36J6m69L57j04k24K75j41K17j47J07J01l40JK34m38M07m6l44M43j32
4703d9j53L24l47J55J3J5N8k96J26J79k59K78P7m16K63J11k11K85l13J43J24l97
$$ y = [-222, 54, 63, -124, 131, 14, -30, 268, -68, 147, -8, -248, 369, 55, -183, 495, -297, 212, 305, -326, 26, 56, -181, 22, -211, 253, -63, -229, 246, -283, -124, 254, -309, 3, 35, -344, 263, 116, -89, 215, -185, 75, 55, -285, 125, -47, -166, 430, -111, 133, 243, -274, 237, -51, -189, 153, 34, -118, 117, -182, 75, -96, -167, 305, -198, 15, 126, -76, 213, 56, -88, 225, -2, 3, -41, -58, 91, 32, 21, 305, -425, -44, 253, -130, 194, 96, -179, 331, 88, -52, 41, 33, 225, -79, -55, 336, -8, 124, 303, -181, 98, 127, -106, 204, 201, -17, 222, -12, 128, 150, -53, 230, -28, 23, 214, -186, 138, -58, -116, 142, -69, -109, 220, -236, 54, -100, -115, 118, -52, 96, 67, -458, 178, 194, -275, 82, -22, -246, 29, -112, 105, -42, 65, 166, -174, -173, 61, -377, 30, -16, -360, 83, -49, -202, 122, -225, -70, -57, -42, 16, -280, -154, 25, -234, 44, 121, -295, -32, 79, -132, 153, -160, -17, 107, -290]
4725b90L98k62J0J84l28K21J49n25O96K5l91L09j71j24L51j88P6o2%R6m27N66
4747C13k00l94M85k24k36L86k38j09M68m83J13K33q3M3n33P49k67m02Q08l97m46
4768d14P59m53j09N84m94J28J57l49K55q5p7K18m21M21q8m13O42l17j44M37l91
4789a54J23k4m0lq8K92P6l70K45q5j12M83m24j64N05n21K11J68m0j1k33J60J40
4812A34m86O41k11l33P24n85j77P12p24K05K52k63J86L6J30k45k93O63l00k70
4832b04O37n75l0N19n45P0M86n09J37J55k66K28l33K98j78l22P15k56k58N68l94
4853e7j37L49m55J87J25j85O7P3J31k07j78N68m13PM86n11l3L28k48M0O5k51J83
4876f6q9J69k01j32O26m18k32N49m36J08L36n38P5K47r1J58l48J51J55k90M76
$$ y = [-290, 108, -154, -144, 40, -288, -67, 82, -443, 253, 278, -113, 196, 25, -99, 252, 64, 140, 78, 78, 174, -253, 313, 113, -281, 204, -20, -256, 130, -108, -217, 251, -232, -119, 114, 31, 74, -459, 290, 23, -379, 429, 32, -414, 345, -108, -217, 367, -127, 1, 158, -191, 64, -21, -98, 120, -301, 120, 32, -381, 261, -56, -200, 237, -154, -31, -55, -95, -98, -186, 106, 182, -188, 57, -28, -140, 343, -81, -245, 260, -261, -50, 118, 78, 67, -166, -6, 134, -352, 289, 78, -255, 469, -116, -293, 419, -305, -100, 152, -111, 75, 111, 241, -4, -297, 366, 66, -204, 433, -142, -172, 347, -198, -128, 358, -151, -14, 141, -125, 103, -230, 68, -110, -432, 283, 27, -231, 337, -57, -194, 155, -300, -113, 12, -173, -106, -33, 98, -109, -287, 281, -132, -125, 361, -150, -183, 145, -103, -63, 2, -249, -66, -155, 14, -187, -319, 307, -111, -343, 206, -230, -122, 214, -324, -249, -2, -93, 65, -283, -132, 23, -267, 209]
4897B09l45J4N19p52L52J75m63L41J19l35M47l80P8k1P7J43j46p2M63n42N9K79
4919B19l85K51J09l17M8J40j87K75j28m0P5j09K48p0k32L30n15K56K47m51K75
4940C9Oj17L9K8J79p2l74O57k75j59M47n33K8M07k97j11J19j91J93m2Q7l2k64
4963b38K73j64K22J55n58K70K46n22M41l5l56L86j49Q1j06n1K20j72R9J43l94
4984b09K03J55l35L61j04j3J49l35O2P8l59N06n8l52N55n52J80K83m10J97J93
5005A95j66K65l67o1K10k00J95j30j02K93l09j80N83m79L01lr9K7O1k02P5PR1
5028EK1j53J58j58O3K72m44M22r2k78J19J81j65K07j12p7o2j8P9k44L26m5k70
5051b65J01J39k69L96j82l85M83j45O9J31k88L13k17j10M63k14k6k5j06K51j93
$$ y = [209, -136, -122, 397, -355, -3, 172, -291, 50, 169, -166, 281, -99, -21, -42, 35, 178, 32, -40, 423, -119, -60, 219, -166, 85, 194, -123, -75, 65, -122, 153, 25, -15, 60, -49, 199, 129, -103, 227, -288, -32, 215, -236, 39, 45, -72, -33, -5, 174, 102, -272, 385, 110, -49, 398, -135, -107, 300, 3, -108, 11, -180, 13, -29, 58, 26, -238, 35, -129, 93, 248, -310, -40, 206, -316, 125, 90, -266, 120, -29, 52, -54, -105, 115, -57, 42, 185, -209, -6, 149, -186, 175, 71, 58, 207, -128, -66, 12, -347, 159, 101, -251, 304, -248, -68, 215, -195, 2, 195, 29, 294, -73, -134, 76, -124, 71, -59, -161, 132, -177, -357, 226, -253, 48, 45, -54, -27, 34, -168, -93, -86, 5, 26, -127, 31, -127, -64, 208, -236, 186, 94, -184, -65, 116, -49, 158, 46, -31, -93, -111, -32, -276, 50, 5, -265, -164, -25, -294, 102, -80, -465, 18, -127, -58, 73, -215, 98, -119, -229, 234, 20, -6, -31, -137, 114, -79]
5072g9j9L50m29K71M2k70K73j69K9L73m94Q0K28m37L50p3j92L95l38J94M8k74
5094a41L67l18J4L39l23L9K81m56K90L5l39L49k20n7L00k21J85j00q5K66l37K31
5116I9J65m24M38j60m00M32k39M6K78m02L06o9k29L11l17J31R6j09R9J21m22M00
5138A51k74j40L75k33J69J12k30M02n72J45N6j39K28J41n01M07m6j80L04j15k2
5159C8o7r6K97k44j21L59n13L23k0M8J68k53q4L78k96J61Kj41O1j64M1J05j08
5182a26L05o6k55N15j72k22L04k05j36J60n0j1j88j7O9P6k4J24k21K37k29j23
5204b55M57k68j75L95k55K11j07Q8O8k74P7K8l29M07p2l25N82l09J31j18j99J10
5226a32K80j63J8r7J04l8k22O21l03l49M92l98Q2Q0k98L21O3j10Q4M0j30J28j70
$$ y = [-79, -98, 252, -177, 94, 136, -134, 139, -30, -1, 372, -122, -42, 186, -251, 99, 26, -166, 229, -109, 85, 133, -141, 226, -92, -78, 261, -62, -23, 258, -198, 92, 127, -212, 137, -83, -140, 160, -61, 124, 24, -61, 205, -132, 99, 264, -160, 278, 118, -282, 150, -89, -43, 235, -167, 139, 70, -159, 152, -165, -34, 62, -47, 52, 173, -249, 151, -123, -263, 112, -121, 48, 160, -70, 332, -240, -95, -39, -178, 50, 191, -310, 97, 51, -129, 175, 60, 38, -29, -125, 172, -72, -193, 166, -347, -24, -44, 4, 172, -81, -165, 213, -83, 78, 80, -61, 0, -164, -123, -18, -126, 179, 113, -142, 373, 201, -21, 283, 78, -58, 102, 52, 41, -147, -164, -95, -19, -43, 81, -140, 97, -132, -255, 202, -66, -241, 154, -101, 110, 3, 91, 159, -115, -38, -10, -339, 68, -4, -329, 253, -56, 75, -43, -242, -132, 148, -15, 3, -94, 10, -28, -250, 371, 68, -281, 211, -187, -105, -25, -323, -2, 61, -49, 35, 75, -55, 73, -97]
5249i7J81j53j62L85j45P0J05j04Nj16j35K41KJ25j8k17J85M4k33K73l33j39L91
5272A55j39J8M4k44L51l0k27J67j22N7K24l49L39l12k31N03l38K30O6k42J26K13
5294B59j84j50J70K08l62k27N86m56L5L39n26K36L20l40R7R6j96J71j0j06j1j05
5316a56L59l78O3K97k63O3M5l57L47j16P4o0J05J49j76m4J43k01O9K42l26R7K37
5339B13m68J75J39j62J21l9P5q1j49K83j06k30L45l47Q4M22m74K03J55l08K04
5360E5l8pO4k53M31k26l6L00m69J43M69o19J40J80k96K56L3k74J41N1j38Q1m1
5383e3J10j50Q1J74m64M48J06m69J83J45l44K31j24R8J46p7j5J9j86K74k26J54
5405F1J84n06K68q4J69O4k72Q7j68k7M64j99m0K70m28K91Q5n38L93K61n05R9Q1
$$ y = [-97, 84, -69, -231, 154, 9, 79, 184, 80, 85, -31, -166, 75, 77, 202, 184, -33, 152, 196, -37, 236, -97, -236, 155, 16, 34, 78, -166, 185, 155, -72, 95, -27, 30, 254, -95, 244, -68, -299, 204, -134, 96, 162, -80, 46, 259, 75, -75, 95, 303, -59, -286, 300, -156, -121, 218, -308, -72, 248, -92, 5, 101, -95, 76, 66, -40, -51, -156, 203, -175, -112, 185, -78, -15, 30, -327, 20, -96, -22, -82, 23, 172, -4, -48, 95, -106, -37, 205, -121, -24, 213, -255, -80, 59, -103, 18, -21, 54, -27, -176, 107, 1, -229, 116, -231, -147, 275, -199, 4, 159, -149, 55, 17, 10, 74, -179, 252, 26, -10, 290, -179, -36, 433, -186, -46, 134, -162, 94, 127, -147, -6, 45, -93, -12, -53, 57, -93, -12, 162, -302, 146, 252, -217, -34, 111, -233, -2, -126, -28, 118, 41, 26, 45, -141, 133, -93, 61, 245, -261, 7, -77, 92, 156, -116, -29, -197, -224, 240, 41, 1, 271, -157, 134, 219, -319, 74, 335, -170, -71, 10]
5428A0J73j02k07J80k40K40K65m47K60N5m55N75J8m28K65j74O6q3O5Q5j40J42
5450A23J33m02P0K73k31J81K1k46J71k69K16J07j81N5K3j08K16j56M9O7k07K96
5472B01o6l53L02r2O8J69l59K91j54j87K74k43NK00k25K41M2l83J95O1k01K13
5494ak8Lj1j02K33k04J03R0l61L94j18j56J73j53O3J46k08K06O1o2o1n3J3R7j43
5519g9K18M1m70L83k74l0J51k51K19N3K2J5n7r6K18k48K04R4k46L10j80N1K18
5542B66k98P3Q6k20L27k56J09J50k94n1L36k07O2l1k52L90j94m8R1r1J05l2lR3
5566A11l24K56J64l40L29j72j25J06j99J17J44j51K60j65KL8j09J43j15j92L12
5587I0k08r1L34j0j16Q8m4j03L6m6J87p7R1k4l12J13K44j42K42k48Q8%j24J00
$$ y = [10, 183, 81, -126, 54, -186, 54, 319, -128, 132, 187, -268, 307, 325, -103, 162, -12, 54, -29, 36, 121, -19, 123, 256, -146, -76, 197, -34, 147, 168, -78, 93, -176, 40, 147, -34, 21, 44, -64, 152, -4, 45, 112, -95, 201, 135, -218, 84, -8, 60, 229, -130, 161, 7, -180, 94, -149, -144, 56, -169, 72, 114, -269, -74, -13, -214, -1, -29, -26, -37, -139, 94, -110, -7, 83, -278, 116, -2, -158, 15, -138, -75, 71, -137, 69, 130, 68, 7, -46, -33, 64, -79, 139, 180, -290, 93, -181, -211, -60, -311, -92, -39, -17, -2, -59, -155, 63, -185, 19, 113, -133, 177, -3, 48, 266, -32, 41, 127, -93, 234, -22, 87, 237, -57, -108, 228, 21, 83, 52, -200, 190, -4, -52, 39, -52, 53, 21, 18, 111, -213, 43, 207, -133, 196, 24, -101, 5, -194, -77, 67, -84, 176, 11, 13, 51, -58, 85, -30, -222, 90, -118, -209, 125, 115, -1, 87, 43, -60, -24, -70, 117, 40, 131, 107, -205, -92, 152, 10, 252, 4, 92, 92, -32, 68]
5611F8j13k56M85m64K33Or3J97j03p5K35j32pK4k6K6j57R4L0J4j14K98j41m0J50
5636A39k64J60N7p0N1j94P2M7Jr0N3QK13k15Q0L0j22J99k61j5L22l31j2K77k46
5661a11Q2L4j39K01m77L11N7j02L75m01L0K05k54N7K11k10J61M9j29P6j01J1O2
5684bj79K54J6k47L12k70L6J49l29K12J21k24K18p1p6J56j24p4O4q2J13l8PL6
5708b2M0J52j46j5J04k27k5J03j19M95k13j21P2l0r6K76l11J25nj13J91r5j67
5731a47K12j80J89p6O5K39l09p3K25l01K36M1r6p4L3k4M6n7J52r9k14K83k08M2
5755i5K26k81K8O1j53K20k9R5r6L3J07k03L6Rl5J17J83l94K66K5j42J1L4l4J3
5780Bj30J06J1j60J64J36k02P6j0Lk3k25K78p9j19L20l25J53Q7j29O2p3M7J8j28
$$ y = [68, -45, -301, 184, -280, -47, -41, -134, 63, -40, -115, 120, -12, -19, 5, -21, 5, -152, -58, -28, -14, -128, 170, 29, -11, 139, -125, 35, 92, 22, 73, -121, -49, -2, -1, -91, -38, -30, 183, -32, 48, 78, -44, 155, -106, -121, 201, -130, -142, 135, -111, -29, 5, -134, 67, -410, -99, -42, -144, 231, -170, -140, 65, -189, -132, 79, -131, 30, 79, -50, 26, -75, -64, -2, -181, 73, 89, -158, 154, -116, -80, 69, -260, -48, 73, -151, 67, -4, -80, 76, -48, -122, -58, -140, -27, -65, -58, -22, 18, 170, 24, 9, 113, -114, -139, -36, -155, 340, 127, 6, 78, 48, -48, 228, -83, 42, 37, -76, 115, 20, -147, 65, -115, 74, -2, 63, 302, -7, -80, 145, -156, 80, 121, 25, -49, -16, -40, 6, -51, 101, 2, -212, 71, -137, -95, 131, -150, -122, -61, -214, 6, -23, 72, -24, 9, 116, -87, -51, -42, -77, 40, 223, -171, 95, 120, -22, -11, 23, -11, 2, -128, -22, -11, -171, -7, 129, -73, 3, -7, -4, -27, -252, 26, -53, -172, 148, -177, -24, 63, -66, -4, -77, -30, -12, -140]
5805a40J85j03j14J34L8k63L02Q3j84R1r8J95k16o2L42m18L99j69M7o3P1j8j48
5828a09J86k11K63q4l0k12K81m2j67J82j8k35J32J84k50J71M5k41K68j27o8K3
5850e9Q7J29q8n8J53k42J55O5k47K37j61p8J18o4q4J56J7p8j42J64q9j09M13j34
5874F1j68K76k89M4m4l0J98J02j74K22l18K21K07j96j89K47l07K43nj78N3N1k8
5897aJ93k54jJ70q3L9r9K71j32n44O08j49j59J76Q1p3p6K3K37k46J07P3l75L63
5921A49j78r5K93r2l56M48o5k43K67k52K55j37K1Q9j09J77n6j36K81k32o2J96
5943A63j26k90J62J4J98j45L5L9j33J6J73j53J87j12j64J30r4j15M32j96m3K6
5965Dr2J73j03l8R1j82J57j34j42M78m14M0L55k86P1P4j24j59K50J01l3j32J66
$$ y = [-140, 45, -58, -172, -38, 0, -263, 39, 122, -62, 29, -69, 126, -90, -152, 190, -228, 171, 2, 49, -14, 57, 39, -109, 77, -134, 129, 45, 15, -197, 84, 42, -125, 57, 39, -196, -64, 120, -130, 41, 86, -155, 113, -14, -82, -59, 28, 157, 69, 11, 164, -78, 77, 142, -105, 132, -29, -107, 11, -53, -137, 19, 36, -42, -184, -20, -109, -218, 195, 61, -107, 169, -120, -76, -120, -150, 48, 150, -24, 198, -120, 101, 308, 112, -77, 170, -137, 106, 101, -77, -24, 27, -1, 192, -62, -63, 107, 24, 63, -36, 235, 103, -441, 167, 18, -141, 35, 116, 43, -33, -10, 227, -19, 88, 161, -214, 149, -29, -124, 169, 77, -279, 169, 104, -139, 128, -124, 131, -6, 15, 104, -5, 172, 116, -20, 261, 29, -33, 163, 37, -253, -91, -77, 121, -24, 11, 50, -83, -67, 106, -47, 140, 28, -136, -6, -100, -215, 217, 21, -22, 4, -88, 85, -18, -56, 35, -147, 10, -124, -266, 212, -202, -162, 193, -93, -22, 52, -72, -231, 19, 120, 87, -45, 121]
5988A21j92j07M61k69l9K69m06J64p1j46M71l20p6Q3r4J01NR9K3k15J16J36j02
6011A2r8J78k25J94k29J2K95j82j8M58l38J23j20l59L42k08P4J18r7N0k8M1J59
6034A54k48R5Lj89K49k37O3J47l45K45J73k66J78j17O8K1n0J6QpR9j19n4L34l49
6059a28J35K25m17L84n4l05J87J21k51J69kL6j26J39k7k61j5K63o4O2p1j45N2
6082i3j1n6K76k10J17j9q1K37mk01K72m75J90K37q1l9k55K30P2p4K17o6m38L83
6106A28q3q3Q9j85J55K48k41pP9q5Ok61K53k1r2M56m52K12l4k15K01n9j82J65
6130hPk91L58m1O7n1k84L65q9J9k47mJ01N2K4L4N9j72J5K27j93n8O0Q9l4jk4n0
6158g0J99k02J9O9j42L6K43k04l6K39l11L01j41j83K56k08%J29m1P3r3P4M7r0
$$ y = [121, -71, -178, 283, 14, -25, 244, -162, 2, -69, -215, 256, -64, -140, -57, -151, -50, -45, 54, 77, -138, -22, 114, 12, -86, 92, -133, 61, -168, -156, 139, -43, -61, 397, 59, 182, 62, -297, 45, -163, -89, 29, -68, -18, -46, -5, 154, -94, 1, 4, -185, 64, -173, -110, 37, -308, -63, 110, -156, 22, -95, -27, -6, -56, -40, -32, -39, 60, -59, -113, 221, -128, 7, 232, -185, 199, 145, -160, 27, 148, -103, 66, 64, 100, -26, 113, 86, -175, -190, 73, 9, 71, 0, -145, -93, -104, -160, 116, -94, 23, 4, -77, 160, 156, -45, 227, -248, -58, 179, 98, 59, -196, 34, 106, 32, 249, 183, -255, 128, 45, -38, 51, -134, 21, 269, 28, 21, 100, 15, 21, -240, 13, -8, -100, 356, -96, 116, 82, -133, 68, 9, -173, -8, -1, -292, 66, 25, 92, 41, -243, 122, 33, 52, -195, -199, -98, -46, -22, 12, 71, -101, -86, 141, -52, -110, -50, 39, 5, 4, -20, -70, 129, -73, -54, 15, -127, -91, 152, -52, -88, 151, -160, 141, 0, -183, 73, -135, -135, -6, -47, 26, -67, 7, 54, -36]
6182c6p2J1q8K80j15MJ93j54J49j42l1L6J59k72J62j09j14K94j92R6j05j20L53
6205A87k39K7N1j81K25%k87J03K24j46Q2Q9l9P3l23K55j65o0K03l20L96j19j18
6228h2J92j20j15L06l58J47J5L8J52j74L2M9m8q0L3j51K53j94J54M8j58K1L6j05
6252a09K14l20J33K53k67J7Q6r6k9O0kR1nj11P0k8L8j28J89J02j99j85K02m3J54
6277H7j10p2L4r0J86j27J43K24k40j30k9J34j8j3j82K74q0j77L29o5l24J66k1
6300a01J91j67J04q5J4J28j31m4J29j03n6L18k66j0K46l29J87J69k39Q0M3n9j
6323A8n7J41o1k28J84k8r6J65Pj49Q0k62J89J00M6r4n5K3O2p0J78j5k00J08J11
6348I7j92K65j10j81N5o3L25k53N2Jo8N1J50l15L20k66J70L1q9J08r0N3N1j09
$$ y = [-36, -108, -97, -185, 95, -20, -16, 177, 23, 172, 30, -1, 35, 194, -78, 84, -25, -139, 155, -37, 59, -46, -166, 187, -52, -25, 26, -155, 70, 70, -217, -114, 110, -36, 46, 135, 96, 169, -154, 101, -64, -124, 79, -241, 155, 36, -82, 110, -10, -125, 181, -177, -30, -15, 23, 175, 1, 33, 82, 34, -46, -13, -164, 89, -105, 49, 97, -61, -40, -4, -109, 105, -215, -82, 171, -96, -79, 7, -89, -118, -58, -60, 31, 26, -85, -15, -43, -5, -133, 56, 158, -41, -226, -24, -67, 87, -23, -95, -61, -151, 35, -92, 51, 275, 35, -95, -124, 10, -8, -21, -203, 71, -9, -186, 143, 78, -246, -80, -101, 90, -77, 27, -58, -44, 84, -47, -91, 38, -65, -121, 197, -69, -79, 167, -162, 25, 194, -45, 35, 78, 19, 18, -39, 102, 41, -187, -3, -31, -127, 38, 45, -104, -24, -286, -97, 3, 49, -45, -100, -77, -15, -85, 93, 78, -122, -14, 97, -95, 170, 60, -121, -66, -129, 196, -57, -5, -4, -72, -21, 129, -186, 134, -132, 38, 69, -20, 88, -2, 51, 102, -7]
6372gj01J99j67J41j64Q6J08k36K4K6n1J08K04k26J23j89J60lj47K54j47k5J57
6395A27k09p5K82k81K16Kj52K41j50J39r7j2J16j50J21J89m17J25K4p4R9j13J29
6418H0j09J2o7N5k3lJ60j13R6j21P0P9k31K62j64j63K48j13J30o4j43K46J1j24
6442A1J04j36N2M9k16J32K22k01J35ll87K51Ql2j26J21j6l3m5K36l73K22J48j21
6466Bo2M3j0M2j83K17m6q6J97J5j27K81l41J24k38o9L46j0j12K16l20Q5Kj12K67
6491A21m01K83P1q1o6J21n1L5l1M9J72j95m4L6k55J90L4j44J89j45J04Q9j43J51
6515H9k90R4J37j38J10q0m4l8K30k49L07j83K10Nj05m2k15J68J51j07o2K29j81
6538dk2J32n5J9k66J14K35n26M17p0j01J11o2L7J32j96K82o1k06J16j95K19m8
$$ y = [-7, -108, 91, -76, 65, -99, -13, 95, -141, -117, -91, -142, -34, 170, -56, 67, -122, 38, 35, -112, 142, -5, -30, 127, -82, -157, 125, -156, 60, 62, -90, 151, 1, 140, 43, 31, 147, -3, 118, 307, -110, 15, 39, -35, 64, -49, 80, -29, -17, -84, -29, -52, -55, 105, -8, 88, -33, 37, 116, -115, 147, -17, -180, 68, -45, 85, 21, -122, 124, 135, 11, 115, -21, 31, 80, -136, -4, 218, 17, 152, 149, -238, 13, 21, -11, -137, -16, -32, -65, -110, 126, -247, -25, 123, 2, -60, -17, -27, 15, -168, 49, 3, -83, 114, 129, 2, 283, -58, 66, -172, -241, 105, 95, -17, 199, -121, -36, -34, -146, 121, -280, 3, 74, -7, -73, 48, -3, 32, 1, 50, 222, 27, -17, 19, -236, -46, -12, -156, 33, -112, -8, 81, -62, 89, -201, -107, 30, -108, 2, -78, -122, -160, 70, -179, 128, -55, 155, 160, 55, 13, -202, -34, 117, 10, -52, 177, -4, -26, 106, 51, 70, -196, -82, 153, -373, 44, -26, -127, -16, -78, -41, 91, -105, 177, 116, -90, 26, -169, 50, 2]
6561Bj70J06J2j64K14M8j65J08J62j76J03k54K94j34o3J45k93K94Lj21Q6M6j84
6584a01J34j26m3K57j50O1j3p2M0j00J33P5j64L15j56k99J58p5K43p9j64R6O1
6607C1O2r1j06O6Nr2J43n6j9K84j14k56J56KO8j5N4K0k32L9P7m2Q1j26p3J60q9
6634f3R6j9m1Q9j26j07J31j29R5K29p1L5p8J9m1j63J97%k05J23K47j52m6k52J88
6659d4J59o6%k59J02J84j7j09J62j30R0j86O2Op0J88rj34J17m1j02J41MrK14m07
6685a54K47m4k26K21j44RJ11l9m9J37q3O3m9j50J47P2p1K04k58K25j96q4N4j29
6709a86J98L5kJ6k4j2P8k90L11q7n1K2N8j80M26m11K05k19L0L59k74j02Q5J14
6733I9j35oq2K29l16K03m7P2J00rj87J94j36J60j33n7O2p4k8j13K85m7j50l5O9
$$ y = [2, -168, -62, -50, -214, 0, 48, -117, -9, 153, -23, 80, -174, 120, -14, -77, 68, -225, 69, 72, -49, 37, 83, -101, 33, -93, -136, 121, -29, 32, 19, -53, -13, -113, 20, 95, -69, 246, 90, -209, -51, -126, 117, 38, -126, -30, 31, 93, 2, -104, -38, -33, -125, 18, -38, -57, 227, 113, -143, 13, 15, 83, 68, 122, 142, -90, -51, 26, -16, 65, -61, -134, 26, -63, 33, 14, -27, 62, -64, -171, -40, -169, -74, 155, 84, 119, 41, 60, 19, -144, 53, 53, -152, -29, 218, 66, 20, -232, -44, 115, 49, 49, -210, -108, 76, 59, -50, 112, -18, 72, -114, -52, -46, -116, 72, 63, -71, 46, 5, -97, 44, 48, 39, 253, -154, 93, 49, -177, 44, -100, -91, 20, -19, -68, 69, -14, 49, 0, -150, -3, 69, -2, 202, -56, 169, -27, -111, -57, -186, 12, 47, 45, 61, 37, 25, 103, -187, 124, 37, -14, 8, 66, -114, 312, -99, 106, -113, -83, 276, 2, -100, -15, 99, -36, -42, -124, 105, -211, -8, -55, 17, 117, 108, -79, 115, -21, 139, 6, -51, 11, -63, -91, -204, 81, 34, -116, -151, -82]
6758h2L4p6L16l39j16L29j18mJ36l13L42k29l6J56Kj54J42K0l6j68J16J89j75
6781f4O3J50m44K55K19k32Nq9r6K63k28J84J30j12J38m1m9Q0k01j08J53J8K6L1
6805E1o6K44k89R4J04j53Oj55J28J02Pj9m2j11R1j48L35l01Q3J69q5j43J13j18
6829a03Q9j6r1l3P7k2J23k9O6p0j55L24k35m4J62r3K8J94k42J52l7k06K40On9
6854B6q2n2J15Q1k14K55k05QJ21k57R9J23j74L03L3j16K6k09L2K12j65nP6M0n6
6879A5j45l3L35j09K7R7k2k03O6j25K59l19J05J36k98J54L6j06J80p6O7M8k29
6902a40K26j26P8J05n9m1l6j95J66J7M8J2r2Q8L9l33M02j33o3K3PJ11N7j19j26
6927h4J38M0o7j14N1N8KJ57k59K06Jj87rJ60nn2j77O2j5Q1j27J45p7oJ43j05O5
$$ y = [-82, -48, -124, 192, -147, -263, 66, -52, -56, 80, -233, 109, -120, -156, 0, 2, -152, -10, 10, -26, -194, -78, 111, -64, -1, 149, -295, -40, 179, -53, -48, -137, -233, 30, -198, -14, 116, 4, 142, 101, 52, 132, -69, -177, -24, -6, 20, 51, -15, 229, -60, 34, 138, -15, -9, -164, -36, 66, 73, 54, 12, -99, -8, -156, 179, -122, -39, 130, 45, -98, 15, -103, -14, -30, -121, -154, -77, -99, 24, -5, 61, -9, -164, 160, -75, -119, 43, -50, -22, 172, -70, 82, 45, -161, 79, 85, 26, -56, -108, 7, 88, -126, 129, -76, -68, 53, -204, -105, 18, -156, 147, 180, 64, 90, -119, -87, 125, -40, -45, 31, 71, 15, -130, -163, 172, 63, 90, 187, 165, -38, 28, -97, 162, -157, -52, 84, -214, -60, -24, -130, 50, -26, 41, 89, -140, 86, -40, 38, 143, 84, 43, 7, -188, -22, -5, 43, 55, -37, 51, 90, -243, 159, 26, -37, -14, -7, 104, 161, 42, -84, 54, 94, 27, -87, -36, 22, 24, 181, -78, 128, 129, -58, -67, 93, 88, 36, -141, -79, -94, -13, -140, 5, -72, -78, 65, -40, 25]
6954B5j89J59J42j49k9J41q0J48j66k1r9L4j6O0l7R5P2k2j35r6K46j05J8J30l40
6979b14J39L03k74O9J1p7J08K18n19P3J57K2j12R7M1j8Jp7P7J24j68k1J70k48
7003a18J09O7o1j46J76O3j36n6m2J66J43l26Q9mK26j63K63j32j85J24o5k72M47
7026A67p7j25J34j49J4J24r8k1k2j45J63Q5J22j59j90K00j34J18O8j38j6J12k1
7049A2ON8Mn9j52J18j35J79o0K8M4j05N5K06j92M3J35j52j20K64k81J39P5j71
7073f1J21o7J90p5n2o9J74k61L26k52m0J19o7p6N5M6jJ64l44K41m2N6j51k3K13
7098A24k05k4J23p6j00J52jOJ50j42J1L1n4K02k92P8J68j09j67J41r6Nm8M9m8
7123a22J26K6O2l83L21RM2m3j75L03k1j56J7l9j59K46j66J50r0KK05l35K40o7
$$ y = [25, -164, -5, 137, -12, -41, 100, 20, 168, 2, -19, -118, -84, -100, -40, -77, 18, 90, 68, -67, -163, 83, -22, -4, 126, -214, -75, 228, -46, 23, 34, -43, 65, 283, -236, -163, -6, 16, -96, 1, 42, 24, 25, -52, 25, 149, -19, -40, 130, -118, -9, 58, -3, -149, 27, 90, -46, -102, -144, 22, 165, -161, -72, -76, 150, -13, 250, 118, -67, 57, -8, -280, 167, 90, -35, 99, -50, -36, 88, -10, -31, -53, -198, -35, 50, 172, 13, -177, 23, -111, 7, 75, -63, -79, 33, 12, 18, 76, 80, 21, -131, -13, -148, 31, -29, -1, 43, -62, -7, 199, 7, 50, 185, 33, -87, 177, -104, 35, 110, -61, 60, -7, 183, 108, 56, -13, 161, -100, 226, -26, -66, 53, -14, -90, -35, 11, 10, 174, -170, 71, 29, 85, -66, -89, 124, -81, -105, 18, -58, -158, -6, -7, -1, 149, 7, 18, 49, -5, 197, -95, -17, 151, 42, -125, 16, -80, -75, -123, -74, -122, 4, 30, 92, -291, 30, 39, 81, 38, -137, 166, 145, -11, 6, -33, -192, 54, -112, 38, -52, -50, 155, -180, 60, -7]
7147gOj4n1L3L9j06P7Q8o5J16j07R2j21R9j87J59k4Rj04m3J62j83K08m1k00K04
7173C9n5j44K12p7r2l6N3L12k11j79J47J14n7J41k08J06M1j75M4KQ3j43K63r3
7197H7j08L4J25k48r8L68k64K04p7qJ2K5o0kr4K01J53m77K15N8k03K0R2l7N7J6
7223iJ37k55J0J71k7o0k9J21R0q7j15Q4l0mn2Ln0J90j78J24J27j32oj12K12j13
7249A0j47J12Q5q3Q1j73Q8Q8j54K34n4n0J8j77J89N8j05M6p3j08J53o7k0K6J94
7274A71k26J44o3O3j34J33j5j42n6J41l9J25k10R3P2k21l9J05K6J02L5J53m38
7297b20J10L1O1QJ25k48K18r4J1O4n4M7j59K09n2m6j06J84k54M0J44J04j01M7
7321F9j53n9J13O2pp9KJ03j7R9j79o4J02K9L2n8k7j17K09n7K20k95J35J2l17J80
$$ y = [-7, -1, -15, -66, -33, 6, -100, -23, 65, 0, 116, 9, 101, -20, 79, -108, 51, 27, 36, -68, -111, 51, -132, 76, 35, -165, 39, -16, -160, 52, -25, -117, -153, -100, 212, 1, -178, -31, 83, 26, 167, -41, 65, 106, -69, -25, -23, 60, -83, 180, 87, -21, 13, 138, -110, -208, 160, -104, 100, 23, 15, 27, 52, -8, -10, -104, 97, 250, -227, -12, 46, -157, -137, -45, -82, -25, -9, 128, -127, -117, 54, 27, -33, -62, 59, 149, 62, -53, 31, 1, -3, -55, -52, -102, 88, -90, 34, 161, 29, 23, -89, 123, 10, -137, -25, 60, -23, 58, -115, -27, 61, -93, 141, 87, 37, 55, -122, 67, 125, 20, 66, -7, -115, 38, -29, -49, -23, 171, -55, 89, 26, 89, -45, 88, 73, -69, -125, 16, -23, 102, -108, -15, 57, -164, -203, -98, -72, 30, 65, 218, -220, -110, -79, -18, -10, 115, -133, 85, -9, 2, 66, 12, 59, -100, 109, 57, 11, -95, 89, -165, -125, 19, 123, 22, 69, -84, -143, -30, 32, 25, -54, -52, 51, 34, 133, -46, -110, -8, 21, 53, -5, -32, -149, 60, 3, 223, -72, 63, 75, -242, -62]
7347f2M3M8o8j42K23P1nj40J10j64R4r2J18j69J29l0J8l5J16p0O3j01j34K76j09
7372a2P8o5j36l7M9m0K49l05K12M4j26ML09l26K86r8k88J83q7oJ36l6j42J14K4
7397a6n3J4R3l4j67K59M0k78K6k2J97J1K4J0j10n7j6J79j11L7q7J07j10j4K4M
7423e0P0Q9o7j48J05j26K81j70m1J35J0j96L68l80K65o0L1l9j13K24j53j22MP4
7447iJ13Q4j66k11L80l79l5K68Jq2p2R2l2j37Q8J08k39N1O1K58q7o4M8l8j05J02
7473bJ7j51J27J01k3M7p5j4j0l3L6j59O6J17m4L4l7P1r6n2J67j37J4L9J64j59
7499HJ16r5J1nn4j61K30k9j00K7%J79j27j37K19Ln5M9j41N7j33Q1l1K16o5j60
7525i7K92k17p8J06k5N9J23j81q3O2L9j91L68k03K58j79p6QQ0q4m7l7K31m4j11
$$ y = [-62, -19, 29, -39, -181, 42, 113, 108, -32, 78, -86, 8, -84, 34, -135, -6, -36, -18, -53, 63, -7, 56, -45, -179, 97, -12, 66, 1, -135, -172, -123, -163, 86, -219, -7, 37, -89, -85, 224, -102, 184, 86, -202, -19, -106, -112, 24, -12, -154, -40, -16, -69, -55, 38, 4, -163, 96, 136, -142, -116, -138, 59, 70, 94, 104, -6, -63, -79, 100, -11, 26, -61, 46, -64, -78, -54, -50, 20, 109, 42, -106, -1, -127, 154, -16, -57, 78, 88, -108, 260, -120, 145, 85, 116, 77, -36, 188, 35, -87, -83, -9, 104, 188, 22, -189, 191, -188, -223, 45, 46, -36, -108, -16, -48, -185, -97, 11, -228, -177, -116, 142, 55, -9, 39, 1, -104, -2, 15, -136, -9, 92, 69, 116, 41, 27, 17, -16, 20, -139, -73, 44, 0, 34, -3, 68, -28, -80, 87, -50, -36, 3, 167, 8, 124, 29, 40, 35, -19, -180, 50, 21, -79, -52, -52, 127, 0, -137, 82, 85, 30, 79, -62, -5, -138, -57, -88, 128, 63, -97, 195, -22, -100, 6, -19, 40, 163, -18, -101, -39, 0, -191, 177, -26, 232, 53, -23, -15, 65, -19, -66, -103, 128, 84, -27]
7550b7J53l08J31L5Rj67N5jR8k03K89m6k27K47q0M7K0n9J23k7N9O0k23j25L05
7575A38j52M1J16j59J03j59J16J52j05r6k0J1K17j26k8q2RK21l10N8J03m2j49
7598a43J99j90J27Q8J38k37lk1K05k49K33l3j63J33m9R0j19j2J26j17j54J98l1
7621A6J04m7O4k07J96j82N7l0n0l6K21j18Q0k89J97J17p8j82J18J01k22l2K41
7644C9j17j6J68j67L01j78k16L68j86R9j68M2m7Jm4J82l9J8J16k33J55L5j16k
7668em5o2M7nj6J90k50J12L4l02K23j5L1N9q0J42q5%P9k91J82J74k05n5J97j25
7694g1kP7k56K54M8k8lj60K12l65L42k8j79K40M3j07m1n5J39J52l12Q2N0K0p2
7719b0p3O3J05m7j7R4p0m9l8J95r9p8p4J30Oq8K22k61O3N6j2k5qJ00j50J85j62
$$ y = [-27, 126, -182, -51, -16, -7, -174, -119, -120, -22, -225, 64, 18, -209, 38, -42, 5, 25, -34, 89, 62, 121, 181, -42, -167, 138, -14, 27, 143, -16, 87, -72, 44, 196, 91, -5, -25, -14, 203, 77, 49, -33, -24, 197, -113, -55, 48, 6, -143, 56, -134, -7, 81, 219, -18, -21, -42, 163, -86, 147, 114, -49, 84, 35, 125, 6, -6, 120, 3, -151, 47, 16, 120, 73, 137, -70, 126, -56, 1, -29, -79, -115, 106, -12, 68, -221, -24, 93, 15, -167, -49, 52, -170, -202, 39, -78, -94, 74, -93, 208, 30, -186, 182, -4, 95, -73, -31, -78, -77, -121, 61, 22, 40, 156, -77, 78, 113, -3, -5, -50, -112, -65, -70, -86, 104, -146, -34, 0, -302, -79, -94, -63, -4, -84, 58, -27, -27, 52, -239, -57, 117, -88, -143, 54, -71, -73, 4, -252, 2, 50, 22, 19, -141, 71, -294, 48, 20, -159, 81, 124, 17, -24, -79, 60, 212, -100, -18, 32, 52, -20, -93, -30, 75, 28, 11, 105, 35, -14, -52, 143, 44, -34, -108, 22, 28, -60, 162, -99, -36, 20, 8, -17, -25, 75, -75, 110, -52]
7746e2J28k4l2JmM0K8k79K59p8J27j51pK43l00RLJ7J9J08p4k9rM7j65R3J80j23
7774b5R2p3L0n7j1J26l0j01K14j96J49j51m1J93j28K4kJ32j35O4n5J46k14P5m2
7799a6Q7j74J7k5O1J01n1k0j88L08p7k63J81K20j39J2r6j0J1m1k8J28N8J4J14
7824A84k68q2L9J99l4o0j8k8N0P6q0l8O6j13K28j88J22j76P6j63J50l2J27kj19
7849h4j1nQ2J44k07K13k36J23M0k8J1q7O0r0Q8j74J43r2J37J4j45K13l2j17O9
7874B9nn9P7N2q3J22j57J54j6o6l2j78L38p9k12P0L4k68K04J27l2K4k80J18L89
7899B71k67Q4j87o3K28n6O1p9o5Q7j73J02j6o8J43j94K37n0R4q2O5j16R9r9R1
7924D7J7j17j34Q9L3J9Q7j72K58j30O2P1j45M4J04j25L3j35K4n4N8P6n7J06j08
$$ y = [-52, 76, 52, 20, 21, 17, 57, 85, -194, 65, -13, 114, -37, -44, 199, -101, -92, -89, -72, -53, 55, -19, -48, -57, -10, -175, -82, 98, -25, 67, -6, 24, -33, -44, 82, 52, -49, 165, -31, 118, -33, -74, 119, -9, 15, 13, 145, 10, 74, 19, 165, -49, 26, -16, 71, -103, -86, -111, -50, 51, 0, -20, -208, 100, 23, -240, -59, 161, 22, 34, -62, -72, -61, -102, -130, -2, 56, 70, 184, -84, -166, -127, 72, 38, -22, -40, -68, -18, 58, -22, -60, 6, -107, 121, -67, 55, -121, -45, -208, -58, -90, 37, 35, -84, -95, -100, -18, 126, -81, 132, -104, 19, 59, 31, 42, -45, 15, -75, 13, -161, -18, -110, 27, 41, -104, 109, 77, -40, 29, 24, -35, 42, 94, 11, 133, -24, 130, 114, 48, 16, -162, 176, 97, -115, -45, -11, -279, -75, 52, 20, 44, -236, -118, 271, 4, 88, -99, -162, 66, 10, 71, -8, -73, 14, -159, -57, -73, -141, 2, -192, 45, -5, 89, 7, 72, -44, 55, -44, 47, 64, -53, -187, -98, -65, -46, 41, -131, 127, -3, 59, 130, -15, 29, 133, 8, 41, -94, -70, -124, -66, 10, -47, 59, -49]
7949d9pj9L44l05j3p2J01p3J08k57K72L5j59J87k12J28J47k48J82k28L0J67q8
7972b9p9K08K0L5p2k24J53j08Q6K92k30j21j7K88l60J01K23j28q5J95j37J56m6
7995A21p5j44L2J63K6j30j57J90o1J6J05k00K05m8j08k3J42j35O7Q3o9j67K48
8018H1Ql78L15j8k7J30k1o2j11J00nl4N0o5n6l1J51M8k0j85l5J18Q7j35L11k67
8044e1O5K7M3j36N9M3J07k41M5K70k91J95q1j62J13O7r0N0j17J64j08j2J34J25
8068B18j52l4j94L6R1P0L5l25L51j00m2L6j37O2J72k29K29P9j40J10j03k30L83
8091A86k99K38N8l64K49O2k49J50on3q8o0N6J07P0j00j73jP1N6P2lM6P0j5J1p6
8118A5k11J87r6J77j6k5j59K94k31m3J27o4J92l40J72J57l8k52J04M1J05j38j40
$$ y = [-49, -56, -75, 269, -36, -49, -121, -20, -93, 15, -242, 30, 65, -94, 93, -119, 9, 156, -92, 90, -138, -108, 59, -29, -108, 100, 120, 155, 83, -141, 12, -96, -10, 282, 52, -69, -86, 202, -158, -57, 166, 38, -47, 148, 11, 167, 121, 46, -98, -66, 97, 123, -7, -164, 26, -35, -19, 86, -114, 91, 43, -65, -88, 54, -81, -14, 69, 0, -167, 81, 89, -289, 26, 8, -19, 111, 90, 28, -83, 17, 12, -22, 28, -37, -93, -124, 27, 75, 55, -130, -165, -47, 40, -95, 216, -51, 14, 41, 84, -52, 7, 50, 157, -84, -39, 231, -60, 135, 54, -108, 5, 72, -18, 32, -85, 79, -29, -41, 93, 218, 66, 32, -162, -126, -35, 35, 70, -255, 96, -4, -46, -10, -147, -85, 87, -142, 87, 166, 26, 136, 33, -197, 186, -113, 125, 183, -181, 68, 130, -119, 31, 25, -28, -116, -176, -120, -13, 57, -43, -216, -217, -146, -90, -18, -21, 25, 95, 80, 91, 15, -196, -9, -105, 72, 56, 31, -128, 166, -65, -108, 19, -45, 147, -193, -21, 136, 98, -154, -50, -9, 96, -42, -182]
8141a82L17l05K39J03k28K4O3JN3j81J08O0j63K05j87K6J7j44K00p8m0R5n6J13
8165F0L8m3L9k7j63J81j17J2J3Q6r7J07k73J62n1K41j86k4k1Q2o9K35j20l2o9
8190c6N2
$$ y = [-182, 135, -170, 69, 172, -56, -32, 31, 32, 85, -96, 12, 72, -91, 114, -73, -47, -30, -174, 26, -52, -92, 3, -53, 60, 98, 55, 94, 67, -96, 85, -32, -20, -7, 79, -18, 89, -184, -22, -73, 168, -18, -42, -63, 19, -50, 185, 65, 33, -36, 16]
8191A6
$$ Imaginary data points
##PAGE= N=2
##DATA TABLE= (X++(I..I)), XYDATA
0@%%%%%%%%%%%%Qj6J6j6J6j9K7l2L5m3N3o1P2q5R6j10J28j48J68j90K16k46K78
35A47l10L47l89M33m84N37n93O58p29Q06q89R80j081J191j310J443j590J753j936
54a016K142k376K640k944L302l729M244m878N689o763Q246j0430J3955k0512L6468
69B4038j37339j52108L85118j32934j47878K46096o4979k05318J67903P5345j39442
80h1498N0710O2693j62626N7102J83926q5769n3286M2721m5077N5010J7666k8122
92A3450P8253q5369r7209J43802L0707q0781J5796k1302m7821M6800M2632n0662
104a1704j5113K8368o1260L3765J10884o5779m1232J2102m9161R5238L3867j12295
116d2320P0211J3574j30029Q3333R2224j08014m4004N6870j9281n791Q2613m6964
$$ y = [0, 0, 0, 0, 0, 0, 0, 0, 0, 0, 0, 0, 0, 8, -8, 8, -8, 8, -11, 16, -16, 19, -24, 29, -32, 40, -45, 51, -59, 69, -79, 89, -101, 115, -131, 147, -163, 184, -205, 228, -256, 281, -312, 346, -383, 423, -466, 514, -567, 624, -686, 757, -833, 920, -1016, 1126, -1250, 1390, -1554, 1748, -1981, 2263, -2615, 3074, -3689, 4557, -5873, 8082, -12430, 24038, -113301, -265409, 119709, -13225, -161103, 84993, 20014, -185304, -17401, 57944, -81498, -30788, 31905, -130721, -73619, 110307, 24538, -28748, 13973, -31104, 23906, 41572, 13450, 91703, 6334, -90875, 52927, 83634, 2853, 18649, -2653, -50474, -3674, 38958, -11704, -26817, 1551, -59709, -25944, 84940, 19161, -22071, -9969, -59130, 36108, 69975, -42320, 27891, 41465, -88564, -5231, 86993, -21021, -65025, -8155, -27436, -33227, 49386, 2422]
128B422q7946P7255m706m1232J00716k6260p0128L6736k1855N3760N5842j15123
140d0519K1518R0068q7866Q476J19431p3827r7774J06985K2529r7143J03243J2276
152H7397j88676R4035R9369j61516M9636R3951j43388q092J04379l3284l5498
163d1687K6777j5641j7980N7578J3758m5518K6077r455l5513O3939M129k6554
175i0K5721m9451N295O7288m5073j3436L3801k9037n79K5743L606j2419k3194
188a1825L7R730J9878K620l1095J2997o337k4570N2656j2213l2826N0978l5393
201e363j9194P5172l3977m4638M2679l435k2077K2107J1789l5492j4307K5866
213h70k1142N086L7018m8700l8M1757l9004J7994K6050m3146K5262J7951k7084
$$ y = [2422, -85524, -8269, -12975, -54207, 46509, 20249, -49879, -13143, -34998, 18762, 74604, -40519, -19001, 71067, -16799, -8323, 111108, 37281, -60493, 46492, 69021, -28122, 75121, 87397, -101279, -7244, 92125, -69391, -19755, 74196, -69192, -77284, 27095, -6189, -41687, -14910, -30551, -48531, 9047, 22805, -22713, 3364, -6091, -41604, 22335, 26464, -90, 25631, -23820, -18525, 48763, 3690, -9746, 24055, -4982, -5561, 20182, 23788, 11369, -11825, -11788, -2058, 17820, 20440, -10655, 2342, -3995, -28565, 24091, 11878, -20948, 30030, -5363, -24557, 50615, 16638, -28000, 14679, 11244, -10833, 11274, 23063, -12429, -26736, -870, -22012, -16926, 20092, -28608, -28646, 13111, -25893, -7899, 18151, -24995, 267, 18218, -8866]
226h866K8007O574l3579J226K5537j894j8404K6105m526m0568L6742L162l7113
239a7597L9712r456l3624L7527q000k1522J2560j1506j692M491J433M485j2077
252a5266L733l665n751K4588j1332k437K2599k1687Q330J4828k5566J6033K699
265G106j6777K0563o481q782N484j2418P393J166k271J1980j1397M500L937j4790
279a0787J7394n285r448K1817j5436p58J3220k2663Q137N679j2959J5717k991
292A637l598O325j0517Q045j873m577J5907j2313K520R536k1077R896J664j4721
306a3146J7840n696m357J2327j3504N306L485q269J4529m725L35J0008j5154O935
320E914l24j2252J5296p152l381J2404j5916M448L343j2097J3671l307k319J2331
$$ y = [-8866, 19141, 25715, -7864, -6638, 18899, 17005, -1399, 24706, 20180, -20388, 16354, 19516, -17597, 22115, 12659, -20965, 16562, 8562, -12960, -400, -11906, -13598, -9107, -7674, -3189, -15266, -11533, -15198, -20949, 3639, -7693, -10130, 12469, -9218, -888, 13940, -11626, 4407, 7106, -9671, 10892, 4411, -4371, 1113, -11305, -3912, -2746, -5017, 6963, -4434, 66, 4003, -10787, 6607, 1322, -8126, 13691, -1745, -2503, 10717, -11946, -3809, 1870, -11089, 4628, 1637, -1961, 4364, -6153, 1892, 19, -4558, 11349, -964, 1556, 11092, -9985, -89, 1575, -13146, 4694, -1002, -5359, 6968, -6536, -1230, 2255, -6014, 8515, 3790, 4125, 14133, -1021, 5914, 5590, -6662, 8634, 1482, -1899, 10505, -5411, -963, 2380, -9717, 3954, 647, -1672, 10659]
334A0659j2906N061J940j3567J3621n405l869J3111j3949K847L431j2893J2383
347D64k453k123J3942j1138N822M107j3681J3475l410n704J4958j1914L18M712
361G375j4380P383k795l987J1071j0083M738K993j4370J2754m146p252J7011j0310
375c998k24R101j4326N367J364n496R951m680N428L331j0755J2386m491n220J8052
390A5790j1133J653J1836j8010N236K549j2409Q963m388j178N048j0726M989l210
404d990n480J2284q366M405R693j4771Q427Q19j0430J2766p810j46J2041j4394
418e952M458L386j2781R570j400k338R998o462j77p14r94N798j1103Q441P778
433G508j9002J5064J165j9221J9869n723j2603K6340n032j2484J2932r91p918
$$ y = [10659, -2247, 2814, 4754, -8813, 4808, -597, -4466, 8645, -5304, -2457, 974, -11919, 464, -1989, -4112, 9830, -1308, 4514, 8621, -5060, 8415, 5005, -699, 14259, 2345, 2663, 7375, -7005, 378, -2417, -6404, 4667, -5416, -678, 2315, -12055, 699, -3447, -10699, 6312, -3998, -4222, 4879, -9447, -4080, -2716, -8212, 1739, -2941, 2487, 5818, -4937, 7449, 2958, -2262, 15790, 4657, 6310, 18146, 136, 5372, 7921, -4488, 4475, 87, -1091, 3957, -6769, -1780, -4990, -10470, 1814, -6552, -2147, 7546, -7225, 1202, 2021, -8409, 4357, -3453, -3599, 8442, -5952, -1494, 1892, -10889, -1319, -2719, -5057, 4941, -1521, -1698, -2412, -3406, 2392, -8711, -270, 7508, -11494, 3570, 4735, -14486, 5383, -340, -12943, 13397, 8365, -4119, 8813, 7822, -96]
446i6K014J0829o543q313J5045j4971r175K5038k6088j0169L2100k2365n643K4959
460F622k0203m597J5266r104K500J5081l500j5253J3532J2724k4987J2245J9081
473A9407l0019J3769J7953k6168J6310N048k7753J7347J2665j2362k03K256k234
486F016r723K295R192q543l68l599l879J5368r532o584J0881j2721J1433J1167
500A1403j8540J8401q83l0516K3222J4276k0252M670K309j1224L221R565j2061
513f409m715J8786k0623p019M5309k2212k8511L8240j6831j1671M3210k1089j9109
526a2644L2209j6392j9319L5630M900l7483R593K5843k3671N717J7714l6123J0037
539c989J9875l2651K4453J5402n0318J1416K0088k3083J6071P089l1232J0470
$$ y = [-96, 1918, 12747, 6204, -2109, 12936, -2035, -11210, 13828, -12260, -22429, 9671, -12694, -18337, 6622, -13581, -18178, -2912, -12016, -9516, 5565, 2065, -13188, 344, 13068, -11919, 326, 19407, -10612, 3157, 21110, -5058, 11252, 16300, -11453, 5894, 18559, 6197, 5994, 8250, 6016, -3707, -1412, 7780, -763, -1131, -4730, -8609, 6759, -2773, -9357, 1524, -11197, 236, 11403, -7137, 11264, 10381, -20135, 3087, 17363, -2889, 1781, 4090, -7134, -3913, 5652, -6409, -11124, 7662, -12961, -19980, 25329, 3117, -25394, 12846, -3985, -15656, 27554, 6465, -12644, 19565, 3173, -16146, 19484, 24384, -13099, -3506, 22337, -1334, 4383, 22097, -14026, -3989, 15886, -16765, 7688, 23090, -27228, -15812, 4276, -18807, -2736, 4353, -26879, -16409]
551a6409K4859k3888k258L9616k8461l0876N8831J735l8720L2624q260k9969L5868
564A4692L425k0850J3897l814j7652N248J8442l3k3012o42J5144J457m996j141
578A65P427j4996j3260L2748K71k0533J8887k1975j2545M6188j6568k5261L3454
591A4002j2622k3047L2080N974k6883P422K890k1878L0233J8828n5969J3289L6070
604B0389n3485J6865N3245n2156r156M0812k7262L284L7393k8837k2836L7467
616A5723L480k7051K4881N043l9806J3819J6723j1686J7257j8890k3007L3522
628A0008r851j6404L2004j6752k4841K7581J936j5777J8173l198l4962K1460L5453
641B4830l4729m129L2664l1877p328L8309r871o993N849j3605J0750R690p983
$$ y = [-16409, 8450, -15438, -17696, 21920, -6541, -37417, 21414, 23149, -15571, 17053, 8793, -21176, 14692, 18117, -2733, 11164, 7350, -10302, -5054, 13388, 13355, -9657, -10299, 4845, 6302, 1306, 165, 7592, -7404, -20664, 12084, 12355, -8178, 10709, -11266, -23811, 22377, 5809, -19452, 14002, 1380, -21667, 10413, 16387, -10496, -3074, -184, -22062, 8171, 26999, -28970, -15681, 20389, -33096, -16231, 37014, -15142, -24298, 16514, -10748, -7464, 29929, 1092, -21744, 15723, 19203, -7848, 17033, 22076, -17730, -3911, 12812, 1126, 18383, -507, -23514, 10008, 157, -16247, 15757, -995, -25836, 1745, 3681, -12096, 6077, 2879, -32083, -10623, 24830, -9899, -14028, 18636, -13241, -20569, 17740, 7869, 876, 6725, -6880, 3870, 13560, 5577]
654E577N78q163k386J0775r66k840L420p175j6897J3503K6038k2609q045K2662
668A3472k1771J207K8887k3314o66J6089k6233J0581K6330k5886j0566J6960r714
681d624m778K4416q692k4879K4025l447k7036M0924J624m7321L0315J5200l3748
694a8021K0719J0858k9704Q705J6602j1635L307J3732j7670j0291K5178l139j0419
707a778J6498j3663o821J8454j4902Q59J4268k3747N77J9070j0528l530M675p257
721g825k658R347M233p234M404R91j3111J2152O820j3196P767k276o119J4538
735G833r256m151J2007j2937L28J4938o481k959L617l967l309P077L753j1376
749d883N698O753j7535R366J0038k0494R351Q143j4996J2964L416j4639P652L268
$$ y = [5577, 6155, -2008, -4394, 6381, 5415, 2575, 5995, -1180, -18077, -4574, 21464, -1145, -9190, 13472, -8299, -7092, 21795, -1519, -2185, 13904, -12329, -1748, 24582, -1304, -11870, 5090, -4624, -9402, 15014, 6322, -18557, 5468, 2021, -25015, 15909, 17533, -29788, 527, 15727, -18021, 2698, 13556, -16148, -7443, 9159, -2476, 831, 14563, -3107, -13398, 11780, 8641, -1778, 14720, 1057, -5764, 12690, -2212, -1353, 12915, -10832, -10255, 8815, -1713, -5243, -568, -7825, -10483, -1136, 3097, -4137, 267, 1258, -11853, 299, 7119, -6077, 1690, -586, -6705, 7833, -1423, -5574, 6433, -6504, -6176, 8762, 2281, -678, 2939, -1028, -4337, 2740, 6493, -4883, 815, 7568, -9967, -601, 9437, -11057, -1706, 6437, -8559, 4405, 7821, -6818, 834, 4102]
763D102p308L589O614m631o907P951k681q674J2041n397q094J5622q291n801J3815
778E950j0311j993J1580o946Q65N850m663k107K165K078o066K033Q514j0460J674
793a837Q477j2754M216O744q609O710N43n510N439l920m71K928n329L174J046
808H47j976J314l224K092k111k225R808n085k211Q868r043J191P504p397K940
823A292J485m039M765k704p14J151m968L734J386J6K664n374K476N25n333R425
839E787k631o774Q465m541l308O471n190p26N22P6M829l854J164J525o795N978
855I98K619k998M611m404j32K864n355N288j159o452P250j738k257M431n285j47
871a866O53j66N900m207n10K829p365M335K413n124L729k620m32L805n115L279
$$ y = [4102, -3206, 383, 6997, 2366, -4541, 3410, 729, -7945, 4096, -1301, -9395, 6227, -2064, -7865, 5950, -4361, -6354, 5226, -1720, -855, 4995, 332, -1775, 390, 2468, -3598, -1565, 6949, -3511, -1837, 6640, -6114, -1898, 4846, -3763, 2947, 3490, -2020, 3419, -501, -972, 1956, -3373, -199, 847, -1129, 185, -3039, -947, -3058, -5283, 4525, -560, -2771, 6097, -2946, -1755, 5749, -1648, 1292, 2777, -1262, 3503, 799, 85, 1236, -3732, 2, 1388, 1404, 4068, -1306, 1170, 1695, -3638, 5787, 3156, -3618, 4847, 306, -3002, 3469, -1721, -2447, -1925, -1849, 2980, -874, 290, 1815, -4980, 998, 3617, 619, 5230, 826, 694, 3558, -1797, 3491, 2332, -4120, 3130, 1392, -865, 3566, -1719, -1866, -1213, -1379, 4521, 314, -196, 2633, -4732, -397, 2016, -3108, 621, -1999, -2431, 1374, -3741, -462]
887d62k98n431P624k97k103M518n163Q2J383j809M679l344j314L158n829L210
903a396J682n437M775j531l67N938m641J241J811n804N888J409k724K925l328
918D41Q8o1k434M577m044n45N615p021K648L310q142M098J660l611M942k338r77
935a794O19l208L375j201J35M048n176L189K688n798N616l44k878O485k978q5
951B693L124n866K017N0k599M266m049j61K747n813K068O48j769L495l101K480
967B30J677m995M675k173l053Q068n578j294Q042p592j176M790l759R57J641K60
983G20j065k82L024n777J555P211j0108K957Q830j1870K965N869r746N489M092
998C864o511M011L919m348k690O300J019q288P880K418j0957Q689p28j1913J1266
$$ y = [-462, -760, -6191, 1433, 1136, -967, 3551, -1612, -1530, -147, -1956, 2723, -621, -1935, 1223, -4606, -1396, 286, -5151, -376, -1907, -2274, 3664, -977, 264, 2075, -3729, 2159, 3568, 844, 3769, 441, 529, 468, -1966, 2611, -1433, -1978, 3637, -3384, -736, 2574, -5568, -1470, 190, -3421, 1521, -817, -1794, -1175, -4383, -1008, -2209, -2074, 1974, -3202, -13, 2675, -3123, 2493, 2149, -729, 5756, 2778, 2693, 5817, -49, 1968, 2018, -581, 3685, -364, -525, 2222, -3591, -1523, -875, -2644, 851, -2250, 230, 1907, -3088, 1587, -586, -3639, 4429, -1149, -2443, 5599, -1993, -3169, 1621, -2138, -1181, 460, 720, -345, -627, 2397, -3380, -1825, 5386, -4722, -1765, 7065, -4805, -1840, 4029, -5717, -228, 3864, -2647, 1364, 5283, 935, -1755, 4545, 5564, -2724, 5156, 7574, -3383, 5306, 4578, -7335, 3931]
1013C931j890j0282J0439j03p793K908J619j679j191L762J96k945O086l627m146
1028d715R349m491l936Q249l142M01J243n103N921j503m386P192k081k337K981
1043C642m007J095J900l415j610K280L758p173q85Q887r516j139J1146r245K794
1058a488Q373j3499M507J0154j2047K71R832n697n049P034m58q520O884l99j0374
1073a0476J4663J70j7571J5491K454j6962J3948L863j2287Q954J717r696P611
1086A879N612j2753N44J4780r974o571J7584r479r983J6021p483m439J4228j0289
1100c23o603J1599l523o434L531K791l999k213N540o16k696J233l534M711L732
1115C196m927M516j705l054O973o259P67J0048j2008j894J2370o967l659N671
$$ y = [3931, 2041, -8241, 2198, 2095, -5698, -2790, -1171, -2850, -4041, -279, -83, -3028, 3058, -569, -4715, 4634, 143, -3793, 4456, 1314, 1715, 2958, -2145, 3776, 2273, -2113, 5079, 2998, 661, 3642, -365, 730, 2630, -785, -2395, -115, 3643, -3530, -4415, 4472, -5044, -6183, 4963, -4282, -1488, 6885, -6614, -2107, 8047, -4000, -3729, 6103, 406, -4643, 2391, 1933, -6587, 297, -102, -10476, 4187, 4357, -13214, 2277, 4731, -12231, 1717, 5580, -6707, 2247, 3964, -5732, 1879, 7491, -5262, -4718, 10062, 88, -6483, 11101, 1622, -8361, 7660, 177, -4262, 9966, -323, -6926, 4673, 1150, -5284, -1753, 1038, -2961, -5174, 366, -250, -2946, -1713, -5247, -536, 3196, -1731, 2785, 1080, -1974, 4999, -1260, -493, 9555, -2453, -4347, 8023, 1056, -2603, 3068]
1129C068l838k203O182m82n613O652k52j3265J1764P603j7201Q615N946j5566
1143h590J0651M301j4703R789M134j3175P092J0333j1148n031J1316m972n222
1156e225J3345p528p615J4223j0382n997J8950j1015q936J5198n314m864J0457
1169E297n263o300R401R17q581Q867N640j7289M476J3062j3839K547Q764j2359
1183d660L458O297q504L422K317n240J151K644K140k026l601J306O21Q37j198
1198a036P90L614p633Q08Q025p927K758M547r817P658N227j1258N597L594r224
1213d277L970N289m907o84L639n450k183J0444o466p485J5171o637r810J6874
1227G488n508j0849J3492l419p518J1189j733r329N799L724q358K088Q599q605
$$ y = [3068, -770, -2973, 3209, 2727, -2886, 3766, 3514, -9751, 2013, 9616, -7585, 1030, 6976, -8590, 2061, 6362, -8341, 1448, 5582, -7593, -501, 9832, -1316, -6347, 4969, -3, -5225, 8120, 592, -7023, 7200, -3182, -9179, 9771, -1244, -10180, 5018, -296, -5160, 5297, 34, -6266, 3135, 4052, -4529, 4338, 9978, -7311, -2835, 10227, -3612, -1065, 7699, -4660, -1202, 5095, -3409, 13, 2330, -2910, -1759, 885, 3025, 999, -2602, -1296, -675, 162, -1036, -246, 3368, -4265, -3457, 4568, -3359, -601, 3946, -5871, 1787, 7014, -4244, 1353, 4947, -4277, -307, 4982, 75, -609, 3030, -2420, -4603, 5841, -625, -8110, 7061, 424, -9386, 7488, 1980, -8869, 4623, 1204, -6314, 4875, 3142, -6187, -388, 3336, -5022, -2934, 5665, -2940]
1241b940j269R444q761J242P928j0692L973P676j0092K950M973p483J310K935
1255A194k653r0K721j344l573M363J87o053O669L38n190O508k860l323O603n658
1271b161J50O136o186M96M177l709n7J566n82j517K514K684n403K470K760p573
1287d235M755L367o500M757r64m744O489k939k791N506l192j131M446j42k601
1302H1l5K311l255Q51O602o948j662O875p853P26P392p946K57M247m654K429K118
1319A536l494n29J577J365j038K732N79o634L917K755n557O001K06p313N815N52
1335B470k934L388k274j054R29M37K823k698j864O10k370K617N67j291P57m987
1351d874K630L598m928L819P15o288N901K556l725J756j451r39P69J989K369m324
$$ y = [-2940, -4209, 5235, -3526, -2284, 5644, -5048, -1075, 6601, -3491, -541, 4432, -3051, -1741, 1194, -1459, -1549, 1172, -172, -3745, 618, 805, -5248, 1421, 1759, -3431, 3077, 217, -3106, 3497, -2161, -2011, 4125, -2061, -1565, 2612, -1097, -1154, 412, -170, -1687, 827, 3511, -1892, 578, 3338, -4235, 520, 3887, -2613, 2144, 1180, -3564, 2925, -14, -2805, 2701, -491, -1622, 2824, 2682, 81, 46, 2357, -898, -47, 6555, -393, -2055, 4820, -3033, -2307, 5085, -2861, -2604, 1643, -3011, -582, 1536, -1958, -2487, -910, 455, -583, 2149, 2728, -3906, 11, 2766, -2791, 3210, 3416, -3897, 1918, 2470, -464, 2924, 650, -404, 525, 962, 3785, 1087, -777, -167, -2537, 80, 647, -644, 113, -4874, -2244, 1354, -3574, 245, 960, -5328, 573, 3129, -596, 1160, -291, -1230, -461, 1528, 3897, -427]
1367d27j139J933k976L461J164m019K240k373P98M997m475n7J927m218L833L045
1383C714k574j061j610J359L54O99L376m398j924M520k781J643J751m879J320
1398d91j16J82L437m442j990J720k845L315J735k185q78j542K590J319j313L660
1414B156k870k124N947j037o85J499l906J161J321L47K516m428j292J956k276
1429a715L022O91k966J05j369K065J154l146K215j960k191N685j130j768J286
1444b2l391J827K377o97K271k599j015K345j089J945l45k190Q39j433K596P48
1460B167m981K428k51l459O047K40l842K106j129K90K124L29O30k624J494J878
1476C447l098K849o34m551L652n72m94K292m134j56J589k188K735k22j993P15
$$ y = [-427, -1566, 367, -2609, 852, 2016, -2003, 237, -2136, -1338, 3659, -816, -873, 1054, -3164, 669, 3714, 1140, 79, -1531, -172, 182, 881, 4257, -141, -2065, 2455, -326, 1317, 3068, -1811, -491, -607, -425, 3012, -1430, -3420, -1700, -4545, -1230, 505, -1680, -2558, -4100, -1510, -191, -1504, 2156, -714, -2838, 3109, 2072, 1387, 2886, -1020, 141, 1462, 1809, 4325, -103, -1395, 561, -1715, 1307, 1998, -968, -863, -2232, -167, 987, -2159, 56, -1904, -4095, 1590, 460, -1308, -22, -3413, -1586, 791, 94, 2365, -234, -1249, 1096, 7, 1952, 1607, -583, 256, -1177, 1419, 2167, -2814, -386, -637, -4096, 1951, 2191, -1651, 455, -674, -384, 1740, 2069, 2699, 75, 1569, 3447, 349, 3198, 2564, -1987, 1665, 1093, 599, 2891, -1243, -1399, 190, -1998, 737, 515, -1478, -763]
1492g63j798K009J30j788J858j945L49L602k677P48J145k659K606O70N64J659
1508C710l930J313J804l519K795j0l479K329n62j140N52o18k46k201K835K038
1524A671m577K941J128n198M467J075m098M547j298l488L832J47k862Q29J844
1539I60j280j469L957j936l598N586l338k766P779m038l633O223k808k604L529
1554E64n96j115Q59J588j566j57L578l862n82N704m029n25M000l936J58J185k582
1571a314K138m93j657J044r59N92p37j275K780j258o98J979q16P33j103n12K777
1588A221j964Q97J536l581L470j76m920N628K69m868M194O33l127J484O74k413
1604a043L88L185l453j785O590m768m552Q771l642m632Q486l576l426O684k818
$$ y = [-763, -2561, -552, -422, -2210, -352, -2297, -1948, 1654, -1023, -275, 870, -1789, 817, 1487, 2051, 3710, -220, 1093, 2897, -622, 2173, 2163, -1316, 1013, 451, -689, -137, -755, -1001, -3202, -367, 1671, -2906, 35, 1163, -4035, 432, 1507, -2591, 1956, 658, -2830, 1002, 1149, -1713, -884, 960, -320, -1789, 2168, 232, -3366, 2220, -1118, -3884, 3895, -143, -3776, 2447, -361, -2965, 564, -32, -1147, -288, 1300, -266, -423, 3155, -707, -1289, 4415, 386, -139, 3861, -75, 83, 1268, -1314, 824, 331, -1326, -282, -1241, -649, -1386, -2661, 119, -1139, -1837, 142, -674, 59, -1044, -1556, 1221, -743, 154, 1690, -1891, 1579, 1403, -3517, 2111, 2380, -2488, 1706, 2339, -788, 696, 1370, -1043, -655, 2530, -923, -2708, 3882, -886, -5438, 3333, -309, -4941, 3545, -31, -3457, 3227, 409]
1619D09l782N725J33n367L078M559o719j77O349o641J22O573o879R04O039p284
1635b958N82N640m088o64L125m41j640Q92Q86k496J757J146l920L655J074m722
1651b172K904N94k329K697j625K59K542l527N61J664k144Q39j78n12J289q21q89
1668h48k44J429l49k515L868J92l989M446j417l026N738l455k928P219l582l803
1684c264N570j106m193L104K165m399K005L583o692J585O732q680Q00Q395q159
1699b554n55P424o221j244N323l712j346M890j315m624M854J369o591M587L186
1714C471o684M335J910o050M320P47n239L817J108l075J189J013r86r13R69L34
1730B66j095J878j172r49K663k483m01K523k862J731R16l663L795m97l572M008
$$ y = [409, -3373, 2352, 2485, -2882, 196, 4755, -1964, -2141, 4208, -2433, -2311, 4262, -2617, -1713, 4326, -2958, -2376, 3264, -824, -1488, 1637, 1196, -444, 448, 1334, -1162, 595, 1741, -2179, 1476, 2550, -2172, 732, 1326, -1003, 1694, 69, 328, 2870, -657, -96, 1568, -576, 263, 85, -427, 862, 41, -848, -1092, 337, -12, -2527, 1341, 1533, -2456, 1990, 573, -2453, 3285, -170, -3098, 4121, 539, -3264, 2306, 1200, -2993, 111, 2276, -2123, -118, 3465, -3227, -1642, 5090, -3590, -2790, 5605, -2554, -3109, 4315, -1906, -3150, 2173, -1539, -2885, 2005, 690, -3934, 920, 2289, -4302, 285, 3471, -3213, 1122, 3032, -3018, 1302, 2049, -3190, 627, 1735, -1340, -151, 862, -124, -1037, -68, 266, -829, 1049, -123, -1072, 1591, -892, -1293, 1230, -1632, 99, 1015, -2648, 1147, 650, -2922, 1086]
1746A086J14k692K527J58j395N45P83j516k79L038k957r52M690m442j681N875
1762B902m717k70N207m949P7M919l921j038L874j479k293L040J370m910K513K076
1778B401n606L506K968o338L295K208n439L039J475l391J452Q68j430P49J044
1793H01j692r63K304q77j376M272k739j982M455k668l17M295l639k36L272k279
1809F31KJ080j124p75K50J148p46p37P46k390R12J695j988J718m54k297L318j098
1827a09j045K949k986k65L347j646K4J130j671q07J363J560j591MJ299l422J741
1844a25L336m709J365J812m166K624K073l747Q72K30j122J417J620p28k026J339
1860F5M98j558L157j72l667K721l73j665L135k204j975J672j020J035Q99j866
$$ y = [1086, 1200, -1492, 1035, 1193, -202, 343, 1126, -390, -669, 2369, -588, -1540, 3150, -1292, -2973, 2902, -1815, -2085, 3122, -1827, -1750, 3169, -752, -1790, 2084, 605, -1688, 1352, 2722, -2188, 325, 2401, -3205, 301, 3269, -3069, 226, 2434, -3005, 34, 1509, -1882, -430, 438, -992, -243, 801, -891, -1854, 450, -427, -1803, 2469, -270, -2252, 2203, -465, -782, 3513, -126, -362, 2910, 631, 633, 1713, 589, -186, 64, 1212, 466, -271, 475, -1915, -1003, 692, -1296, 422, -32, -2329, 989, -109, -1154, 1795, -1191, -1456, 1891, 245, 269, 1399, -272, -1079, 284, 1844, 253, 257, 1556, -1866, -125, 3211, -1498, -133, 1679, -2487, 137, 2210, -1537, -665, -435, -1557, -140, 1480, 752, -1274, 65, 563, -995, 2162, 1990, -1677, 1044, 671, -994, 2141, -63, -2038, -366, -1386, -351, 548, -1318]
1876a318l69l53M53J201K39M73k224M18K219j894J857M47l824K761J441j716K137
1893A948j259k159J619Q40O36l7j138n03j285J868O90j894N43j336n75L021j301
1910c22n70O99k840K097K254j474R64q06j601J639J080P52j130q65M02j151K042
1927A170R46l333Q30J54j291L291o99j937M71j299J378K031j031n33q86k70J354
1944C46K82J123j554j485K383o32N92J736l671j86J848o02J634m72k314J31n80
1961a421J213R72j713J53j110J44K337r26j58m46j142K450O25k53J065k642J55
1978f97J934n24J294n54k190P53K01M31P73j964oj95P36J498j399p8p82j565L370
1997A036k2j653J401k141m77K859n72l85K90j007M15P40J222q95j845J576p17
$$ y = [-1318, -1687, -2040, -1587, -386, -147, 326, -1898, -1480, 739, -1155, 702, 1149, -2675, 86, 1527, -189, 1948, 689, -1470, 149, 989, 1625, 1588, 450, -53, -1338, 530, 1220, -674, -131, -1467, -2042, 979, -322, -892, -193, -3033, -936, 1318, -156, 808, 2, -1599, 40, 1120, 1872, 742, -123, 279, -872, 1170, 2116, -1217, -387, -233, -1524, 1767, 1068, -869, -398, -1697, -319, 1712, 681, 148, -738, -1008, 346, 628, 1751, 197, -1288, 1095, 463, 1055, 2791, -880, -1066, 782, 180, 1814, 1342, -972, -841, -1421, -208, 764, -949, -796, -1906, -1762, 575, -351, -509, -955, -2097, 353, 978, 725, 1790, -852, -697, 1237, 713, 2007, 1453, -737, 16, 217, 648, 1421, -543, -549, -744, -8, 1490, 91, 13, -769, -2334, 1036, 1014, -639, 762, -1379, -1856, 1003, 431, 46, 336, -671, -256, 484, 1706, 811, -1034, 542, -175]
2014a75j42K684k385j352J373j536J430J321k045jj47M58Q82k90L02j128j15K077
2032A211p51L27R06k939R45J329j152J368r18j002L07k29J172j71j649J214r99
2049a031J39J947j750q07P66n80Q96K04K77n13j508J997J90j043K342j514j264
2066a252K940j293m69J635j565n48J155K49o44o03N89j754M49K788k513k78K729
2083A615l178N66K803k545N0J865j587L59J276p25j083L05J176j997J495J700
2099B095l349Q88J837k436J475O63k156J153J96o66N58j95J86j153N70J407j557
2116d84O56M19j570J600L39j169J308n58k40M82q62J203r33j169K171j468m59
2133g34J749j693k64J239j025J76R87m1j100K00J895k373J00K679k931J15L248
$$ y = [-175, -317, 2367, -18, -1370, 3, -1533, -103, 1218, -827, -828, -975, -517, 365, 75, 377, -751, -866, 1211, 460, 787, 1693, -1246, -301, 1028, -124, 1244, 326, -676, -369, -598, 574, 403, -1246, -32, -1031, -892, 1055, -695, -1502, -736, -1316, -420, -216, 61, -452, -1960, 37, 227, -816, 1526, 12, -1252, 1688, 395, -74, 1561, -4, -552, 603, 852, 208, -395, 194, -1560, -1111, 1677, -836, -1114, 1615, -1563, -997, 1806, -739, -689, 1176, -411, -52, 1224, 499, -584, -279, 897, -1100, 395, 2095, -1254, -366, 1471, -965, 510, 1173, -983, 170, 366, -300, 258, 63, 249, -904, -334, 1073, -484, 172, 591, -979, 621, 960, -209, 1099, 541, 301, 783, -79, 1124, 191, -978, 1193, -275, -734, 1015, -678, -942, 297, -728, -552, 435, 394, -706, -506, 1389, -984, -884, 1795, -1136, -1021, 2227]
2150B227l353J73K826k992L41K482j486j144J781j35k105J723J208l083J927J435
2166A825m174K425J657m157K256J677k903J273J089j557N4J128m34j002K032k49
2182I40k627K648L2k885K773l30j929K050o59q03J225o26k07J01L33M88j157Q64
2200B31N85j866J184J80p45P38o50M78l48m88J312j180j90K176k199L35K254k757
2218i50K10J842j542k38J272o14r29J045M68k298J438J735l506K015J844l751
2234a959J744J589l007J616J361k585P64J604j620p34K042m75k028K619j42k749
2250a960L200o89k516L337q92j789K564p21j365J222k15p06N8R31o90l79J628
2267A018j340p69K277j541j02J924j644J14R37j278J053j47o34Q78r49K71N95
$$ y = [2227, -1126, -953, 1873, -1119, -778, 1704, 218, -926, 855, 720, -1385, 338, 1546, -1537, 390, 1825, -2349, 76, 1733, -2424, -168, 1509, -1394, -121, 968, -589, -535, 593, 159, -843, 1189, 940, -1687, 961, 993, -1892, 881, 551, -1378, 672, 13, -790, 435, -191, -398, -297, 36, 524, -633, 231, 816, -1050, 134, 314, -431, 307, -343, 135, -213, -701, 611, -569, -759, 1417, -782, -447, 1807, -950, -740, 1102, -440, -678, 594, -20, -949, 96, 564, -1734, -296, 1439, -2067, -52, 1792, -1959, -215, 1374, -1633, -17, 1344, -1241, -477, 1127, -493, -1227, 815, 340, -1688, 931, 789, -1960, 1240, 551, -1965, 1372, 480, -1309, 1255, 534, -831, 391, 176, -530, -472, 459, -231, -610, 1018, -322, -1091, 1186, -355, -457, 1467, -177, -63, 874, -404, 649, 502, -132, 746, -203, 68, 663]
2284F63r95L92L35n54M10j31O04j035K1J372j885K56K058k659R70J567k594J139
2302f6R85j959R15Q92p45MO94j36j421J340M35k089K094N4k814K631l68k316K469
2321E99n27j347J888n37p45O63K62p21m3J416q49o94J861j762l26K271k084m8
2339g23J846j739L59J127j340J38M28k50M2J76K53j077J22J056j167N22O78j533
2357a082J091J42r44J546r22k88J451j342P56R51j651L03M24o44N11j16J87j149
2375g76L74J089j646P08J009k373J327J066j912J531k71j361J396r0r7J92l16
2392a50p0j63O63K12j008R72n29n81J835j188o19J367j532L18J526j530K80j06
2410c03n63N36M30k0j89n43J019o71N11Q07j864R21P08j254J823l83k017J419
$$ y = [663, -332, 60, 395, -159, 251, 120, 724, -311, -290, 1082, -803, -547, 1511, -1148, -178, 1389, -1205, -66, 919, -1040, -125, 767, 22, 26, 720, 584, -837, 503, 938, -1151, 943, 997, -1817, 814, 446, -1870, 599, 72, -1275, 613, 76, -669, -6, 256, -465, -508, 908, 59, -635, 1226, -536, -862, 1409, -675, -723, 1123, -616, -257, 870, -470, -332, 96, -154, -112, 64, 317, -760, -638, 418, -749, -227, 451, -1082, 9, 151, -793, 753, -169, -457, 994, -348, 408, 1359, -292, 11, 435, -209, 302, 186, 373, -776, -402, 687, -959, -251, 758, -1615, -288, 778, -1134, 397, 126, -1235, 161, 71, -26, 166, -150, -220, -383, 280, 492, -516, 456, -73, -654, 1181, -7, -626, 741, -791, -473, 1053, -477, -197, -303, -866, -330, 100, 80, -109, -652, 367, -304, 207, 1014, -850, 71, 779, -475, 1348, 965, -1052, 367]
2428C67n65K3R52p05l69j65l8O11m73O83n82q82J594k44l53Q61j448J42J227q24
2448a88J177k61j511J004nN6P33n49l35n7R3R87j041J00j06j141J672K8j296J000
2468C60j037l86J654o06L16R9r89O05L72J35J32r17M83j75k0J515j678l63Q58
$$ y = [367, -198, -175, 777, 72, -297, -462, -500, 111, -362, 321, -261, -1143, 451, 207, -146, 715, -733, -591, 636, -188, 989, 728, -783, 221, 216, 272, 1005, 456, 121, 64, 157, 1144, 103, 203, 97, -1044, 628, 656, -640, 360, -677, -1063, 591, -15, 301, 400, -589, 16, 388, 523, 655, -262, 221, 46, 26, 1541, -137, -500, 358]
$$ [...]
8191c8
##END NTUPLES=NMR FID
##END=
