##TITLE=1H_50-2024
 CDCl3
 8 sc, 
 8.7.2024
##JCAMPDX= 6.0         $$ Bruker NMR JCAMP-DX V2.0
##DATA TYPE= NMR FID
##DATA CLASS= NTUPLES
##ORIGIN= UXNMR, Bruker Analytische Messtechnik GmbH
##OWNER= root
$$ XWIN-NMR		Version 3.5
$$ Mon Jul  8 14:05:23 2024 Russian Standard Time (UT+4h)  she@DPX200
##.OBSERVE FREQUENCY= 200.1314
##.OBSERVE NUCLEUS= ^1H
##.DELAY= (6, 6)
##.ACQUISITION MODE= SIMULTANEOUS
##.ACQUISITION SCHEME= undefined
##.AVERAGES= 8
##.DIGITISER RES= 18
##SPECTROMETER/DATA SYSTEM= spect
##.PULSE SEQUENCE= zg30
##.SOLVENT NAME= DMSO
##.SHIFT REFERENCE= (INTERNAL, DMSO, 0, 15.7039)
##AUDIT TRAIL= $$ (NUMBER, WHEN, WHO, WHERE, WHAT)
$$ ##TITLE= Audit trail, XWIN-NMR		Version 3.5
$$ ##JCAMPDX= 5.01
$$ ##ORIGIN= Bruker BioSpin GmbH
$$ ##OWNER= she
$$ F:/spectra/data/she/nmr/H-F/1/audita.txt
$$ ##AUDIT TRAIL=  $$ (NUMBER, WHEN, WHO, WHERE, WHAT)
(   1,<2024-07-08 14:04:21.12 +0400>,<she>,<DPX200>,
      <created by zg, POWCHK disabled, PULCHK disabled
       configuration hash MD5:
       00 E9 B6 7A A2 85 ED C7 34 08 36 98 17 FE 4E 26
       data hash MD5: 16K
       F5 05 85 37 1B 1F 10 3C A7 1B B0 9C B5 D8 62 9A>)
$$ ##END=
$$ 
$$ hash MD5
$$ 56 E4 EE E0 CC 5B 2F 1A 4A D9 69 F6 25 51 0C 4A
##$RELAX= 
##$RELAX= 
##$RELAX= 
##$RELAX= 
##$RELAX= 
##$RELAX= 
$$ Bruker specific parameters
$$ --------------------------
##$DU= <F:/spectra>
##$EXPNO= 1
##$NAME= <H-F>
##$PROCNO= 1
##$TYPE= <nmr>
##$USER= <she>
##$AMP= (0..31)
100 100 100 100 100 100 100 100 100 100 100 100 100 100 100 100 100 100 
100 100 100 100 100 100 100 100 100 100 100 100 100 100 
##$AQSEQ= 0
##$AQ_mod= 1
##$AUNM= <au_zg>
##$AUTOPOS= <>
##$BF1= 200.13
##$BF2= 200.13
##$BF3= 200.13
##$BF4= 200.13
##$BF5= 200.13
##$BF6= 200.13
##$BF7= 200.13
##$BF8= 200.13
##$BYTORDA= 1
##$CFDGTYP= 0
##$CFRGTYP= 5
##$CHEMSTR= <none>
##$CNST= (0..31)
1 1 145 1 1 1 1 1 1 1 1 1 1 1 1 1 1 1 1 1 1 1 1 1 1 1 1 1 1 1 1 1 
##$CPDPRG= <>
##$CPDPRG1= <>
##$CPDPRG2= <>
##$CPDPRG3= <>
##$CPDPRG4= <mlev>
##$CPDPRG5= <mlev>
##$CPDPRG6= <mlev>
##$CPDPRG7= <mlev>
##$CPDPRG8= <mlev>
##$CPDPRGB= <>
##$CPDPRGT= <>
##$D= (0..31)
0 1.2 0 0 0 0 0 0 0 0.06 0 0.03 0 0 0 0 0.0002 0 0 0 0 0 0 0 0 0 0 0 0 
0 0 0 
##$DATE= 1720433060
##$DBL= (0..7)
120 120 120 120 120 120 120 120 
##$DBP= (0..7)
150 150 150 150 150 150 150 150 
##$DBP07= 0
##$DBPNAM0= <>
##$DBPNAM1= <>
##$DBPNAM2= <>
##$DBPNAM3= <>
##$DBPNAM4= <>
##$DBPNAM5= <>
##$DBPNAM6= <>
##$DBPNAM7= <>
##$DBPOAL= (0..7)
0.5 0.5 0.5 0.5 0.5 0.5 0.5 0.5 
##$DBPOFFS= (0..7)
0 0 0 0 0 0 0 0 
##$DE= 6
##$DECBNUC= <off>
##$DECIM= 24
##$DECNUC= <off>
##$DECSTAT= 4
##$DIGMOD= 1
##$DIGTYP= 9
##$DL= (0..7)
0 120 120 120 120 120 120 120 
##$DP= (0..7)
150 150 150 150 150 150 150 150 
##$DP07= 0
##$DPNAME0= <>
##$DPNAME1= <>
##$DPNAME2= <>
##$DPNAME3= <>
##$DPNAME4= <>
##$DPNAME5= <>
##$DPNAME6= <>
##$DPNAME7= <>
##$DPOAL= (0..7)
0.5 0.5 0.5 0.5 0.5 0.5 0.5 0.5 
##$DPOFFS= (0..7)
0 0 0 0 0 0 0 0 
##$DQDMODE= 0
##$DR= 18
##$DS= 0
##$DSLIST= <SSSSSSSSSSSSSSS>
##$DSPFIRM= 0
$$ [...]
##$SUBNAM2= <"">
##$SUBNAM3= <"">
##$SUBNAM4= <"">
##$SUBNAM5= <"">
##$SUBNAM6= <"">
##$SUBNAM7= <"">
##$SUBNAM8= <"">
##$SUBNAM9= <"">
##$SW= 24.0689651099613
##$SWIBOX= (0..15)
0 0 2 0 0 0 0 0 0 0 0 0 0 0 0 0 
##$SW_h= 4816.95568400771
##$TD= 16384
##$TD0= 1
##$TE= 0
##$TE2= 300
##$TE3= 300
##$TEG= 300
##$TL= (0..7)
0 120 120 120 120 120 120 120 
##$TP= (0..7)
150 150 150 150 150 150 150 150 
##$TP07= 0
##$TPNAME0= <>
##$TPNAME1= <>
##$TPNAME2= <>
##$TPNAME3= <>
##$TPNAME4= <>
##$TPNAME5= <>
##$TPNAME6= <>
##$TPNAME7= <>
##$TPOAL= (0..7)
0.5 0.5 0.5 0.5 0.5 0.5 0.5 0.5 
##$TPOFFS= (0..7)
0 0 0 0 0 0 0 0 
##$TUNHIN= 0
##$TUNHOUT= 0
##$TUNXOUT= 0
##$USERA1= <user>
##$USERA2= <user>
##$USERA3= <user>
##$USERA4= <user>
##$USERA5= <user>
##$V9= 5
##$VALIST= <valist>
##$VCLIST= <CCCCCCCCCCCCCCC>
##$VD= 0
##$VDLIST= <DDDDDDDDDDDDDDD>
##$VPLIST= <PPPPPPPPPPPPPPP>
##$VTLIST= <TTTTTTTTTTTTTTT>
##$WBST= 1024
##$WBSW= 4
##$XGAIN= (0..3)
0 0 0 0 
##$XL= 0
##$YL= 0
##$YMAX_a= 755757
##$YMIN_a= -851772
##$ZGOPTNS= <>
##$ZL1= 120
##$ZL2= 120
##$ZL3= 120
##$ZL4= 120
##$ABSF1= 10
##$ABSF2= 0
##$ABSG= 5
##$ABSL= 3
##$ALPHA= 0
##$AQORDER= 0
##$ASSFAC= 0
##$ASSFACI= 0
##$ASSFACX= 0
##$ASSWID= 0
##$AUNMP= <proc_1d>
##$AZFE= 0.1
##$AZFW= 0.1
##$BCFW= 1
##$BC_mod= 2
##$BYTORDP= 1
##$COROFFS= 0
##$CY= 11.3945322036743
##$DATMOD= 1
##$DC= 2
##$DFILT= <>
##$DTYPP= 0
##$F1P= 15.6554695791079
##$F2P= 12.8336369535428
##$FCOR= 0.5
##$FTSIZE= 0
##$FT_mod= 4
##$GAMMA= 1
##$GB= 0.15
##$INTBC= 1
##$INTSCL= 1
##$ISEN= 128
##$LB= 0.24
##$LEV0= 0
##$LPBIN= 0
##$MAXI= 10000
##$MC2= 0
##$MEAN= 0
##$ME_mod= 0
##$MI= 1.114404
##$NCOEF= 0
##$NC_proc= 0
##$NLEV= 6
##$NOISF1= 3.799351
##$NOISF2= 2.8
##$NSP= 1
##$NTH_PI= 0
##$NZP= 0
##$OFFSET= 15.70392
##$PC= 1
##$PHC0= -25650.3
##$PHC1= 11.38748
##$PH_mod= 1
##$PKNL= yes
##$PPARMOD= 0
##$PSCAL= 0
##$PSIGN= 0
##$REVERSE= no
##$SF= 200.130013532006
##$SI= 16384
##$SIGF1= 3
##$SIGF2= 2
##$SINO= 400
##$SIOLD= 16384
##$SREGLST= <1H.CDCl3>
##$SSB= 0
##$STSI= 0
##$STSR= 0
##$SW_p= 3612.71676300578
##$SYMM= 0
##$S_DEV= 0
##$TDeff= 0
##$TDoff= 0
##$TI= <>
##$TILT= no
##$TM1= 0
##$TM2= 0
##$TOPLEV= 0
##$USERP1= <user>
##$USERP2= <user>
##$USERP3= <user>
##$USERP4= <user>
##$USERP5= <user>
##$WDW= 1
##$XDIM= 8192
##$YMAX_p= 0
##$YMIN_p= 0
$$ End of Bruker specific parameters
$$ ---------------------------------
##NTUPLES= NMR FID
##VAR_NAME=  TIME,          FID/REAL,        FID/IMAG
##SYMBOL=    X,             R,               I
##VAR_TYPE=  INDEPENDENT,   DEPENDENT,       DEPENDENT
##VAR_FORM=  AFFN,          ASDF,            ASDF
##VAR_DIM=   8192,          8192,            8192
##UNITS=     SECONDS,       ARBITRARY UNITS, ARBITRARY UNITS
##FACTOR=    0.0002076,     1,               1
##FIRST=     0,             0,               0
##LAST=      1.7004516,     0,               0
##MIN=       0,             -851772,         0
##MAX=       1.7004516,     755757,          0
$$ Real data points
##PAGE= N=1
##DATA TABLE= (X++(R..R)), XYDATA
$$ [...]
1998a830o74L498R81k286q36J043Q89Q48n87j408J108J436j931k131K539K500
$$ -1830 -2504 994 1975 -311 -1147 -104 785 1633 1046 -362 746 2182 251 -1880 659 3159
2014C159k954k512K044J407j633m71R73O41j7j102j203J495K855j304l307J979
$$ 3159 205 -2307 -263 1144 -489 -960 13 654 637 -465 -1668 -173 2682 1378 -1929 50
2030E0K916k729l201L589K877l686l376K890K112k053j905J304J876r43k302L9
$$ 50 2966 237 -2964 625 3502 -184 -3560 -670 1442 -611 -2516 -1212 664 -279 -2581 -2542
2046b542L384J221l405j390L861J157l937j39M029L35l741o21K479J46j016L6
$$ -2542 842 2063 -1342 -2732 1129 2286 -1651 -1790 2239 2574 -1167 -1788 691 837 -179 -143
2062a43l99M27O68j539j348K702K273l136k144L307J956l048j098L226J024k921
$$ -143 -542 -115 553 -986 -2334 368 2641 -495 -2639 668 2624 -424 -1522 1704 2728 -193
2078a93j329J763J309l55j668p87J597J124k579j306L262J580l530j909L379J763
$$ -193 -1522 241 1550 1195 -473 -1260 337 1461 -1118 -2424 838 2418 -1112 -3021 358 2121
2094B121k273r92J918J107j256j618M94K311P69k814j959L327J577l788j402M578
$$ 2121 -152 -1144 774 1881 625 -993 -499 1812 2581 -233 -2192 1135 2712 -1076 -2478 2100
2110B100L93m527r21M130L31k683M00J585n01q34J38J15O50J108j483j883J498
$$ 2100 2493 -2034 -2955 1175 1506 -1177 -777 808 307 -527 -389 -274 376 1484 1 -1882 -384
2127c84J829j938j349K004R46j930j637J853J363p34j320K19J632J85j745J47
$$ -384 1445 -493 -1842 162 1108 -822 -2459 -606 757 23 -1297 -1078 554 739 -1006 -859
2143h59L138K5l961N29L503m97l567J905L137k761k861K730J707j821j105J828
$$ -859 2279 2304 -1657 -1128 2375 1878 -1689 216 3353 592 -2269 461 2168 347 -758 1070
2159A070k89j325O37P42p28L70O19j433n38J737N04j554j74J116l50j158n5R86
$$ 1070 781 -544 93 835 107 477 1096 -337 -875 862 1366 -188 -362 754 404 -754 -809 177
2177A77P99m38j650j10K095k1k075N06K539p69l195J340K837j356j845J744P55
$$ 177 976 538 -1112 -1222 873 852 -1223 -717 1822 1053 -2142 -802 2035 679 -1166 578 1333
2194A333k058j52J552j35q85O85o48r53R80J029j242m26J603p41j737R84J894
$$ 1333 -725 -877 675 540 -345 340 -308 -1261 -281 748 -494 -920 683 -58 -1795 -811 1083
2211A083j053j350J175M69j490j79J210N97n84q06m42J226R46j610o98K226Q66
$$ 1083 30 -1320 -145 324 -1166 -1345 -135 462 -122 -928 -1370 -144 802 -808 -1506 720 1586
2228A586l110m46L457L30k860L23K065p33j553J034R23q34l47M38n88l14J186
$$ 1586 -1524 -1970 1487 1817 -1043 -720 1345 612 -941 93 1016 182 -165 273 -315 -629 557
2245E57j7j070L16P97r77j40R06J91l38L9m79l62J099O28j713P3J610j076k072
$$ 557 540 -530 -214 583 -394 -534 372 563 225 264 -215 -577 522 1150 -563 -490 1120 44 -2028
2264b028J485K370j954k084K057J283k522n35K672O02j969q21J242J032p67q27
$$ -2028 -543 1827 -127 -2211 -154 1129 -1393 -1928 744 1346 -623 -1444 -202 830 63 -764
2280g64L44J325m28k399K03L003j09l167N22K465q59k115J397J931j323r41P77
$$ -764 -420 905 477 -1922 -1719 1284 1175 -1992 -1470 995 136 -1979 -582 1349 26 -915 -138
2297a38L08k75Q06P7j104N07R24j007r87J574J076j699j063Q42M19k48j51m10
$$ -138 170 -105 701 778 -326 181 1105 98 -889 685 1761 62 -1001 -159 260 12 -139 -549
2315e49P43N61j040j205J839J749j980j600K328J256k415o66L115J54k601l17
$$ -549 194 755 -285 -1490 349 2098 118 -1482 846 2102 -313 -979 2136 2290 -311 -628
2331f28J720K99j123l80N00M43K3j531m97K348J058k459j308K526J051k380q35
$$ -628 1092 1391 268 -112 388 831 854 -677 -1174 1174 2232 -227 -1535 991 2042 -338 -1173
2348a173K177Q25j709j594R57J518O2k250q42K395J011l075j111L776J061l688
$$ -1173 1004 1829 120 -1474 -517 1001 1063 -1187 -2029 366 1377 -1698 -2809 967 2028 -1660
2364a660r34L185O96k317JK098j58j186L33j01O05J033p27j851O46J798j022j598
$$ -1660 -2594 591 1287 -1030 -1029 1069 911 -275 58 -43 562 1595 868 -983 -337 1461 439 -1159
2382a159J229J350j234j785J090J414j51j099o94J267Q54j579j293K711J413l159
$$ -1159 70 1420 186 -1599 -509 905 754 -345 -1039 228 1082 -497 -1790 921 2334 -825
2398h25j637L355J305l543n10L467J13l318j39K690J20j394l61P45L43L06j131
$$ -825 -2462 893 2198 -1345 -1855 1612 1725 -1593 -1732 958 1078 -316 -677 68 411 717 -414
2415d14l78J891R03k299j208K423J038k100j255J847P10j522j078P18J177K4j537
$$ -414 -792 1099 2002 -297 -1505 918 1956 -144 -1399 448 1158 -364 -1442 -724 453 477 -1060
2432a060j002J790J326k345r32K571P96k506p14K520J83j381K46P50k69l80K57
$$ -1060 -2062 -272 1054 -1291 -2223 348 1144 -1362 -2076 444 627 -754 -508 242 -27 -407 -150
2449a50k06K60Q52p82j550J133J739j340j573J942J116k298p21K359O56j592q49
$$ -150 -356 -96 756 -26 -1576 -443 1296 -44 -1617 325 1441 -857 -1578 781 1437 -155 -1004
2466a004J257M75m48p94K21J816l74k154k43K457J63k499J46K502p47k086Q07
$$ -1004 253 728 280 -514 -293 1523 1149 -1005 -1248 1209 1372 -1127 -981 1521 774 -1312 -505
2483e05J363l80o11M66n27J93R38l32j153Q85J242j548j410J917J033j611q77
$$ -505 858 478 -133 333 -194 -1 937 605 -548 337 1579 31 -1379 538 1571 -40 -917
2500i17J418o7q83J35L51j61J85j38o16M62R36o66p42Q16L30j196L16J153m42
$$ -917 501 434 -449 -314 37 -124 61 -77 -693 -231 705 39 -703 113 443 -753 -437 716 274
2519B74r08N82K59j010J20J267m41r27O20N9p14L11P41m30m16Q47J04j172O33
$$ 274 -634 -52 207 -803 -683 584 143 -784 -164 -105 -819 -508 233 -197 -613 234 338 -834 -201
2538b01J126q11m62Q12j94o05M99Q68r33l96P45j77j256J134Q10j072m89Q77J46
$$ -201 925 114 -348 464 270 -335 164 1032 99 -297 448 271 -985 149 959 -113 -602 275 421
2557D21p96O08K91l50q6L72n22j8J002j99j043K42P10q93m71J133oq75M15J66
$$ 421 -375 233 524 174 88 460 -62 -80 922 723 -320 -78 632 -261 -732 401 395 -480 -65 101
2577A01j076M12J466k48j891Q66J168m36j427J051J166j017m17k1K93O07j35j008
$$ 101 -975 -563 903 655 -1236 -370 798 362 -1065 -14 1152 135 -282 -303 -10 597 462 -546
2595e46J87Q42k53j282N94J316r16j179R96P33r61J13Q10n38m26R14j59o58M89
$$ -546 -359 483 230 -1052 -458 858 -58 -1237 -241 492 -469 -356 454 -84 -510 404 245 -413 76
2614G6R66j105o59J258k31o79N11O99j040k89J197k26o07M21O15o66j27O48k66
$$ 76 1042 -63 -722 536 305 -374 137 836 -204 -493 704 478 -129 292 907 241 114 762 496
2633D96m00J005j48j338M04J057m70j059P24Q24j032o18Q01K02k17K77o32n43
$$ 496 96 1101 953 -385 19 1076 606 -453 271 1095 63 -555 246 448 231 508 -124 -667
2651f67J168M08j306MJ625q8j814M94J080k26q75L01M72m50J47l22m46O59P47
$$ -667 501 909 -397 -393 1232 1144 -670 -176 904 678 -197 104 576 126 273 -49 -495 164 911
2670I11j410n62J465Q7j213J38J159o70p67Q71L64r17L36P31j068m14J290N4j189
$$ 911 -499 -1061 404 491 -722 -584 575 -95 -862 9 373 -544 -208 523 -545 -959 331 385 -804
2689h04K79R59p45p81J010O22j019j54P56J57p88P2O29M39j98p70j11J321p4j701
$$ -804 -525 434 -311 -1092 -82 540 -479 -633 123 280 -508 -436 193 632 434 -336 -447 874 800 -901
2709i01J95K173p48k251P36K063j128j428J188O12j485J58J210l74o52P90L68
$$ -901 -706 1467 719 -1532 -796 1267 139 -1289 -101 511 -974 -816 394 20 -632 158 526
2726E26j613K82J789o30j785J034J522j103j193P52J267n34j364J62J290K40j498
$$ 526 -1087 -805 984 354 -1431 -397 1125 22 -1171 -419 848 314 -1050 -888 402 642 -856
2743h56m22K005K75k670K76K581m72k290O07K216j188j683J314J148j450n29J105
$$ -856 -1278 727 1002 -1668 -1392 1189 717 -1573 -966 1250 62 -1621 -307 841 -609 -1138 -33
2760c3o1p46N36K87p75N12O90o89q93J416O42j255m89R41N02o33m94O71O27l45
$$ -33 -94 -840 -304 -17 -792 -280 410 -279 -1172 244 886 -369 -858 83 585 -48 -542 129 756 411
2780D11q11k29J224O11j630l15J598k07j239M18J285n88o92N74j28m35P14M00
$$ 411 -400 -629 595 1206 -424 -739 859 652 -587 -169 1116 528 -164 410 282 -153 561 961
2798I61j271J4J455m67k016J401J760j360j863K048R96j679q26J947M09j834k95
$$ 961 -310 -296 1159 692 -1324 77 1837 477 -1386 662 1658 -21 -847 1100 1509 -325 -620
2815f20J235P13j292n40R16O34j061q35J025J350j610j021J839L82j667l64J972
$$ -620 615 1328 36 -504 412 1046 -15 -850 175 1525 -85 -1106 733 1115 -552 -916 1056
2832A056j78j941P27J405r66q50J591O9j696K04J651o43j494J137J169j285j173
$$ 1056 878 -1063 -336 1069 103 -747 844 913 -783 -579 1072 429 -1065 72 1241 -44 -1217
2849a217J429O57p79o60P13L43j42p23K49R87n4j074j38J297n45r39O94J097j301
$$ -1217 212 869 90 -570 143 486 344 -379 -130 857 803 -271 -409 888 343 -596 98 1195 -106
2868a06o71J297J30j329M01J353q97j241J267N81j023k29J047l07q12P07L11o42
$$ -106 -777 520 650 -679 -278 1075 178 -1063 204 785 -238 -467 580 273 -539 168 479 -163
2886a63lO32m41n04K94L17l94J04q3j30K11J18o31j23J275m72j336Q76J007q80
$$ -163 -166 466 25 -479 -185 132 -262 -158 -241 -371 -160 -42 -673 -796 479 7 -1329 -453 554 -326
2906c26n76R72J81j279L63R86m64q00J146Oj361M05R95m05p10N16M95p40k4N39
$$ -326 -902 70 251 -1028 -665 321 -143 -943 203 209 -1152 -747 248 -157 -867 -351 144 -596 -620 -81
2926h1k97J93M19m95o12R06O19j059r1Q59j16r39M44M95j65k29j0q1j79O63k04
$$ -81 -378 -185 234 -261 -873 33 652 -407 -498 361 245 -694 -250 245 80 -149 -159 -240 -419 244 40
2947D0n16N20M51n96l06Q03k14m03N43K55q51q8J058l58j099Q76J032j365q04
$$ 40 -476 44 495 -101 -407 396 182 -221 322 577 -274 -362 696 338 -761 115 1147 -218 -1022
2966a022J577N38j180l10P26Jq14O83J02k02l8j38j99K87J7r6j51O88n17n68R76
$$ -1022 555 1093 -87 -397 329 330 -484 199 301 99 61 -77 -276 11 28 -68 -219 469 -48 -616 360
2987C60K47j092K7R49k56j164O16J123r25o89J026K12j127M19Q41m27o79P00m1
$$ 360 607 -485 -458 491 235 -929 -313 810 -115 -804 222 434 -693 -274 567 140 -539 161 120
3006A20n00M03J48j30j97N44n78J04L95J92r01L59N12k81p38P00Q01r62k86N22
$$ 120 -380 23 171 41 -156 388 -190 -86 309 501 -400 -41 471 190 -548 152 953 -9 -295 227
3026B27k1n19O05kk39J16J34m32pP62k88p93M23P05q15q9O00k6p03M55J66n47
$$ 227 206 -313 292 290 51 167 301 -131 -138 624 336 -457 -34 671 -144 -233 367 341 -362 93 259 -288
3048b88M09O29q31n76O45M18r30L04R64p95q34P10N93p43k13J005m31n70K99J06
$$ -288 121 750 -81 -657 -12 406 -524 -220 744 -51 -885 -175 418 -325 -538 467 36 -534 -235 -129
3068a29l0J7P5r0j52K37j1n51M79M89n21l33M97ok0L33k89k77K34M22j182L19
$$ -129 -159 -142 -67 -157 -309 -72 -83 -634 -155 334 -187 -520 -23 -29 -49 284 -5 -282 -48 374 -808 -489
3090d89J326k40j568M90J548q05j391J262Q38j041q58J194M82p38k41P00q3l25
$$ -489 837 597 -971 -481 1067 262 -1129 133 971 -70 -928 266 748 10 -231 469 386 61
3108F1j01K28l0N76o18j81N19p5p35M10R37r11q69J069M19q80NP76l42n95M84
$$ 61 -40 188 158 734 116 -65 454 379 -356 54 991 80 -789 280 699 -181 -176 600 258 -337 147
3129A47J57l39MO29m87n46P20K38j057K29N47M3n08j39O01k24J27k8n55Q6P51
$$ 147 304 -35 -31 598 111 -435 285 523 -534 -305 242 285 -223 -362 239 15 142 114 -441 -355 396
3150C96m69o91J127L27j163j95R71L82j233L39N50m57l99L07J34J20J42j77m47
$$ 396 -73 -764 363 690 -473 -668 303 685 -548 -209 341 -116 -515 -208 -74 46 188 11 -436
3169d36L82K26k06m92Q65l3q77K14J046n44k84L62K45n42l60P01j13k18J73j31
$$ -436 -54 172 -34 -526 339 306 -571 -357 689 145 -139 223 468 -74 -434 267 154 -64 109 -22
3189b2k88M57J73p10M1Q44n61o29O69O55q62k49N29q3l97J49M19l20j42N06m46
$$ -22 -310 147 320 -390 -349 495 -66 -695 -26 629 -233 -482 47 -36 -433 -284 135 -185 -327 179 -267
3210b67k57M19J15l07lO06n52l48P68N5o36K60K95o49mN56k20m06K91L32o07j70
$$ -267 -524 -105 10 -297 -300 306 -246 -594 174 229 -407 -147 148 -501 -505 51 -169 -575 -284 48 -559 -729
3232g29J053j65p33L77O22q42o0N53K36p79P6M66k17o6J92N5m2K88m49l23O15
$$ -729 324 159 -574 -197 425 -417 -477 76 312 -467 -391 75 -142 -208 -16 39 -3 285 -164 -487 128
3253A28N13q85p2P64J22p71J79Q22k30n14L40Q1l44J99K82p27J71O24m25r13Q98
$$ 128 641 -244 -316 448 570 -201 -22 800 570 56 396 477 133 332 614 -113 58 682 257 -656 242
3274B42N02o45l88N89K0n85L50M37m73j44M89j03k77L62J88n33L48J07n90K15
$$ 242 744 99 -289 300 320 -265 85 522 49 -95 394 291 14 376 564 31 379 486 -104 111
3294A11K99l23m01N76K27q64k9Q92j35o48K65L90m26q4O96q3o57J2Q19p02k60
$$ 111 410 87 -314 262 489 -375 -404 488 353 -295 -30 360 -66 -150 546 463 -194 -182 637 -65 -325
3315c25L83L88n55k17L75j13J18J09m31K47N00k68o76N25P08o99l69P06j7l20
$$ -325 58 446 -109 -326 49 -64 54 163 -268 -21 479 211 -465 60 768 69 -300 406 389 69
3335F9LL30j07k36L92l54l36N23K05j018K15O49j51o99K43O61k43n17L75k1O9
$$ 69 72 402 295 59 451 97 -239 284 489 -529 -314 335 184 -515 -272 389 146 -371 4 -17 52
3356E2M9J67l07jK42m96L23L59k03p81L16N68l14o29O02L48p19k20N48K7l8K24
$$ 52 101 268 -39 -40 202 -294 29 388 185 -596 -280 288 -26 -655 -53 295 -424 -644 -96 -69 -107 117
3378A17j87n34O83J99q63L8R90l21j226L99J017m53p81M34M33k42k07o2J33K87
$$ 117 -70 -604 79 278 -585 -547 443 122 -1104 -705 312 -141 -922 -488 -55 -297 -504 -566 -433 -146
3398a46O6o37K53Q77q8j079O18R00p66m40N54L13l99k87L20j16K9J58l67j07M62
$$ -146 -80 -717 -464 413 325 -754 -136 764 -2 -442 112 425 26 -261 59 -57 -28 130 -237 -344 118
3419A18K68j103L31Q75l05o24L20O83n51o25O42M55l67n2r3N0J22k04k41L25N69
$$ 118 386 -717 -386 489 184 -440 -120 563 12 -613 29 484 117 65 -28 22 144 -60 -301 24 593
3440E93o25n66L59R21o77n67Q58J92p50Q6L73L6k0K43n27j25O82J11r52rJ134
$$ 593 -32 -598 -239 682 5 -562 296 488 -262 -176 197 233 213 456 -71 -196 486 597 -355 -364 770
3461G70o47q72L82R88p11m13M03L25l64k91L09J88M7k2m12J96K65o2k44L40K17
$$ 770 123 -749 -367 621 -90 -503 -100 225 -139 -430 -121 67 114 92 -320 -124 141 79 -165 175 392
3482C92l45k78N64Q8n04K44K32m31O8L55j4l86K37J3l43j5O44k97o44Q40L71r61
$$ 392 47 -231 333 421 -83 161 393 -38 30 385 371 -15 222 235 -108 -123 521 224 -420 420 791 -170
3504a70j62P73J90p19k65P50l16r4n9J58J13J06l76j98M71J96l34k37N19O4o18
$$ -170 -332 441 631 -88 -353 397 81 -13 -72 86 199 305 -71 -269 202 398 64 -173 346 410 -208
3525b08J22J94j17o6K91k24l01K90L45m25l4L64j49l60J18M23n54k4L68k94l09
$$ -208 -86 108 -9 -75 216 -8 -309 -19 326 -99 -133 231 82 -278 -160 263 -291 -315 53 -241 -550
3546e50N32K74m67o9K92Ml82J86K99k45J7L21n07J3O30j91m38K79R6l03k89N02
$$ -550 -18 256 -211 -280 12 16 -366 -180 119 -126 -109 212 -295 -282 348 157 -281 -2 94 -209 -498 4
3568DK71m80K23J27j86k5K08P8n93O41K1n07L22M74l27j64J14L55n92M2N93l50
$$ 4 275 -205 18 145 -41 -66 142 220 -373 268 289 -218 104 578 251 87 201 556 -36 6 599 249
3590B49l62r7L15q9j56J64j13J6R0k68K3N23N6n36m1N75p8p13M59N12n31k90L66
$$ 249 -113 -210 105 16 -140 24 -89 -73 17 -251 -228 295 351 -185 -226 349 271 -442 17 529 -2 -292 74
3613G4Qk31rMr8o1L50j73l95O62j13l43PM41n9k55K74K47l47NJ65j29r8J99ln54
$$ 74 82 -149 -158 -154 -252 -313 37 -136 -531 131 18 -325 -318 123 64 -191 83 330 -17 -12 153 24 -74 125 122 -432
3639d32K83L35l86k25N42k54j83J73K64j79j1K50j52Ql2K72k69J72L29n84l8N56
$$ -432 -149 186 -200 -425 117 -137 -320 -147 117 -62 -73 177 25 33 1 273 4 176 505 -79 -117 439
3661D39r7r34L60O75k05p13M14L88m11k12L10K9k5j23L12j12j26O74q44k96O69
$$ 439 342 -592 -232 443 238 -475 -61 327 -84 -296 14 43 18 -105 207 95 -31 643 -201 -497 172
3682A72K71m80j14L00l56LJ73k69J89J05r3m41K37N37j81l94K60J92m07m6M28
$$ 172 443 -37 -151 149 -207 -204 -31 -300 -111 -6 -99 -540 -303 234 53 -341 -81 111 -296 -342 86
3703H6k3j75J66j07m53K10N96l71n64O31N9n47k5N93j1m93L57O1j09M6J14Q1o2
$$ 86 63 -112 54 -53 -506 -296 300 -71 -635 -4 55 -492 -517 76 65 -428 -71 -10 -119 -73 41 122 60
3726F0N9k8k21L96Q8m16L72K2k13n39O98R5m05k08N35k36l00N73l46P9j44M14
$$ 60 119 91 -130 266 354 -62 310 332 119 -420 278 373 -32 -240 295 59 -241 332 -14 65 -79 335
3748C35k71k58N11n8m73K15Q22m55n69M66K90l75k93J77j10J4Lj41j48N38j10
$$ 335 64 -194 317 259 -214 1 823 368 -201 265 555 180 -113 64 -46 -32 -29 -170 -318 220 110
3769A10m24J29N96J7p56J20M12qk56N7J81j31P4k85M2L05K3n16K7R69n32q23N75
$$ 110 -314 -185 411 428 -328 -208 204 196 -60 -3 178 47 121 -164 -122 183 206 -310 -283 686 154 -669 -94
3792i4N26n33l93O20N45p28k11N72J61l06k48K40j71M38p2m70k8O31j52n25mN72
$$ -94 432 -101 -494 126 671 -57 -268 304 465 159 -89 151 -20 418 346 -124 -152 479 327 -198 -202 370
3814C70l08m73K24M34j48J25mj69L94J2p70K61O73j96q33K84P81l09q98P49K84
$$ 370 62 -411 -187 247 99 224 220 51 445 457 -313 -52 621 425 -408 -124 657 348 -550 199 483
3835D83p27k18O72k69j06P8J34l44R7K37k49l8L17j05l29L82J60j88k27M72l27
$$ 483 -244 -462 210 -59 -165 -87 47 -297 -200 37 -212 -250 67 -38 -367 15 175 -13 -240 232 -95
3856i5M7k0N1k15K66n7m02Q0P18o56l94O28O76r30m28R21J91o43k36P92q2n51
$$ -95 -48 -68 -17 -232 34 -23 -425 -345 373 -283 -677 -49 627 -303 -731 190 381 -262 -498 294 212 -339
3878c39j16L53R9j7l62j14M59K44l93l06M32L54n78L4N37k78j92L78k5k45j62
$$ -339 -455 -102 -3 -20 -382 -496 -37 207 -186 -492 -60 294 -284 -250 287 9 -183 195 170 -75 -237
3899b37M54m15L16J27k72p1j29M22m2k17L36j43l18L07L01m51l19P87l05l49J18
$$ -237 217 -198 118 245 -27 -98 -227 195 153 -64 272 129 -189 118 419 -32 -351 436 131 -218 -100
3920a00L80m78k29M71j46l19K88L56p79K40M64k20m84N16L37k61l01K51j96K67
$$ -100 280 -198 -427 44 -102 -421 -133 223 -556 -316 148 -72 -556 -40 297 36 -265 -14 -210 57
3940E7l0j99J81K71j94k84J29N23k94m53L23M19o88j29Q67k53m54J82M27m95k57
$$ 57 27 -172 9 280 86 -198 -69 454 160 -293 30 449 -239 -368 499 246 -208 -26 401 -94 -351
3961c51M78O7l24J55J17k48J85O7k14r4M02m2l72m0M77J42l60R7K08j39mj39M1
$$ -351 127 194 -130 25 142 -106 79 146 -68 -162 240 198 -174 -214 263 405 45 142 350 211 207 68 109
3984A09K35J96m43j98M03L01o44p8M50jo19J0O29k99k79K24J30j71J76j89k43
$$ 109 344 540 97 -101 302 603 -41 -119 331 330 -289 -279 350 51 -228 -4 126 -45 131 -58 -301
4005c01R7N34j39m56K78J20m18N9L60l07k39J39L50l07P2L5L82l49J5M9k30K91
$$ -301 -204 330 191 -265 13 133 -285 -226 134 -173 -412 -273 77 -230 -158 -123 259 -90 -75 -26 -256 35
4027C5L8j89j61P27k52m72J87L05j97Ql7k7o4j5o5j29L32K8k54j81M27K45o29
$$ 35 73 -116 -277 450 198 -274 -87 218 21 29 -8 -35 -99 -114 -179 -308 24 52 -202 -383 44 289 -340
4050c40M10K35j32l12L70k33o6K19J32k87k07L10J83o85J79N67l36j94L03J20
$$ -340 70 305 173 -139 231 -2 -68 151 283 -4 -211 99 282 -403 -224 343 7 -187 116 236
4070B36m10J66N7j21j48L65j8k85K1K88k45j58L11r3l5P3J9l16L09P6k87j29L38
$$ 236 -174 -8 49 -72 -220 145 127 -158 -137 151 -94 -252 59 -34 -69 4 23 -293 16 92 -195 -324 14
4093A4K31n79j0K70j57P7K13P3m15L80J34j70l41M28j9m34N2K65oj63L18l6k23
$$ 14 245 -334 -344 -74 -231 -154 59 132 -283 97 231 61 -280 148 129 -305 -253 12 6 -157 161 125 -98
4116i8P2M6k90j3M07j62j46J93K84k82j27N63l63r6L89j78m44J87M52k95k83M33
$$ -98 -26 20 -270 -283 124 -38 -184 9 293 11 -116 447 84 -12 377 199 -245 -58 394 99 -184 249
4138B49l4m52R0L90k90j64N35k64j61K82P2q8l05M54o5m14K09J75k77r4L28k10
$$ 249 215 -237 -147 243 -47 -211 324 60 -101 181 253 165 -140 314 249 -165 44 219 -58 -152 176 -34
4160c4j17L19K16o59L9M50j78j86K00lj24j04L7km5M09l49k22L34L85m66k43L01
$$ -34 -151 168 384 -275 -236 214 36 -150 50 47 -77 -181 -144 -146 -191 218 -131 -353 -19 366 -100 -343 -42
4183d2K32m73J10L76l71K8K90k87j74M28j12j71J74K85o2m16L53m2k71m7N09m07
$$ -42 190 -283 -173 203 -168 -140 150 -137 -311 117 5 -166 8 293 231 -185 168 126 -145 -192 317 -90
4205i0k02L67r7J03j33M4j76J08J82ok69L06K55p78J78N24k06k90K73K25l65j09
$$ -90 -292 75 -22 81 -52 -8 -184 -76 106 100 -169 137 392 -386 -208 316 110 -180 93 318 -47 -156
4227a56L01O0j81J71j49k39K50m1j62L0L33o0l47L0N63k36n01K77P9m4k45K53
$$ -156 145 205 24 195 46 -193 57 16 -146 -116 217 157 -190 -160 403 167 -334 -57 22 -22 -267 -14
4249a4j8KK82m04o6J33J43k26k12K82R1l27M11P3l38J32L89l27j55K11J71k71
$$ -14 -32 -30 252 -152 -218 -85 58 -168 -380 -98 -7 -334 77 150 -188 -56 333 6 -149 62 233 -38
4271c8q5M99l85j19K31J54n21K98K70l30l35M27L91m73M2M5J43k82l3Jp6L68q3
$$ -38 -123 376 -9 -128 103 257 -264 34 304 -26 -361 66 457 -16 26 71 214 -68 -101 -100 -176 192 109
4294A09l23J26L14k09k30N10p7k90m8L38kk26J76K15l24p2L54k10k65K30M0l97
$$ 109 -214 -88 226 17 -213 297 220 -70 -118 220 218 -8 168 383 59 -13 341 131 -134 96 136 -261
4316b61Q0N59l16l51L4L41m38M33o7R7q0j49j1l0K62k32j25%L67k02l36M11K85
$$ -261 -181 378 62 -289 -255 86 -352 81 14 111 31 -118 -129 -159 103 -129 -254 -254 113 -89 -425 -14 271
4339B71n99M8M01k17j55m5N23m04R6N5J57l2Q7N2o05K06L84j08k60K30K60l45
$$ 271 -328 -280 121 -96 -251 -296 227 -177 -81 -26 131 99 186 238 -367 -161 223 115 -145 85 345 0
4361@k18K33m1j01J10L8k91N20r4l99J56L69k31l03L51J09l24j83M49j69Ppl6
$$ 0 -218 15 -26 -127 -17 21 -270 250 156 -243 -87 282 51 -252 99 208 -116 -299 150 -19 -12 -19 -55
4384e5k86K05J6L29l08N9m8k0J20M54n92j03M57Qm57K45L18m22j77K27J12m25
$$ -55 -341 -136 -120 209 -99 -40 -88 -108 12 466 -126 -229 228 236 -221 24 342 -80 -257 -30 82 -343
4406c43K23K89m53N4L13j39j02jK77r8l86M08k9o2J05q5K6M7J57j85j11J92N7
$$ -343 -120 169 -284 -230 83 -56 -158 -159 118 20 -366 42 13 -49 56 -29 -3 44 201 16 -95 97 154
4429A54k99J64J77j89o7J70N7l15J46M39o18J72K7K69m67L94J16l02p2K43J49
$$ 154 -145 19 196 7 -60 110 167 -148 -2 437 -181 -9 18 287 -180 214 330 28 -44 199 348
4450C48o16L50K52l64k37L90j96j99M21qj55k93K38J83k16J85J40k91J60l8J3
$$ 348 -268 82 334 -30 -267 123 -73 -272 149 141 -14 -307 -69 114 -102 83 223 -68 92 54 67
4471F7j36J06R9j06k6J7k46Q0K96j58k72K45K55k33k21L69Q0m78P2M28l79n8L62
$$ 67 -69 37 136 30 4 21 -225 -145 151 -7 -279 -34 221 -12 -233 136 216 -262 -190 238 -141 -199 163
4494A63k27k63K82K36L7k47j22J87j0j66K20k02j20J26O2p4P4k72J53K94J84o58
$$ 163 -64 -327 -45 191 228 -19 -141 46 36 -130 90 -112 -232 -106 -44 -118 -44 -316 -163 131 315 -343
4516c43J79L35p0k03L54k8j48k4J51j2l12J78J93m67R6J88J12k38L9L10l28J15
$$ -343 -164 171 101 -102 252 224 76 52 203 191 -121 57 250 -217 -121 67 179 -59 -20 290 -38 77
4538G7J75j89j80K75j05k5k10M49k07j21l1P2j03J39Pk37J34K29l28Lk1L98l47
$$ 77 252 63 -117 158 53 28 -182 267 60 -61 -92 -20 -123 16 23 -214 -80 149 -179 -176 -197 201 -146
4561a46OJ67O6k83J27K60n02J84J29j27l11L03R5j09k72N07Q3l77l7K93K0k29
$$ -146 -140 27 93 -190 -63 197 -305 -121 8 -119 -430 -127 -32 -141 -413 94 177 -200 -237 56 76 -153
4583a53L31j75J37Q7j99j41J02K46k81j26L94Ql82J88J61j17o1K96l78j09L34
$$ -153 178 3 140 227 28 -113 -11 235 -46 -172 222 230 -152 36 197 80 19 315 -63 -172 162
4604A62O7l11rL25om08J78P6J2k86K54L03m92J2K38k27N3L37k55K1J12k16K71
$$ 162 229 -82 -91 234 228 -180 -2 74 86 -200 54 357 -135 -123 115 -112 -59 278 23 44 156 -60 211
4627B11q9n5k25p3J58K33k29N2Kl3p2K38j24j93K74j75k7M0J94k47l68M68K57
$$ 211 122 67 -158 -231 -73 160 -69 -17 -15 -48 -120 118 -6 -199 75 -100 -127 -87 107 -140 -508 -40 217
4650B17l65l10N07J30l96K19L7K5q9J32k87k7L85r7j78J3K76j54k69M33r9j01
$$ 217 -148 -458 49 179 -217 2 39 64 -25 107 -180 -207 178 81 -97 -84 192 38 -231 202 103 2
4672Br8LJ34j34K02q5j25J30J18m46L26K01k20j37K00J51l98l9N64l34j55J85
$$ 2 -96 -93 41 -93 109 24 -101 29 147 -299 27 228 8 -129 71 222 -176 -215 349 15 -140 45
4694D5K33k24l62N21l36O2L32j26k23J15PJ0k62J99J08l19R2J30q3J81j2j20j74
$$ 45 278 54 -308 213 -123 -61 271 145 -78 37 44 54 -208 -9 99 -220 -128 2 -81 100 88 -32 -206
4717b06L83o8k75J61K41k17l67L10Q8j36j08K07j0p5j63K07j16p6K94k72J63j12
$$ -206 177 109 -166 -5 236 19 -348 -38 50 -86 -194 13 3 -72 -235 -28 -144 -220 74 -198 -35 -147
4739a47K12j28O4J54j36l16M95j44k58L09J95m54J45K60k97j26J63J32k57L08
$$ -147 65 -63 1 155 19 -297 198 54 -204 105 300 -154 -9 251 -46 -172 -9 123 -134 174
4759A74J16k18n8J02K51l66j36J70Q6j6j14Q9p5J74j8K6k08K47j70l98L37L83
$$ 174 290 72 14 116 367 1 -135 35 121 105 -9 80 5 179 161 187 -21 226 56 -342 -5 378
4781C78l08k50K06K71k65o7L80n98K12K88k46o4J15K8k34J05N9j7k75K44L6j18
$$ 378 70 -180 26 297 32 -35 345 -253 -41 247 1 -63 52 80 -154 -49 10 -7 -282 -38 -2 -120
4803a20N1K95l31Jk8K12k89n0K61M6K6K8j02p3j47J90l15M47qj13j37K12k06l9
$$ -120 -69 226 -105 -104 -132 80 -209 -259 2 48 74 102 0 -73 -220 -30 -345 102 94 -19 -156 56 -150 -189
4827a89L34j2j91j12J63N5k69J16J87J57m02K98J66l45m6K1J73n6n1K9pj11K99
$$ -189 145 133 -58 -170 -7 48 -221 -105 82 239 -163 135 301 -44 -90 -69 104 48 -3 26 19 -92 207
4850B07k96OK56L0l91K3K48r4l2J92r1j9R9O1m01N3K75rk27J03L00n98O4L50K7
$$ 207 -89 -83 173 203 -188 -165 83 -11 -43 149 58 39 138 199 -202 -149 126 117 -110 -7 293 -305 -241 109 136
4875A36o4l80K92j38J51qj41n7J91R8j33r4Q9J00k48N5J27k25O4L14k01j53M18
$$ 136 72 -308 -16 -154 -3 -11 -152 -209 -18 80 -53 -147 -58 42 -206 -151 -24 -249 -185 129 -72 -225 193
4898A93N5m95Q9K48R8k54L04n3l71J30J37j45M5J36j01P7K3J69q6k45J53n4j72
$$ 193 248 -247 -158 90 188 -66 238 185 -186 -56 81 -64 -19 117 16 93 116 285 199 -46 107 53 -119
4921a19L90j23k68n5L78k10j12J73K07k43o0K05p8r0K44j56l3mJ25j54j57P4J23
$$ -119 271 148 -120 -175 203 -7 -119 54 261 18 -42 163 85 -5 239 83 50 46 171 17 -140 -66 57
4944E7po7K34j64o2O4r7j05K32r3m5J17K19l72o0K37p1p8j93L67j67J0R1j10l0
$$ 57 50 -17 217 53 -9 55 -42 -147 85 -8 -53 64 283 -89 -149 88 17 -61 -254 113 -54 -44 47 -63 -93
4969i3lJ30p3j07Q6K15k44L7K01j61r1L63k21j81L56k17P3j34P4J60j78J70o1
$$ -93 -96 34 -39 -146 -60 155 -89 -52 149 -12 -103 260 39 -142 214 -3 70 -64 10 170 -8 162 101
4992A01j11j36M97j69j57L2k56P3MJ85K0j80O4J10o0q5K00Rp8J24j50p5j18M42
$$ 101 -10 -146 351 182 25 57 -199 -126 -122 63 83 -97 -33 77 17 -68 132 141 63 187 37 -38 -156 286
5016B86k15l06K96P7k06l1J07l6j19M25l00k57Q6M27k67k08L53j49KL9J27l36
$$ 286 71 -235 61 138 -68 -99 8 -28 -147 278 -22 -279 -193 234 -33 -241 112 -37 -35 4 131 -205
5038b05JL22n5j64K12l5j75K8J92k09L7oM7o6K3J41j83j41K05K24j68k08L08k50
$$ -205 -204 118 63 -101 111 76 -99 -71 121 -88 -51 -57 -10 -76 -53 88 -95 -236 -31 193 25 -183 125 -125
5062a25r2L81j6j74J9O9m1n0R1q8J7M0J74l36K06P1l02l6L71k13j19K41M4o1j65
$$ -125 -217 164 148 -26 -7 62 21 -29 62 -26 -9 31 205 -131 75 146 -156 -192 179 -34 -153 88 132 71 -94
5087i4R4J16k45J98K3r3j17J99J65k90J68j54j72n8M26j80l16L92J30j16j43N4
$$ -94 0 116 -129 69 92 -1 -118 81 246 -44 124 -30 -202 -260 166 -14 -330 62 192 76 -67 -13
5109a3j03j04K60L4k41J13j9K3K07k13k2j15K79r1k13K99j3L0k02J66o8j02K5
$$ -13 -116 -220 40 74 -167 -54 -73 -50 157 -56 -78 -193 86 -5 -218 81 68 98 -104 62 -6 -108 -83
5132h3K60m9k27J6L01k46j6K50k75L7q6M09k58l38M86l09k6M3K49k20j34J82P9
$$ -83 177 128 -99 -83 218 -28 -44 206 -69 -32 -118 291 33 -305 181 -128 -154 -111 138 -82 -216 -34 45
5155D5j5j40K68k55J01L0j1l0J55j39j35K85r7K07k35J86q8k65J28J21n3j43L5
$$ 45 30 -110 158 -97 4 34 23 -7 148 9 -126 159 62 269 34 220 132 -133 -5 116 63 -80 -45
5178d5K3m6o5J91k26j8K50k27M6K10M3k04j63L11j77J65k67J41j13pJ63n7m0K52
$$ -45 -22 -68 -133 58 -168 -186 64 -163 -117 93 136 -68 -231 80 -97 68 -199 -58 -171 -178 -15 -72 -112 140
5202A40k02j46J14J98k90J00R6P4k08J6K71k62R7Q0N0l11K21L8l68P6K60J24l84
$$ 140 -62 -208 -94 104 -186 -86 10 84 -124 -108 163 -99 -2 78 128 -183 38 76 -292 -216 44 168 -216
5225b16J38L38k46p9J82j78P1M1j1k22J40K13q7n3O9j8n9R4Q2j78j56K46q8M0
$$ -216 -78 260 14 -65 117 -61 10 51 40 -182 -42 171 84 31 100 82 23 117 199 21 -135 111 23 63
5249F3k02K04J8j07M3j53K44n4j94L3J13J45j95J18L2R5k61K3J59p2k56J50J88
$$ 63 -139 65 83 -24 19 -134 110 56 -138 -105 8 153 -42 76 108 203 -58 -35 124 52 -204 -54 134
5272A34l08P3Q7m0j56K31j3k05K24P7j96J6K7J7j42J90P3n8l55L32M5k32L53j20
$$ 134 -174 -101 -14 -54 -210 21 8 -197 27 104 -92 -76 -49 -32 -174 16 89 31 -324 8 53 -179 174 54
5296E4n1M7N5j46j49K05J80k70K09L2j10k40K45J00j83L00j53J75k39Lj01j58
$$ 54 3 50 105 -41 -190 15 195 -75 134 166 56 -184 61 161 -22 278 125 300 61 64 -37 -195
5318a95K23n9j20k4J61L9K5n2m1J6o8K39j80o5L07j67M4j16L0J84j21K9n2q8Q5
$$ -195 28 -31 -151 -175 -14 25 50 -2 -43 -27 -95 144 -36 -101 206 39 83 -33 -3 181 60 89 37 -51 34
5343C4J59k24j14K18O3k06K0L69m37N1O3J76p7l0k03R8p8J1J01r5j5J29P8k28
$$ 34 193 -31 -145 73 136 -70 -50 319 -118 -67 -4 172 95 65 -138 -40 -118 -107 -6 -101 -116 13 91 -137
5367a37L5J86m23L97o6o5J31K5j76J36J82k87J04k71K11K8j19K5L12l81J13j4
$$ -137 -102 84 -339 58 -8 -73 58 83 -93 43 225 -62 42 -229 -18 10 -109 -84 228 -153 -40 -54
5389e4J74Km5l1q9OK51l67l7K96j38Q4r5L17k56J3J26k6l24J81P7r6Q0M7n8n3
$$ -54 120 122 77 46 -43 -37 214 -153 -190 106 -32 52 -43 274 18 31 157 131 -193 -12 65 -31 49 96 38 -15
5415a5j14O5L7M8o9j30K51q1L0QPP2k73J62p0J24j32M6M9k05R8Q9Q6k90L02P3
$$ -15 -129 -64 -27 21 -48 -178 73 -8 22 30 37 109 -164 -2 -72 52 -80 -34 15 -190 -92 -3 83 -207 95 168
5441A68n06K64K95l66J00J41L3j07m5K97k16k53L38J08l84K08LR4k07k2J73k40
$$ 168 -338 -74 221 -145 -45 96 129 22 -23 274 58 -195 143 251 -133 75 78 172 -35 -57 116 -124
5463a24J45j4n8j4L11k43k26K95J12k29m8J30K59k46j59N4M5o9N8qO4P7n3j38
$$ -124 21 7 -51 -65 246 3 -223 72 184 -45 -93 37 296 50 -109 -55 -10 -79 -21 -29 35 112 59 -79
5487g9n1K32j63p7qL80l06Q3m2rM1J75j59k05K91j2j86n0J42J22l60K19P3k2r7
$$ -79 -130 102 -61 -138 -146 234 -72 11 -31 -40 1 176 17 -188 103 91 -95 -145 -3 119 -241 -22 51 29 -68
5512f8q5K08j80J55J20l17M28k78J95k84J77J59k98J30J81j54j15o8J26j87J95
$$ -68 -153 55 -125 30 150 -167 261 -17 178 -106 71 230 -68 62 243 89 -26 -94 32 -155 40
5533D0j36J14j1N5N7j20m2K54l17K5J00J02k15M5J48J6j75J63k9l57M89r5l5j48
$$ 40 -96 18 7 62 119 -1 -43 211 -106 -81 19 121 -94 -49 99 115 -60 103 74 -283 206 111 76 -72
5557g2K20l94J84P2Q3j49J40K6m5n1l3J30k01J7O6N1k15J82nj22K3J41j08j07
$$ -72 148 -246 -62 10 93 -56 84 110 65 14 -19 111 -90 -73 -7 44 -171 11 6 -116 -93 48 -60 -167
5581a67J80k25j6K07Q4k50K08Q1n2j41M6L5j40N7MK08j59r4K59k47p4J59K1O3
$$ -167 13 -212 -228 -21 63 -187 21 102 50 -91 -45 -10 -150 -93 -89 119 -40 -134 125 -122 -196 -37 -16 47
5605D7j29Pj47K65O2k9k50M38k21J20k24J06j29kK0R7k58O7K95j82p8K66p9j49
$$ 47 -82 -75 -222 43 105 76 -174 264 43 163 -61 45 -84 -86 -66 31 -227 -160 135 -47 -125 141 62 -87
5629h7J61j35R2J5K4n4j59R9J96j96J45N7q5k90K96J52k63M3N3Q7p2j12q3J74
$$ -87 74 -61 31 46 70 16 -143 -44 152 -44 101 158 73 -217 79 231 -32 11 64 151 79 -33 -116 58
5653E8l2n0LJ95r1l7j56J09J6j92pK41n5j17J57r1L8j6J51jj99J04m2r7k31M61
$$ 58 26 -24 -21 174 83 46 -110 -1 15 -177 -184 57 2 -115 42 -49 -11 -27 124 123 -76 28 -14 -111 -342 119
5679A19j2K6j8j57j27J44p5J9L5O7K63l54R1qJ49j84j10J66o3k3K49k88n8K75
$$ 119 107 133 115 -42 -169 -25 -100 -81 -46 21 284 -70 21 13 162 -22 -132 34 -29 -52 197 -91 -149 126
5703A26j5k37J11L9jo3J35%j37JMJ09j38Q6J00k39R6J0j14P6m8P4o0R5q2m4J17
$$ 126 111 -126 -15 24 23 -40 95 95 -42 -41 -37 72 -66 20 120 -119 -23 -13 -127 -51 -99 -25 -85 10 -72 -116 1
5730AK15l67M1K40k9mj24j34L7K57k1j43m3L8J3p7R8M3k02j79M30n1k3k39K83
$$ 1 216 -151 -110 130 101 97 -27 -161 -124 133 112 -31 -74 -36 -23 -100 -2 41 -161 -340 90 39 16 -223 60
5755F0k00K51L7j12q4K6RL4j39r6L5J05J82q0o0p5N0j2Q6k64K85pj22K27p5j29
$$ 60 -140 111 148 36 -48 -22 -13 21 -118 -214 -179 -74 108 28 -32 -107 -57 -69 17 -247 38 31 -91 136 61 -68
5781f8j9O3J92l03L74o5j61J84j66m6o1L10j30k00L73r7j95r5J05K44m08K87J22
$$ -68 -87 -24 168 -135 239 174 13 197 31 -15 -76 234 104 -96 277 180 -15 -110 -5 239 -169 118 240
5804B40l17NJ85l6r0J02k5j21q0M4K7P6m8k0P9N8J61k88j72L47N8k46p5J44j24
$$ 240 -77 -72 113 77 -13 89 64 -57 -137 -93 -66 10 -38 -58 21 79 240 -48 -220 127 185 -61 -136 8 -116
5829a16l9L65m01L3J85J40j80r4P6J44k25J90J83k22k38L09k38r4K62j8k4j27
$$ -116 -155 210 -191 -158 27 167 -13 -107 -31 113 -112 78 261 39 -199 110 -128 -222 40 22 -2 -129
5851a29K31L5r1n4J10j39n0J35j99J96J6J12k02N6K28k45K7p5J13k16K27M2j31
$$ -129 102 137 46 -8 102 -37 -87 48 -151 45 61 173 -29 27 255 10 37 -38 75 -141 86 128 -3
5874cJ7k0o0J14K2J41p2k98K85o1M0j20k2o6j8J25j94P8K07j59j90K75J26o3j24
$$ -3 14 -6 -66 48 70 211 139 -159 126 65 105 -15 -37 -103 -121 4 -190 -112 95 -64 -254 21 147 84 -40
5899d0J38j36j34L41j56p9J37pj38OR0J82k81K3R1j2K6Jp3K00k85J91l9L9j23
$$ -40 98 -38 -172 169 13 -66 71 64 -74 -68 22 204 -77 -54 37 25 51 52 -21 179 -106 85 46 85 -38
5924c8n4L35j88M6n3r1P0K07k99J33M8k57kK38R2k54M5K42j63n2l2OR6J13Jj84
$$ -38 -92 243 55 101 48 -43 27 234 -65 68 116 -141 -143 95 187 -67 -22 220 57 5 -27 -21 75 188 189 5
5950El7L01l26K06N1l60K85j15J25k59l5J57j5j56L10K9j64MM7k22J89j7J75j98
$$ 5 -32 269 -57 149 200 -160 125 10 135 -124 -159 -2 -17 -173 137 166 2 6 53 -169 20 3 178 -20
5974b0k0j12Q9P1O1O3Mj81k3j52R2J49L5j76J29j34K09n6O5k86M4K70Rj70J48
$$ -20 -40 -152 -63 8 69 132 136 -45 -68 -220 -128 21 56 -120 9 -125 84 28 93 -193 -149 121 130 -40 108
5999A08L0j69k10J60oj01O4K21M5l56J53P9p8J23j85P0KJ64l9q0Q2PJ28k55P5
$$ 108 138 -31 -241 -81 -87 -188 -124 97 142 -214 -61 18 -60 63 -122 -52 -50 114 75 -5 77 84 212 -43 32
6024C2K61m95K32j7%O5m3J28j97L67l23j01q0L29j37mO6J03k61qJ44j40r7L90
$$ 32 293 -202 30 13 13 78 35 163 -34 333 10 -91 -171 158 21 17 83 186 -75 -83 61 -79 -176 214
6048B14l06K13j99K40j36o4P4o4M7j03J09K7o9j03J41r0K40j46J38j15j19j33
$$ 214 -92 121 -78 162 26 -38 36 -28 19 -84 25 52 -17 -120 21 -69 171 25 163 48 -71 -204
6070b04J83J07p7o7p6J06J15k65K75p8M4n3N5J1j82K95q3j00n9M5n9J0N6O4j88
$$ -204 -21 86 9 -58 -134 -28 87 -178 97 19 63 10 65 76 -106 189 106 6 -53 -8 -67 -57 -1 63 -125
6095a25J32J55o0k10J09K58l23J28J26k24J02O7J0k08K00Jj82q2K48j42p2J0J81
$$ -125 7 162 102 -108 1 259 -64 64 190 -34 68 135 145 -63 137 138 -44 -126 122 -20 -92 -82 99
6118I9j81N0n0L7Q7j51Q9n1j9J14q7J0o3K01j10J14k65K47j82J9J59j40J32l03
$$ 99 -82 -32 -82 -45 42 -109 -20 -71 -90 24 -63 -53 -116 85 -25 89 -176 71 -111 -92 67 -73 59 -244
6142b44M22j52J01K4j96J27n1o5q7J44L5k34J54k6M0j20K04j80J19j29J82m7j00
$$ -244 178 26 127 151 -45 82 31 -34 -121 23 58 -176 -22 -48 -8 -128 76 -104 15 -114 68 21 -79
6165g9J31k67J53N4l7N1m2N6L4n8j12K24k25m3J45J18k09Q8O4j9n5L32k50QM7
$$ -79 52 -215 -62 -8 -45 6 -36 20 54 -4 -116 108 -117 -160 -15 103 -106 -18 46 27 -28 304 54 62 109
6190A09j02J2P4j0r4K79m22Q0j19K67j37Lp1K2J99l5n5j57J67l0N1j17n8M8J60
$$ 109 7 19 93 83 -11 268 -154 -74 -193 74 -63 -60 -131 -109 90 55 0 -157 10 -20 31 -86 -144 -96 64
6215F4o2K6R4j60k42J39j33J25K57j03n7P5n2M3J64j54N4j56l4K1J3J20O8n0k36
$$ 64 2 28 122 -38 -280 -141 -274 -149 108 5 -52 23 -29 14 178 24 78 -78 -112 -91 -78 42 110 60 -176
6240a76R4J44j89J03J81K5k8j02L4m2r6J3n6M6q2P5J57k33M16k43l5q8k4J34r4
$$ -176 -82 62 -127 -24 157 182 154 52 86 44 -52 -39 -95 -49 -131 -56 101 -132 284 41 6 -82 -106 28 -66
6265f6P4O6k65Rk5L01p9O1k28J77k93L35j11j2k6k5K33k68K92o8j11J74Kj92J11
$$ -66 8 74 -191 -182 -207 94 15 76 -152 25 -268 67 -44 -56 -82 -107 126 -142 150 82 -29 145 147 -45 66
6290F6n0l2O8j34l5K29P6k06QO0l15K86l6P2j07p9J98K51l11J4k0J42o1j55K00
$$ 66 16 -16 52 -82 -117 112 188 -18 -10 50 -265 21 -15 57 -50 -129 69 320 9 23 3 145 84 -71 129
6315A29N5j58j16l4J43R9o3M7j42Qm3N9j33R0J57pNM0k63O3Q0j6k7L2o0J3J25
$$ 129 184 26 -90 -124 19 118 55 102 -40 -32 -75 -16 -149 -59 98 91 96 136 -127 -64 16 0 -27 5 -55 -42 83
6342H3j15o2J63kk16LK59Nq3j40N5n1MJ05k03J33J47p0m0Qn7n8J96j09R5k70K08
$$ 83 -32 -94 69 67 -149 -146 113 118 35 -105 -50 -101 -97 8 -195 -62 85 15 -25 -17 -74 -132 64 -45 50 -220 -12
6369a2J48k40Qj17K53Jq4R7K2j44K12k10J15r6J61k1k13J16j39P6k20L17r4mJ42
$$ -12 136 -104 -96 -213 40 41 -43 54 76 -68 144 -66 49 -47 114 93 -120 -4 -143 -67 -287 30 -64 -68 74
6394G4L3j80Q3N2K8k91J93MK75l75Q6q2J7K21j47Q1p3J43q7L1q3J03j23N7N3j1
$$ 74 107 -73 10 62 90 -201 -8 -4 271 -104 -18 -100 -83 138 -9 72 -1 142 55 86 3 106 -17 40 93 82
6420H2r6K6l0q9K54j24p0J05o0k6j28J79q3J68j19M1n6j9K76j93j09J87j19Q0
$$ 82 -14 12 -18 -107 147 23 -47 58 -2 -28 -156 23 -60 108 -11 30 -26 -45 231 38 -71 116 -3 77
6444G7j48J00Mpj58K10j31n7K93j98J31j07Rj84K97k19J2Q3p9R1n5j60J53M9k32
$$ 77 -71 29 33 26 -132 78 -53 -110 183 -15 116 9 18 -166 131 -88 -76 7 -72 19 -36 -196 -43 6 -226
6469b26M52l50J2J11J83r3k71J54l7r5K54k5j12O4P5M4l08J69O9N5j36j28J78
$$ -226 226 -124 -112 -1 182 89 -182 -28 -65 -160 94 69 -43 21 96 140 -168 1 70 125 -11 -139 39
6492C9n3K90j19l4p1oL4j64J26q7L3J64k42j13K26K4o0M7N1K6K4r4j3J2j6j19
$$ 39 -14 276 157 123 52 46 80 -84 42 -45 -12 152 -90 -203 23 47 -13 34 85 111 135 41 28 40 24 -95
6518i5K65j76m4j6Q4P7k25M76l75N7j82L3r4K48j40j7J36J53j61j32J94J12j13
$$ -95 170 -6 -50 -66 18 95 -130 346 -29 28 -154 -121 -215 33 -107 -124 12 165 4 -128 66 178 65
6541F5Jo9j39J86n1j22p0R9J54l3j37J73j04K73j98J39r3q1k0q2K20O2l90L46
$$ 65 66 -3 -142 44 -7 -129 -199 -100 54 21 -116 57 -47 226 28 167 74 -7 -27 -109 111 173 -217 129
6565A29p0J2j03kK03n2j44J70m0j27J31l4l4n5M4L4j79N4Q0m8j00K17J31j09O1
$$ 129 59 71 -32 -34 169 117 -27 143 103 -24 107 73 39 -16 28 62 -117 -63 17 -31 -131 86 217 108 169
6590A69k88J9R9O5J18j43kK83k28j08J2O7j08J9J24k26J64JQ7k12o1J26L9k44
$$ 169 -119 -100 -1 64 182 39 37 320 92 -16 -4 63 -45 -26 98 -128 36 37 124 -88 -149 -23 16 -228
6614b28L10j02j3O3K17k80r4n5K01j22R2j1J23k44J65M9k6q4pj48K71r4j74J48
$$ -228 82 -20 -33 30 247 -33 -127 -182 19 -103 -11 -22 101 -143 22 71 45 -39 -46 -194 77 -17 -191 -43
6638d3J39k36l1J54J29M3j10J44k46J37p6Q2mp1k41L81j08j3O8j16J34k48J33
$$ -43 96 -140 -171 -17 112 155 45 189 -57 80 4 86 82 11 -230 151 43 30 98 -18 116 -132 1
6661AN7j04NJ13j90K08j42P5J09k95K56P3m4j78pn4m5M6Q7o9N5qr3L08k28M7R5
$$ 1 58 -46 -41 72 -118 90 -52 23 132 -163 93 166 122 -56 -63 -117 -162 -116 -29 -98 -43 -51 -144 164 -64 -17 78
6688G8Rk64J75j7m2J63J0k4k96M8J73k11K68Q8j35j14R6m0O3RK3j51J21j63K39
$$ 78 87 -177 -2 -19 -61 102 112 88 -208 -160 13 -198 70 158 23 -91 5 -35 28 37 60 -91 30 -133 106
6713A06k19K44j05j56P7j56J29L6J56j21J15O7j64M1m4n8r5n7L78n1k9l35K28
$$ 106 -113 131 26 -130 -53 -209 -80 -44 112 -9 106 173 9 50 6 -52 -147 -204 174 123 94 -241 -13
6736a3O2j30J20J97k23l7M7o3l6m2MK05k04J63k5k3K14l69K16n1q2m3R7o5k0J60
$$ -13 49 -81 39 236 13 -24 23 -40 -76 -118 -114 91 -113 50 25 2 216 -153 63 12 -70 -113 -16 -81 -101 59
6762E9r5k2k6N6J79o9j87J80Pj22RJ65j30o6N3k5n6rJ54L9j6j32o7j58L40J75
$$ 59 -36 -58 -84 -28 151 82 -105 75 82 -40 -31 134 4 -62 -9 -34 -90 -99 55 94 78 -54 -121 -279 61 236
6788B36l00o3Q7J39k69K60J27k23q3L32j03j45nL1o1Q7j55J60o8M3j92J92N8p
$$ 236 -64 -127 -40 99 -170 90 217 -6 -89 243 140 -5 -10 21 -40 47 -108 52 -16 27 -165 27 85 78
6812G8Q4m37J86J5K53l05J43r3p7J99J04p4j56J62O6o7j0R0m1k95J81k9o6j9K9
$$ 78 162 -275 -89 -74 179 -126 17 -76 -153 46 150 76 -80 82 148 81 71 161 120 -175 6 -23 -89 -108 -79
6837g9O6j67J37q0K62n8O2j48M4j05MrJ21j07j40J20J4P6o4J6J83p7l8J18k04
$$ -79 -13 -180 -43 -123 139 81 143 -5 39 -66 -62 -71 50 -57 -197 -77 -63 13 -51 -35 148 71 33 151 -53
6862e3P2J67j83j00K08k87K26Nop4j26K38J48j96N5o7q0O9m1J93j73j68K47m2
$$ -53 19 186 3 -97 111 -176 50 55 49 -25 -151 87 235 39 94 27 -53 16 -25 168 -5 -173 74 32
6886C2p6J04k8j09J58K7l06K78j85JP9Q3L8r7n4J23j16n2J79K6p9PK0M4j48J48
$$ 32 -44 60 32 -77 81 108 -198 80 -105 -104 -25 58 96 -1 -55 68 -48 -100 79 105 26 33 53 97 -51 97
6912I7j67nJ00n0J0J6J88k24r4J51k0RM1N8k8Oj80J87k7N1o4r2K6m4J79j70QQ2
$$ 97 -70 -75 25 -25 -15 1 189 -35 -129 22 2 11 52 110 82 88 -92 95 68 119 55 -37 -11 -55 124 -46 -38 44
6940D4J32k03P9j45M3j21R3j34J96j8J7OJ78k93K10l9q3L3j4J80n6j9j31O1No9
$$ 44 176 -27 52 -93 -50 -171 -78 -212 -16 -34 -17 -11 167 -126 84 45 -38 -5 -19 161 105 86 -45 16 21 -48
6966d8j02N5J13L7N3l3j6rm9R1n8J00l35J64P0Pq6j85N8K18J7j80J00J08j63M6
$$ -48 -150 -95 18 55 108 75 59 50 1 92 34 134 -201 -37 33 40 -46 -231 -173 45 62 -118 -18 90 -73 -27
6992b7N2j84K22m7J28p3j16o1R3J45j65J28m9j7l2p8J94j82j3J99k49Q4J95k20
$$ -27 25 -159 63 16 144 71 -45 -106 -13 132 -33 95 46 29 -3 -81 113 -69 -82 117 -132 -48 147 -73
7016g3K39k07J24J11j39K1n0K4m0j18N3m9K9j30M7J02J01P7q3r6N8l6J43l5k01
$$ -73 166 -41 83 194 55 76 26 50 10 -108 -55 -104 -75 -205 -158 -56 45 122 39 -57 1 -35 108 73 -128
7041a28K85m2m6K1j1p9r5J30L8R9l39P3L75k86J19J18l70j6J36J80j47J39j24
$$ -128 157 115 69 90 79 0 -95 35 73 172 -167 -94 281 -5 114 232 -138 -154 -18 162 15 154 30
7064C0n8N5j79J65k17K50j85J75j24L9J17M9l5j85J83Rp0NO5j46J12o8j44j0L12
$$ 30 -28 27 -152 13 -204 46 -139 36 -88 -49 68 117 82 -103 80 89 19 24 89 -57 55 -13 -157 -167 145
7089A45o7N8k28j03J34l5Q1l7P1N1j01j3o7J40j26J13l4J92n3k34J48j22M2j33
$$ 145 78 136 -92 -195 -61 -96 -15 -52 19 70 -31 -44 -111 29 -97 16 -18 174 121 -113 35 -87 -45 -178
7113a78J44M2k0J21k24Q8N9k28N5K04J20l11R5J73j63k0K62k56nJ5j4m6j2J04
$$ -178 -34 8 -12 109 -115 -27 32 -196 -141 63 183 -128 -33 140 -23 -43 219 -37 -42 -27 -41 -87 -99 5
7137EQ0k77J26J74m6j07J87p6k11J63P8j64q8J95j38J55J25j76k39K53J54l15
$$ 5 85 -192 -66 108 62 -45 142 66 -145 18 96 -68 -156 39 -99 56 181 5 -234 19 173 -142
7159a42m6J20K25n3J18k14q3J49r6j3Nj37L08j86L6j04k0J44j66J83j30K0K05
$$ -142 -188 -68 157 104 222 8 -75 74 -22 -35 -30 -167 141 -45 -9 -113 -133 11 -155 28 -102 -82 123
7182A23j40P1o3o9K54k67K66j53J1o4J97k76K09J01k56q4K3O0JK43k60J39l2p1
$$ 123 -17 54 -9 -78 176 -91 175 22 33 -31 166 -110 99 200 -56 -140 -117 -57 -56 187 -73 66 34 -37
7206c7N9m7J02J25j39J00k88k4Q9O3K06k90jQ2J4mR6j48o3Q9p2r5O4K06o1L4p0
$$ -37 22 -25 77 202 63 163 -125 -149 -60 3 209 -81 -82 0 14 10 106 -42 -105 -16 -88 -183 -119 87 26 60 -10
7233a0J00N8j28o5L04j87o5p5L7p5L23k63N4j44N7J88k20J09Q1j48K03k21L3l0
$$ -10 90 148 20 -45 259 72 7 -68 -31 -106 217 -46 8 -136 -79 109 -111 -2 79 -69 134 -87 -54 -84
7257h4m5K70j75j22L08k04J11j14N1n6L8L2n3R2M0m3j12J8J75o3j29K33l72K50
$$ -84 -129 141 -34 -156 152 -52 59 -55 -4 -60 -22 10 -43 49 89 46 -66 -48 127 64 -65 168 -204 46
7281D6O5j63J0P6j25J36N7m1o0K44k67L8j80j49M80j68j60K25j15L6k35M59k85
$$ 46 111 -52 -42 34 -91 45 102 61 1 245 -22 16 -164 -313 167 -1 -161 64 -51 -15 -250 209 -76
7304g6J66l2j15R7j07R8M1Nj8j35R2j68J48j27J88j61L68k55J90k56k3P5J4K3
$$ -76 90 58 -57 40 -67 31 72 77 59 -76 16 -152 -4 -131 57 -104 264 9 199 -57 -80 -5 9 32
7328C2j06R8j73L6J5J67o3K1o7P8q0on1P6o2Q5Ql7O7n5J04k12J23K23l47R9J6
$$ 32 -74 24 -149 -113 -98 69 6 27 -40 38 -42 -48 -99 -23 -85 0 8 -29 38 -17 87 -125 -2 221 -126 -27 -11
7355a1J92m06L16l2rJ99l79J48l12L89l4j13J64q4J59J21j46k57o4J17O7O0%J09
$$ -11 181 -225 91 59 50 249 -130 18 -294 95 61 -52 112 28 187 308 162 -95 -159 -42 25 85 85 194
7379A94j63r0J38n1k9j59K13J3j69K71j08j20J0R0n3r3J13Jj21J12N1k79J75K02
$$ 194 31 -59 79 28 -1 -160 53 66 -103 168 60 -60 -50 40 -13 -106 7 8 -113 -1 50 -229 -54 148
7403A48j30J1J92k19K3Q2N4n4k09K42k28P5J16m9J55l40J93l5l8o6j9N0j26M0
$$ 148 18 29 221 2 25 107 161 107 -102 140 -88 -13 103 54 209 -131 62 27 -11 -77 -96 -46 -172 -132
7427a32K67j98J65l6l07J87L4J37j90K4l3J93k5o3Q3j22M4p5J3R3j48J46j8j42
$$ -132 135 -63 102 66 -241 -54 -20 117 -73 -49 -82 111 86 23 106 -16 28 -47 -34 59 -89 57 39 -103
7451a03J03K3K8j58K76j48J05k98N1M8J12j18m2J4J55j4K8J3m8p9K07k24l3K14
$$ -103 0 23 51 -107 169 21 126 -172 -121 -73 39 -79 -121 -107 48 34 62 75 27 -52 155 -69 -102 112
7475A12j25j38K8J38PJ71l01P5jq0M9Q2j14J20J6o8J28j09m5K0N9J4R8p5p6k9
$$ 112 -13 -151 -123 15 22 193 -108 -33 -34 -114 -65 17 -97 23 39 -29 99 -10 -55 -35 24 38 136 61 -15 -44
7501d4j27J70j35K97k37R0M0j13J65l2o4j04rK68M1o2j63R4p1J67n3m7m9o9J53
$$ -44 -171 -1 -136 161 -76 14 54 -59 106 74 10 -94 -103 165 206 144 -19 75 4 171 118 71 22 -47 106
7526A06j47l0L7Mn8J85N8k97P3L5L5L2j51K5L3QP4k21K68k6j00J21k00K15k02
$$ 106 -41 -71 -34 -30 -88 97 155 -142 -69 -34 1 33 -118 -93 -60 -52 22 -199 69 43 -57 64 -136 79 -123
7551a23K33k88R3J64k20J46j8K12j26M1q2J43m08L84j26j20P0m9K29q0j69l5J66
$$ -123 110 -178 -85 79 -141 5 -13 199 73 114 32 175 -233 151 25 -95 -25 -74 155 75 -94 -129 37
7574C7m1o1K29r5j15p1K66j63k1j85L77k60J0J33j30R0p3M1q6J35q4N5O1j64j15
$$ 37 -4 -65 164 69 -46 -117 149 -14 -35 -220 157 -103 -93 40 -90 0 -73 -32 -118 17 -67 -12 49 -115 -230
7599b30K68oP5j00j3j2L2o8j0J61q2j5k7K37l44K08j20K05j83q5K38k50J16J26
$$ -230 38 32 107 7 -6 -18 14 -54 -64 97 15 0 -27 210 -134 74 -46 159 -24 -109 129 -121 -5 121
7623A21J2k90K35N4k17J36k65P8J28J9ll0N0RLk11R2K39j56o0q9J58J5r9M3L9
$$ 121 133 -157 78 132 -85 51 -214 -136 -8 11 8 -22 28 37 40 -171 -79 160 4 -56 -145 13 28 -71 -28 11
7649A1n5k1J47J3j59J53L5j12l4pJ41j15N0M9j58R6MJ5j6l0K5n9J57q6rKm0J57
$$ 11 -44 -65 82 95 -64 89 124 12 -22 -29 112 -3 47 96 -62 34 38 53 37 7 32 -27 130 44 35 37 -3 154
7677A54o4j11j05J03j79K39j41Q4J63l4j33L1M4n8j45J71m4q6L28p5k28r1K44
$$ 154 90 -21 -126 -23 -202 37 -104 -20 143 109 -24 7 51 -7 -152 19 -25 -111 217 142 -86 -177 67
7700F7O6j89L00j27k31P3K43j84n7J4j42L8P3J13o8J51k39J92r1j4J10k2o3j06
$$ 67 133 -56 244 117 -114 -41 202 18 -39 -25 -167 -129 -56 57 -11 140 -99 93 2 -12 98 76 13 -93
7724i3J44j46j54Q2J06R4M9O1k97K64J10m62J99m2J22K2r9J23l01K47J50q2j82
$$ -93 51 -95 -249 -167 -61 33 82 143 -154 110 220 -242 -43 -85 37 59 -40 83 -218 29 179 97 -85
7747h5J8O5L7p0Q7lj70J91p5R8o8Qp1o9K11n7m0n6N7K5j44K8P2j08O0M7n4M9K70
$$ -85 -67 -2 35 -35 52 49 -121 70 -5 93 25 33 -38 -107 104 47 7 -49 8 33 -111 -83 -11 -119 -59 -12 -66 -17 253
7776B53k54NJ20j80q1K58j57J38j44K19o8j3k85K60j40p5K15k35J77L7K4j35j01
$$ 253 -1 4 124 -56 -137 121 -36 102 -42 177 109 96 -189 71 -69 -144 71 -164 13 50 74 -61 -162
7799a62K74j64O0l75M36l04J14J30Q4q1k00Q1J8Q3j91J98N0k07K02k21L30L6j30
$$ -162 112 -52 8 -367 69 -235 -121 9 93 12 -188 -107 -89 -6 -197 1 51 -156 46 -175 155 191 61
7822F1j02J64J00k32J09j72PJ21J2M7o8k73L04Rn8J24p5j51J07j17J8J61r5N0
$$ 61 -41 123 223 -9 100 -72 -65 56 68 115 47 -226 78 87 29 153 78 -73 34 -83 -65 96 1 51
7846E1Q9k83L77l06P9J53k27m9J57Rj12L2M9j98K50j64n2l4R1K6J85J8k24J98
$$ 51 140 -143 234 -72 7 160 -67 -116 41 50 -62 -30 19 -179 71 -93 -145 -179 -88 -62 123 141 -83 115
7870A15k13PK26lk82J5J93k45J35K3K68l30J63j90J75m0J2q7J49J50k13MM9m3
$$ 115 -98 -91 135 132 -150 -135 58 -187 -52 -29 239 -91 72 -118 57 17 29 -58 91 241 28 32 81 38
7894C8np7K16j55n7M6K9J6j29Q1j00N3J36L8j71L4N7K16k97j00J79n1j66K34J57
$$ 38 33 -44 172 17 -40 6 35 51 -78 3 -97 -44 92 130 -41 -7 50 266 -31 -131 48 -3 -169 65 222
7919B22k77K9JJ29p9O8p8L3J89j01k15K7n7J35j43J80o5j00R7nJ12n4j00j38L4
$$ 222 -55 -26 -25 104 25 93 15 48 237 136 -79 -52 -109 26 -117 63 -2 -102 -5 -10 102 48 -52 -190 -156
7944a56J41L9o7o6Q3lN8J71k23j3pn0K08l19P6K56q0j74q0K63m1j9K1J77j26J8
$$ -156 -15 24 -43 -109 -26 -29 29 200 -23 -36 -43 -93 115 -204 -128 128 48 -126 -206 57 16 -3 18 195 69 87
7970H7pKl7%lO7J16l01J53l4o5l5P8j10q2P7j23L37p4m9L0j30Q1J77j16J3L61
$$ 87 80 82 45 45 42 109 225 -76 77 43 -22 -57 21 -89 -171 -94 -217 120 46 -3 27 -103 -22 155 39 52 413
7997D13l50j24O9j24K52j13J0lm5l7K45k34j77J93M6j69K03j4k2l1NM3O4m2m8
$$ 413 63 -61 8 -116 136 23 33 30 -15 -52 193 -41 -218 -25 21 -148 55 41 19 -12 -7 36 100 58 10
8022A0p5Q7r2P5K7N8o6q6M5Q6j82J84j15k8J80j84K0K9m5R6j22J17j67l1J71J2
$$ 10 -65 22 -70 5 32 90 24 -62 -17 69 -113 71 -44 -72 108 -76 -56 -27 -72 24 -98 19 -148 -179 -8 4
8048Dj69J89p8Q7O3l16L68k32j3J63O5N1p3j19p1J78k43N0J29j23J45mL5j50J18
$$ 4 -165 24 -54 33 96 -220 148 -84 -97 66 131 182 109 -10 -81 97 -146 -96 33 -90 55 51 86 -64 54
8073E4j07L6r1M0l8J66p4k7J04m7K0r8O2k6m7O3K1J4q7j93K41M8N4j46J88j62
$$ 54 -53 -17 -108 -68 -106 60 -14 -41 63 16 36 -62 0 -26 -73 -10 11 25 -62 -255 -14 34 88 -58 130 -32
8099c2k1K56k28J39p9j5j27J79J1j21J08jj32O7OJ0j46M9M3j20J10k2mLK9K2N
$$ -32 -53 203 -25 114 35 20 -107 72 83 -38 70 69 -63 4 10 20 -126 -77 -34 -154 -44 -66 -70 -67 -38 -16 -11
8126a1Q1k96K32K9j88K05J3N3j67K1K61l21J35k65J85J0r9J22j79J75J8n5O3m0
$$ -11 70 -226 6 35 -153 52 65 118 -49 -28 233 -88 47 -218 -33 -23 -122 0 -179 -4 14 -41 22 -18
8150a8j88J39J70j87Q4J64n8p2M9R0M5l43k8K52j43j4J59j72k4K68j01j16k3K12
$$ -18 -206 -67 103 -84 0 164 106 34 83 173 218 -125 -153 99 -44 -58 101 -71 -95 173 72 -44 -67 145
8174A45j20j10N0R7L4j88K05k5j29lK19j90Q1j45Q2Jj16
$$ 145 25 -85 -35 62 96 -92 113 88 -41 -44 175 -15 66 -79 3 4 -112
8191a12
$$ Imaginary data points
##PAGE= N=2
##DATA TABLE= (X++(I..I)), XYDATA
0@%%%qK4k4K4m0N6p2Q8j12J44j76K11k59L20l79M43n25O21p23Q37r69J116j280
$$ 0 0 0 0 -8 16 -8 16 -24 32 -40 48 -64 80 -96 115 -144 176 -203 240 -285 336 -387 450 -519 597 -683
26f83J462j664J888k136K407k707L039l403L802m238M715n241N820o453P149p917
$$ -683 779 -885 1003 -1133 1274 -1433 1606 -1797 2005 -2233 2482 -2759 3061 -3392 3757 -4160
42d160Q764r701J0746j1914J3230j4723J6427j8401K0719k3479K6835l1022L6415
$$ -4160 4604 -5097 5649 -6265 6965 -7758 8669 -9732 10987 -12492 14343 -16679 19736
55A9736m3658N3965o9907R8035j61997N48934J6831j201497N82920R12395l83742
$$ 19736 -23922 30043 -39864 58171 -103826 445108 461939 -739558 -156638 755757 372015
66C72015r58134L94631P73261l14545p88079K46153O23578j28189n07210J19761
$$ 372015 -586119 -191488 581773 267228 -520851 -274698 348880 220691 -286519 -166758
76a66758L35160j05250k47228J54817J84656j06553j07270J08525m960j17945
$$ -166758 168402 63152 -184076 -29259 155397 48844 -58426 50099 45139 -72806
86g2806P5563J66497j13820j76107R8862J20795j45240o7293J99591N1641k36540
$$ -72806 2757 169254 55434 -120673 -21811 98984 -46256 -113549 86042 137683 -98857
97i8857m2007K32862K5257k05149M9453K40057p0504k79385N2042K96889o745
$$ -98857 -140864 91998 117255 -87894 -38441 201616 131112 -148273 -96231 200658 193913
108A93913k82745l0680K41799J0705k81328o1382K82477J02955k89349j82015
$$ 193913 -88832 -119512 122287 132992 -148336 -209718 72759 175714 -113635 -295650
118b95650K19653J87281j72819j65647J65148J77571j37593j88392J05863K21086
$$ -295650 -75997 111284 -61535 -227182 -62034 115537 -22056 -210448 -104585 116501
128A16501j4358j74932j8314J37972K3094j19716j5110J28349K6075j32951o2759
$$ 116501 102143 -72789 -91103 46869 69963 -49753 -64863 63486 89561 -43390 -106149
139a06149P9239M6719l6014q334J5465k8234k0831K5121R169J336M5748J0308
$$ -106149 -26910 19809 -16205 -24539 -9074 -37308 -58139 -33018 -23849 -22513 23235 33543
151C3543q3472l5490Q6463M3218p0111j8942O8310j9362j08026L563J16461J8106
$$ 33543 -49929 -85419 1044 44262 -25849 -44791 23519 4157 -103869 -100306 16155 34261
163C4261j03704l2425P4810J2851p6141P662J13273K1327j12330l6777J00494
$$ 34261 -69443 -101868 -27058 -14207 -90348 -82686 30587 51914 -60416 -97193 3301
174C301M5501o2563p91P3185j9324q6130J3368P3604n349l5260J8131o791o0152
$$ 3301 48802 -13761 -14552 58633 39309 -46821 -33453 40151 34802 -458 17673 10882 -49270
187d9270J811O9300P005m9971K724L0029l1201l4918M7695O2659j9745n7772k532
$$ -49270 -47459 21841 28846 -21125 -18401 11628 -19573 -54491 -6796 55863 36118 -21654 -24186
200b4186L6147K364j8355K1908L4775k9883n8991J0291N1108m50k2954J9988N429
$$ -24186 11961 14325 -4030 17878 52653 22770 -36221 -25930 25178 24728 1774 21762 27191
213B7191n2340j3416O1787K4922l9511j716L0825k7883m3137M2621O3716k2430
$$ 27191 -25149 -38565 23222 48144 8633 6917 37742 9859 -33278 9343 73059 50629
225E0629n4682O153K8407j6740k2656L1521M2717k6814o8669l872O3719J6339
$$ 50629 -4053 2100 30507 13767 -8889 22632 65349 38535 -30134 -34006 29713 46052
237D6052m9584j774N2628k0111p8610J6173R4290L753p9384q989N4569r937n2504
$$ 46052 -3532 -5306 47322 27211 -51399 -35226 59064 62817 -16567 -25556 29013 19076 -33428
250c3428K2294O8188p029p3746k2247N3163K9732l4977j5830M2072P340o5757
$$ -33428 -11134 57054 50025 -23721 -45968 7195 36927 1950 -13880 28192 35532 -30225
262c0225k2571O9982L8146m9768k9402L0385m28l4621J6539M4810q950l2639J294
$$ -30225 -52796 17186 55332 5564 -23838 6547 6119 -28502 -11963 32847 23897 -8742 -7448
275g448J010j4112K0716M0435j3144m4996O13K8666o626j8412K3906L2970k7275
$$ -7448 -6438 -20550 166 40601 27457 -17539 -16926 11740 5114 -13298 10608 43578 16303
288A6303n8741K937N9470J3581m7622r598M1746j0352n9690J2716P5258M063o3299
$$ 16303 -42438 -39501 19969 33550 -14072 -23670 18076 7724 -51966 -39250 36008 40071 -23228
301b3228r426L8150l383k1786K3694K9305j8464l1267m107J0588J4466J2888n951
$$ -23228 -32654 5496 2113 -19673 4021 33326 14862 -16405 -20512 -9924 4542 17430 11479
314A1479j9777p528j38l416Q887K0761K236j9242j5538j005J2370K2318R050j5322
$$ 11479 -8298 -15826 -15964 -19380 -10493 10268 12504 -6738 -22276 -23281 -10911 11407 20457 5135
328E135j0031O704n817j0440K1172K9601j4532l9373p654K1235J1426o375m851
$$ 5135 -4896 1808 -4009 -14449 6723 36324 21792 -17581 -25235 -4000 7426 1051 -3800
341c800P045K674k3792k4276K8853N2202j1778n4388M658M6102j1224l8487K9868
$$ -3800 3245 5919 -17873 -42149 -13296 38906 27128 -27260 -22602 23500 12276 -26211 3657
354C657N3844k6183o3229L403N0058J0959k9970j1935J8389M613l1482k0276L7440
$$ 3657 57501 31318 -31911 -28508 21550 32509 2539 -9396 8993 13606 -17876 -38152 -712
367g12M5178k4427n5061P843M6634j133l0444J5244L8246j1786m9009q409M6610
$$ -712 44466 20039 -35022 -27179 19455 18322 -12122 3122 41368 29582 -19427 -27836 18774
380A8774L2949k9073m2116J3665L2519k5695m0919L4855N6661l4468p2399J3831
$$ 18774 51723 22650 -19466 -5801 26718 1023 -39896 -5041 51620 17152 -55247 -41416
392d1416O3173k347m3429P947L9489q650m6488o107N1112L4957l5445m9991J6505
$$ -41416 21757 19410 -24019 -16072 23417 14767 -31721 -37828 13284 48241 12796 -37195 -20690
405b0690M3942j8047m3102K6788N1867l0211o9749Q856O5534J0701m7408j4531
$$ -20690 23252 5205 -37897 -11109 40758 10547 -59202 -50346 15188 25889 -21519 -36050
417c6050L6908J3631m0032k1355N1298M8792m1636o5115K5491O3025j7446n3391
$$ -36050 858 14489 -25543 -46898 4400 53192 11556 -53559 -28068 34957 17511 -35880
429c5880K3653N2834l0180o7417J2273O7023R545n3294k3793L5790K1435l6243
$$ -35880 -12227 40607 10427 -56990 -44717 22306 31851 -21443 -45236 -9446 11989 -24254
441b4254k3358M8931M3110m7132n9913L4124O2625j8903m7663K1614M1007k7544
$$ -24254 -47612 1319 44429 -2703 -62616 -28492 34133 15230 -32433 -10819 30188 2644
453B644m8907J7870N4891M868m7081k4299K9777K5453k5438k2551L6900L3703
$$ 2644 -46263 -28393 26498 31366 -15715 -40014 -10237 15216 -10222 -32773 4127 37830
465C7830m1729m9697L3487N7639j3696m4641R693L5195j2984l8110Q607M9050
$$ 37830 -3899 -53596 -20109 37530 23834 -20807 -11114 24081 11097 -27013 -18406 30644
477C0644J1326m9789l3433L5617L6355k8539l0577L4512K9964m4443m0995L9465
$$ 30644 41970 -7819 -41252 -5635 30720 2181 -28396 6116 36080 -8363 -49358 -9893
489i893M8267k0408l7076R151K2448q954j6657J1633K7126K059l0782j9875K2528
$$ -9893 38374 17966 -19110 -9959 12489 3535 -13122 -1489 25637 27696 -3086 -22961 -433
502d33K7514j0300j7624J2946J0405k2717j4806K5076K5414r604k2643l619J1704
$$ -433 27081 16781 -843 12103 22508 -209 -15015 10061 35475 25871 3228 -391 11313
515A1313N919o045M84J7538L514l0356j8189L0373K6508k2199k0469J8388P933
$$ 11313 17232 11187 11671 29209 32723 2367 -15822 14551 41059 18860 -1609 16779 24712
528B4712k7913r075L1204J7948k1602k3507K810J4396M105p383n8J3294j721k6903
$$ 24712 -3201 -12276 18928 36876 15274 -8233 -5423 8973 13078 5695 5637 18931 17210 -9693
542i693p643L1063J8479k1457j4222J3796J835j6504M226K4007L609j9893j2069
$$ -9693 -17336 13727 32206 10749 -3473 10323 12158 -4346 -120 23887 27496 7603 -4466
555d466N634R269M93k161N102K480j7362j7120J5493K4077j0368k1014Q297R014
$$ -4466 1168 10437 10930 8769 13871 16351 -1011 -18131 -2638 21439 11071 -9943 -1646 7368
569G368k0959j0031K7303J5893k1406j8723O621P513j332K118M619n9n634j0675
$$ 7368 -13591 -23622 3681 19574 -1832 -20555 -13934 -6421 -7753 -5635 -1016 -1075 -6709 -17384
583a7384m969J3692J6265o157j4923j0L936l635L414J2043K031q772n766l680
$$ -17384 -22353 -8661 7604 1447 -13476 -13486 -9550 -13185 -9771 2272 4303 -4469 -10235 -13915
597a3915J262J3045R300r649r695L263j800p225R159J5209o944j8689l284P685
$$ -13915 -12653 392 9692 43 -9652 -6389 -8189 -15414 -6255 8954 2010 -16679 -19963 -12278
611a2278K342j473K872M020l630j5119q443J8282K1602j3140k2372J2600J6762
$$ -12278 -9936 -11409 -8537 -4517 -8147 -23266 -31709 -13427 8175 -4965 -27337 -14737 2025
624B025k0871j4600L2710K3302l1131k7393K1360K1414j4096r844J6608Q107j8262
$$ 2025 -18846 -33446 -736 22566 -8565 -35958 -14598 6816 -7280 -17124 -516 7591 -10671
637a0671j5005J0355K0529K511j4240n979P914m14r230P599J7613l862j7895k791
$$ -10671 -25676 -15321 5208 7719 -6521 -12500 -4586 -5000 -14230 -6631 10982 7120 -10775 -13566
651a3566Q390J640J882O611k715r183k199P18P96R346Q513r565j2408L359P492
$$ -13566 -5176 -3536 -1654 4957 2242 -6941 -9140 -8422 -7626 1720 10233 668 -11740 -8381 -889
666h89o6L737O184m079n976p50j709L824J7510L832k3177r323K1428O254k0157
$$ -889 -955 2782 8966 4887 -1089 -1839 -3548 276 17786 21618 -1559 -10882 10546 16800 -3357
681c357L150K7325n390l3997j381L1089P567k0727m800J6205j063k0003o42K5646
$$ -3357 -207 27118 21728 -12269 -13650 17439 25006 4279 -521 15684 14621 -5382 -6024 19622
695A9622Q931k2248j2359J5269N320j5393M106K2562o464k7246K746J9941m620
$$ 19622 28553 6305 -6054 9215 14535 -858 3248 25810 19346 -7900 -5154 14787 10167
708A0167j0000J3026M923k0152o794J6104M114p513N590M480j5128r128J4612
$$ 10167 167 13193 18116 -2036 -8830 7274 11388 3875 9465 13945 -1183 -10311 4301
721D301J1446p221n903L971K15q359l013J0658J2764n606j8333k965J4728L767
$$ 4301 15747 8526 2623 6594 6809 -1550 -4563 6095 18859 13253 -5080 -8045 6683 10450
735A0450j1762K364J3737n591j9907o11J7951Q043r270r333J949N995m023q331
$$ 10450 -1312 1052 14789 9198 -10709 -11320 6631 14674 5404 -3929 -1980 4015 -8 -8339
749h339Q851J7758r321k6612L720K6118m084k0531J0435J8965j8458k3272J7157
$$ -8339 512 18270 8949 -17663 -13943 12175 8091 -12440 -2005 16960 -1498 -24770 -7613
762g613K3651j0555j6232P338P226j0091n431J1500J0449m629j1592l677O348
$$ -7613 16038 5483 -10749 -3411 3815 -6276 -11707 -207 10242 5613 -5979 -9656 -3308
775c308N445j232N50K041m966p317K712M951m3L107K478j2083j0078J1829J2058
$$ -3308 2137 905 1455 3496 -1470 -8787 -6075 -1124 -1167 1940 4418 -7665 -17743 -5914 6144
790F144r847o923J2538M67j8283k145K0515O829j3717o665N832K092m220o00P552
$$ 6144 -3703 -10626 1912 2379 -15904 -18049 2466 9295 -4422 -11087 -5255 -3163 -7383 -7983 -431
805d31O233p162j3572J569J5592J685j1038K850R489r958j1734J1842J5227o545
$$ -431 5802 -1360 -14932 -13363 2229 3914 -7124 -4274 5215 -4743 -16477 -4635 10592 4047
819D047r935L775K121m879R62P490K813k914n746o319L407J0515R9q111J362M860
$$ 4047 -5888 -2113 8 -4871 -3909 3581 6394 3480 -2266 -8585 -5178 5337 5436 -2675 -1313 3547
835C547p602o651J0417J1044n653j0146L41N601N93k028L107O570k707j3128j850
$$ 3547 -4055 -10706 -289 10755 5102 -5044 -4703 898 1491 -537 2570 9140 6433 -6695 -8545
850h545J4860M655j2785m5J2163q092j7518J1624K1234j1046j7865J1554J1025
$$ -8545 6315 10970 -1815 -1860 10303 2211 -15307 -3683 17551 6505 -11360 194 11219
863A1219j7149o841K2081Q226k0478q613J4346M207j1168J472J2572j668j5371
$$ 11219 -5930 -12771 9310 17536 -2942 -11555 2791 6998 -4170 -2698 9874 8206 -7165
876g165l221J1976M938p983j368Q093n113j3026O285J6372n420j3093Q838P932
$$ -7165 -10386 1590 6528 -1455 -2823 5270 157 -12869 -6584 9788 4368 -8725 113 8045
890H045j6924o564K3969Q540k4299p278K0862R80k0522M190K2974m135k2849m75
$$ 8045 -8879 -15443 8526 17066 -7233 -14511 6351 7331 -13191 -9001 13973 9838 -13011 -13486
904a3486J7258K442j0983l65J0237j43j3337l405J4745Q908j1474p823Q746K850
$$ -13486 3772 6214 -4769 -5134 5103 4960 -8377 -11782 2963 11871 397 -7426 1320 4170
918D170j0699R43J3606K99j2859k146O337m07p43L945k42m206l90q61k510N873
$$ 4170 -6529 -5586 8020 8319 -4540 -6686 -349 -756 -1499 2446 2204 -2002 -2392 -3253 -5763 110
934A10Q130o104r585L448O597l311k750O029L270n528p110k10P510P371m890j0055
$$ 110 8240 2136 -7449 -4001 2596 -715 -3465 2564 5834 306 -6804 -7014 496 7867 2977 -7078
950g078L707Q700o944q437J1140J1743j0400j3314O353R877j949l775J498J730
$$ -7078 -3371 5329 -1615 -10052 1088 12831 2431 -10883 -4530 5347 3398 -377 1121 2851
964B851j018l195l377M437R682j747j2416j730R959J296o431K165O605k628p194
$$ 2851 1833 -1362 -4739 -302 9380 7633 -4783 -6513 3446 4742 -1689 476 7081 4453 -2741
979b741j538N299P172L41q366k397P304N83q563L544J2872l878j4873J926J1836
$$ -2741 -4279 1020 8192 8533 167 -2230 5074 5657 -2906 638 13510 9632 -5241 -3315 8521
994H521k083o864N205N036p000o408M075O662R83k960l931Q53K703k610k026O462
$$ 8521 6438 -426 4779 9815 2815 -3593 482 7144 8127 5167 1236 2089 4792 2182 156 6618
1010F618M814q532p180N563M684k561J62K211l977k465K808q33k086O921L224
$$ 6618 11432 2900 -4280 1283 5967 3406 3568 5779 1802 -663 2145 1312 -774 6147 9371
1025I371j1593o352J0891O357r400l765R565J740j1261m769R805Q696n344j0881
$$ 9371 -2222 -8574 2317 8674 -726 -4491 5074 6814 -4447 -9216 589 9285 3941 -6940
1039f940R65J0046j157j1488L352J4973l878j8218J541J6283n70j1880K450Q405
$$ -6940 -5975 4071 2914 -8574 -5222 9751 5873 -12345 -10804 5479 4909 -6971 -4521 3884
1053C884m243q074K355O645K481l043n587j727N943K442o012j64Q039j656j0812
$$ 3884 -359 -8433 -6078 567 3048 5 -5582 -7309 -1366 1076 -4936 -5100 2939 1283 -9529
1068i529l9J0147K720o364l013K295J888j614l339K169Q080k22j2648l110J3450
$$ -9529 -9568 579 3299 -3065 -6078 -3783 -1895 -3509 -6848 -4679 3401 3179 -9469 -12579 871
1083H71M194j1633k451J1827L80j2948j693J2154N020p889p258K659O829j04p897
$$ 871 5065 -6568 -9019 2808 3188 -9760 -11453 701 5721 -2168 -9426 -6767 62 -42 -7939
1098g939Q65J0977o94j4901j256J5093L017j1844j651R131r15p618R83O442K259
$$ -7939 -7074 3903 3209 -11692 -12948 2145 5162 -6682 -8333 798 -117 -7735 -6752 -310 1949
1113A949k445m906j994N033M263m283k963N836J384q148j348Q466K948n342j818
$$ 1949 -496 -5402 -7396 -2363 1900 -2383 -5346 490 1874 -6274 -7622 844 3792 -1550 -3368
1128c368K050J00n1R74P29J942J022n524l103O943M667o051k783O478j8q211R17
$$ -3368 -1318 -1218 -1269 -295 434 2376 3398 -2126 -5229 1714 6381 330 -2453 4025 4007 -4204 -3287
1145c287Q755J138o100k057K397J676O68j961J89N054L4q317j514J0936L327r795
$$ -3287 5468 6606 506 -1551 846 2522 3190 1229 1418 6472 6506 -1811 -3325 7611 10938 1143
1161A143j878Q053m70p697J587P453l85m861j646K32J662L067j033l198J730K125
$$ 1143 -735 7318 6848 -849 738 8191 7806 2945 1299 1531 3193 6260 5227 2029 3759 5884
1177E884m322k307N108L457l453k855K09m3J561J607k414q59L098j957n891K957
$$ 5884 1562 -745 4363 7820 4367 1512 1721 1678 3239 4846 2432 1573 4671 2714 -3177 -220
1193b20P208k511o425K460L018l826o25M845N92l139j18k49j467K801K911l104
$$ -220 6988 4477 -1948 512 3530 -296 -921 3924 4516 1377 1259 1010 -457 2344 5255 2151
1209B151k446L162r86m917K986O288l700n773K924K920l830p57M636L68l873j238
$$ 2151 -295 2867 1881 -3036 -50 6238 2538 -3235 -311 2609 -1221 -1978 2658 3026 -847 -2085
1225b085J018J110J101l98r87J89m98k171J132L347j000k590K148o26n082K743
$$ -2085 -1067 43 1144 746 -241 -52 -550 -2721 -1589 1758 758 -1832 316 -310 -5392 -2649
1241b649Q068m453q590O215P387r369o675J2819O597j3166o614J2030M246j0518
$$ -2649 5419 966 -7624 -1409 5978 -3391 -10066 2753 9350 -3816 -10430 1600 5846 -4672
1255d672k157R949J402r484k752O898L521m414l281L119J724m254j679N534J404
$$ -4672 -6829 3120 4522 -4962 -7714 -816 2705 -1709 -4990 -1871 -147 -4401 -6080 -546 858
1270H58n129k67M082l429l556O555M097q517k481Q969r95r274M489J0691o647
$$ 858 -4271 -4538 -456 -3885 -7441 -886 3211 -5306 -7787 1182 187 -9087 -4598 6093 -554
1285e54r714P624P247q162l785R916K058r699j464Q489J062o102O56M852j124
$$ -554 -10268 -2644 4603 -3559 -7344 2572 4630 -5069 -6533 1956 3018 -3084 -2428 2424 1300
1300A300n125N43N089Q56l795m70K546j507k763L936L861n564k764O802M55r225
$$ 1300 -3825 -3282 1807 2663 -1132 -1602 944 -563 -3326 610 4471 -1093 -3857 2945 3400 -5825
1316e825K281J2261l862j3950N126J3022o405j1443Q649J0354r587q641P654O679
$$ -5825 -3544 8717 4855 -9095 -3969 9053 2648 -8795 -146 10208 621 -8020 -366 6313
1330F313m927l097L453J028k710j16J343P22N98k0j673j640N61K296J024k524
$$ 6313 1386 -1711 1742 2770 60 -56 1287 2009 2607 2587 914 -726 -165 2131 3155 631
1346F31k377K094K199l923k117N662K474o675k057O042P54n015J904M506l588
$$ 631 -1746 348 2547 -1376 -3493 2169 4643 -2032 -4089 1953 2707 -2308 -404 4102 514
1361E14l504L226J233k425K026J743m922l32N191k001n526O058N655q850o460
$$ 514 -2990 236 1469 -956 1070 2813 -2109 -2441 2750 749 -4777 1281 6936 -1914 -8374
1376h374J0450O572j0858m688J1867M300j2375m911J1863O718j0216p750Q438
$$ -8374 2076 8648 -2210 -6898 4969 9269 -3106 -8017 3846 10564 348 -7402 1036
1389A036P289q421p438Q409P922q844p779P946N400p228j804P368j756o839M358
$$ 1036 8325 -96 -7534 875 8797 -47 -7826 120 5520 -1708 -3512 3856 2100 -4739 -381
1404c81N364o335k418R305q3j1359R70J1766k219j0720L260Q857m864q501M476
$$ -381 4983 -1352 -3770 5535 5452 -5907 -4937 6829 4610 -6110 -2850 6007 1143 -7358 -2882
1419b882Q287l255q091K423P173k014p467K686R829k267j1761K175J2553k540
$$ -2882 5405 2150 -5941 -3518 3655 1641 -5826 -3140 6689 4422 -7339 -5164 7389 4849
1433D849j2217L699J1804m386j2431L243J1306j397r288p71O834K614n646m370
$$ 4849 -7368 -3669 8135 3749 -8682 -5439 5867 4470 -4818 -5589 1245 3859 -1787 -6157
1447f157N208P575m353r258L657R477k005p493K117N216k003l520J000J020P20
$$ -6157 -949 6626 2273 -6985 -3328 6149 4144 -3349 -1232 3984 1981 -1539 -539 481 1201
1462A201K374l081n786L868P711m650q275O065Q344o792q539P562Q744n382q253
$$ 1201 3575 494 -5292 -1424 6287 1637 -6638 -573 7771 979 -7560 2 8746 3364 -4889
1477d889M051P966l658p817L722Q826l835j0736L072J1190m419j0924N697J0259
$$ -4889 -838 7128 3470 -4347 -625 8201 4366 -6370 -3298 7892 3473 -7451 -1754 8505
1491H505p379j0390Q204R324p431o444O691L566n449j279M174l22j422J835j921
$$ 8505 1126 -9264 -1060 8264 833 -5611 1080 4646 -803 -2082 2092 1770 348 2183 262
1506B62m263L711N669m930o270M181O154m755p316M743Q652l058j0475J212J1950
$$ 262 -4001 -290 5379 449 -5821 -1640 4514 -241 -7557 -2814 5838 2780 -7695 -6483 5467
1521E467Rj1828K60J3037j063j3728J615J3303j713j1279J979Q511l627o369M249
$$ 5467 5476 -6352 -6092 6945 5882 -7846 -6231 7072 5359 -5920 -3941 4570 943 -5426 -1177
1536a177M238l717j776K216n60j106K288J157k126n20J497l2q68M69J130K71j415
$$ -1177 3061 -656 -2432 -216 -776 -1882 406 1563 -563 -1083 414 382 -486 -17 1113 1384 -31
1553c1j934P44K257j335k504J929J991m453k195N785K396o391r36O641k63o250
$$ -31 -1965 -1221 1036 -299 -2803 -874 1117 -3336 -5531 254 2650 -3741 -4677 1964 1701 -4549
1569d549J516O396o31m867O1K556Q19o98j608n34L196L68n420j032O852J327p327
$$ -4549 -3033 3363 2732 -2135 -2074 482 1301 603 -1005 -1539 1657 2025 -3395 -4427 2425 3752 -3575
1586c575j498O761O73n999j63N906K19m702j089K959J886j944k116K035J798k899
$$ -3575 -5073 1688 2361 -3638 -3801 2105 2324 -2378 -3467 -508 1378 -566 -2682 -647 1151 -1748
1602a748l011L590L081m170j710M655k79m820K623N752l146m446M965K939n436
$$ -1748 -4759 -1169 1912 -2258 -3968 687 408 -4412 -1789 3963 817 -3629 1336 4275 -1161
1617a161m44P387n02p015J622N867k878m955M027M326m887m466L396L936l101
$$ -1161 -1605 5782 5280 -1735 -113 5754 2876 -2079 1948 6274 1387 -3079 317 4253 1152
1632A152l751K698L820l286n081L371O623l795o271M263N545n768m365O639L846
$$ 1152 -2599 99 3919 633 -4448 -1077 5546 1751 -4520 -257 5288 -480 -4845 1794 5640
1647E640o715k892O052M22m897J909M169k657k816K823J354k240J243K353j826
$$ 5640 -1075 -3967 2085 2507 -2390 -481 3688 1031 -1785 1038 2392 152 1395 3748 1922
1662A922j664J532J058j213L34J006j043j525k19K97L78k30j537m8J037j658k052
$$ 1922 258 1790 2848 1635 1969 2975 1932 407 188 485 863 633 -904 -952 85 -1573 -3625
1679c625L095K674l841k784M737J476m740M32N328n79m538R79L438r29j099J409
$$ -3625 -530 2144 -1697 -4481 256 1732 -3008 -2576 2752 2173 -2365 -1386 2052 1123 24 1433
1695A433l80j182Q24J76j777J796K423k490k960K644K452k237q83K132J71k006
$$ 1433 1053 -129 695 871 -906 890 3313 823 -2137 507 2959 722 -161 1971 2142 136
1711A36n17O39P16J163j627k406J447J435k717j797L684J432n021j093M583N45
$$ 136 -381 258 974 2137 510 -1896 -449 986 -1731 -3528 156 1588 -3433 -4526 57 602
1727F02l540O31L496r33k374O61J841J069k22j860n41K394O91l636j26M521m75
$$ 602 -2938 -2307 1189 256 -2118 -1457 384 1453 1231 -629 -1170 1224 1915 -1721 -1847 2674 2199
1744B199n582M0M304M7l201j57K000N0j300j154N67L180Q69m471j643M921J840
$$ 2199 -3383 -3343 961 1008 -2193 -2350 -350 -300 -1600 -2754 -2187 993 1862 -2609 -4252 669 2509
1761B509n124j206N265O82n529p80M558J058k519q97R11J013J58j466j11L076
$$ 2509 -2615 -3821 1444 2126 -3403 -4183 375 1433 -1086 -1983 -1072 -59 99 -1367 -1478 1598
1777A598J251l943j090L854J471l114m56K545l97k443J64J214M76j80j775j517
$$ 1598 2849 -1094 -2184 1670 3141 27 -429 2116 1719 -724 -560 654 1130 950 -825 -2342
1793b342K266J486l040r48M520P81n770k39O237M82n250M85M595q40m291P49L503
$$ -2342 -76 1410 -1630 -2578 1942 2723 -3047 -3286 2951 3433 -1817 -1332 3263 2423 -1868 -1119 2384
1810B384N79k453k377J210K334q96k896J305L643j910m564K042M395j567k806
$$ 2384 2963 510 -1867 -657 1677 781 -2115 -810 2833 923 -3641 -1599 2796 1229 -1577
1825a577J242J477q89p83L90L7J016P14k968j337L536J135l857p52M224q78l502
$$ -1577 -335 1142 253 -530 -140 -103 913 1627 -1341 -2678 858 1993 -1864 -2616 1608 730 -2772
1842b772P68L817J8k551k7J443L49q8q82N60K224p97l540L79M363p26m562J253
$$ -2772 -2004 1813 1831 -720 -747 696 1045 957 75 635 2859 2062 -1478 -1099 3264 2538 -2024 -771
1860g71L616k426l524K280K834j367k025M67J002M00m8o00L33J912q93l125J492
$$ -771 2845 419 -3105 -825 2009 642 -1383 -916 86 486 438 -162 171 2083 1190 -1935 -443
1877d43L325r46l308J140J776j630j533J889Q12o22m74q20p14K473J083k587m92
$$ -443 2882 1936 -1372 -232 1544 -86 -1619 270 1082 460 -14 -834 -1548 925 2008 -579 -1071
1894a071L020m03l503J135L945j100l686N01K051q40j490K68J153K61j235k196
$$ -1071 1949 1546 -1957 -822 3123 2023 -1663 -1162 889 49 -1441 -1173 -20 241 -994 -3190
1910c190Q69L723q26l788J586L860k313l618L511L936k731l324J950J995j247
$$ -3190 -2321 1402 576 -3212 -1626 2234 -79 -3697 -186 3750 1019 -2305 -355 1640 393
1925C93j032K76J016K06j335j970J885K841j459l396J926K969k703j767L252J854
$$ 393 -639 -363 653 859 -476 -2446 -561 2280 821 -2575 -649 2320 -383 -2150 1102 2956
1941B956k400j370J119O69J7J18q40m71J267n36k381R35K874j148l283J241K010
$$ 2956 556 -814 305 974 991 1109 269 -202 1065 529 -1852 -917 1957 809 -2474 -1233 777
1958G77o72j235J293J081o46r65o26R32K357n25l004N47L174k066l810K886M125
$$ 777 105 -1130 163 1244 598 -367 -993 -61 2296 1771 -1233 -686 2488 422 -3388 -502 3623
1975C623l538m241K955L245k792k083K743K104k004k034R05K503Q53k487j473
$$ 3623 85 -4156 -1201 2044 -748 -2831 -88 2016 12 -2022 -1117 1386 2239 -248 -1721
1990a721K539J612l520j404M194J304m301j863L076J193k373k02J462j84l45n50
$$ -1721 818 2430 -1090 -2494 1700 3004 -1297 -3160 -84 1109 -1264 -1466 -4 -188 -533 -1083
2006a083m47J606K220j758k491K007K404k107j792K609J301k199j899J399J116
$$ -1083 -1530 76 2296 538 -1953 54 2458 351 -1441 1168 2469 270 -1629 -230 886
2021H86K3o79j216M47J725j203k188K475L250k750l768L224L404k757k531L174
$$ 886 909 230 -986 -539 1186 -17 -2205 270 3520 770 -2998 226 3630 873 -1658 1516
2037A516J930l270k163J942K299j071k700l15K452J42l093o54M221P51m164j166
$$ 1516 3446 176 -1987 -45 2254 1183 -1517 -1832 620 762 -2331 -2985 1236 1987 -2177 -3343
2053c343M202J076l283j37K991m44k137J60R60O94M30j530j722J357K290k424
$$ -3343 859 1935 -1348 -1485 1506 1062 -1075 -915 45 739 1169 -361 -2083 -726 1564 -860
2069h60k120L445J621l833j762L620J864k275j350K088N65q70q54L74J696Q79
$$ -860 -2980 465 2086 -1747 -3509 111 1975 -300 -1650 438 1003 133 -721 -347 1349 2228
2085B228k638j809K574J877l025j718L115J137l423j128K460K017j368j605l3
$$ 2228 -410 -2219 355 2232 -793 -2511 604 1741 -1682 -2810 -350 1667 299 -1306 -1339
2100a339K064M94k156n51L292J367m139j777M487J452m240p95L736k07l532K74
$$ -1339 725 1219 -937 -1488 1804 3171 -968 -2745 1742 3194 -1046 -1841 1895 1688 -1844 -1570
2116a570K818k33j333j34K15L1J079m32j111J312J344j993j988K398J741j921
$$ -1570 1248 1015 -318 -452 -237 -206 873 441 -670 642 1986 -7 -1995 403 2144 223
2132B23j707J280R59j429j009R60J632n63k259n09K750M25k910O77L170j063l762
$$ 223 -1484 -204 755 -674 -1683 -723 909 346 -1913 -2422 328 753 -2157 -1480 1690 627 -3135
2149c135J664L881j453l184K320J947k713q31K234P15j763j63Q42p59N4J344n63
$$ -3135 -1471 2410 957 -2227 93 2040 -673 -1504 730 1445 -318 -481 361 -398 -344 1000 437
2166D37p55R66L73j770J78J808J53j424k89O55K71n8j075N51J341n22k572N29
$$ 437 -318 648 1021 -749 -571 1237 1390 -34 -323 332 603 545 -530 21 1362 840 -1732 -1203
2184a203L082o48k959J176K324j763j720J951J906j651j008J280j09q64J088L08
$$ -1203 1879 1231 -1728 -552 1772 9 -1711 240 2146 495 -513 767 658 -206 882 1190
2200A190j356M13P15j117m72J834M42k196L78J218q49j250J650R97j628r69Q89
$$ 1190 -166 247 962 -155 -627 1207 1649 -547 -169 1049 200 -1050 600 1597 -31 -1000 -111
2217a11L73k51n60kR73L9j739p09K357J101k606j050K916K35k897M47L122n50
$$ -111 262 11 -549 -551 422 461 -1278 -1987 370 1471 -1135 -2185 731 966 -1931 -1484 1638 1088
2235A088k462O96J448n91l14R32m27o57P71l22r75P35J113q70j026N95M63l51
$$ 1088 -1374 -678 770 179 -135 797 370 -287 484 162 -813 -78 1035 165 -861 -266 197 -154
2253a54L89K1m36L28K55j149K58K199m48k192O55J941j593j731K213J617k498
$$ -154 235 256 -180 148 403 -746 -488 1711 1263 -929 -274 1667 74 -1657 556 2173 -325
2270c25j613J973J311k019l97J398N24j169r13O98J572N1k080j17K144j10k576
$$ -325 -1938 35 1346 -673 -1070 328 852 -317 -1230 -532 1040 1091 -989 -1106 1038 928 -1648
2287a648O04K855r12k858N72J996q61j191J224J28j019L14L04m69M91J476j043
$$ -1648 -1044 1811 899 -1959 -1387 609 -252 -1443 -219 -91 -1110 -796 -492 -961 -470 1006 -37
2304c7j387J124J304j217n54J417N5r96l26L7Q20K98r52j239R88J215j415j361
$$ -37 -1424 -300 1004 -213 -767 650 705 -291 -617 -580 240 538 -414 -1653 -665 550 -865 -2226
2322b226K516J431k891j281K877R90k326j75K176n5j610j72J117P25k79j123o91
$$ -2226 290 1721 -1170 -2451 426 1416 -910 -1085 1091 1036 -574 -746 371 1096 817 -306 -997
2339i97J515R62j936r42K743Q11k863j122K723J351j706j248J219J096n36j610
$$ -997 518 1480 -456 -1398 1345 2156 -707 -1829 894 2245 539 -709 510 1606 1070 -540
2355e40%K263P63l201j483L227J142l604q35L420L42l264m30K565M01j316j75
$$ -540 -540 1723 2486 -715 -2198 1029 2171 -1433 -2268 1152 1494 -1770 -2200 365 766 -550 -725
2372g25K77P1P21j53p05O28J436r83j984J468J692r58j473P57J012p94j013LJ518
$$ -725 -448 -377 344 191 -514 114 1550 567 -1417 51 1743 785 -688 69 1081 287 -726 -723 795
2391G95N77j773j419K170J562k802j031L131J137l724r76L638J152l544l70K575
$$ 795 1372 -401 -1820 350 1912 -890 -1921 1210 2347 -1377 -2353 1285 2437 -1107 -1477 1098
2407A098p7k084L35J136M83o63r38l73J395J117j713j104K455P03k212q78K413
$$ 1098 1021 -1063 -728 408 891 228 -710 -1083 312 1429 -284 -1388 1067 1770 -442 -1320 1093
2424A093J201j890j053R27J054k03j448j37J422O80k489j072K563J215k724o26
$$ 1093 2294 404 -649 278 1332 1129 -319 -456 966 1646 -843 -1915 648 1863 -861 -1487
2440a487K059K46k095R2J764m11n19P0k20Q9Q06j67j182N64J492j792j509K486
$$ -1487 572 818 -1277 -1185 579 168 -351 -281 -501 -412 394 227 -955 -391 1101 -691 -2200 286
2458B86J293k295j353K093Q26j990m06J777N55j041p49K40J542J61j802J51J837
$$ 286 1579 -716 -2069 24 850 -1140 -1546 231 786 -255 -1004 -764 778 939 -863 -712 1125
2475A125j21k479L20K627l91k382M98J687p75q54M67M82k08K58l74j129J023J585
$$ 1125 1004 -1475 -1155 1472 1081 -1301 -803 884 109 -745 -278 204 -4 254 -120 -1249 -226 1359
2493A359j215j380J546J089j574o25J776J59j125j48M68j52K94o1n76m8N41m13
$$ 1359 144 -1236 310 1399 -175 -800 976 1135 10 -138 330 178 472 411 -165 -213 328 -85
2511h5q38J015P64r99n15J229m96p44J088N45j155k95J099k06p63M17O30j060
$$ -85 -923 92 856 -143 -658 571 75 -669 419 964 -191 -486 613 407 -356 61 691 -369
2529c69q2M55q6o27J062j46j078J25R27m85m17R81lp52j0P60m51k17R07n1j142
$$ -369 -451 4 -82 -709 353 207 -871 -746 181 -304 -721 260 257 -495 -505 255 -196 -413 494 443 -699
2550f99K16J028r22o46J304L30j010j36N24j42L7N96o62k60Q23R5p07L02Q37o09
$$ -699 -483 545 -377 -1023 281 611 -399 -535 -11 -153 -116 480 -182 -442 381 476 -231 71 908 299
2570B99r58J019o7l85K18P70j208n60J432k08j399M92J745r63j602J133J207q01
$$ 299 -659 360 293 -92 126 896 -312 -872 560 352 -1047 -555 1190 227 -1375 -242 965 164
2588A64p54O11O7Q8j56k09N9J078k77j650M70J130k50j087N62N55q45l85P87k10
$$ 164 -590 21 88 176 20 -189 -130 948 671 -979 -509 621 371 -716 -154 401 -444 -829 -42 -252
2608b52n82N90J30r13J91J247p47l66R08k25q55L01J043o54o53R46N0r00O0R03
$$ -252 -834 -244 -114 -1027 -836 411 -336 -702 206 -19 -874 -573 470 -184 -837 109 159 -741 -681 222
2628B22n84ML45m6o76Q16L19r84M10J082n37j450J165J192j072l71L26K01k98
$$ 222 -362 -358 -13 -59 -735 81 400 -584 -174 908 371 -1079 86 1278 206 -165 161 362 64
2647F4l1J38k75O40N9j358j20J579M04j702K86J400l37j295M58R32Kk82k39n16
$$ 64 33 171 -104 536 595 -763 -883 696 1100 -602 -316 1084 747 -548 -90 842 844 562 323 -193
2667a93P49M79p49n36J075K31j324j35J474k88j133O55L37r79jJ182n02r37R97
$$ -193 556 1035 286 -250 825 1056 -268 -403 1071 783 -350 305 642 -337 -338 844 342 -595 402
2686D02K20j174J60J213k64j255O04O44j050l24J132N0o19m94P71K52k52k80r6
$$ 402 622 -552 -392 821 557 -698 -94 550 -500 -824 308 358 -261 -755 16 268 16 -264 -360
2705c60J111r4j617J36K115j95k164O60J944r82j729J299J313j302o66R28j70
$$ -360 751 657 -960 -824 1291 1096 -1068 -408 1536 554 -1175 124 1437 135 -531 397 227
2722B27q54O94N65j167m83J787m99j550Q01J936j132j537R33J350o92j155L66
$$ 227 -627 67 632 -535 -1018 769 270 -1280 -479 1457 325 -1212 -279 1071 379 -776 -410
2739d10J151j31j399k32J839J35j847k10K283k91k415P69K553j002k368J213J497
$$ -410 741 610 -789 -1021 818 953 -894 -1104 1179 888 -1527 -758 1795 793 -1575 -362 1135
2756A135j397p81J366k3r97J12P46o74r6J069p55q93Q29O51j128o59J357M19r60
$$ 1135 -262 -1043 323 300 -697 -585 161 -513 -609 460 -295 -1188 -359 292 -836 -1495 -138 281 -679
2775f79l83N96N53k11o62O2P59J57j212mJ423K00j643J18J331k36r30M42M02o37
$$ -679 -1062 -466 87 -124 -786 -724 35 192 -1020 -1024 399 599 -1044 -926 405 169 -761 -319 83 -554
2795e54L18N04r63J09J399l95j757O98J909j207j615J717J558k097j203K049O12
$$ -554 -236 268 -695 -586 813 418 -1339 -641 1268 61 -1554 163 1721 -376 -1579 470 1082
2812A082j796k75J694J51j201l84J088P17j001p42R62Q68j422p74J545J148j834
$$ 1082 -714 -989 705 856 -345 -729 359 1076 75 -667 295 1163 -259 -1033 512 1660 -174
2829a74r16J805K97j927N15J668j113j245J472O82j589m2J761o21j799J126J285
$$ -174 -1090 715 1012 -915 -400 1268 155 -1090 382 1064 -525 -567 1194 573 -1226 -100 1185
2846A185r53j104J035Q75j197n44O88P41m17q21Q6J064j28j059J67J321m89j373
$$ 1185 232 -872 163 1038 -159 -703 -15 726 309 -512 -426 638 510 -549 -382 939 450 -923
2864i23R30J041p35r73J365K89j668R8J727o78j127J033O16j176k23J112j72q02
$$ -923 7 1048 313 -660 705 994 -674 -576 1151 473 -654 379 995 -181 -404 708 536 -266
2882b66M15N76p20j05P92j41n66L19L19m18n4J39K5K34j3p39L5Q62j54j047O07
$$ -266 149 725 5 -100 692 551 -15 304 623 205 151 290 315 549 536 -203 -168 694 540 -507 100
2903A00Q09q92q70J138N26j099j66J013m55m93O12L86r22j33Q53l32q89P30M66
$$ 100 909 17 -853 285 811 -288 -454 559 104 -389 223 609 -313 -446 407 75 -814 -84 382
2922C82m51m52N35k54j87N51l23m63O91M59r56l83J046K54j060J58O81o12J37
$$ 382 -69 -521 14 -240 -427 124 -199 -662 29 488 -468 -851 195 449 -611 -453 228 -384 -247
2941b47K32l14O2J48L00q42J68P74l85m11K43L29n94M27M69o45l48J326m96j188
$$ -247 -15 -329 -267 -119 181 -661 -493 281 -104 -515 -272 57 -537 -110 359 -286 -634 692 196 -992
2961i92Q03J265r34j043J142L96j125p0J161Q1j270N88K74j84j44J87J1l53L26
$$ -992 -189 1076 142 -901 241 637 -488 -558 603 684 -586 2 276 92 -52 135 146 -207 119
2980A19k22R6L82l56l78M88L81q66l7J112j21j160K04J049o86r54J098O54j267
$$ 119 -103 -7 375 19 -359 129 510 -356 -393 719 598 -562 -358 691 5 -949 149 803 -464
2999d64L9O97m09n12O56L28r03j6N75j43q1N45l46l75M11K87r11L31Q63n42j033
$$ -464 -425 272 -137 -649 7 335 -568 -584 -9 -152 -233 312 -34 -409 2 289 -622 -291 572 30 -1003
3020a003R98N98q62l60R32k24l84J32K77l30K46L42p26J47N27j05n09J24R11q36
$$ -1003 -5 593 -269 -629 303 79 -305 -173 104 -226 20 362 -364 -217 310 205 -304 -180 731 -105
3040a05j92O33l6n55K65M85m80j94O20l43p00Q32N03r82j98R87l69o80O42M94
$$ -105 -297 336 300 -255 10 495 15 -179 441 98 -602 230 733 -249 -447 540 171 -509 133 627
3060F27o39n09R54N9p80K44N63m21n31M29j31M5L80l72n01M75M07n28l68Q52j73
$$ 627 -12 -521 433 492 -288 -44 519 98 -433 -4 -135 -90 290 -82 -583 -108 299 -229 -597 255 82
3081H2n70K40J37j43J15O00p64o09J278K25j601L82J451o86j563R94J412r92j179
$$ 82 -488 -248 -111 -254 -139 461 -303 -912 366 591 -1010 -628 823 137 -1426 -432 980 -12 -1191
3100a191J186M70r15k89P96K69l01k52N6L94k6l58L3M93o0p27J60R94m07q29N60
$$ -1191 -5 465 -450 -739 57 326 25 -227 -171 223 197 -161 -128 365 305 -422 -262 732 325 -504 56
3121E6O39p97m36R69J17q68L27N75p02M8O32k25n54L73O85r61k02Q43Q6q05K90
$$ 56 695 -102 -538 431 548 -320 7 582 -120 -72 560 335 -219 154 839 -122 -324 519 605 -200 90
3142I0K66l29J13j03Km8N43m72n51P81K77o44n22Q90J90j020L69P30l77m74L53
$$ 90 356 27 140 37 39 -9 534 62 -489 292 569 -75 -597 293 483 -537 -168 562 185 -289 64
3163F4l0j33K62O3n10K15L55l23m68N15K76p04J09Q23m61n91O02N44p69j9N03
$$ 64 34 -99 163 226 -284 -69 286 -37 -505 10 286 -418 -309 514 53 -538 64 608 -161 -180 323
3184C23k30j87O5K97l77K29J20m91m9J092k32r62N00O35q46l78J015J24o18j56
$$ 323 93 -94 -29 268 -109 120 240 -251 -300 792 560 -402 98 733 -113 -491 524 648 30 -126
3204a26N26k78p7K73l36j82J59L57n96J84O11n73k15L84K63q43L89M71j98n42
$$ -126 400 122 45 318 -18 -200 -41 316 -280 -96 515 -58 -273 111 374 -469 -80 391 193 -349
3224c49L91J14n87L29M65l68m03M49j81m08K24N81o45l67O95r9l33N6O57l72m65
$$ -349 42 156 -431 -102 363 -5 -408 41 -140 -548 -324 257 -388 -755 -60 -159 -492 -436 221 -151 -616
3245f16M71p9j86J59n6l72M69K85o07k49Q12K32j008%Q56j40o55N73J15l16J39
$$ -616 -145 -224 -410 -251 -307 -679 -210 75 -532 -781 31 263 -745 -745 111 -29 -684 -111 4 -312 -173
3266a73K25k98L5N95r5r54N77O93q43k73P11J34o42j82N76n1l97M33Km21K17J02
$$ -173 52 -246 -211 384 289 -665 -88 605 -238 -511 200 334 -308 -490 86 35 -362 71 73 -348 -131 -29
3288b9l28L94O06m66l15M56k07k39M40L10o77j84N13q0o01K76O37o70j69K19K87
$$ -29 -357 37 643 177 -138 318 111 -128 312 622 -55 -239 274 194 -407 -131 506 -164 -333 -114 173
3309A73k79J84N60m47m73N34K75n79m8L84l74J69m0j37k7M61qj056L87Q25l24
$$ 173 -106 78 638 191 -282 252 527 -52 -100 284 -90 79 39 -98 -125 336 328 -728 -341 484 160
3330A60q47P28L15n89J43J53J50J07K57k81l83L82L05n69j11P84j43q81J15P80
$$ 160 -687 41 356 -233 -90 63 213 320 577 296 -87 295 600 31 -80 704 561 -320 -205 575
3350E75r2q14N18J28k82RL43j67k9L24m80k96O83R8m95J50N28n39n88P37L77o61
$$ 575 483 -331 187 315 33 42 385 218 189 513 33 -263 420 518 23 173 701 162 -426 311 688 27
3372B7JQ9Q6j66J51l1j45L49M5o47K4J008k5j115L93J002o22q08K12O98l47m21
$$ 27 28 117 203 37 188 157 12 361 406 -241 -217 791 766 -349 44 1046 424 -384 -172 526 179 -242
3394b42j64J98K68j35n37q1J003k69j013M62Q69k92o39N17N25p61m0N51j71k01
$$ -242 -406 -208 60 -75 -612 -693 310 41 -972 -510 359 67 -572 -55 470 -291 -331 220 49 -152
3414a52M2j36k56P03k4o06j78R55j75q64J28J110l31p41M60L77m29k33M36k13
$$ -152 -110 -246 -502 201 177 -429 -607 348 173 -691 -563 547 216 -525 -65 312 -117 -350 86 -127
3434a27L66m08j15J89M48l22m76L44N51o76p70R53O89q23k59N01l2p9j48K13l29
$$ -127 239 -169 -284 -95 353 31 -445 -101 450 -226 -996 -43 646 -177 -436 65 33 -46 -194 19 -310
3455c10O72L0q56K48Q12Lj110L23P80k33r42N62O89m99o26J14J89Op0k13J73J79
$$ -310 362 392 -464 -216 596 599 -511 -188 592 359 -583 -21 668 169 -457 -343 -154 -148 -218 -431 -258 -79
3477g9j46k82L36M55m03n02P70j48m55J78M37l8m45M39k5n09N05L44n02K0J47
$$ -79 -225 -507 -171 284 -119 -621 149 1 -454 -276 161 123 -322 117 92 -417 88 432 -70 -50 97
3498I7j36m41O12M22p70j52N80M5n16Q3N76n1m08j02L26MJ85j1l29j8L32j65k70
$$ 97 -39 -480 132 554 -216 -368 212 257 -259 -176 400 349 -59 -161 165 169 354 343 14 -4 328 163 -107
3521a07M79Q2m39j43M60j87k39J36M09n20LM44l90j00O28j02o39L49K28n29j05
$$ -107 372 454 15 -128 332 145 -94 42 451 -69 -66 378 -12 -112 516 414 -225 124 352 -177 -282
3542b82P69j77n29R5K47l73R4M40k2o89K67K59k63K08r5J09l61O02l16k59J51
$$ -282 487 310 -219 -124 123 -250 -156 284 262 -427 -160 99 -164 44 -51 58 -303 299 -17 -276 -125
3563a25N97m00o08O06K79p94J22M36l00P9j25p3o5M02R9n23J2N52j34k93M71L31
$$ -125 472 72 -536 70 349 -445 -323 113 -187 -108 -233 -306 -371 31 130 -393 -381 171 37 -256 215 546
3585E46p48k18O70Ml14m1N90m11k33M15k45O9N4p6l09L16J35l40j16P50j98o93
$$ 546 -202 -420 250 254 -60 -101 489 78 -155 260 15 84 138 62 -247 69 204 -136 -252 498 300 -393
3607c93J59N82J0o57L70M18m80k56M09O8j50K18k41l87M39J53n81r4N24K96r01
$$ -393 -234 348 358 -299 71 489 9 -247 162 230 80 298 57 -330 109 262 -319 -413 111 407 -494
3628d94K32K64NK4J71j06m87P07j76m94L39M24n01l57N58N9k66k7J82j45m98M46
$$ -494 -262 2 7 31 202 96 -391 316 140 -354 -15 409 -92 -449 109 168 -98 -125 57 -88 -586 -140
3650a40L65k56J4J89m04k4N91m63J46O03j77p81L43N88l94n04L87N04p13k59O45
$$ -140 225 -31 -17 172 -232 -256 335 -128 18 621 444 -337 6 594 200 -304 83 587 -126 -385 260
3671B60p4l7j12J2j9l5J95J6l30L96J33m55l9L30J70m22Q5j10j02L36J24n22K02
$$ 260 186 149 37 49 30 -5 190 206 -124 272 405 -50 -89 241 411 -11 74 -36 -138 198 322 -200 2
3694BJ55q7n30M59K11l30k84N12k58j38K19K40n34K71M19l02o09P16J95n87k22
$$ 2 157 70 -460 -1 210 -120 -404 108 -150 -288 -69 171 -363 -92 327 25 -584 132 327 -260 -482
3715d82M97P5n51M6N69k68k93J97q3L50m81J1J19K16p8k91L46K91k03m41L04K89
$$ -482 15 90 -461 -415 154 -114 -407 -210 -293 57 -424 -413 -294 -78 -156 -447 -101 190 -13 -454 -150 139
3737A39n37K18M60j51k49j4L26o01J11L50l64P8L94j25n76K14Q27k72n86K58O36
$$ 139 -398 -180 280 129 -120 -134 192 -409 -298 52 -312 -234 160 35 -541 -327 500 228 -358 -100 536
3758E36n47n1J35nm0Q5q5j98K83K39o50p7O88j04p71L64O25k56o32M33l9Q5R3
$$ 536 -11 -62 73 68 28 113 28 -170 113 352 -298 -375 313 209 -562 -198 427 171 -461 -28 -67 18 111
3781A11k13K24Q5p1m02J40O00l24o48M00O62o55o57Q55K90p22m45R06K5l05O7
$$ 111 -102 122 207 136 -266 -126 474 150 -498 -98 564 -91 -748 107 397 -325 -770 136 161 -144 -77
3802g7J21j13N2J84m11O2N94k46l28m4M06o4k62O7K69o8k04M0m5L16M8n95MQ21
$$ -77 44 -69 -17 167 -244 -182 412 166 -162 -206 200 136 -126 -59 210 142 -62 -22 -67 249 297 -298 -294 527
3826E27j44o89L66Q26n94o06M77O42o33j96M46N3m98J96Q7l16J9J18%j20K20o
$$ 527 383 -306 60 886 292 -314 163 805 172 -24 422 475 -23 173 260 -56 -37 81 81 -39 181 175
3848A75k92K03L80m48o2J42J93j08NJ36j33j65n8l36L91L54m82n14M12O43n02
$$ 175 -117 86 466 18 -44 98 291 183 188 324 191 26 -32 -368 23 377 -105 -619 -207 436 -66
3869f6m11Q04N3o47k07N86J94m45q6L85O4p2l1l8Q3J15l83l92M49L14l37n57O26
$$ -66 -477 327 380 -267 -474 112 306 -139 -225 160 224 152 121 83 166 281 -102 -494 -45 269 -68 -625 1
3892AO4o19K74L46l02n9L55j14j80J70J83k61J02J07k88k10N14K6k61J31N78n74
$$ 1 65 -554 -280 66 -236 -295 60 -54 -234 -64 119 -142 -40 67 -221 -431 83 109 -152 -21 557 -17
3914a7k40L26K21m49JM17k07j53J69nk18J85K80n04k34P08j39o00K21J99n4l85
$$ -17 -257 69 290 -159 -158 259 52 -101 68 63 -155 30 310 -194 -428 280 141 -459 -238 -39 -93 -478
3936d78L04J6J32k80K18L9L7J24l50l6M85l35k51K49M58m44j79N36k0q36L37N49
$$ -478 -174 -158 -26 -306 -88 -49 -12 112 -238 -274 211 -124 -375 -126 332 -112 -291 245 225 -611 -274 275
3958B75m63j86K33L97m16j31K41r5M9J97l02%L65J32n96m4L74m5k62J37M0J11
$$ 275 -188 -374 -141 256 -160 -291 -50 -145 -96 101 -201 -201 164 296 -300 -344 30 -15 -277 -140 -100 11
3980A1Q5k80Q6LM35j32l21L25K84l76m73P23K60o30LL76j71k70L19Ok27J39Pj6
$$ 11 96 -184 -98 -95 340 208 -113 212 496 120 -353 370 630 0 3 379 208 -62 257 263 36 175 182 166
4004A66q7J92j35k35K57J57l73K5M65l59l00M65J10l75n6L64Kl65k6P4k08M67
$$ 166 79 271 136 -99 158 315 -58 -33 432 73 -227 238 348 -27 -83 281 283 -82 -108 -34 -242 225
4026B25K28p48J72L41j63k82Q6M00k6l53K24Lk01J49j5N1P0J10m50j51N21kn57
$$ 225 453 -295 -123 218 55 -227 -141 259 233 -120 104 107 -94 55 40 91 161 271 -179 -330 191 189 -368
4049c68J65L36l2o23L40L94l62O0L91m21J7K17J83l48l5M44j90j96Q5J88m32J66
$$ -368 -203 133 101 -522 -182 212 -150 -90 301 -120 -103 114 297 -51 -86 358 168 -28 57 245 -187 -21
4071b1J67rj35K92ml87Q0j9%n3L16j07j67J87K4l02N8L46j77k67K18J11l97K27
$$ -21 146 137 2 294 290 -97 -17 -36 -36 -89 227 120 -47 140 164 -138 -80 266 89 -178 40 151 -246 -19
4095a9J75j70k49K84n8k97L39K56k93l14M83K30m27j45L69N6l71J60j00j44K30
$$ -19 156 -14 -263 21 -37 -334 5 261 -32 -346 137 367 -60 -205 164 220 -151 9 -91 -235 -5
4116eJ07l22j03L00q7q2J09J77l97J41K05k25o6N20l21k73M66J64k80k88M31J64
$$ -5 102 -220 -323 -23 -110 -192 -83 94 -303 -162 43 -182 -248 272 -49 -322 144 308 28 -260 171 335
4138C35m22j29M85k49o2K66j29k92j2M28l47J90J85J2l03J51K21k96n5M23j11
$$ 335 -87 -216 269 20 -42 224 95 -197 -209 219 -128 62 247 259 -44 107 328 32 -23 400 289
4159B89n14L69L33m65k6L43j12n34M23j00J09j58K40k67o6J96k50r8K59K63m63
$$ 289 -225 144 477 12 -14 329 217 -317 106 6 115 -43 197 -70 -136 60 -190 -288 -29 234 -229
4180b29j81K74J96l01J89Q2j16k24L71j11k03J44J84k01j54L65R8l33J46K57l55
$$ -229 -410 -136 60 -241 -52 30 -86 -310 61 -50 -253 -109 75 -126 -280 85 183 -150 -4 253 -102
4201a02o5L01L3j52J9K16n45J31M56m92M0K60j04k6r5K79j40k28M53j44m58J43
$$ -102 -167 134 167 15 34 250 -295 -164 292 -200 -160 100 -4 -30 -125 154 14 -214 239 95 -363 -220
4223b20M66j92p8j19R7Q0j09M36l54o2M20l81k42L48L16m74PM90l77j0oJ33r0
$$ -220 246 54 -24 -143 -46 34 -75 361 7 -55 365 -16 -258 90 406 -68 -61 429 52 42 36 169 79
4246G9K8j6j21j05n0J70j55N6L27k66k33N19j20l57O3L62m70q4M10q6j52K1K31
$$ 79 107 91 -30 -135 -185 -15 -170 -114 213 -53 -286 233 113 -244 -181 181 -289 -373 37 -49 -201 -180 51
4269E1l81P7M93k72k14L08J19m22oN26k84k30M1N67l20l57M63K16m79O4J88J3
$$ 51 -330 -253 240 -32 -246 62 181 -241 -247 279 -5 -235 -194 373 53 -304 159 375 -104 -40 148 161
4291A61k7k20M9Q7J42j06m45L92J86l06q5L74P6m58K81J73k13Q3K17q0l65L42
$$ 161 134 -86 -37 50 192 86 -359 33 219 -87 -172 202 278 -180 101 274 61 144 361 281 -84 258
4313B58O2k32k69L76N1n30L37K16n3l37L70O6l44K46q7l9Q4n8n9p7K00j5l97L83
$$ 258 320 88 -181 195 246 -284 53 269 216 -121 249 315 -29 217 130 91 175 117 58 -19 181 166 -231 152
4337A52K45o92n6P27j87m27Q9L88l76j84J84K9o4J01J33m92L60L83l09k93K75
$$ 152 397 -295 -351 376 189 -238 -149 239 -137 -321 -137 -108 -172 -71 62 -430 -70 313 4 -289 -14
4358a4K43k88j8k3j1J15K42k47k34L47o4k07n7M04Q8o17L80J35j62l07M29J52
$$ -14 229 -59 -77 -100 -111 4 246 -1 -235 112 48 -159 -216 188 276 -341 39 174 12 -295 134 286
4380B86m34J83J97m40K44O2k5m3N4L4k42j4J93j53n5K58r9j13Q4Q4J82m11J61
$$ 286 -148 35 232 -208 36 98 73 30 84 118 -124 -138 55 -98 -153 105 6 -107 -23 61 243 -168 -7
4403gP5j46J22L21k77k85L73p5l52J31L63j28l82L94k5j86j42o3J64N9k5o8K8
$$ -7 68 -78 44 365 88 -197 176 101 -251 -120 243 115 -267 127 102 -84 -226 -289 -125 -66 -91 -159 -131
4426a31J57J41k98m4J67J2k27K15j22k34K01J93j74m24N28P8l01K37M18n38j20
$$ -131 26 167 -131 -175 -8 4 -223 -8 -130 -364 -163 30 -144 -568 -40 38 -263 -26 392 -146 -266
4447b66J53K66m36N6N03j47k38K53n2j23L3J51j31r8J54K30n34K32K63l70O6K86
$$ -266 -113 153 -283 -227 276 129 -109 144 92 -31 2 153 22 -76 78 308 -226 6 269 -101 -35 251
4469B51j63r9Q8P2m9r0J36j16n8K27K7l51R6L74k91l73M05K15n30L10O3o5l38
$$ 251 88 -11 77 149 100 10 146 30 -28 199 226 -125 -29 345 54 -319 86 301 -229 81 144 79 -259
4492b59K71J97k02O0%j34J19nn8l31K21J98j62L3j42L42m10K90j5k12N3J97p2
$$ -259 12 209 7 67 67 -67 52 47 -11 -342 -121 77 -85 -52 -194 148 -262 28 13 -199 -146 51 -21
4515b1j40K94k88O8J37K03k97j84L38Lr8j4L78m40j20N02j35k77R1J80r9k87N82
$$ -21 -161 133 -155 -87 50 253 -44 -228 110 113 15 1 379 -61 -181 321 186 -91 0 180 81 -206 376
4538C76j42m55M4K85m0J14mj66q8Q5R5p3L2pj70O5J71o7j67k4M25l48j70N48k36
$$ 376 234 -221 -177 108 68 182 178 12 -76 9 104 31 63 56 -114 -49 122 55 -112 -136 289 -59 -229 319 83
4563H3k34J08K11j12j63L41j63l34J99K97m93P9L03J06k64l30L91l17K50k9k7
$$ 83 -151 -43 168 56 -107 234 71 -263 -64 233 -260 -181 122 228 -36 -366 25 -292 -42 -71 -98
4584i8j41J72N9k27K73J54n5q3l9K32n13K27J99l19j02K83R3l91K46K00k56r1
$$ -98 -239 -67 -8 -235 38 192 137 54 15 247 -266 -39 160 -159 -261 22 115 -276 -30 170 -86 -177
4606a77K26r9j67J60J56P4l51K70L4k15M8J87l12P8L07ojk88K53k22j8K73k71
$$ -177 49 -50 -217 -57 99 173 -178 92 126 -89 -41 146 -166 -88 219 213 212 -76 177 -45 -63 210 -61
4629f1l9M7K43l06J82L15k37j68J44p0R7Jj25o1p5M24k36m52L67K63l84j84K54
$$ -61 -100 -53 190 -116 66 381 144 -24 120 50 147 148 23 -38 -113 311 75 -377 -10 253 -131 -315 -61
4652f1J36k83J30K44k63k9K87k05k31J40K03k45j2L39j34j72J47J59k28k28L39
$$ -61 75 -208 -78 166 -97 -126 161 -44 -275 -135 68 -177 -189 150 16 -156 -9 150 -78 -306 33
4673C3j17j23K78n1j89J99j5j5j80M41k38o0j06L64k68k86N21j9n66K39M70m62
$$ 33 -84 -207 71 20 -169 30 15 0 -180 261 23 -37 -143 221 -47 -333 188 169 -397 -158 312 -150
4695a50J03L3K08q6p0K4N6J0J13j39m65M53K52k71j73K69k88K89k14J64j70O3
$$ -150 -47 -14 194 108 38 62 118 128 241 102 -363 90 342 71 -102 167 -121 168 -46 118 -52 11
4717A1Q3j89j84M70j15k30J22K86j83l81L97K22m11m7J00r0K01O9j68k55M77k91
$$ 11 94 -95 -279 191 76 -154 -32 254 71 -310 87 309 -102 -149 -49 -139 62 131 -37 -292 185 -106
4739a06l7J48J97j88j84L45q4m33R7N88m26j02K73L5m28L56P3j49K5J63k73r2
$$ -106 -143 5 202 14 -170 175 91 -342 -245 343 -83 -185 88 123 -305 51 124 -25 0 163 -110 -202
4761b02K43J81k4k76L3J65k80J09J70l8N3j37J03l7K50j60k75kK81q3j58K58J59
$$ -202 41 222 198 -78 -45 120 -160 -51 119 81 134 -3 100 63 313 153 -122 -124 157 74 -84 174 333
4784C33j91j00o9Q0j27o4J65j43L26j31l20J48L11J0m24J06K42qk83L19m5k17
$$ 333 142 42 -27 53 -74 -138 27 -116 210 79 -241 -93 218 228 -196 -90 152 144 -139 180 135 -82
4806h2NL16k43nL1J18j71J43q9q4Q1J05k67j00L42p0r6J2K20j66k82N72j9k79
$$ -82 -77 239 -4 -9 22 140 -31 112 23 -61 20 125 -142 -242 100 30 -66 -54 166 0 -282 290 271 -8
4830hmJ88m07J65J73j89j67M4L74j97r4J75M3J9q1q4qL2J68j68M1J13j18l7o6
$$ -8 -12 176 -231 -66 107 -82 -249 -205 169 -28 -122 53 96 115 34 -50 -58 -26 142 -26 15 128 10 -27 -93
4855i3J24n1k31L18J64k55k40K75K3r9K15K8l07J80J46j20j74L06k3k01r3J20
$$ -93 31 -20 -251 67 231 -24 -264 11 34 -65 150 178 -129 51 197 77 -97 209 186 -15 -108 12
4877A2k20J06J95j68M8K08p6m09K24L05m42J73K14m3m77J19M68k02k03J36J67
$$ 12 -208 -102 93 -75 -27 181 105 -304 -80 225 -217 -44 170 127 -350 -231 237 35 -168 -32 135
4898A35k72oJ48o6j47N2J03j00J32J5j47Jq5K19r5O7Q5Kj65J77j45%O7K00j93
$$ 135 -137 -143 5 -61 -208 -156 -53 -153 -21 -6 -153 -152 -237 -18 -113 -46 39 41 -124 53 -92 -92 -25 175 -18
4923a8J22J40k39j34NL78l74j47M57q6k22J78J1P8l21L62j17j81K53j20j86J11
$$ -18 104 244 5 -129 -124 254 -120 -267 190 104 -118 60 71 149 -172 190 73 -108 145 25 -161 -50
4945e0J80L3k12M3Q0P6k5j13r0j12L57J6k41J02J40k66K0J84k4j87j10K01o8r3
$$ -50 130 163 -49 -6 74 150 125 12 -78 -190 167 183 -58 44 184 -82 -62 122 98 -89 -199 2 -66 -159
4969a59J40Kj75O2L76k47j89L65o9k06OL76k68r2J79j19p9Q2O4j54j12L33j23
$$ -159 -19 -17 -192 -130 246 -1 -190 175 106 -100 -94 282 14 -78 101 -18 -97 -15 49 -105 -217 116 -7
4992gN8nj11j13J09J24l22K70M8J89m21R2K59r6J5J50j12k3O7j02j79n7K29j09
$$ -7 51 46 -65 -178 -69 55 -267 3 51 240 -181 -89 170 74 89 239 127 104 171 69 -110 -167 62 -47
5016d7l8J35J88k11l3q7R7n1J34o2q6J53J8p1k3mJ2j48J79K28k61q8j0K74l54
$$ -47 -85 50 238 27 -6 -93 4 -47 87 25 -61 92 110 39 16 12 24 -124 55 283 22 -66 -76 198 -156
5041a56K62R6l82K32n8J40j68l8K48k04n0L8K7q6K24n9j93L0K96k79J4o3K40k80
$$ -156 106 202 -180 52 -6 134 -34 -72 176 -28 -78 -40 -13 -99 125 66 -127 -97 199 -80 -66 -129 111 -169
5065a69K3J93j25jJ90k03r2K2K29j27o9N7m2J02q2J17j73O3J17kk24M35r5k82
$$ -169 -146 47 -78 -79 111 -92 -184 -162 67 -60 -129 -72 -114 -12 -94 23 -150 -87 30 28 -196 239 144 -138
5089a38L1K19o5k97K95l4j73K07J96l82L08Mo0j40JJ92Rl57L70j14r6p0K15qj80
$$ -138 -107 112 47 -250 45 11 -162 45 241 -141 167 171 111 -29 -28 164 173 -184 186 72 -24 -94 121 113 -67
$$ [...]
8191I7
##END NTUPLES=NMR FID
##END=
