##TITLE=1H_50-2023
 CDCl3
 8 sc, 
 11.8.2023
##JCAMPDX= 6.0         $$ Bruker NMR JCAMP-DX V2.0
##DATA TYPE= NMR FID
##DATA CLASS= NTUPLES
##ORIGIN= UXNMR, Bruker Analytische Messtechnik GmbH
##OWNER= root
$$ XWIN-NMR		Version 3.5
$$ Fri Aug 11 14:05:42 2023 Russian Standard Time (UT+4h)  she@DPX200
##.OBSERVE FREQUENCY= 200.13135
##.OBSERVE NUCLEUS= ^1H
##.DELAY= (6, 6)
##.ACQUISITION MODE= SIMULTANEOUS
##.ACQUISITION SCHEME= undefined
##.AVERAGES= 8
##.DIGITISER RES= 18
##SPECTROMETER/DATA SYSTEM= spect
##.PULSE SEQUENCE= zg30
##.SOLVENT NAME= CDCl3
##.SHIFT REFERENCE= (INTERNAL, CDCl3, 0, 15.7039)
##AUDIT TRAIL= $$ (NUMBER, WHEN, WHO, WHERE, WHAT)
$$ ##TITLE= Audit trail, XWIN-NMR		Version 3.5
$$ ##JCAMPDX= 5.01
$$ ##ORIGIN= Bruker BioSpin GmbH
$$ ##OWNER= she
$$ F:/spectra/data/she/nmr/H-F/1/audita.txt
$$ ##AUDIT TRAIL=  $$ (NUMBER, WHEN, WHO, WHERE, WHAT)
(   1,<2023-08-11 14:04:18.04 +0400>,<she>,<DPX200>,
      <created by zg, POWCHK disabled, PULCHK disabled
       configuration hash MD5:
       00 E9 B6 7A A2 85 ED C7 34 08 36 98 17 FE 4E 26
       data hash MD5: 16K
       F0 3E 3C 67 60 2F 77 FB 14 F8 B5 D0 59 92 88 4A>)
$$ ##END=
$$ 
$$ hash MD5
$$ 84 A8 DC FE 94 84 7F 3A F5 89 74 0D BE 01 17 82
##$RELAX= 
##$RELAX= 
##$RELAX= 
##$RELAX= 
##$RELAX= 
##$RELAX= 
$$ Bruker specific parameters
$$ --------------------------
##$DU= <F:/spectra>
##$EXPNO= 1
##$NAME= <H-F>
##$PROCNO= 1
##$TYPE= <nmr>
##$USER= <she>
##$AMP= (0..31)
100 100 100 100 100 100 100 100 100 100 100 100 100 100 100 100 100 100 
100 100 100 100 100 100 100 100 100 100 100 100 100 100 
##$AQSEQ= 0
##$AQ_mod= 1
##$AUNM= <au_zg>
##$AUTOPOS= <>
##$BF1= 200.13
##$BF2= 200.13
##$BF3= 200.13
##$BF4= 200.13
##$BF5= 200.13
##$BF6= 200.13
##$BF7= 200.13
##$BF8= 200.13
##$BYTORDA= 1
##$CFDGTYP= 0
##$CFRGTYP= 5
##$CHEMSTR= <none>
##$CNST= (0..31)
1 1 145 1 1 1 1 1 1 1 1 1 1 1 1 1 1 1 1 1 1 1 1 1 1 1 1 1 1 1 1 1 
##$CPDPRG= <>
##$CPDPRG1= <>
##$CPDPRG2= <>
##$CPDPRG3= <>
##$CPDPRG4= <mlev>
##$CPDPRG5= <mlev>
##$CPDPRG6= <mlev>
##$CPDPRG7= <mlev>
##$CPDPRG8= <mlev>
##$CPDPRGB= <>
##$CPDPRGT= <>
##$D= (0..31)
0 1.2 0 0 0 0 0 0 0 0.06 0 0.03 0 0 0 0 0.0002 0 0 0 0 0 0 0 0 0 0 0 0 
0 0 0 
##$DATE= 1691748257
##$DBL= (0..7)
120 120 120 120 120 120 120 120 
##$DBP= (0..7)
150 150 150 150 150 150 150 150 
##$DBP07= 0
##$DBPNAM0= <>
##$DBPNAM1= <>
##$DBPNAM2= <>
##$DBPNAM3= <>
##$DBPNAM4= <>
##$DBPNAM5= <>
##$DBPNAM6= <>
##$DBPNAM7= <>
##$DBPOAL= (0..7)
0.5 0.5 0.5 0.5 0.5 0.5 0.5 0.5 
##$DBPOFFS= (0..7)
0 0 0 0 0 0 0 0 
##$DE= 6
##$DECBNUC= <off>
##$DECIM= 32
##$DECNUC= <off>
##$DECSTAT= 4
##$DIGMOD= 1
##$DIGTYP= 9
##$DL= (0..7)
0 120 120 120 120 120 120 120 
##$DP= (0..7)
150 150 150 150 150 150 150 150 
##$DP07= 0
##$DPNAME0= <>
##$DPNAME1= <>
##$DPNAME2= <>
##$DPNAME3= <>
##$DPNAME4= <>
##$DPNAME5= <>
##$DPNAME6= <>
##$DPNAME7= <>
##$DPOAL= (0..7)
0.5 0.5 0.5 0.5 0.5 0.5 0.5 0.5 
##$DPOFFS= (0..7)
0 0 0 0 0 0 0 0 
##$DQDMODE= 0
##$DR= 18
##$DS= 0
##$DSLIST= <SSSSSSSSSSSSSSS>
$$ [...]
##$SUBNAM2= <"">
##$SUBNAM3= <"">
##$SUBNAM4= <"">
##$SUBNAM5= <"">
##$SUBNAM6= <"">
##$SUBNAM7= <"">
##$SUBNAM8= <"">
##$SUBNAM9= <"">
##$SW= 18.05172834244
##$SWIBOX= (0..15)
0 0 2 0 0 0 0 0 0 0 0 0 0 0 0 0 
##$SW_h= 3612.71676300578
##$TD= 16384
##$TD0= 1
##$TE= 0
##$TE2= 300
##$TE3= 300
##$TEG= 300
##$TL= (0..7)
0 120 120 120 120 120 120 120 
##$TP= (0..7)
150 150 150 150 150 150 150 150 
##$TP07= 0
##$TPNAME0= <>
##$TPNAME1= <>
##$TPNAME2= <>
##$TPNAME3= <>
##$TPNAME4= <>
##$TPNAME5= <>
##$TPNAME6= <>
##$TPNAME7= <>
##$TPOAL= (0..7)
0.5 0.5 0.5 0.5 0.5 0.5 0.5 0.5 
##$TPOFFS= (0..7)
0 0 0 0 0 0 0 0 
##$TUNHIN= 0
##$TUNHOUT= 0
##$TUNXOUT= 0
##$USERA1= <user>
##$USERA2= <user>
##$USERA3= <user>
##$USERA4= <user>
##$USERA5= <user>
##$V9= 5
##$VALIST= <valist>
##$VCLIST= <CCCCCCCCCCCCCCC>
##$VD= 0
##$VDLIST= <DDDDDDDDDDDDDDD>
##$VPLIST= <PPPPPPPPPPPPPPP>
##$VTLIST= <TTTTTTTTTTTTTTT>
##$WBST= 1024
##$WBSW= 4
##$XGAIN= (0..3)
0 0 0 0 
##$XL= 0
##$YL= 0
##$YMAX_a= 552382
##$YMIN_a= -590416
##$ZGOPTNS= <>
##$ZL1= 120
##$ZL2= 120
##$ZL3= 120
##$ZL4= 120
##$ABSF1= 10
##$ABSF2= 0
##$ABSG= 5
##$ABSL= 3
##$ALPHA= 0
##$AQORDER= 0
##$ASSFAC= 0
##$ASSFACI= 0
##$ASSFACX= 0
##$ASSWID= 0
##$AUNMP= <proc_1d>
##$AZFE= 0.1
##$AZFW= 0.1
##$BCFW= 1
##$BC_mod= 2
##$BYTORDP= 1
##$COROFFS= 0
##$CY= 11.3945322036743
##$DATMOD= 1
##$DC= 2
##$DFILT= <>
##$DTYPP= 0
##$F1P= 15.7292609196834
##$F2P= 12.9074282941183
##$FCOR= 0.5
##$FTSIZE= 0
##$FT_mod= 4
##$GAMMA= 1
##$GB= 0.15
##$INTBC= 1
##$INTSCL= 1
##$ISEN= 128
##$LB= 0.24
##$LEV0= 0
##$LPBIN= 0
##$MAXI= 10000
##$MC2= 0
##$MEAN= 0
##$ME_mod= 0
##$MI= 1.114404
##$NCOEF= 0
##$NC_proc= 0
##$NLEV= 6
##$NOISF1= 3.799351
##$NOISF2= 2.8
##$NSP= 1
##$NTH_PI= 0
##$NZP= 0
##$OFFSET= 15.70392
##$PC= 1
##$PHC0= -21039.66
##$PHC1= 10.45272
##$PH_mod= 1
##$PKNL= yes
##$PPARMOD= 0
##$PSCAL= 0
##$PSIGN= 0
##$REVERSE= no
##$SF= 200.130013532006
##$SI= 16384
##$SIGF1= 3
##$SIGF2= 2
##$SINO= 400
##$SIOLD= 16384
##$SREGLST= <1H.CDCl3>
##$SSB= 0
##$STSI= 0
##$STSR= 0
##$SW_p= 3612.71676300578
##$SYMM= 0
##$S_DEV= 0
##$TDeff= 0
##$TDoff= 0
##$TI= <>
##$TILT= no
##$TM1= 0
##$TM2= 0
##$TOPLEV= 0
##$USERP1= <user>
##$USERP2= <user>
##$USERP3= <user>
##$USERP4= <user>
##$USERP5= <user>
##$WDW= 1
##$XDIM= 8192
##$YMAX_p= 0
##$YMIN_p= 0
$$ End of Bruker specific parameters
$$ ---------------------------------
##NTUPLES= NMR FID
##VAR_NAME=  TIME,          FID/REAL,        FID/IMAG
##SYMBOL=    X,             R,               I
##VAR_TYPE=  INDEPENDENT,   DEPENDENT,       DEPENDENT
##VAR_FORM=  AFFN,          ASDF,            ASDF
##VAR_DIM=   8192,          8192,            8192
##UNITS=     SECONDS,       ARBITRARY UNITS, ARBITRARY UNITS
##FACTOR=    0.0002768,     1,               1
##FIRST=     0,             0,               0
##LAST=      2.2672688,     0,               0
##MIN=       0,             -590416,         0
##MAX=       2.2672688,     552382,          0
$$ Real data points
##PAGE= N=1
##DATA TABLE= (X++(R..R)), XYDATA
$$ [...]
2550B034l608J357J472l625L805j604j428K970l301J643J738l441L600j219j782
$$ 2034 -1574 -217 1255 -2370 1435 -169 -1597 1373 -1928 -285 1453 -1988 1612 393 -1389
2565a389K549k295R29K066l792K955n29k107L877l008P02J873l201K101j49k724
$$ -1389 1160 -1135 -206 1860 -1932 1023 494 -1613 2264 -744 -42 1831 -1370 731 582 -2142
2581b142M089k795L70J668l223K809r06j575L128k026j73K708l103K117L60k910
$$ -2142 1947 -848 -478 1190 -2033 776 -130 -1705 1423 -603 -776 1932 -1171 946 1306 -1604
2597a604L313k197K26K088l400K228k75k321L592k599j28K837l175J583O63k840
$$ -1604 1709 -488 -262 1826 -1574 654 379 -1942 1650 -949 -1077 1760 -1415 168 831 -2009
2613b009L912k043k45K001k784J153J551k736K397j944O2K552k718Q36Q06k476
$$ -2009 1903 -140 -385 1616 -1168 -15 1536 -1200 1197 -747 -685 1867 -851 -15 791 -1685
2629a685L019j292j959L646l035J012J309l027K680m08j404L515l088K35K395
$$ -1685 1334 42 -1917 1729 -1306 -294 1015 -2012 668 260 -1144 2371 -717 -482 1913
2644A913l811K264J17k036L269k748J54K057k434K356k39k786L038j555m82K750
$$ 1913 -1898 366 483 -1553 1716 -1032 -878 1179 -1255 1101 862 -1924 1114 -441 -923 1827
2660A827l726L039k34k881L583k060o54L061l223J940M35k577L393k186n46K535
$$ 1827 -1899 1140 906 -1975 1608 -452 -1106 1955 -1268 672 1107 -1470 1923 -263 -809 1726
2676A726l199J715M23k832L463j888r31K631k705J485P74k530L419j483p77K570
$$ 1726 -1473 242 665 -2167 1296 -592 -1523 1108 -1597 -112 662 -1868 1551 68 -709 1861
2692A861k783J534J041l092K610j168j252K961k872P41J302k782K989r80j469
$$ 1861 -922 612 1653 -1439 1171 3 -1249 1712 -1160 -419 883 -1899 1090 110 -1359
2707a359K981k311R21J161k486K358l60k115L002k794N63J730k956K080k81k066
$$ -1359 1622 -689 232 1393 -1093 1265 905 -1210 1792 -1002 -439 1291 -1665 415 134 -1932
2723a932K920k075M31K186k974K211L01k284L194k366j68K467l411J722N87k509
$$ -1932 988 -1087 -656 1530 -1444 767 1068 -1216 1978 -388 -556 1911 -1500 222 809 -1700
2739a700K975k012k17K362k927J741M56k444L006j475m54K377k785J125J038k585
$$ -1700 1275 -737 -954 1408 -1519 222 678 -1766 1240 -235 -689 1688 -1097 28 1066 -1519
2755a519K608j178j005K642k671J302J208l388L170p44j077K293k386Q90J108
$$ -1519 1089 -89 -1094 1548 -1123 179 1387 -2001 1169 425 -652 1641 -745 145 1253
2770A253k810K337q20j335K586k359O71J458k717K391n16j042K481k243M99J841
$$ 1253 -1557 780 -40 -1375 1211 -1148 -477 981 -1736 655 139 -903 1578 -665 -166 1675
2786A675l066K428k92k122K837k310K07J889k877K084Q8j880K611j822j65K606
$$ 1675 -1391 1037 745 -1377 1460 -850 -643 1246 -1631 453 541 -1339 1272 -550 -715 1891
2802A891k941J669J4k006K948j841n44K012k421J686O9k139K730j599m72K064
$$ 1891 -1050 619 633 -1373 1575 -266 -810 1202 -1219 467 536 -1603 1127 -472 -944 1120
2818A120k503J508O52k447K948j308q25K235k444J440P44k336K632j265r44K431
$$ 1120 -1383 125 777 -1670 1278 -30 -855 1380 -1064 376 1120 -1216 1416 151 -793 1638
2834A638k693J087J004k402K175o45j603K693k175P05J048k157K152n22j465K590
$$ 1638 -1055 32 1036 -1366 809 164 -1439 1254 -921 -216 832 -1325 827 305 -1160 1430
2850A430j985M89J303k488K148l90j609K704k112L65J363k834K334l81j568K861
$$ 1430 -555 -66 1237 -1251 897 507 -1102 1602 -510 -145 1218 -1616 718 337 -1231 1630
2866A630k331K24J619k545K411k09k442K980j814K03J654k827J775K41j973K586
$$ 1630 -701 -477 1142 -1403 1008 799 -1643 1337 -477 -274 1380 -1447 328 569 -1404 1182
2882A182j532m29K102k780K050K48k361K760j536o58K452k582J358M18k331K600
$$ 1182 -350 -779 1323 -1457 593 841 -1520 1240 -296 -954 1498 -1084 274 692 -1639 961
2898I61r45r04K173k373J183J064k765K529j078q71K515k457J038P93k406K528
$$ 961 16 -888 1285 -1088 95 1159 -1606 923 -155 -1026 1489 -968 70 863 -1543 985
2914I85r99j026K492k289O55J115k311K320l87j601K519j802J48J558k576K143
$$ 985 -14 -1040 1452 -837 -182 933 -1378 942 555 -1046 1473 -329 -181 1377 -1199 944
2930I44o05j694K678k114L35J685k423J569J06j762K671k046J94J744k345J753
$$ 944 339 -1355 1323 -791 -456 1229 -1194 375 481 -1281 1390 -656 -462 1282 -1063 690
2946F90j05j817K455j528l37J584k445J837L70k027K500j438n91K195k481J590
$$ 690 585 -1232 1223 -305 -642 942 -1503 334 704 -1323 1177 -261 -852 1343 -1138 452
2962D52L43k262K707j324q58K448k606J256P38k315K321j087q11K373k439J064
$$ 452 795 -1467 1240 -84 -942 1506 -1100 156 894 -1421 900 -187 -998 1375 -1064 0
2978@J192k794K451p99r93K164k215R10J261k531K284n28j297K517k412N89J479
$$ 0 1192 -1602 849 50 -943 1221 -994 -84 1177 -1354 930 402 -895 1622 -790 -201 1278
2995A278k589K287r03j216K316j828K74J623k642K213o87j214K324k106L13J647
$$ 1278 -1311 976 73 -1143 1173 -655 -381 1242 -1400 813 126 -1088 1236 -870 -557 1090
3011A090k423J827K17j726K399k183J62J797k607J820K30j974K505j469l67J802
$$ 1090 -1333 494 711 -1015 1384 -799 -637 1160 -1447 373 603 -1371 1134 -335 -702 1100
3027A100k416J886J48k047K629j592m45K229k449J014P69k470K584j187p17K220
$$ 1100 -1316 570 718 -1329 1300 -292 -737 1492 -957 57 826 -1644 940 -247 -964 1256
3043A256k214J247O46k278K178r53q10K199j908P15R00k239K264q96j030K365
$$ 1256 -958 289 935 -1343 835 -118 -928 1271 -637 78 978 -1261 1003 107 -923 1442
3059A442k245O69J140k283K153p55j149K413k337P91J319k703K240m66j483K428
$$ 1442 -803 -134 1006 -1277 876 121 -1028 1385 -952 -161 1158 -1545 695 229 -1254 1174
3075A174j922L40J488k415K003j4j906K557j762N1J835k510J755j47j691K593
$$ 1174 -748 -408 1080 -1335 668 654 -1252 1305 -457 -406 1429 -1081 674 527 -1164 1429
3091A429j842r9J526k340J589L83j913K425j513n09J952k617J460P71j885K396
$$ 1429 -413 -512 1014 -1326 263 646 -1267 1158 -355 -864 1088 -1529 -69 702 -1183 1213
3107A213j311o19J960k300Q48R03j997K421j139j069K558k420J042O01j774J928
$$ 1213 -98 -717 1243 -1057 -209 694 -1303 1118 -21 -1090 1468 -952 90 691 -1083 845
3123H45p59j097K277k174O70J253k452K618j086j106K223j817K88J363k343J973
$$ 845 86 -1011 1266 -908 -238 1015 -1437 1181 95 -1011 1212 -605 -317 1046 -1297 676
3139F76k23j535K339k014L31J693k575K088n69j501K743j847M3J465k367J986
$$ 676 453 -1082 1257 -757 -426 1267 -1308 780 211 -1290 1453 -394 -351 1114 -1253 733
3155G33l26j464K307j489l72J675k073J273J33j562K546j797n25K344k567J348
$$ 733 407 -1057 1250 -239 -611 1064 -1009 264 397 -1165 1381 -416 -941 1403 -1164 184
3171A84L96j859K607j442n59J912k370J259N31k067K196r34q93K158j946O93J239
$$ 184 580 -1279 1328 -114 -673 1239 -1131 128 659 -1408 788 -146 -1039 1119 -827 -134 1105
3188A105k330K284j234m50K050k357Q08P37j983K116j017q30K293k144O35J268
$$ 1105 -1225 1059 -175 -625 1425 -932 -124 613 -1370 746 -271 -1101 1192 -952 -317 951
3204I51k404K152k73j665K587j936M68J111k109J753j07j329K188j996l9J714
$$ 951 -1453 699 426 -1239 1348 -588 -120 991 -1118 635 528 -801 1387 -609 -648 1066
3220A066k438J981k35j522K241j551j14J880k514J593K83j813K194j578j08J879
$$ 1066 -1372 609 374 -1148 1093 -458 -572 1308 -1206 387 670 -1143 1051 -527 -635 1244
3236A244k575J878k06j731K246j036m86K123k385J256R18k437K326j253m59K069
$$ 1244 -1331 547 341 -1390 856 -180 -666 1457 -928 328 1246 -1191 1135 -118 -577 1492
3252A492k415J199N26k083K377j456o01K267k446J438Q61k730K469o98j271K306
$$ 1492 -923 276 802 -1281 1096 -360 -961 1306 -1140 298 1159 -1571 898 200 -1071 1235
3268A235k013Q26J060k596J938k51j152K268k115N86J436k234J989o19j173K249
$$ 1235 -778 48 1108 -1488 450 199 -953 1315 -800 -214 1222 -1012 977 358 -815 1434
3284A434j848K24J212k061J326l21r72K355k236O10J384k246J399O2j520K826
$$ 1434 -414 -190 1022 -1039 287 -34 -1006 1349 -887 -277 1107 -1139 260 322 -1198 1628
3300A628j927l00J724k426J831J94j872K276j793j34J903k505J727L02j856K731
$$ 1628 -299 -599 1125 -1301 530 724 -1148 1128 -665 -799 1104 -1401 326 628 -1228 1503
3316A503j956l42J761j768J105N25j872K231j379l92J953k267J350L36k127K195
$$ 1503 -453 -795 966 -802 303 828 -1044 1187 -192 -584 1369 -898 452 788 -1339 856
3332H56j002n95J741k046J072Q26j892J777p59p61J725j505N91J145k274J778
$$ 856 -146 -741 1000 -1046 26 852 -1040 737 -22 -783 942 -563 28 1173 -1101 677
3348F77l11j419K336k009M60J644k294J543k38j514K165j896M62J265k208J685
$$ 677 366 -1053 1283 -726 -266 1378 -916 627 389 -1125 1040 -856 -394 871 -1337 348
3364C48Mj586K226j539o7J815k112J359O3j313J832j429l8J980k084O98L93j691
$$ 348 352 -1234 992 -547 -614 1201 -911 448 511 -802 1030 -399 -437 1543 -541 157 550 -1141
3382a141J886j344m02J939k194J498N09j979J927j201l76K032k085J260O95k245
$$ -1141 745 -599 -1001 938 -1256 242 751 -1228 699 -502 -878 1154 -931 329 1024 -1221
3398a221K336j280p23K159k274Q67J193k417K386j335q88K016j522N15J139j989
$$ -1221 1115 -165 -888 1271 -1003 -136 1057 -1360 1026 -309 -1197 819 -703 -188 951 -1038
3414a038J889n97q03J879j956O13Q20k068J876l54j304J785j716P60J116k177
$$ -1038 851 254 -549 1330 -626 -13 807 -1261 615 261 -1043 742 -974 -214 902 -1275
3430a275J718J41j639J800j496M36J364k083J659k46j557K432j781K01J551k072
$$ -1275 443 584 -1055 745 -751 -315 1049 -1034 625 379 -1178 1254 -527 -326 1225 -847
3446h47J251P9j574K013j159j06J476j963J174L11j957K169j045n38K054k336
$$ -847 404 483 -1091 922 -237 -343 1133 -830 344 655 -1302 867 -178 -716 1338 -998
3462i98R87N66j863K001r96l82J925k168J330O58j941J922j141r06K244j955P97
$$ -998 -11 555 -1308 693 -303 -685 1240 -928 402 1060 -881 1041 -100 -1006 1238 -717 80
3479H0P02k170K120j047l33J447j514L81J121j853J551m2j296K190j975M85R30
$$ 80 782 -1388 732 -315 -648 799 -715 -334 787 -1066 485 443 -853 1337 -638 -153 777
3496G77j955J756j99j335J706j162n7J535k288J678Q3j280K006j458L8R69j476
$$ 777 -1178 578 379 -956 750 -412 -469 1066 -1222 456 539 -741 1265 -193 -155 814 -662
3513f62J160K61j767K042j521l27K097k369J150M2j472J837o73m22J769j991J308
$$ -662 498 759 -1008 1034 -487 -814 1283 -1086 64 106 -1366 471 -202 -624 1145 -846 462
3530D62O90k239J790q08n18J507k121J458P40j866J446m36q88J891j623M89N14
$$ 462 1152 -1087 703 -105 -623 884 -1237 221 961 -905 541 105 -783 1108 -515 -26 488
3547D88j624J797j037k22J960k276P39J230k309J981k73j459K257k076Q23O68
$$ 488 -1136 661 -376 -598 1362 -914 -175 1055 -1254 727 454 -1005 1252 -824 -1 667
3563F67j324R92n9r70J711j789N17J232j984J690m52j689K714j659l72K001k382
$$ 667 -657 335 276 -694 1017 -772 -255 977 -1007 683 231 -1458 1256 -403 -775 1226 -1156
3580a156J980l60j241J731j408J77J327j979J074m1q30J892j734l49J981j992
$$ -1156 824 464 -777 954 -454 -277 1050 -929 145 104 -726 1166 -568 -917 1064 -928
3596i28R80M8j069J863j113o04J932k500J761J85j782K242j173m54J663j952J112
$$ -928 52 100 -969 894 -219 -823 1109 -1391 370 555 -1227 1015 -158 -612 1051 -901 211
3613B11K13j359J924j426o42K014j896J175J60j784K131k81j099J924j839L37
$$ 211 424 -935 989 -437 -1079 935 -961 214 374 -1410 721 440 -659 1265 -574 -237
3629b37R24j658J523m01p36J543j522L71J178j406J010m41j090K323j966K43J475
$$ -237 687 -971 552 151 -585 958 -564 -193 985 -421 589 148 -942 1381 -585 -342 1133
3646A133k417J536L95j757J832j361J8J805k420J667K57j947J938j567M05R89
$$ 1133 -1284 252 647 -1110 722 -639 -621 1184 -1236 431 688 -1259 679 -888 -483 506
3662E06j453J020K68r89J345o66n87J198j712J262O08j687J656p32r48J818j794
$$ 506 -947 73 341 -648 697 31 -556 642 -1070 192 800 -887 769 37 -911 907 -887
3679h87J310j5j512J314m25q00J839j313K92J009j911J816q26l01J451j684Q08
$$ -887 423 408 -1104 210 -215 -1015 824 -489 -197 812 -1099 717 -109 -410 1041 -643 165
3696A65R13k044J066k97k80J742k080P96P15j813J498n73p31K267k148R24J234
$$ 165 1078 -966 100 -197 -477 1265 -815 -19 696 -1117 381 -192 -923 1344 -804 120 1354
3713A354j811J303l29j444J630j113j48J123j855J383J57j265J703r42m06J442
$$ 1354 -457 846 517 -927 703 -410 -558 565 -1290 93 250 -1015 688 -254 -660 782
3729G82j825J654J83j663J932p92j138J995j937Q07J20j215J910r66m39J729j917
$$ 782 -1043 611 794 -869 1063 271 -867 1128 -809 -2 118 -1097 813 -153 -592 1137 -780
3746g80N55P17r60J516j094l31J318j620P62P56j874J413o15l51J269j140K75
$$ -780 -225 492 -468 1048 -46 -377 941 -679 83 839 -1035 378 -237 -588 681 -459 -184
3763a84J222j589J353n83p92J515j408k94J470j955J678n02r82K006j555L96P90
$$ -184 1038 -551 802 219 -573 942 -466 -760 710 -1245 433 -69 -1051 955 -600 -204 586
3780E86j494J150N7q48J380j182L0J317j652J418m73j132J519j172k9J234j873
$$ 586 -908 242 299 -549 831 -351 -321 996 -656 762 289 -843 676 -496 -525 709 -1164
3797a164J157J65j400J926j073j95J327j373O68N15j430J633q12l14J235j762
$$ -1164 -7 158 -1242 684 -389 -584 743 -630 38 553 -877 756 -56 -370 865 -897
3813h97Q06Q20j615J236q66J15Q17j087P40P13j751K210r85q23J528j474N33P74
$$ -897 -91 729 -886 350 -516 -401 416 -671 69 782 -969 1241 256 -567 961 -513 20 794
3831G94j517J384n92o61J301j410P50O44j599Q40O3j140J871j791R92R28j593
$$ 794 -723 661 69 -592 709 -701 49 693 -906 -66 -3 -1143 728 -1063 -71 857 -736
3848g36J219N3j183J444r68n4J064j519J326l21j183J593r93q9R92j594J199J34
$$ -736 483 536 -647 797 -171 -225 839 -680 646 325 -858 735 -258 -347 645 -949 250 384
3866C84j132J399p58m31J355j631R37N07j363J615j203j27J225j265N01L88j394
$$ 384 -748 651 -107 -538 817 -814 123 630 -733 882 -321 -448 777 -488 13 401 -993
3883i93J304m46m47J412j552Q93K12j204J713j086k45J519j693O05Q54j685J485
$$ -993 311 -135 -582 830 -722 171 383 -821 892 -194 -439 1080 -613 -8 846 -839 646
3900F46p01n96J397j396N60M97j432J387l02o98J514j443L36J103j576J070j99
$$ 646 -55 -651 746 -650 -90 407 -1025 362 60 -638 876 -567 -231 872 -704 366 167
3917A67r82J739j236K93R60j770J353j07j240J410q68k8R78j479J000K43j221
$$ 167 -815 924 -312 -19 941 -829 524 417 -823 587 -281 -309 669 -810 190 433 -788
3934g88J528j039n9J006j089M91O01j671J759q11k84J512j869R20L04j496J705
$$ -788 740 -299 -358 648 -441 50 651 -1020 739 -72 -356 1156 -713 207 511 -985 720
3951G20q67k73J581j816O82M67j358J549p07m01J060j211N54P27j559J779j015
$$ 720 -147 -420 1161 -655 27 494 -864 685 -22 -423 637 -574 -20 707 -852 927 -88
3968h8o89J713j510N04P18j142J212o30r49J774j486J31O33j218J344j59r12J724
$$ -88 -777 936 -574 -70 648 -494 718 88 -861 913 -573 -442 191 -1027 317 158 -754 970
3986I70j261L90O93j474J023K19j390J917j489j08J517j926J395m0j483J716j207
$$ 970 -291 99 792 -682 341 560 -830 1087 -402 -510 1007 -919 476 436 -1047 669 -538
4003e38qJ400j799J442p8j270J790j088k41J093j264P36L72j541J701q75r9Q75
$$ -538 -546 854 -945 497 419 -851 939 -149 -390 703 -561 175 547 -994 707 -168 -267 608
4021F08j287R20J57j382J414j35r30J588j441N81Q35k054J862o54n80J103j208
$$ 608 -679 241 398 -984 430 295 -635 953 -488 93 928 -1126 736 82 -498 605 -603
4038f03L10P08j377J350m50n24J441j248L74O79j218J174n52p78J628j231K91
$$ -603 -293 415 -962 388 -62 -586 855 -393 -19 660 -558 616 64 -714 914 -317 -26
4055b6N94j730J399k46o17J206j053L04P66j404J231J2j230J653j339L20Q55j442
$$ -26 568 -1162 237 -9 -626 580 -473 -169 597 -807 424 436 -794 859 -480 -160 695 -747
4073g47R80k09r83J662j026L3R06j338J051r5r44J390r21l67J631j799Q37O35
$$ -747 233 24 -959 703 -323 -290 616 -722 329 234 -710 680 -241 -608 1023 -776 61 696
4091F96j410J401n96p31J368j555P32O87j494J634p68o43J773j691P53O22j674
$$ 696 -714 687 91 -640 728 -827 -95 592 -902 732 -36 -679 1094 -597 156 778 -896
4108h96J060l73k84J314j471L35P03j247J291l84m83J234j316J63J243j596J036
$$ -896 164 -209 -493 821 -650 -315 388 -859 432 48 -435 799 -517 -354 889 -707 329
4125C29k08r22J421j042l7J209j536Q51l04n04J357j216J94J209j477R56J22j320
$$ 329 121 -801 620 -422 -459 750 -786 65 -239 -743 614 -602 -408 801 -676 280 402 -918
4143i18J605j016l9J078j471J341J71j718J704r10j97J168j643R72K14j135J485
$$ -918 687 -329 -368 710 -761 580 751 -967 737 -173 -370 798 -845 127 341 -794 691
4160F91r33l00J132j490R92N60j419J549n14p03J327j483P00P44j787J637p32
$$ 691 -242 -542 590 -900 92 652 -767 782 268 -435 892 -591 109 853 -934 703 -29
4177b9j85J015j131K49N12j188J195k35q41J614j471M69Q79j589J057k63r73J582
$$ -29 -214 801 -330 -81 431 -757 438 203 -638 976 -495 -26 853 -736 321 58 -915 667
4195F67q99m0P76j202R55r4j239J892j071k5J114j524J366j15j292J572j058j99
$$ 667 -232 -272 504 -698 257 163 -1076 816 -255 -280 834 -690 676 561 -731 841 -217 -416
4213d16J295j624Q86O2q49J350q64l39J254j438J019Q8j185J380n99l71J319j557
$$ -416 879 -745 141 203 -646 704 -160 -499 755 -683 336 424 -761 619 20 -351 968 -589
4231e89M56N05j312J392p79n7J380j616M06J053j715J551n00q09J507j075N8J159
$$ -589 -133 372 -940 452 -327 -384 996 -620 -214 839 -876 675 175 -634 873 -202 -144 1015
4249A015j785J400p87m15J355j210R1R82j525J205l16q11J362q97K99O94j115
$$ 1015 -770 630 -157 -572 783 -427 -336 646 -879 326 10 -801 561 -336 -37 657 -458
4266d58Q39O6r67J455j295K91Q98j311L32M76q27J366j483J38J277j763J227R5
$$ -458 381 447 -520 935 -360 -69 829 -482 -150 326 -501 865 -618 -480 797 -966 261 356
4284C56p73J191r34k3Q66j249J011m82n69R95n91l78J064j272J074J94j686J640
$$ 356 -417 774 -160 -183 683 -566 445 -37 -606 389 -202 -580 484 -788 286 480 -1206 434
4302D34m46p13J300j171O18Q36j734J606r18k68J467j583N63M86j276J131l09
$$ 434 -12 -725 575 -596 22 858 -876 730 -188 -456 1011 -572 -9 477 -799 332 23
4319B3j37R56j560M10R05j325J006l8j034J634j035L65M32j295P96R0j030J563
$$ 23 -114 842 -718 -308 597 -728 278 240 -794 840 -195 170 602 -693 103 193 -837 726
4337G26r34m9O56j100J074j04j234J753r98k15J388j692P78J39j209K150j713
$$ 726 -208 -257 399 -701 373 269 -965 788 -210 -425 963 -729 49 188 -1021 1129 -584
4354e84l52J805j529P87M08j114J064m04l84R28j089J043J21j461J508r42k87
$$ -584 -936 869 -660 127 535 -579 485 81 -303 625 -464 579 700 -761 747 -195 -482
4371d82J223j231Q94R4j476J745n10q09J098j213P74L38j067P39o6o61J164q55
$$ -482 741 -490 404 498 -978 767 257 -552 546 -667 107 445 -622 117 51 -610 554 -301
4389c01J38R11j814J425j0j175J595j168M45O80j471J017j7n72J128j145K30Q05
$$ -301 -163 748 -1066 359 349 -826 769 -399 46 726 -745 272 255 -317 811 -334 -104 701
4407G01j622J067m4o45J083p28o72J567j359P76P1r38J368j044J37J178j718J205
$$ 701 -921 146 102 -543 540 -188 -860 707 -652 124 195 -743 625 -419 -282 896 -822 383
4425C83l75p31J178j74p82P01r83J367k36q79R42n02m10J217j544J058N17j404
$$ 383 8 -723 455 281 -501 200 -783 584 348 -531 411 -91 -501 716 -828 230 747 -657
4443f57J365o59n93J580j654M61P03j473J627m75r77J107n62R7N94j422J283k4
$$ -657 708 49 -544 1036 -618 -157 546 -927 700 225 -752 355 -207 -110 484 -938 345 321
4461C21o20P75q75m0J260j710R92J21p40R92r77L15Q81j295J018k24m71O88r88
$$ 321 -299 476 -399 -439 821 -889 103 224 -516 476 -501 -186 695 -600 418 194 -277 411 -577
4480e77n0J584j852Q39O89j565J581q92J79O91q17l9R00j137J309j041l16J054
$$ -577 -627 957 -895 -56 633 -932 649 -243 -64 627 -190 -229 671 -466 843 -198 -514 540
4498E40r38O25O79j758J195k88p68J375j030N17N32j424J366j102MJ143j245N39
$$ 540 -398 227 906 -852 343 55 -713 662 -368 149 681 -743 623 -479 -475 668 -577 -38
4516c8N60j513J339n78k26J070j267M91Q83j238J165m01o14O32o59L98N05j359
$$ -38 522 -991 348 -230 -456 614 -653 -162 721 -517 648 247 -367 265 -394 4 509 -850
4534h50J192k73q14J426j318N91N30j616J716n10p80J234j101J76J142j156O03
$$ -850 342 69 -745 681 -637 -46 484 -1132 584 74 -706 528 -573 -397 745 -411 192
4551A92j86n94J353j128n0J219j526Q52M95j340J201p06k25O94m21Q2N68j288
$$ 192 6 -588 765 -363 -413 806 -720 132 627 -713 488 -218 -443 251 -170 -88 480 -808
4569h08J662r80l10J708j967O65M31j453J796o35o68J404j139O30l14p78J373
$$ -808 854 -126 -436 1272 -695 -30 401 -1052 744 109 -559 845 -294 336 22 -756 617
4586F17q23l03J094r54K69O88j396J095k10p69J487r00j12J047j654R38l19l45
$$ 617 -206 -509 585 -369 -100 588 -808 287 77 -692 795 -105 -217 830 -824 114 -205 -550
4604e50J406j077k32M77o85R86k35l53P64p94j81P45p36Q03m49m71J377r63J20
$$ -550 856 -221 -453 24 -661 325 90 -263 501 -293 -474 271 -465 338 -111 -582 795 -168 -48
4623d8P19j447J052M7j155J756j181n16J453j040P04k61p02J535j282m17J170
$$ -48 671 -776 276 323 -832 924 -257 -773 680 -360 344 83 -619 916 -366 -783 387
4640C87q20P74K72j081R11o77k91J127j022L64M06j424J538m26o15J182j068L74
$$ 387 -433 341 613 -468 443 -234 -525 602 -420 -56 350 -1074 464 38 -577 605 -463 -89
4658h9Q74j477J131p12J03R78r01J6K01j130J680n29r91J619r04K38L01j210J176
$$ -89 785 -692 439 -273 -170 808 -93 -77 124 -1006 674 145 -846 773 -131 107 408 -802 374
4677C74k99j203J499q54K57O93j200Q56J25j109J669r62j02R91r77M91K76j109
$$ 374 75 -1128 371 -483 -226 467 -733 123 248 -861 808 -154 -256 735 -242 249 525 -584
4695e84Q04n43N21N47j487P37J02q01Q92m63K05M28r40Q32j28m69O31o61K39R15
$$ -584 220 -323 198 745 -742 -5 97 -704 188 -275 -70 358 -582 250 122 -347 284 -377 -138 777
4715G77j027J042m76j223J384o20p0J065j359M95N89j105Q95j69p24J190n54k27
$$ 777 -250 792 316 -907 477 -143 -213 852 -507 -12 577 -528 367 198 -526 664 110 -117
4733a17Q86j569J295l40r87J385r82O3Q54r02O42o4m86J367q92o26Q38q12R85
$$ -117 769 -800 495 155 -832 553 -429 -366 488 -414 228 164 -322 1045 153 -473 365 -447 538
4752E38l97n69Q52r57J41Q42j071P81q2p73J389j020Q8O00r03O84K1n16P43p13
$$ 538 141 -428 424 -533 -392 450 -621 160 78 -695 694 -326 -238 362 -541 143 164 -352 391 -322
4772c22R2J043j324Q52o1r19J283m25n35P93j223L21P81p13J201j012p04J348
$$ -322 -230 813 -511 341 280 -639 644 219 -316 477 -746 -425 356 -357 844 -168 -872 476
4790D76p31J27O50j011J182p51l35R00r57M40L96p16O99m15J01N10r52M66J38
$$ 476 -255 -128 522 -489 693 -58 -393 507 -450 -10 386 -330 369 -46 55 565 -387 79 217
4809B17q44J011O5r28Q87n86j65O64n15K36J70p39R33l04k09P41j575J198p1r05
$$ 217 -627 384 449 -479 408 -178 -343 321 -194 42 212 -527 406 102 -107 634 -941 257 186 -719
4829g19R29k28l97R70j004P20j39q40J299q27k21Q52r66N34n3n76J079n41q7O61
$$ -719 210 -18 -415 555 -449 271 132 -708 591 -236 -457 395 -571 -37 -90 -666 413 -128 -215 446
4849D46q84N78J27o67R73o69l82O28p98M43O40q28J163j090j59J063j097L30L24
$$ 446 -438 140 267 -400 573 -96 -478 150 -648 -205 435 -393 770 -320 -479 584 -513 -183 141
4868A41o86J021o01j67J376j734N91L42r58P56P3m62O66j336O45O92j031N51p0
$$ 141 -545 476 -125 -292 1084 -650 -59 283 -675 81 154 -308 358 -978 -333 359 -672 -121 -191
4887a91J77J79r5n42J037j345O32M31j057J036l65kO44r00J75N69r59J265q66
$$ -191 -14 165 70 -472 565 -780 -148 283 -774 262 -103 -105 539 -361 -186 383 -576 689 -177
4906a77q0O59r16P30p3n38P62q44L7M94r06J014L76j276J377q90J22R94j293O54
$$ -177 -257 402 -514 216 143 -395 367 -477 -440 54 -852 162 538 -738 639 -251 -129 865 -428 226
4926B26K6j004J176n37n57J205o99J3O70j002N91j64o02J422j089P09j92m77M18
$$ 226 252 -752 424 -113 -670 535 -164 -151 519 -483 108 -56 -658 764 -325 384 192 -285 133
4945A33K15n19K26m01J47N16n73P29L41j226P97m40k51J512j754J236m73q72M73
$$ 133 348 -171 55 -346 -199 317 -256 473 814 -412 385 -55 -306 1206 -548 688 215 -657 -184
4964a84k06J34P26r04K41K35n94J069p58J24R64j043L62j90j64N92p55N41L40
$$ -184 -390 -256 470 -434 -193 42 -552 517 -241 -117 847 -196 166 -24 -188 404 -351 190 530
4983E30j060M91K07q17M35N2R6N83p40N12k9q41Q65o93J63J088j243P51o27m38
$$ 530 -530 -39 168 -649 -214 -162 -66 517 -223 289 260 -581 284 -409 -246 842 -401 350 -277 -715
5003g15R37J13q38R93q37L97J002j582P50J45j065J483r10N03j01j184J214k84
$$ -715 222 335 -503 490 -347 50 1052 -530 220 365 -700 783 -127 376 275 -909 305 21
5021B1Q3L30o01j55O56j072J089K38q67J118p63m24Q99o06L46lq25J073o18m46
$$ 21 104 434 -167 -322 334 -738 351 589 -278 840 77 -347 552 -54 292 289 -536 537 -81 -527
5041e27R87q55N81p48L23O76k94o16P39q40N65M19j067J344j291L19P72p01MN07
$$ -527 460 -395 186 -562 -239 437 143 -473 266 -574 -9 410 -657 687 -604 -285 487 -214 -210 297
5061B97p75O45j80o46J056p67L68K57r14N51J79l70O20q06J20R40j089P01r0m36
$$ 297 -478 167 -13 -659 397 -370 -2 255 -659 -108 71 -299 321 -485 -365 575 -514 187 97 -339
5081c39M46k24M27k49o90J111j34q80J038j016P61K46j145P67m98K18O50q38K13
$$ -339 107 -117 310 61 -629 482 348 -532 506 -510 251 497 -648 119 -379 -161 489 -349 -136
5100a36Q21j256P04J28o66J098n59k0Q63j843Q06R7m24Q05n58L2M27q27P93J02
$$ -136 685 -571 133 261 -405 693 134 114 977 -866 -60 37 -387 418 -140 -108 319 -508 285 387
5120C87r26R25n52m6K40k08O31m10k60M50k34Q5L75r25M77M96r34N43k84k65J168
$$ 387 -539 386 -166 -212 28 -180 451 41 -219 231 -3 82 457 -468 9 505 -429 114 -170 -435 733
5141G33p51Q11R8j296Q41p91J07J39N7J04K24n17O24J25p32N54o40K23L27n82
$$ 733 -18 793 891 -405 436 -355 -248 -109 -52 52 276 -241 383 508 -224 330 -310 -87 240 -342
5161c42K30R4l88J376j527L07N13q23N41K47j045N32L78L1K69n98J84m39j22R64
$$ -342 -112 -18 -406 970 -557 -250 263 -560 -19 228 -817 -285 93 124 393 -205 -21 -460 -582 382
5181C82j36m16O50j454N45N98l26K24j56l4M17l65q3M86k17O23n23o12O96n23
$$ 382 246 -170 480 -974 -429 169 -157 67 -89 -123 294 -71 -154 332 115 738 215 -397 299 -224
5201b24N86l74l41P12r0l18K20l99m9M62k63Q16r65J4J028j271J80M95q76O92
$$ -224 362 -12 -353 359 269 -49 171 -228 -277 185 -78 738 -227 -213 815 -456 -276 219 -657 35
5221C5m57K08M62n16K71N49p69R43j073k13J461m24q32P88j626J723n11n48Q97
$$ 35 -422 -214 248 -268 3 552 -217 726 -347 -560 901 477 -355 433 -1193 530 19 -529 368
5240C68o5o83N90q67P58j90q33Q61L44l99l8J4J38Q78j565M17K16o6M87o41k13
$$ 368 303 -380 210 -657 101 -89 -922 -61 283 -116 -154 -140 -2 876 -689 -272 -56 -122 365 -276 -489
5261d89P40j058J445l57n92O65q73Q92J93q55N59l16j68Q99p47j55N53j051R41
$$ -489 251 -807 638 281 -311 354 -519 373 566 -289 270 -46 -214 685 -62 -217 336 -715 226
5280B26r22R35k04Q9j068P35J11K61O1q79J187o19M8L69p45R6P14o86P08J90n70
$$ 226 -696 239 35 124 -944 -209 -98 163 224 -655 532 -87 -39 330 -415 -319 395 -291 417 607 37
5301C7R45j692J003k22m71J082j610N14N93r85R59m13m59J274o79n36P55q40P25
$$ 37 982 -710 293 71 -400 682 -928 -414 179 -806 153 -260 -719 555 -124 -660 95 -745 -20
5320b0m3J20J92j90j54L03k85o5L34q55J100n97l47P69m89k10P75j79Qk88j98
$$ -20 -63 57 249 59 -95 208 -77 -142 192 -663 437 -160 -507 262 -227 -437 338 159 167 -121 -319
5341c19J017p17K28n8n09J293q98n10J442r88k38Q30r04L13J34m98M65m02L03
$$ -319 698 -19 209 151 -358 935 37 -473 969 -19 -257 573 -331 -18 116 -382 83 -319 -16
5360a6m25K19M29p02L89N10p73Q34n9j074N69L07m40J260o68n01P65p66L90n12
$$ -16 -441 -222 207 -495 -106 404 -369 465 406 -668 -99 208 -232 1028 360 -141 624 -142 248 -264
5380b64L98O94j093N39N3q19Q03K41j011N67m05k01P65n49P60l82q02J012r8q90
$$ -264 134 828 -265 274 327 -492 311 552 -459 108 -297 -498 267 -282 478 96 -706 306 208 -682
5400f82J445j127L35L8r17J240k46n33O43o94M53L62m51N28m23m09N65o43P62
$$ -682 763 -364 -29 9 -908 332 86 -447 196 -498 -45 317 -134 394 -29 -438 127 -516 246
5419B46k49k44P33k22m19Q06j355O17L33m78O25m08o81J284n29l08O09j017P20
$$ 246 -3 -247 486 264 -155 651 -704 -87 246 -232 393 -15 -696 588 59 -249 360 -657 63
5438F3q6m58P64r82Q21M49j371N28L54l14N13l61j60M39m86Q16l93p99R23n64
$$ 63 -23 -481 283 -699 122 571 -800 -272 82 -232 281 -80 -240 199 -287 529 136 -663 260 -304
5458c04M22K94j122Q66m09n28Q18r8K81N13j157N87K31j128R53k80l08P53r83
$$ -304 118 412 -710 156 -253 -781 37 -61 220 733 -424 163 394 -734 219 -61 -369 384 -599
5477e99P44r7n11R33l33o09J081j009O30R9q28J025l62l14N86m67Q3J85m99O74
$$ -599 145 48 -463 470 137 -472 609 -400 230 329 -499 526 164 -150 436 -31 52 237 -262 412
5497D12l39n01O26m00k3K95n74N34j17m9O95n08m69O83p21N33J32p02Q48l69j07
$$ 412 73 -428 198 -202 -225 70 -504 30 -87 -136 559 51 -418 265 -456 77 209 -493 355 -14 -121
5518a21L16n69M19j96j85M91j55NK57o10M27P5p45Q48o73O60K28q00N26j03m00
$$ -121 195 -374 45 -151 -336 155 0 5 262 -348 79 154 -591 257 -416 244 472 -328 198 95 -305
5539c05M16l21J11N82o86J70M27o52J32M3k1M94o85K91K11l63L76l34r8N96p66
$$ -305 111 -210 -99 483 -203 -33 394 -258 -126 -83 -104 390 -295 -4 207 -156 220 -114 -212 384 -382
5560c82L79jl52O73l02k95N99m44n6O14o47M85J35o91R17r35K57J71m11J73K66
$$ -382 -3 -4 -356 317 15 -280 319 -125 -181 433 -214 271 406 -285 632 -303 -46 125 -286 -113 153
5581A53l64N46n32j13Q02r67O97M8m16N42p21K27L85o54N84j80k9J05Kl62O32
$$ 153 -211 335 -197 -310 492 -475 222 270 -146 396 -325 -98 287 -367 217 37 8 113 115 -247 385
5602C85n72K67J53n89P68m30k71R08q07J96Ll43N81k39j15N12p13L40J92q58J129
$$ 385 -187 80 233 -356 412 -18 -289 619 -188 8 11 -332 249 10 -105 407 -306 34 226 -632 497
5623D97l91j08K58o78L28N15q63P83k66m32O60l44J31K31o81Q00n11n1M81o10
$$ 497 106 -2 256 -422 -94 421 -442 341 75 -357 303 -41 90 321 -360 440 -71 -122 359 -251
5643b51J70L65p29P59J27n72L28m06J83M23o62L75J78n10M54o18K71K28o62P65
$$ -251 -81 284 -445 314 441 -131 197 -209 -26 397 -265 110 288 -222 232 -386 -115 113 -549 216
5663B16k37l91Q46o09J0N42q71O80j2n29P31l94j23N42p11K89L59p10N89m27j03
$$ 216 -21 -412 434 -175 -165 377 -494 186 174 -355 376 -18 -141 401 -310 -21 338 -372 217 -210 -313
5684c13O80m33N2K24n07P24l94p5N37p43L19L55p76M81J01l98O01p21K31J86n67
$$ -313 367 -66 -14 210 -297 427 33 -42 495 -248 71 426 -350 131 232 -166 435 -286 -55 131 -436
5705d36P55k51m86P55o56L46J97n69O73q8n43N61m05R4K68k55L35k54m02P90o87
$$ -436 319 68 -418 337 -319 27 224 -345 328 240 -303 258 -147 -53 215 -40 295 41 -361 429 -258
5726b58J45L84n24K38K7k13N07l00j05N06q01O07j25j83M66m53MO23p17J54R2
$$ -258 -113 271 -253 -15 12 -201 306 6 -99 407 -394 213 88 -95 371 -82 -78 545 -172 -18 74
5747G4k99M19l97l5J34PJ9L12n67P05k78k43O88o11M5L13l07K35j32j47N79n55
$$ 74 -225 194 -203 -238 -104 -97 -78 234 -333 372 94 -149 539 -72 -27 286 -21 214 82 -65 514 -41
5769d1K3M47q36O39k51k10L69j51J65j29l08K62L63n65M94m01M8L19m92N21j69
$$ -41 -18 429 -407 232 -19 -229 140 -11 154 25 -283 -21 342 -223 271 -130 -82 237 -255 266 97
5790I7m44O99m04k2M18m22J42k14p1M50m57J4M37n97N71k49k82O65n17J46K40
$$ 97 -347 352 -52 -74 344 -78 64 -150 -221 229 -228 -214 223 -374 197 -52 -334 331 -186 -40 200
5811B00m33L70j8m71J054n28k68M73p13L55K46o67P69l80j80O33q23L28J51k15
$$ 200 -233 137 119 -352 702 174 -94 379 -334 21 267 -400 369 -11 -191 442 -381 -53 98 -117
5831a17L19j10k59M75k58j02L65o60O10k64RK72o63M76M1n74M45l6P5M20p53K12
$$ -117 202 92 -167 308 50 -52 313 -347 263 -1 8 280 -383 93 134 -440 5 -31 44 464 -289 -77
5853g7J38m18M64K0L3p6k90J68L19m74K89L9n02K59J55j38L91l37O0Nl69N37l76
$$ -77 61 -357 107 127 160 84 -206 -38 281 -193 96 135 -367 -108 47 -91 300 -37 23 28 -341 196 -180
5876a80K26J51k58O2K33l62M11j80l65N41l91l7N18n20N29l79q5K39l33L13j21
$$ -180 46 197 -61 1 234 -128 283 103 -262 279 -112 -149 369 -151 378 -1 -86 153 -180 133 12
5897A2k94M82k85j72O62m53J39Rl59N25k49k47N78m31nL87o84P16k49l73M46l23
$$ 12 -282 200 -85 -257 405 -48 91 100 -259 266 17 -230 348 -83 -88 299 -385 331 82 -291 155 -168
5919a68J79N4l35N88j77k77N45o31L64nl78L14j1o8L01p23L20K42k90L01k65m
$$ -168 11 65 -270 318 141 -136 409 -222 142 137 -241 73 62 -6 295 -428 -108 134 -156 145 -120 -124
5941a24R9p3Q5K63n86M24j71j28L86k39m8L69j81k5J71m75N28m05J01q9l56M10
$$ -124 -25 -98 -13 250 -336 88 -83 -211 175 -64 -112 257 76 51 222 -253 275 -130 -29 -118 -474 -64
5963f4L17l08J58j50n7M41l86J60r7k77O20m73k1L95k10R0J18p07N57K4m88P80
$$ -64 253 -55 103 -47 -104 337 -49 111 14 -263 357 -116 -137 258 48 138 256 -451 106 130 -358 422
5985D22k57l87M42n54M14K09o88P14j81K6R2n98L30N7l53L49k1k8K62n30L09j84
$$ 422 165 -222 220 -334 80 289 -399 315 134 160 252 -346 -16 41 -312 37 16 -12 250 -280 29 -155
6007a55mJ86J23l46M65o03N25j49l03N20k74K3L36m76m8K86k64O15m84P4M41o93
$$ -155 -159 27 150 -196 269 -334 191 42 -261 259 -15 8 344 -132 -180 106 -158 457 -27 47 488 -205
6029b05K13q2K3L65l48l32M20k68J96J25l30M94l84o4K65q8q5L48n27L39j5l03
$$ -205 8 -74 -51 314 -34 -366 54 -214 -18 107 -223 271 -113 -177 88 0 -85 263 -264 75 60 -243
6051b43O09m83l8L04l93M10J48n96M99l40J46q1k28N88l00k83M86k46j07K85n45
$$ -243 366 -117 -155 149 -244 166 314 -282 217 -123 23 -58 -286 302 2 -281 205 -41 -148 137 -408
6072d08N32J04m73N16m97J19K70m26K13P2j70L25j75k13N82q22M69L44m56J70
$$ -408 124 228 -245 271 -226 -107 163 -263 -50 22 -148 177 2 -211 371 -451 18 362 -94 76
6092G6n0k38O45n67j44L27j22J95j12k95L49k11K49J60m44K47j10LJ99j49o9J72
$$ 76 26 -212 433 -134 -278 49 -73 122 10 -285 64 -147 102 262 -182 65 -45 -42 157 8 -61 111
6114A11q4K71k56j34L58m30J11J85k87M88k73k85N50m98K22l8j89L47m5m72M07
$$ 111 27 298 42 -92 266 -164 -53 132 -155 333 60 -225 325 -173 49 11 -178 169 124 -348 59
6135E9J13k69K10l23M28k06r6Q7n4p0L01k95K08r2k19L27j81o6L93l08K27n4j85
$$ 59 172 -97 113 -210 218 12 -84 3 -51 -121 180 -115 93 1 -218 109 -72 -138 255 -53 174 120 -65
6158f5PP4k54M14j91P5l4l76L62J39m60L02j49O6J39l09M23l61O9L18k39L9L8
$$ -65 -58 16 -238 176 -15 60 26 -350 12 151 -309 -7 -156 -90 49 -260 163 -198 -129 189 -50 -11 27
6181B7k21K48j3j54K39l91q0K10j55M25j47q3K01l34o9N49m05K66j66k02M41l77
$$ 27 -194 54 41 -113 126 -265 -345 -135 -290 135 -12 -95 106 -228 -297 252 -153 113 -53 -255 186 -191
6203a91J56K59m05J73J89k33K05j20l03L18l16J40J61K2on8k38L08k42K10J62
$$ -191 -35 224 -181 -8 181 -52 153 33 -270 48 -268 -128 33 55 49 -9 -247 61 -181 29 191
6224A91j87J56k55J6L18m23J21J66j87L19l17j46J81l48M63M2k51J78k1j42J82
$$ 191 4 160 -95 -79 239 -184 -63 103 -84 235 -82 -228 -47 -395 68 110 -141 37 16 -126 56
6245E6k44M2K92l68O33n96K5N53o07K88j32NL13j25k65Q6r5R6J26m41M78k3k76
$$ 56 -188 -146 146 -222 411 -185 -160 393 -214 74 -58 -53 260 135 -130 -44 -139 -43 83 -358 120 97 -179
6268a79K92k38J92n2r3K06j56K8J64j12k09N30l70l3J70k27L29j35l50K43l16
$$ -179 113 -125 67 15 -78 128 -28 0 164 52 -157 373 3 -30 140 -87 242 107 -243 0 -316
6289c16L58J74l43j01J75J45k0j97m9O8p1K03k01K4K82o0k08M64n37J98r5l2M01
$$ -316 42 216 -127 -228 -53 92 72 -125 -174 -106 -177 26 -175 -151 131 71 -137 327 -210 -12 -107 -139 262
6312B62m65K28kk74K69%j53L39l66L02K04o68L80n4k7J42j88M2K83l53K02Ol24
$$ 262 -203 25 23 -251 18 18 -135 204 -162 140 344 -324 56 2 -25 117 -71 -29 254 -99 103 109 -215
6335b15N78l64j32J00j11R8k8m0L52j39k01K52j89J24J36m47L83k43n4L28l43
$$ -215 363 -1 -133 -33 -144 -46 -74 -114 238 99 -102 150 -39 85 221 -226 157 -86 -140 188 -155
6356a55J21M3j31L0L47m92L54m61L84J82l84L85l82K3j07J55J26P1n42M24r4K8
$$ -155 -34 9 -122 -92 255 -237 117 -344 40 222 -162 223 -159 -136 -243 -88 38 109 -433 -9 -103 -75
6378g5K03l56K41R2k17J30Jk31O10m58P7N3m77M79m1q2P8R6k4J43j73o4Kj93J64
$$ -75 128 -228 13 105 -112 18 19 -212 398 -60 17 70 -407 72 31 -51 27 123 99 242 69 5 7 -186 -22
6403b2m8N4o9l75N16K97n36K46Jj2J9l49K81K02l16J2N7j57M32k72l8L03l02K53
$$ -22 -70 -16 -85 -460 56 353 -183 63 64 52 71 -278 3 205 -111 -99 -42 -199 233 -39 -77 226 -76 177
6427A77k86oK78j17j92M13l12J77j10K3j24j67K88K04m86M48l02J18J86m42rN47
$$ 177 -109 -115 163 46 -146 267 -45 132 22 45 -79 -246 42 246 -240 208 -94 24 210 -232 -241 306
6449C06l00q3J26l69O77l70J04o0k09J12J67j03K25m88K49J37k67J20rm36N51
$$ 306 6 -77 49 -320 357 -13 91 31 -178 -66 101 -2 223 -265 -16 121 -146 -26 -35 -471 80
6470H0k33M02j59l29J74l4P5Rm4J76J52m79M25j78k02L17j52J37ll05J46K19l87
$$ 80 -153 249 90 -239 -65 -99 -24 -15 -59 117 269 -210 215 37 -165 152 0 137 134 -171 -25 194 -193
6493a93L46j52R9K2l14J46j88L75j07j58J39J21m25M23ok54L23n7j38K09j25k52
$$ -193 153 1 100 122 -192 -46 -234 141 34 -124 15 136 -289 134 128 -126 197 140 2 211 86 -166
6515a66M02k10K47j72j85R6L8k34L09l56K88L9j98J14j78J91j07j58M21ol47J05
$$ -166 236 26 273 101 -84 12 50 -184 125 -231 57 96 -102 12 -166 25 -82 -240 181 175 -172 -67
6537f7r7J03K19k66O5Q6%J93k77L3k5J61Rj90K2J06J36k43K11k95J24L6l43J02
$$ -67 -164 -61 158 -108 -43 43 43 236 -41 -8 -33 128 137 -53 -31 75 211 -32 179 -116 8 44 -299 -197
6561a97j51J16M76l59K15o5l01N38l87K47L5n18K86M20n42J2PN2K21m23K44r9
$$ -197 -348 -232 244 -115 100 35 -266 272 -115 132 167 -351 -65 355 -187 -175 -168 -116 105 -318 -74 -173
6583a73L1J70p7r7L51n73M53M9k38L83q5l14P7l2K17k03l55N71l18J13Q7k25j0
$$ -173 -142 28 -49 -146 205 -368 85 134 -104 279 194 -120 -43 -75 142 -61 -416 155 -163 -50 37 -188 -198
6606a98J60j33L63k98j60M55l70K94j35k49K47J52j50K1R3m19J67J02J71k79J02
$$ -198 -38 -171 192 -106 -266 189 -181 113 -22 -271 -24 128 -22 -1 92 -327 -160 -58 113 -166 -64
6627f4J67m24L06L70m96K52k02K43o0k74K10K90n44K75J63l17K7J9O3O3n1L5K3
$$ -64 103 -321 -15 355 -141 111 -91 152 92 -182 28 318 -226 49 212 -105 -78 -59 4 67 16 51 74
6650G4l83K89M9l32L47j70K78k74q8K60j36j0K28j98K4R0l87K76M4R3mN4q9K80
$$ 74 -309 -20 29 -303 44 -126 152 -122 -210 50 -86 -96 132 -66 -42 48 -339 -63 -19 74 70 124 35 315
6674C15n37K79l4o3K37q7k14K40k88R6J76j34M01j57k93oj78J47J71l58N83m18
$$ 315 -222 57 23 -40 197 110 -104 136 -152 -56 120 -14 387 230 -63 -69 -247 -100 71 -287 296 -122
6696a22N7r8J87J39k6m53M25P0k37J76J1q8R3l09L23j32l7j1k06L56R2n02N50
$$ -122 -65 -163 24 163 137 -316 109 179 -58 118 129 41 134 -175 148 16 -21 -32 -238 118 210 -292 258
6719B58l10p7K96j14j12K17n06M91k04k0K9M9P7m0p1L59j97l0L20m15j29K81j55
$$ 258 -52 -129 167 53 -59 158 -348 143 -61 -81 -52 -3 74 34 -37 322 125 95 415 0 -129 152 -3
6742cJ11o2j70Q1J0j5O3k3J32m4l33L57j78j5J25J1lM7k35K33N3q8L6O9j22M8
$$ -3 108 46 -124 -43 -33 -48 15 -8 124 80 -253 104 -74 -89 36 47 44 91 -144 89 142 54 90 159 37 85
6768H5j7j04J39l99L95l81K07K11j11q6j18Q0K39k70J80J18j06J19j77P6n6m2
$$ 85 68 -36 103 -296 99 -282 -75 136 25 -61 -179 -99 140 -130 50 168 62 181 4 80 24 -18
6790a8k36J90r3J16J82k22K83k83j39J80j2J8l4J25k70K43j77O6J59k4n3m4L74
$$ -18 -254 -64 -157 -41 141 -81 202 -81 -220 -40 -52 -34 -68 57 -213 30 -147 -81 78 54 1 -43 331
6813C31m48j26K91k37J2K61j87J64k44K61K86m01N1O8k03J66j39J1N7Q1j31K66
$$ 331 -117 -243 48 -189 -177 84 -103 61 -183 78 364 -37 14 82 -121 45 -94 -83 -26 55 -76 190
6835A90m56K29j30Q9L59n30K00k20R2K63L8j1q4l6M04l03j96n1Q7J44O2k83K6
$$ 190 -266 -37 -167 -78 281 -249 -49 -269 -177 86 124 113 29 -7 397 94 -102 -153 -66 78 140 -143 -117
6858a17J44j54J43L75m40J57k38L58m35K52J0J64m52L11k83K86j49j26L53l02
$$ -117 27 -127 16 391 -49 108 -130 228 -207 45 55 219 -233 78 -205 81 -68 -194 159 -143
6878a43J82j21j91J40J93kKL3K6r8k55J11L62k30J12J93m80J82j2j05J31j86K62
$$ -143 39 -82 -273 -133 60 58 60 93 119 21 -234 -123 239 9 121 314 -166 16 4 -101 30 -156 106
6901A06r2j37L09l06j12K67k01J74O2k09J69m4q9J18n4J7q7J95n2m2O3nj76r6
$$ 106 14 -123 186 -120 -232 35 -166 8 70 -139 30 -14 -103 15 -39 -22 -109 86 34 -8 55 50 -126 -222
6925b22L12p2J94p5k18m4J52K37j10n4J40m45K64J41k65J03M8k81K13n6j53k0
$$ -222 90 18 212 137 -81 -125 27 264 154 100 240 -205 59 200 -65 38 86 -195 18 -38 -191 -211
6947b11M06J80n2k29q9J06k36J40j7j6K62m46L26j10k02J57N8j87L61k93j71J12
$$ -211 195 375 323 94 5 111 -125 15 -2 -18 244 -202 124 14 -188 -31 27 -160 201 -92 -263 -151
6969a51J56K83m46m5J34P4J95j64J40j87l04L94j96K62l30L88l94J65K7O7OO0
$$ -151 5 288 -158 -203 -69 5 200 36 176 -11 -315 79 -117 145 -185 203 -191 -26 1 68 74 134
6991A34j50J79l15J44N8m4R4k51J53K42l13o0J58n1Jj96J03K31j53J51o8k15J19
$$ 134 -16 163 -152 -8 50 6 100 -151 2 244 -69 -129 29 -22 -21 -217 -114 117 -36 115 47 -168 -49
7014d9J81J8j22k93K14R8k19K79k8l7J97k54m9J58q1M4nj20M9l33N16N9j13J62
$$ -49 132 150 28 -265 -51 47 -172 107 79 42 239 -15 -64 94 13 57 52 -68 -19 -352 164 223 110 272
7038B72k48k42K5J4K50j75K77r4j56J80L0j57K78k01k28L90Rl34j16K34j5j68
$$ 272 24 -218 -193 -179 71 -104 173 79 -77 103 133 -24 254 53 -175 215 224 -110 -226 8 -7 -175
7060a75J42L4m3J45k03J09P9j72K25j11P9k3O9M5l91K66k1k41J25k8L01L3k88
$$ -175 -33 1 -42 103 -100 9 88 -84 141 30 109 86 155 200 -191 75 54 -187 -62 -90 211 244 -44
7083d4j25K1L5P7K03k59J63J07k06p4Q8L5j88NJ83k01L65k53J78J3k97J38K02
$$ -44 -169 -148 -113 -36 167 -92 71 178 -28 -102 -14 21 -167 -162 21 -180 185 -68 110 123 -174 -36 166
7106A66M7j56L7j70J87M1k32K45l8k14P5j64L18j92J64o4J7R9m1k88L24J5j81
$$ 166 213 57 94 -76 111 152 -80 165 127 -87 -12 -176 142 -50 114 50 67 166 125 -163 161 176 -5
7129eOo8L53m50M38k59oj35K32O1j08K35l49J17k54L55k3j39R6m6J46Q1o08M45
$$ -5 1 -67 286 -164 274 15 9 -126 106 167 59 294 -55 62 -192 163 140 1 97 51 197 278 -330 115
7153A15n3q2J62m8k10L5M1L19j83j71J79j78J64q6oj80K95k4Q2m71K82M9k69M53
$$ 115 62 -20 142 94 -116 -81 -40 279 96 -75 104 -74 90 4 -2 -182 113 89 171 -300 -18 31 -238 215
7177B15l28J49l4j29O5P2l1l2k8o1ML9n9K81m87L44j70J47M4j96N1O6J10p5J41
$$ 215 -113 36 2 -127 -62 10 -21 -53 -81 -142 -138 -99 -158 123 -364 -20 -190 -43 1 -195 -144 -78 32 -43 98
7202I8k89K17o6r6R7J63p5j14k04J20L1k4L60j38k16K0o1L57l70K42j54o3J68
$$ 98 -191 26 -40 -136 -39 124 49 -65 -269 -149 -118 -142 218 80 -136 -116 -177 180 -190 52 -102 -165 3
7225CL2j5j99N6NL49k65J38m7k13K9L22k45J07mk41M09m67J85L45l29J41j55j75
$$ 3 35 20 -179 -123 -118 231 -34 104 57 -156 -127 195 -50 57 53 -188 221 -246 -61 284 -45 96 -59 -234
7249b34J18k6l20L02K17m6L7o4Q9j3j00J02j21P7j60K15K1j71N1J49j37j65o6
$$ -234 -116 -142 -462 -160 57 11 48 -16 73 60 -40 62 -59 18 -142 73 94 -77 -26 123 -14 -179 -245
7272b45L08m4kj38k7P2K99l07K17j14r6j7M45l11O4%p7q0N1p2Q7L5k99N19l34
$$ -245 63 19 17 -121 -148 -76 223 -84 133 19 -77 -94 351 40 104 104 27 -53 -2 -74 13 48 -251 268 -66
7297f6j11L4J47N3J02k48k3Q5L4P5r8N3j01N0P8O2k55L09k57j38K15j87J88J10
$$ -66 -177 -143 4 57 159 -89 -112 -27 7 82 -16 37 -64 -14 64 126 -129 180 -77 -215 0 -187 1 111
7321A11mJ18j08j20j8l49L32J4k73J83m4K70p9j16J45j06K41j20R1j7m24K54Q7
$$ 111 107 225 117 -3 -21 -370 -38 -24 -297 -114 -158 112 33 -83 62 -44 197 77 168 151 -273 -19 68
7344F8k5K4l24K72J21L9j52r8l6M5J30J20o9J8o6J05k51j0L4k60J78J45R3r2j50
$$ 68 43 67 -257 15 136 175 23 -75 -111 -66 64 184 115 133 67 172 -79 -89 -55 -315 -137 8 101 9 -141
7369a41r9M42k22n5J58n7k82M7K29K9j95L17k31k43M73j16o9J72p4J67k11j2R4
$$ -141 -240 202 -20 -75 83 26 -256 -209 20 49 -146 171 -60 -303 170 54 -15 157 83 250 39 27 121
7392A21o2j60J84l0m8j47K61j76Q9K4J1k0p3J26j89J56j60K76J14m25l6K96j45
$$ 121 59 -101 83 53 5 -142 119 -57 32 56 67 47 -26 100 -89 67 -93 183 297 -128 -164 132 -13
7415a3m6J0K0O8J3j97kR7J22q8m4M7R7j43K75j93J06k51p5N73m80J86O0m29J07
$$ -13 -59 -49 -29 39 52 -145 -147 -50 72 -16 -60 -13 84 -59 216 23 129 -122 -197 376 -104 82 142 -287 -180
7440a80K92k11P8K16j21O1k39J37Nj27k49J04J75Qj87K18l6K5J35m5p7L8N2K00
$$ -180 112 -99 -21 195 74 135 -104 33 38 -89 -338 -234 -59 -51 -238 -20 -56 -31 104 59 -18 20 72 272
7464B72j95j46J42j65K12k74L99k26j4N1m1N9r1N5j2m68M86N5p6j04n2K06n7q7
$$ 272 77 -69 73 -92 120 -154 245 19 5 56 15 74 -17 38 26 -442 44 99 23 -81 -133 73 16 -71
7488g1M90o79J11K22j08R7j12o7LK06j50K61k82Q3j25J13N5k10n7M45k43j25K58
$$ -71 419 -260 -149 73 -35 62 -50 -117 -114 92 -58 203 -79 4 -121 -8 47 -163 -220 225 -18 -143 115
7511A15k51N92m79q0p6M1J85j98Ql6J69K45k79L8J57P4n35L70j64K02q7J00k94
$$ 115 -136 456 -23 -103 -179 -138 47 -151 -143 -179 -10 235 -44 -6 151 225 -310 60 -104 98 11 111 -183
7534a83P9J12k30K66j76K09k36L36q7j76J15n4NK6j08n4K30k07M01m38N1J17O2
$$ -183 -104 8 -222 44 -132 77 -159 177 90 -86 29 -25 -20 6 -102 -156 74 -133 268 -170 -119 -2 60
7557F0m7l4k75K91J47k19J96j75r2l7O4J25k09O0J11O9p3K50j54q7j28J78q2J45
$$ 60 13 -21 -296 -5 142 -77 119 -56 -148 -185 -121 4 -205 -145 -34 35 -38 212 58 -29 -157 21 -61 84
7581H4k70L56k49j26K99j27J47k10j1Q6o3K95k99K42j04j60J57nj60l6R1L56m39
$$ 84 -186 170 -79 -205 94 -33 114 -96 -107 -21 -84 211 -88 154 50 -110 47 42 -118 -154 -63 293 -146
7604a46K98j95K83k81j00O4P6J51R3k73K68j34Oj26J84k66o3L69j68oj55R8j96
$$ -146 152 -43 240 -41 -141 -77 -1 150 243 -30 238 104 110 -16 168 -98 -161 208 40 34 -121 -23 -219
7627b19K10K2m12N78r2j43l58N48j02l57L37p7m7l8K66k35K50j63J08l38P1J67
$$ -219 -9 13 -399 179 87 -56 -414 134 32 -325 12 -65 -112 -150 116 -119 131 -32 76 -262 -191 -24
7649b4k7J32j27j73J88J61m7q8J37J66k69n6JJ21j2p6k60J87KJ14Q8j82k79K46
$$ -24 -51 81 -46 -219 -31 130 83 -5 132 298 29 -27 -26 95 83 7 -253 -66 -64 50 138 -44 -323 -77
7673g7J38o3J09k25K28J08k20o9P6k19J01J67k21K15Nr4Q0J16j22Q3k14J18n2
$$ -77 61 -2 107 -118 110 218 -2 -71 5 -214 -113 54 -167 48 53 -41 39 155 33 116 -98 20 -32
7696c2k29N49m63K51j70m7J67j15Q5m8K8p1M20k19r2o5n7L87k25k59J23j93L06
$$ -32 -261 288 -175 76 -94 -141 26 -89 -4 -52 -24 -95 325 106 14 -51 -108 279 54 -205 -82 -275 31
7719C1o4K37l22Q1K0k48K15K24j06o4Ql6p9k2P3n7l6L04p9r7l04L83n9m0N7j33
$$ 31 -33 204 -118 -37 -17 -265 -50 174 68 4 12 -24 -103 -125 -52 -109 -145 159 80 -17 -321 62 3 -37 20 -113
7745a13J41ok5k27L48K7k71K49k75O5k9L66m29L22r6j25K08l2k54J71j23K19J70
$$ -113 28 22 -3 -230 118 145 -126 123 -152 -87 -116 250 -179 143 47 -78 130 98 -156 15 -108 111 281
7768B81k22j15O5J50j84QM2j42Q5j23J45N5k33j39M35%k31J91M2j49P5L5J3k07
$$ 281 59 -56 9 159 -25 -17 25 -117 -32 -155 -10 45 -188 -327 108 108 -123 68 110 -39 36 71 84 -123
7792a23j72J47K47k8k22L7K10n4Q5j4m1K1n7j53J93o3m6j8J55j11K1q3K8K66m37
$$ -123 -295 -148 99 71 -151 -114 96 42 127 113 72 93 36 -117 76 13 -33 -51 104 -7 14 -69 -41 225 -212
7817b12K66m0k58J23K99l18K31k24J09O4K5K52j26j58P9l41J30j64L63J23k69
$$ -212 54 14 -244 -121 178 -140 91 -133 -24 40 65 317 191 33 112 -229 -99 -263 100 223 -46
7838d6N3M6M9l03K67j00J55j17J6R9j14L4Rj50Q0K51l14L65m96K83q8j40L30j70
$$ -46 7 53 102 -201 66 -34 121 4 20 119 5 39 48 -102 -22 229 -85 280 -216 67 -21 -161 169 -1
7862aR1n0j71K27K2k33J88n4k19K70j58o3L43q9k52L0J24J83l40M12j5j31o3j74
$$ -1 90 40 -131 96 118 -115 73 19 -200 70 -88 -151 192 103 -149 -119 5 188 -152 260 245 114 51 -123
7886a23K39R1j29o4M9O1l36K39j9J17k97J64N81o92j47L33k84N62n18L2J93k35
$$ -123 116 207 78 14 63 124 -212 27 8 125 -172 -8 573 -119 -266 67 -217 345 -173 -141 52 -183
7908a83M52l10N7j73K2K65o0r5M4L0k22L73j77k57N04j30j16J8r0j71L84j47j16
$$ -183 269 -41 16 -157 -135 130 70 -25 19 49 -173 200 23 -234 270 140 24 42 -48 -219 165 18 -98
7931i8K18m6o9p6J74k38Q6K74k60P2k81L01n1j44R7PJ45j96j9j54J08M48l07K24
$$ -98 120 74 5 -71 103 -135 -49 225 -35 37 -244 57 6 -138 -41 -34 111 -85 -104 -258 -150 298 -9 215
7955B15k71j46K24q0j9PP4J40K5j22J6r7j64L6L94Ml50R1L9J81m63J59K96l51
$$ 215 -56 -202 22 -58 -77 -70 4 144 169 47 63 -34 -198 -162 232 236 -114 -23 16 197 -266 -107 189 -162
7979a62Q5l9%k64N34k98J49l5J72j98K2J7K2Q0j52K7K51j61L6Mm26J22K6N22j43
$$ -162 -77 -116 -116 -380 154 -144 5 -30 142 -56 -34 -17 5 85 -67 -40 211 50 86 90 -336 -214 -188 334 191
8004A91p6r5k16K01O7k3L7k78J56j9R5Lk5J11J13k42j0r8j69K31J03j16J24r7
$$ 191 115 20 -196 5 72 49 86 -192 -36 -55 40 43 18 129 242 0 -10 -108 -277 -46 57 -59 65 -32
8028c2m6J97n0J0j36M7R5R7r0j88K10j52lJ36j14l6o9K35k70K07k57Q7L26r2j36
$$ -32 -78 119 69 79 -57 -10 85 182 92 -96 114 -38 -41 95 -19 -55 -124 111 -159 48 -209 -122 204 112 -24
8053b4J22l0k16K82j45j5R0N3n9P2j63j10O9R2J01l60K79j33q7L4j2J20j6j9M
$$ -24 98 68 -148 134 -11 -26 64 117 58 130 -33 -143 -74 18 119 -241 38 -95 -182 -148 -160 -40 -56 -75 -71
8078g1R9k28M17j10p4o8k49L67j01p5m1k1N5K00Q1k54J30k18K86l5pR2k59J17
$$ -71 28 -200 217 107 33 -35 -284 83 -18 -93 -134 -155 -100 100 181 -73 57 -161 125 90 83 175 -84 33
8102C3j4K41n9j22k14Q4J7J48M1J23l52j60L07r1J0J10J35k83N8K7M6j41j66K07
$$ 33 19 260 201 79 -135 -51 -34 114 155 278 -74 -234 73 -18 -8 102 237 -46 12 39 85 -56 -222 -15
8126a5J41p0k07K1L11m48N9L3J25N3o0K2m4P0n5O2J10j2l50L91k88J62k0L00l72
$$ -15 126 56 -151 -130 181 -267 -208 -175 -50 3 -57 -35 -79 -9 -64 -2 108 96 -254 137 -151 11 -9 291 -81
8151h1L03j11j68J9k2P1K56k64q5P1k79L58M6k02j05L16j00N5m55K70K41p6m3
$$ -81 222 111 -57 -38 -60 11 267 3 -82 -11 -290 68 114 -88 -193 123 23 78 -377 -107 134 58 15
8174A5j7k59l3M76j39K1N1k51Q4k0jJ70J49j62j44J77m
$$ 15 -2 -261 -294 182 43 64 115 -136 -52 -72 -73 97 246 84 -60 117 113
8191A13
$$ Imaginary data points
##PAGE= N=2
##DATA TABLE= (X++(I..I)), XYDATA
0@%%%%%%%%%%QqQj6J6k4L2l6M4n6O4p2Q8j04J21j43J70j97K28k63L00l41L88m41
$$ 0 0 0 0 0 0 0 0 0 0 0 8 0 8 -8 8 -16 16 -20 24 -32 32 -40 48 -56 65 -78 92 -105 123 -140 160 -181 207 -234
34b34N01n66O35p13P98q91R92j104J227j362J508j666J839k028K238k466K714
$$ -234 267 -299 336 -377 421 -470 522 -582 645 -717 791 -875 964 -1064 1174 -1292 1422
51A422k990L296l634M012m435M914n460O090o829P704q758J0063j1738J3969j7110
$$ 1422 -1568 1728 -1906 2106 -2329 2585 -2875 3215 -3614 4090 -4668 5395 -6343 7626 -9484
66i484K1923l0392N0047j87387k61302j68597n224Q6835p4762K16076K9636J09002
$$ -9484 12439 -17953 32094 -155293 -416595 -585192 -590416 -503581 -578343 -362267 -332631 -223629
78b23629K64052M7947J98585J55248p5361J25482r1560j04929M5163j95802o8622
$$ -223629 40423 88370 286955 442203 366842 492324 400764 295835 340998 145196 76574
89G6574o6077k38661J6503r5289o8760J36592o7443O7298J06656o5677J64814
$$ 76574 10497 -228164 -211661 -306950 -375710 -239118 -306561 -239263 -132607 -198284 -33470
100c3470M9525L007J60166p8629O320M5540j35894P8182k0231q5412Q7856j17024
$$ -33470 16055 19062 179228 100599 106919 152459 16565 94747 74516 -10896 76960 -40064
112d0064k0517O4735j05302R7641J1425q0909R3175r6839j8020Q1212r8462Q0016
$$ -40064 -60581 4154 -101148 -3507 7918 -72991 20184 -76655 -94675 -13463 -111925 -31909
124c1909R942q7382J05517n4159J8753J29976o2156R1018L0565q7386R7337n8114
$$ -31909 -21967 -109349 -3832 -57991 -39238 90738 28582 119600 150165 62779 160116 102002
136A02002k6717P2159j32065J444k9970j35939O7416n4447k6647R7297q2240N7200
$$ 102002 75285 147444 15379 16823 -13147 -149086 -81670 -136117 -162764 -65467 -147707 -90507
148i0507O3846m1314J48129K1476N903J09613q4659K3054K9349j02588O0932o1584
$$ -90507 -26661 -67975 80154 101630 107533 217146 132487 155541 184890 82302 143234 81650
160H1650r3329L2064j27898q651L5677q3655Q5763r793l8814J05987m3172N6340
$$ 81650 -11679 20385 -107513 -116164 -80487 -164142 -78379 -88172 -126986 -20999 -64171 -7831
172g831R6491n2271Q7922q332o0200Q1142o9266M247M6658j08899L2140l4812
$$ -7831 88660 36389 124311 115979 55779 136921 67655 71902 118560 9661 41801 6989
184F989q1926P6152n9586J422N8358r2250M9926O774m8991J04401l3364L642O6687
$$ 6989 -74937 1215 -58371 -56949 1409 -90841 -40915 -34141 -83132 21269 -12095 -8453 58234
197E8234q4095N0645K0319n2698Q9595m6104k6931M8869r2786L4045J6571o8402
$$ 58234 -25861 24784 45103 -7595 82000 35896 8965 57834 -34952 -907 15664 -52738
209e2738O8457n3252l7758N7648p2330M6371M0314n5694P6743k9701k3016P8841
$$ -52738 15719 -37533 -75291 -17643 -89973 -43602 -3288 -58982 17761 -11940 -34956 43885
221D3885n2869M2923L5824p4674N2479m0813m3561O4996o7075J5498K3181q4748
$$ 43885 -8984 33939 69763 -4911 47568 6755 -36806 28190 -38885 -23387 -206 -84954
233h4954N1964j8691k6561Q6829m5566K3740M2743o8747O4659p34l0864P5807
$$ -84954 -32990 -51681 -78242 8587 -36979 -13239 29504 -39243 25416 24682 -6182 69625
245F9625o1133n644K7951q2258M9838m126m5391O6664n8881m171M9398n9233O4642
$$ 69625 8492 2848 30799 -51459 -1621 -5747 -51138 15526 -43355 -47526 1872 -57361 7281
258G281J5965m1966O8481m9222o549N3872o1707M6173L661o3617N2225m9158j1517
$$ 7281 23246 -18720 49761 539 -6010 47862 -13845 32328 35989 -27628 24597 -24561 -36078
271c6078N8897n7177M0635J2017n8569O2840k7571m410O6331n6623K7839J0356
$$ -36078 22819 -34358 6277 18294 -40275 22565 -5006 -9416 56915 292 28131 38487
283C8487o3887N7721k5509j6537N7535o4516J6573J6899n7478O4257j3100j8776
$$ 38487 -25400 32321 6812 -9725 47810 -16706 -133 16766 -40712 23545 10445 -8331
295h331N8190o0593J5035K6908n4749O0705j5198l4060N0349o1848J0579L5213
$$ -8331 49859 -10734 4301 31209 -23540 37165 21967 -12093 38256 -23592 -13013 22200
307B2200n3060N6768j1578l8088N6147m9499J5694M5264n2899M7841j2108m5665
$$ 22200 -30860 25908 14330 -23758 32389 -17110 -1416 43848 -9051 38790 26682 -18983
319a8983N4495m5471P442M1022o1862L5026j0861m6192N9220l4733N038M4454
$$ -18983 35512 -9959 -2517 38505 -23357 11669 808 -45384 13836 -20897 -15859 28595
331B8595n9599L4179K815l9032O4740k7576k802M1349o2442K8294P622m3264N6829
$$ 28595 -31004 3175 5990 -33042 31698 4122 1320 42669 -19773 8521 16143 -27121 29708
344B9708l2887j8734L5910o1525K6075J6743m1903N6711k6220j7753M8837m6721
$$ 29708 -3179 -21913 13997 -47528 -21453 -4710 -46613 10098 -16122 -33875 14962 -31759
356c1759L4136K9085m2070N1076k6096k6733M5838n0464J8358J8691n9824L6148
$$ -31759 2377 31462 -10608 40468 14372 -12361 33477 -16987 1371 20062 -39762 -3614
368c614k7511l0467N3128m0199K1686L2244m8514M8926m000j6897O4348l4187
$$ -3614 -31125 -61592 -8464 -48663 -26977 5267 -43247 5679 1679 -15218 49130 14943
380A4943J1499K5361o0286L3321j2504l6003M5875m9012o870K2904n6348M0700
$$ 14943 26442 51803 -8483 24838 12334 -23669 22206 -26806 -33676 -10772 -67120 -26420
392b6420O479k3770N9294l0105M813M1870m1102M4407R572l5183M3690m1567j4784
$$ -26420 -19941 -43711 15583 -14522 -9709 32161 -8941 35466 45038 9855 53545 11978 -2806
405b806L1310n1955K7772K005m5835M0798l1937n989M7606l7817L4138J4019m0350
$$ -2806 28504 -23451 4321 6326 -39509 1289 -30648 -36637 10969 -26848 7290 21309 -19041
418a9041M7071k1356p063M7560m4111J9544P905m9386M2680j9461j3163M5445
$$ -19041 28030 6674 -389 47171 3060 22604 30509 -18877 23803 4342 -8821 36624
430C6624m6708J3635J4108m5964M5389j2952j8462M2054m7593Q937J9964m2558
$$ 36624 -10084 3551 17659 -28305 17084 4132 -14330 27724 -19869 -10932 9032 -33526
442c3526M6476o815k1461M5379l9446J2377L0812l7712M3265p489l1198L7980
$$ -33526 12950 6135 -15326 30053 -9393 2984 33796 -3916 39349 31860 662 38642
454C8642m2592J976K6004m7110K9511j1198l7205M0482l1602P323L7610l8389
$$ 38642 -3950 -1974 24030 -23080 6431 -4767 -41972 -1490 -33092 -25769 11841 -26548
466b6548L4008J668k9043M8962k2591L479L4492m7104K1863k720l7619M2094k6762
$$ -26548 7460 9128 -19915 29047 6456 9935 44427 -2677 19186 16466 -21153 20941 -5821
479e821q502K9835m9172K0443P454l3034M7349k0313r368L4990m3833K3023J6058
$$ -5821 -14323 15512 -33660 -13217 -5763 -38797 8552 -11761 -21129 13861 -29972 -6949 9109
492I109l2124M5072j9676j5131L6292l9735K1361J9108l6539L7858k1108k3171
$$ 9109 -23015 22057 2381 -12750 23542 -16193 5168 24276 -12263 25595 4487 -18684
504a8684L4707m0332J3435J6637m3694L1080j7412k1069M3187k8428J8241K7662
$$ -18684 16023 -24309 -10874 5763 -37931 -6851 -24263 -45332 -2145 -30573 -12332 15330
516A5330l5125L8164l294j6042M6933k8961N499J7424m9231K2286j2494l0521
$$ 15330 -19795 18369 15075 -967 45966 17005 22504 39928 -9303 12983 489 -30032
528c0032L4655l6408l724K1229m0349L3738Q939j6317N0508k0045N163L3322l3788
$$ -30032 4623 -31785 -35509 -14280 -54629 -20891 -11952 -28269 22239 2194 7357 40679 6891
541F891L1244N160l2119L1604l6681j5798K1651m4842J9803L209l4428L6490k0429
$$ 6891 38135 43295 11176 42780 6099 -9699 11952 -32890 -13087 -9878 -44306 -7816 -28245
554b8245j461M2908k5976L1072J6025l0601L8241j8971j1152L2828m1144Q570
$$ -28245 -29706 13202 -12774 18298 34323 3722 41963 22992 11840 44668 3524 12094
566A2094J686m4419K8475j8157j2177L7726l1605J6536J9255k9038M2078k679
$$ 12094 13780 -30639 -2164 -20321 -32498 5228 -26377 -9841 9414 -19624 22454 19775
578A9775r815L7236l5059N128J2029m0290K7491j3373k5206K8558l6368M791K2229
$$ 19775 9960 47196 12137 17265 29294 -10996 16495 3122 -22084 6474 -29894 -25103 -2874
591b874k9005L6499J444j6977L9016k4880P551K6613l3978K4956q623l2714K7253
$$ -2874 -31879 4620 6064 -10913 28103 3223 10774 37387 3409 28365 19742 -12972 14281
604A4281l2322k578K3287l6702K3250r0k4009M0738j5500O401L3780l2158K2666
$$ 14281 -18041 -20619 2668 -34034 -10784 -10874 -34883 5855 -9645 -3244 30536 -1622 21044
617B1044L014k9301L3679k3027r608K2054m2634J2513L078k9646L6290j5049n752
$$ 21044 24058 -5243 28436 5409 -4199 17855 -24779 -12266 -9188 -38834 -2544 -17593 -23345
630b3345L1735l0520K0556J5834k4442L6070j4223j4385K6307l5453J0764J1318
$$ -23345 8390 -22130 -1574 14260 -10182 25888 11665 -2720 23587 -11866 -1102 10216
642A0216l2556K7489j5114j7176L1242k6908J5118K0478k8040L0192q786j6636
$$ 10216 -22340 5149 -9965 -27141 4101 -22807 -7689 12789 -15251 14941 6155 -10481
654a0481L2691k6799P253J5541l6713K1635r988k0401L3222k3818N964K1228l1566
$$ -10481 22210 -4589 2664 18205 -18508 3127 -6861 -27262 5960 -17858 -11894 9334 -22232
667b2232K7076R40j6159L7282k1589Q88J9450l5578K0785j229k4058L0026k5413
$$ -22232 4844 5784 -10375 26907 5318 6206 25656 -9922 10863 9634 -14424 15602 -9811
680i811n807K1188l2335K3341O830k1619L4061j8900l166K7617k8323K1051P523
$$ -9811 -15618 5570 -26765 -3424 3406 -18213 15848 -3052 -6218 21399 -6924 14127 21650
693B1650k7890K7657k0239r942K5911k9781J5053P274k9386K7551j3916p871L0795
$$ 21650 -6240 21417 1178 -8764 17147 -12634 2419 9693 -19693 7858 -6058 -13929 16866
706A6866k5748J3816J0883k8595K7408j0070j0244K9666k7718P704J0625l0681
$$ 16866 -8882 4934 15817 -12778 14630 4560 -5684 23982 -3736 3968 14593 -16088
718a6088K6654p194j4291K9168k7602M950J4241k8974K7089l767j6436K8779k5829
$$ -16088 10566 3372 -10919 18249 -9353 -4403 9838 -19136 7953 4186 -12250 16529 -9300
731i300L756J8998k7579K5547k379j9606K8688k4215J423K1503k8864K1842k214
$$ -9300 -5544 13454 -14125 11422 9043 -10563 18125 -6090 -4667 16836 -12028 9814 7600
744G600k3437K7315k1308n44K3368k8713J8605R91k3286K9149j6288j279K4855
$$ 7600 -15837 11478 -9830 -10374 12994 -15719 2886 3877 -19409 9740 -6548 -7827 17028
757A7028k8500J5454L551k4469K9079j4738n482K3567k9927J2508O489k4003K8879
$$ 17028 -11472 3982 7533 -16936 12143 -2595 -8077 15490 -14437 -1929 4560 -19443 9436
770I436j1868q521K4319k7494J1899J0832k3929K7721j1056j1801K4373k6923
$$ 9436 -2432 -10953 13366 -14128 -2229 8603 -15326 12395 1339 -10462 13911 -13012
782a3012R700J3104k5749K5026j0249j4530K5814k4596R503J5542k6017K3291
$$ -13012 -3312 9792 -15957 9069 -1180 -15710 10104 -14492 -4989 10553 -15464 7827
794G827o978j5415K7826k1166O709J6808k8118K1131n080j6709K8205k0749K938
$$ 7827 849 -14566 13260 -7906 -1197 15611 -12507 8624 3544 -13165 15040 -5709 -2771
807b771J6786k8984J8881j442j7884K8386j8359l77J8420k8086J9034K701j8325
$$ -2771 14015 -14969 3912 2470 -15414 12972 -5387 -5764 12656 -15430 3604 6305 -12020
820a2020K8228j7684l336J9467k6577J6509N057k0956K5415j6221o484K1418k4763
$$ -12020 16208 -1476 -4812 14655 -11922 4587 9644 -11312 14103 -2118 -8602 12816 -11947
833a1947J5420P416k2114K4468j3579p476K4047k3765J2896P918k5032K2949j2083
$$ -11947 3473 10889 -11225 13243 -336 -7812 16235 -7530 5366 13284 -11748 11201 -882
846h82r597K4237k3500R726R444k5169K3386p941r370K6221k1921P658J1438k5255
$$ -882 -10479 13758 -9742 -16 9428 -15741 7645 -296 -9666 16555 -5366 2292 13730 -11525
860a1525K3093o132j2628K4448k3595L302J2319k6018K1514l391j4713K5219k0822
$$ -11525 11568 5436 -7192 17256 -6339 -3037 9282 -16736 4778 1387 -13326 11893 -8929
873h929L136J6836k3305K1546r10j6265K3897j9221O4J6927k5198J7169j489k0071
$$ -8929 -5793 11043 -12262 9284 8374 -7891 16006 -3215 -3151 13776 -11422 5747 4258 -15813
887a5813K3139j7644r12J9919k3548J6128L075j9132K5447j2951j801K1289k3889
$$ -15813 7326 -10318 -11230 8689 -14859 1269 4344 -14788 10659 -2292 -4093 17196 -6693
900f693J2550L493k1662K3377j3103o091J9947k5289J0425N752k1085K4485r678
$$ -6693 5857 9350 -12312 11065 -2038 -8129 11818 -13471 -3046 2706 -18379 6106 -3572
913c572o846K1711k2738J0310R736k0900K3549r358j0229K1411k2880Q054J0750
$$ -3572 -10418 11293 -11445 -1135 8601 -12299 11250 1892 -8337 13074 -9806 -1752 8998
926H998k2277K1418p693j2261K2405k0404P065J3510k2877J9913n947j3326K2899
$$ 8998 -13279 8139 446 -11815 10590 -9814 -2749 10761 -12116 7797 1850 -11476 11423
939A1423j8938M776J4225k3629J7570l306j4535K3878j6322K603J5343k3538J6198
$$ 11423 -7515 -2739 11486 -12143 5427 2121 -12414 11464 -4858 -2255 13088 -10450 5748
952E748n53j5606K3710j6427p56J5080k3933J4554J691j6752K3341j4240k506
$$ 5748 5195 -10411 13299 -3128 -3884 11196 -12737 1817 3508 -13244 10097 -4143 -6649
965f649J7852k2034J5190M915j7136K3108j3511n016J8565k2338J1820M994k0251
$$ -6649 11203 -10831 4359 9274 -7862 15246 1735 -3281 15284 -7054 4766 9760 -10491
978a0491K0227j2709p716J9514k1218J0851P358k0024K1076q906p104K2575j9364
$$ -10491 9736 -2973 -10689 8825 -12393 -1542 5816 -14208 6868 -2038 -9142 13433 -5931
991e931R445R384k1259K0015p203r680K1450k0143N102R225k2481J8104n491j1640
$$ -5931 3514 12898 -8361 11654 4451 -5229 16221 -3922 1180 10405 -12076 6028 537 -11103
1005a1103K1337j9174L803J1562k1044J8476j926j2190K1782j6745K429J4166
$$ -11103 10234 -8940 -5137 6425 -14619 3857 1931 -10259 11523 -5222 -2793 11373
1017A1373k0472J7107q29j4741K0505j6656l36J4323k1276J4536j82j6558J9987
$$ 11373 -9099 8008 7179 -7562 12943 -3713 -4049 10274 -11002 3534 3352 -13206 6781
1030F781j4121j177J7271j9902J3597K884j6507K1585j1927k421J8067k0951J1265
$$ 6781 -7340 -8517 8754 -11148 2449 5333 -11174 10411 -1516 -3937 14130 -6821 4444
1043D444K941j8701J9833j1290n643J7430k1068R326N175j8210K0978q086o348
$$ 4444 7385 -11316 8517 -2773 -8416 9014 -12054 -2728 2447 -15763 5215 -2871 -9219
1056i219J9543j9130Q945Q625j7767J9880o736q727J8196j9042N962R042j9677
$$ -9219 10324 -8806 139 8764 -9003 10877 4141 -4586 13610 -5432 530 9572 -10105
1069a0105J7087o581j1204J8120j7745M871J1356j9415J6497l348j1203K0552
$$ -10105 6982 401 -10803 7317 -10428 -5557 5799 -13616 2881 -467 -11670 8882
1081H882j5017M317J3218j9069J5483k038j2350J9867j4461P56J2983k0991J3150
$$ 8882 -6135 -1818 11400 -7669 7814 5776 -6574 13293 -1168 -412 12571 -8420 4730
1094D730j069j4851J9897j3936q92J3718j9903J2832K131j3978K0491j1443k083
$$ 4730 3661 -11190 8707 -5229 -6121 7597 -12306 526 2657 -11321 9170 -2273 -4356
1107d356J5599j8731J1773M321j5405J8620j0894n093J5745j9226R648M700j7070
$$ -4356 11243 -7488 4285 8606 -6799 11821 927 -4166 11579 -7647 2001 6701 -10369
1120a0369J7701r756o284J7045j7223Q672P187j7403J7733p373o754J8461j6060
$$ -10369 7332 -2424 -8708 8337 -8886 -214 6973 -10430 7303 -70 -6824 11637 -4423
1133d423O706P667j7822J6134n739q853J7639j6674M224Q316j9019J5017l890
$$ -4423 2283 9950 -7872 8262 2523 -6330 11309 -5365 -1141 7175 -11844 3173 -717
1146g17r878J8213j5191L186J0690j7243J5932j533j0076J8732j4047J503J1846
$$ -717 -10595 7618 -7573 -4387 6303 -10940 4992 3459 -6617 12115 -1932 -429 11417
1159A1417j8035J3884j407j3002J6874j4398q68J1990j8510J2448M32j3748J7922
$$ 11417 -6618 7266 5859 -7143 9731 -4667 -5535 6455 -12055 393 825 -12923 4999
1172D999j1525n17J5086j6628J2123K613j3903J7740j0122k365J4374j7441Q653
$$ 4999 -6526 -7043 8043 -8585 3538 6151 -7752 9988 -134 -2499 11875 -5566 3087
1185C087L021j6111J6413r078m673J4696j7183P899N264j5379J7368o537n312
$$ 3087 6108 -10003 6410 -2668 -7341 7355 -9828 -1929 3335 -12044 5324 -1213 -6525
1198f525J6004j5940O917O771j5485J5859n641p998J5889j6225N169P815j6427
$$ -6525 9479 -6461 456 7227 -8258 7601 1960 -6038 9851 -6374 -1205 6610 -9817
1211i817J4927m495r107J6096j4014L835R660j6028J4182k920j0128J6801j3283
$$ -9817 5110 615 -8492 7604 -6410 -2575 7085 -8943 5239 2319 -7809 8992 -4291
1224d291K816J0336j6370J2808k067j0951J6841j2566J195J0989j6780J1385l19
$$ -4291 -1475 8861 -7509 5299 3232 -7719 9122 -3444 -2249 8740 -8040 3345 3026
1237C026j1618J6517j1103o23J2034j6544J0487J776j2109J6372r660k075J2161
$$ 3026 -8592 7925 -3178 -3801 8233 -8311 2176 3952 -8157 8215 -1445 -3520 8641
1250H641j5786R396L082j2766J5449q604l999J3081j5011P803M520j3351J4887
$$ 8641 -7145 2251 5333 -7433 8016 -588 -4587 8494 -6517 1286 5806 -7545 7342
1263G342p656n140J4048j4707O930N371j4323J3638o383n982J4529j3899N256
$$ 7342 -314 -5454 8594 -6113 817 6188 -8135 5503 -880 -6862 7667 -6232 -976
1276i76P037j5046J3573m255o962J5306j2909M263P745j5032J3040l295p887J4658
$$ -976 6061 -8985 4588 333 -6629 8677 -4232 31 7776 -7256 5784 2489 -5398 9260
1290I260j2697K225P850j5306J1857k384q909J4750j1895J270R769j4604J1824
$$ 9260 -3437 -1212 6638 -8668 3189 805 -8104 6646 -5249 -3979 5790 -8814 3010
1303C010j49r942J4900j0485j8J0623j4465J0286M71j1183J4035r918j454J1274
$$ 3010 2861 -7081 7819 -2666 -2684 7939 -6526 3760 4231 -6952 7083 -2835 -4289 6985
1317F985j4390Q788K225j2044J4030q235k077J1992j3508P629K838j2397J4027
$$ 6985 -7405 1383 3608 -8436 5594 -2641 -4718 7274 -6234 1395 4233 -8164 5863
1330E863o951l906J2822j4104O694M195j2679J3658n593m748J2708j3124N196
$$ 5863 -1088 -4994 7828 -6276 418 4613 -8066 5592 -1 -4749 7959 -5165 31
1343C1N106j2797J2825m780o408J2724j2913M333O701j3448J2725l229p131J3772
$$ 31 5137 -7660 5165 385 -6023 6701 -6212 -1879 4822 -8626 4099 870 -6261 7511
1357G511j1510L629Q103j3134J1531k662q449J3475j1471J591P585j3998R891
$$ 7511 -3999 -370 7733 -5401 6130 3468 -4981 8494 -2977 -1386 6199 -7799 2092
1370B092k219q799J3184r602O99R823j2560R908O75q676J4326q302l49R713j3325
$$ 2092 -127 -8926 4258 -5344 -4645 5178 -7382 2526 3201 -5475 8851 549 200 9913 -3412
1385c412P978P06j0874J2548q730k695R701j3441P270K357j0180J3281p165k175
$$ -3412 4566 5272 -5602 6946 -1784 -4479 5222 -8219 -949 1408 -8772 4509 -2656 -4831
1399d831J1149j1567P176L891j0572J2150o201m270J1221j2459N386L888j1905
$$ -4831 6318 -5249 1927 5818 -4754 7396 1195 -3075 8146 -4313 1073 4961 -6944
1412f944J1494n353m930J1860j1490N057N125j1699J1163l959n525J2111j0737
$$ -6944 4550 -803 -5733 6127 -5363 -306 4819 -6880 4283 324 -5201 6910 -3827
1425c827L220N805j2382J0755k924o522J2311r913K182P297j2211J0157j616p371
$$ -3827 -607 5198 -7184 3571 647 -5875 6436 -3477 -1295 6002 -6209 3948 2332 -5039
1439e039J1959r818Q27P267j2557Q957l60q259J1642q578K05R085j1347Q570J122
$$ -5039 6920 -2898 -2071 5196 -7361 1596 1236 -7023 4619 -3959 -3754 5331 -6016 2554 3676
1454C676q205J1923p698p46Q804j1736P070O24j0032J0493p598k209R472j1612
$$ 3676 -4529 7394 -304 -1050 7754 -3982 3088 3712 -6320 4173 -3425 -5634 3838 -7774
1468g774O611K497r638J1782n012k250J0998j0732O120L547j0076J1154n723l787
$$ -7774 -1163 1334 -8304 3478 -1534 -3784 7214 -3518 2602 6149 -3927 7227 1504 -2283
1482b283R921j1387L771L308j0713R855m014m879J0382r905L643N732j0161J0540
$$ -2283 7638 -3749 22 3330 -7383 2472 -1542 -6421 3961 -5944 -2301 3431 -6730 3810
1496C810k408n493J1155r186K500O147j0824R079k330p077J0630r297J221O512
$$ 3810 1402 -4091 7064 -2122 378 6525 -4299 4780 2450 -4627 6003 -3294 -2073 4439
1510D439j0994P972j064o884J0849p756J036P639j0327Q039Q1p070J1089p414
$$ 4439 -6555 1417 353 -6531 4318 -3438 -2402 5237 -5090 2949 3030 -4040 7049 -365
1524c65j15P684j1216O791M31q751J0014o885j504P622j0810O170J885q123J0943
$$ -365 -480 7204 -4012 2779 3210 -5541 4473 -2412 -3916 3706 -7104 -934 951 -7172 3771
1539C771n499j398R447r667O136L009q774J0339n552l327Q246j0207L963K948
$$ 3771 -1728 -3126 6321 -3346 2790 5799 -2975 7364 1812 -1515 6731 -3476 487 3435
1553C435r992Q940m419m339R572r073M286M427r002R544k716m283J0250q419K872
$$ 3435 -6557 2383 -2036 -6375 3197 -5876 -1590 2837 -6165 3379 663 -3620 6630 -1789 1083
1568A083N098j0279Q375k627n618R461q644J357N354r981P762j057n505R775p561
$$ 1083 6181 -4098 4277 1650 -3968 5493 -3151 -1794 3560 -6421 1341 284 -5221 4554 -3007
1583c007J255O290r778P594l3o603R570p095j78O966r825O596K94o851R412o431
$$ -3007 -1752 4538 -5240 2354 2321 -4282 5288 -1807 -1985 4981 -4844 1752 2046 -4805 4607 -1824
1599a824p31P409r492O046R98p793R383n905j406P954r536N339K074p711R451
$$ -1824 -2555 4854 -4638 1408 2406 -5387 3996 -1909 -3315 4639 -4897 442 2516 -5195 4256
1614D256m668j987Q508q908M344K462q317Q780m391l370P996r020L165L227q398
$$ 4256 -412 -2399 6109 -2799 1545 4007 -4310 4470 79 -3291 4705 -4315 -1150 2077 -6321
1629f321P860k665l449Q704p993L391M416p902Q276k259m211Q453p843K071M077
$$ -6321 1539 -1126 -4575 4129 -3864 -473 3943 -3959 4317 2058 -2153 6300 -1543 528 4605
1644D605r056P324k285n373Q446p592J505N363q876P736q02n098R143o410J172
$$ 4605 -4451 2873 588 -4785 3661 -3931 -2426 2937 -5939 1797 995 -4103 5040 -1370 -198
1659a98N853r050O185l72o518Q625o466l07N761r079N851Q19o407R137n331l75
$$ -198 5655 -3395 2790 2418 -4100 4525 -1941 -2248 3513 -5566 285 1104 -5303 3834 -1497 -1872
1675a872P138q804N825J751p349Q615n018k110O860q896M254J645p411P829m260
$$ -1872 5266 -3538 2287 4038 -3311 5304 286 -1824 5036 -3860 394 2039 -5372 2457 -1803
1690a803k715P587p773M462L173p503Q542l054l057P810p777L043L554q142O898
$$ -1803 -4518 3069 -4704 -242 2931 -4572 3970 916 -2141 5669 -2108 935 4489 -3653 3245
1705C245l072m061P659p319K322L519p885P395j961m039Q720o786K233M593q409
$$ 3245 173 -3888 3771 -3548 -1226 2293 -5592 1803 -158 -4197 4523 -2263 -30 4563 -3846
1720c846P257j423m736P621o809N68M844q281O060r23n180P840n949P24N739q054
$$ -3846 3411 1988 -2748 4873 -1936 -1368 3476 -4805 1255 332 -4848 2992 -2957 -2233 3506 -4548
1736d548O143M82n646Q294m980q18O176p939N075N24o470P676m997j392O373p951
$$ -4548 1595 2077 -3569 4725 -255 -1073 5103 -2836 2239 2763 -3707 3969 -1028 -2420 3953 -3998
1752c998M024J550o603P232m153j451O930p547L874K293o603Q014l227k099O898
$$ -3998 26 1576 -5027 2205 -1948 -3399 3531 -4016 -142 2151 -4452 3562 335 -1764 5134
1767E134p115L353K499p307P108l199l411P313p620K554L076p362P047k523l591
$$ 5134 -1981 1372 3871 -3436 3672 473 -2938 4375 -3245 -691 2385 -4977 2070 -453 -4044
1782d044P625o461K399L868p057O629j532m169P243o469J528M207p696O121j064
$$ -4044 3581 -2880 -481 3387 -3670 2959 1427 -2742 4501 -1968 -440 3767 -3929 2192 1128
1797A128m992P362n629L65N367p462N499J00n382P492m790l94N559p655M826L35
$$ 1128 -3864 3498 -2131 -1766 3601 -3861 1638 1738 -3644 3848 -942 -1336 4223 -3432 1394 1729
1813A729n734P493m372j407O152p614M264J653n837P559m458j643N863p063M087
$$ 1729 -4005 3488 -884 -2291 3861 -3753 511 2164 -3673 3886 -572 -2215 3648 -3415 672
1828F72J587o533P000l869j705O552o886L627K463o155P018l198k490O608o387
$$ 672 2259 -4274 2726 -1143 -2848 3704 -3182 445 2908 -3247 3771 573 -1917 4691 -1696
1843a696K420K626p587O460l026l414O732o382K270L243p269P167j724k785P385
$$ -1696 724 3350 -4237 2223 -803 -4217 2515 -3867 -1597 1646 -5623 1544 -180 -2965 4420
1858D420n668J873L860o512N464j316m973O872o240J19M412p470N169m93m496
$$ 4420 -1248 625 4485 -2027 3437 2121 -2852 4020 -2220 -2101 2311 -5159 10 -483 -4979
1873d979P645m794J191N092o385N524K00m952O475m702o00M313p614L955N4n641
$$ -4979 2666 -2128 -937 4155 -2230 3294 3494 -1458 5017 315 -285 4028 -3586 369 423 -5218
1889e218O694m618p50N682o056M779J224m828P517l631q68O013p037L402J489
$$ -5218 1476 -3142 -3892 1790 -4266 513 1737 -3091 4426 795 -73 5940 -1097 2305 3794
1904C794p482O552l922k777O122o693K960K334n649O802k134k325O806n883K512
$$ 3794 -3688 2864 -1058 -3835 2287 -4406 -1446 888 -4761 2041 -93 -2418 4388 -1495 1017
1919A017K706o108N498k364l421O150o007J040L409o426O091j513l177O616m817
$$ 1017 3723 -2385 3113 749 -2672 3478 -2529 -1489 1920 -4506 1585 72 -3105 3511 -1306
1934a306J461M189o459N018j109m597O690n674N71L959p201M778k55m193O243
$$ -1306 155 4344 -2115 2903 1794 -2803 3887 -1787 -1216 2743 -4458 320 65 -4128 2115
1949B115l973L36M771n901M065J058m630O592m566j065M415o653L835N14n232
$$ 2115 -1858 -1522 3249 -2652 1413 2471 -2159 4433 -133 -1198 3217 -3436 399 913 -4319
1964d319O208l777r17N653o058L948K081n170O330l393j273M820n959K763J968
$$ -4319 1889 -1888 -2805 2848 -3210 738 2819 -2351 3979 586 -687 4133 -1826 937 2905
1979B905o854N900l254k165N284n844K939K687n841O524k267k113O577n542J483
$$ 2905 -3949 1951 -1303 -3468 1816 -4028 -1089 1598 -4243 2281 14 -2099 4478 -1064 419
1994D19K868n479M989j728l304O049n829R89L061o108N612j423l947O873n231
$$ 419 3287 -2192 2797 1069 -2235 3814 -2015 -1026 2035 -4073 1539 116 -3831 3042 -2189
2009b189R03L630n655M665K48m445O586m726N92L953o531M677l53m308N561l741
$$ -2189 -1286 2344 -3311 1354 1602 -2843 3743 -983 -391 3562 -2969 1708 1355 -2953 2608 -1133
2025a133q02M758o448M510k8m499O138l598j320N410o156M282J143m934N883l065
$$ -1133 -1935 2823 -3625 885 857 -3642 2496 -1102 -2422 2988 -3168 1114 2257 -2677 3206 141
2041A41j535N118n896L067J365n636N575k799k172N444o082K293K391n612O113
$$ 141 -1394 3724 -2172 895 2260 -3376 2199 -600 -2772 2672 -3410 -1117 1274 -4338 1775
2056A775k304j612N763n225K348K455m989N365k085l137N806n690J173K685n874
$$ 1775 -529 -2141 3622 -1603 745 3200 -1789 3576 1491 -1646 4160 -1530 -357 2328 -3546
2071c546N269j492l721N750m878J131L705n657N315r62l661O098m231O31L831
$$ -3546 1723 231 -3490 2260 -2618 -1487 2218 -3439 1876 914 -2747 3351 -880 -249 3582
2086C582o005M342n23m012N813m163l76M202n837M070Om843O159l952jM655o282
$$ 3582 -2423 1919 1396 -2616 3197 -966 -1342 2860 -2977 1093 1099 -3744 2415 -1537 -1538 3117 -3165
2103c165M010P18m721O360l709q33M744n359K581J325n071O051l068k063N319
$$ -3165 845 1563 -3158 3202 -507 -1340 3404 -1955 626 1951 -3120 2931 -137 -2200 3119
2118C119o146K607K197m956M939k329k122N899m984J845K945n803N019j400l323
$$ 3119 -3027 -420 1777 -3179 1760 -569 -2691 3208 -1776 69 3014 -2789 2230 830 -2493
2133b493O057n116J404K480n196M579j855l028N765m591P39L061n314M780j042
$$ -2493 3564 -1552 -148 2332 -2864 1715 -140 -3168 2597 -1994 -1255 1806 -3508 1272 230
2148B30k949N437m089N62L830n291M003p23l184M977m029O96L258n108L481J14
$$ 230 -2719 2718 -1371 -809 3021 -2270 1733 1010 -2174 2803 -1226 -530 2728 -2380 1101 1215
2164A215m301N057l609l30L857m903L707P32m770O063l746k02M962n875L067R36
$$ 1215 -3086 1971 -1638 -1968 1889 -3014 693 1425 -3345 2718 -1028 -1230 3732 -2143 924 1860
2180A860m242N288l244j200M527n355K394J790n033M889k421j102M702m738K500
$$ 1860 -2382 2906 -338 -1538 2989 -2366 28 1818 -3215 1674 -747 -1849 2853 -1885 615
2195F15J002m309N558l053j298N026n499J881K859n709M018j240k952N539m805
$$ 615 1617 -2692 2866 -187 -1485 3541 -1958 -77 2782 -2927 1091 -149 -3101 2438 -2367
2210b367J944K487n374M816q71k488N071m060J162J973m774M098j050k795M432
$$ -2367 -423 2064 -3310 1506 635 -1853 3218 -842 320 2293 -2481 1617 567 -2228 2204
2225B204m059N85L465n580L793L2l270N526m198M11L847m440K988Q9l186N284
$$ 2204 -1855 -1270 2195 -3385 408 440 -2830 2696 -1502 -1091 2756 -1684 1304 1393 -1793 3491
2241C491l979j199M395n517L268J280n170M959j963j735M502n439L614N75l486
$$ 3491 -488 -1687 2708 -2809 459 1739 -3431 1528 -435 -2170 2332 -3107 507 1082 -2404
2256b404M475k265j360M921n319K575J436m864M945j961j839M509n106K463K171
$$ -2404 2071 -194 -1554 3367 -1952 623 2059 -2805 2140 179 -1660 2849 -2257 206 2377
2271B377n325M412j692j684M212m394J548K597m812L951j331j961M360l978P60
$$ 2377 -2948 1464 -228 -1912 2300 -2094 -546 2051 -2761 1190 -141 -2102 2258 -1720 -960
2286i60L514m687M030p10k948M797m419J377K278m948L779l77l155L909l115K43
$$ -960 2554 -2133 1897 1187 -1761 3036 -1383 -6 2272 -2676 1103 726 -2429 1480 -1635 -1392
2302a392L714m981L506j84k907M687l334L05L027m395L189J60l544M797l234o08
$$ -1392 2322 -2659 847 663 -2244 2443 -891 -586 2441 -1954 1235 1395 -2149 2648 -586 -1194
2318a194L709n050K790J555m280M806k892o18L668m658J972J721m066M223k574
$$ -1194 2515 -2535 255 1810 -2470 2336 -556 -1174 2494 -2164 -192 1529 -2537 1686 -888
2333h88q70M394m857K588J519l602L663j482k348L634l257J916J130m837M714
$$ -888 -1758 2636 -2221 367 1886 -1716 1947 465 -1883 1751 -1506 410 1540 -3297 1417
2348A417k217j197M184m290K112K083m217M264r56k044L457l722J375K780m889
$$ 1417 -800 -1997 2187 -2103 9 2092 -2125 2139 1183 -861 2596 -1126 249 3029 -1860
2363a860K607o4l467M733l836R57K713m635L381k01k104M114k291o26L216m220
$$ -1860 747 683 -2784 1949 -1887 -930 1783 -2852 529 328 -1776 2338 47 -579 2637 -1583
2379a583L267n03l228M114l400O6L206m539K498L48l246N003k875m60M150m071
$$ -1583 1684 1181 -2047 2067 -1333 -1267 1939 -2600 -102 246 -3000 2003 -872 -1332 2818 -1253
2395a253K148L36k723L816j877j346L001m759L550o41k988L756k264m24L411l464
$$ -1253 895 1231 -1492 2324 447 -899 2102 -2657 893 252 -2736 1020 -1244 -1668 1743 -1721
2411a721J714K198m263M182j336j316L108l334P35J686m349L623j166k225L616
$$ -1721 -7 2191 -2072 2110 774 -542 2566 -768 -33 1653 -2696 927 -239 -2464 1152
2426A152l464K270J925m627L643m22k063M041l033O52K841m770K837m84k681M132
$$ 1152 -2312 -42 1883 -2744 899 477 -1586 2455 -578 74 2915 -1855 982 498 -2183 1949
2442A949l544P14K499m032K648J73k491L738k357K35L091m016K405J50k898L940
$$ 1949 -1595 -881 1618 -2414 234 407 -2084 1654 -703 -468 2623 -1393 1012 1162 -1736 2204
2458B204k725n69K430l787K249P56l331M292k503n11L572l649J986J155l459L306
$$ 2204 -521 -1090 1340 -2447 -198 558 -2773 1519 -984 -1495 2077 -1572 414 1569 -1890 1416
2474A416j720j002L068l040J494Q05k498L140j331j236K901k860J128J902m197
$$ 1416 -304 -1306 1762 -1278 216 1021 -1477 1663 332 -904 1997 -863 265 2167 -2030
2489b030L097n03k076L195k850Q39J669l943L796q66k326L712l169J428J859l765
$$ -2030 1067 564 -1512 1683 -1167 -328 1341 -2602 1194 328 -1998 1714 -1455 -27 1832 -1933
2505a933L461m66k663L981k939L29K272l811K430k13k606L826k785P5K565l546
$$ -1933 1528 1062 -1601 2380 -559 -230 2042 -1769 661 448 -2158 1668 -1117 -1042 1523 -2023
2521b023K414M55k545L759k781l00K756l054K244l69k014L065j692j026L185m143
$$ -2023 391 846 -1699 2060 -721 -1021 1735 -1319 925 556 -1458 1607 -85 -1111 2074 -2069
2537b069K182Q48k618L475k034r54K822l127K059Q80l580L640j841j211L573l119
$$ -2069 113 961 -1657 1818 -216 -1170 1652 -1475 584 1464 -2116 1524 -317 -1528 2045 -1074
2553a074P65J911l399L352j653j087L549l533Q32J976l881K762q37j972L342k134
$$ -1074 -309 1602 -1797 1555 -98 -1185 2364 -1169 -337 1639 -2242 520 -317 -2289 1053 -1081
2569a081N83K337l169K275l01k020L653k916L54K168l795K788m26k404L584k946
$$ -1081 -498 1839 -1330 945 644 -1376 2277 -639 -285 1883 -1912 876 450 -1954 1630 -1316
2585a316P65J815l833L290k11k025L505k230j187L433l382J869J55k598L868k278
$$ -1316 -551 1264 -2569 721 510 -1515 1990 -240 -1427 2006 -1376 493 648 -1950 1918 -360
2601c60p00K897k733J571J37l134L359r82j322L108k866P79J450l559L888k069
$$ -360 -1060 1837 -896 675 812 -2322 1037 55 -1267 1841 -1025 -246 1204 -2355 1533 -536
2617e36o20K849l011J559N70k456L757k163q34L146l186J139L36k420K385o51
$$ -536 -1156 1693 -1318 241 811 -1645 2112 -51 -885 2261 -925 214 550 -1870 515 -136
2633a36j506L011k267R19J424l363L199j014j888L863l242P7L049l818K813j004
$$ -136 -1642 1369 -898 21 1445 -1918 1281 267 -1621 2242 -1000 -923 2126 -1692 1121 117
2649A17j558L046k658J112J171l739L291o32j906K968k020L28J894l165K032J89
$$ 117 -1441 1605 -1053 59 1230 -2509 782 150 -1756 1212 -808 -480 1414 -1751 281 470
2665D70k388L334j946o33K806k963K059J44k669L416j638n98K863l176J594L76
$$ 470 -1918 1416 -530 -1163 1643 -1320 739 883 -1786 1630 -8 -606 2257 -919 675 1051
2681A051k635L023j611j087K458l013J505J112k932L159j241j146K899k618J544
$$ 1051 -1584 1439 -172 -1259 1199 -1814 -309 803 -2129 1030 -211 -1357 1542 -1076 468
2696D68J359l258K820j036j683L162l052R73J043k564K424q29j432K956k336N02
$$ 468 1827 -1431 1389 353 -1330 1832 -1220 -247 796 -1768 656 -173 -1605 1351 -985 -483
2712d83K130l101K761n55j752K881k577O14J596k884J970m34k204K867j900J73
$$ -483 1647 -1454 1307 752 -1000 1881 -696 -82 1514 -1370 600 166 -2038 829 -1071 -898
2728h98J890k626K044K79k209K916j654k33K056k767J911L34k520K841k001q5
$$ -898 992 -1634 410 689 -1520 1396 -258 -491 1565 -1202 709 1043 -1477 1364 -637 -722
2744g22K179l059K060M72k513K824j299q19K501k907J413J111k879K570j251p84
$$ -722 1457 -1602 458 930 -1583 1241 -58 -877 1624 -1283 130 1241 -1638 932 -319 -1103
2760a103K526k791J509N92k299K518o48j200K530k181N43J231k213K188j199j234
$$ -1103 1423 -1368 141 733 -1566 952 304 -896 1634 -547 -4 1227 -986 1202 3 -1231
2776a231L016k942N24J568l003K786j143q90K675k380J041J561k561K022l36k083
$$ -1231 1785 -1157 -633 935 -2068 718 -425 -1315 1360 -1020 21 1582 -979 1043 707 -1376
2792a376K786j820oJ826k923K132j91j882K696j882j9K097k644J459N79k074K802
$$ -1376 1410 -410 -416 1410 -1513 619 428 -1454 1242 -640 -659 1438 -1206 253 832 -1242 1560
2809A560j806m44K106k604J609O16k481K710j720n54K428k871J262Q68k232K455
$$ 1560 -246 -690 1416 -1188 421 1037 -1444 1266 -454 -1008 1420 -1451 -189 679 -1553 902
2825I02j067q41K402k667J397R80k379K448q02j325K600k695J345P82k420K532
$$ 902 -165 -1006 1396 -1271 126 1106 -1273 1175 373 -952 1648 -1047 298 1080 -1340 1192
2841A192j289j055K490k528J140J128k804K332n98j297K748k408M44J854k741
$$ 1192 -97 -1152 1338 -1190 -50 1078 -1726 606 8 -1289 1459 -949 -505 1349 -1392
2856a392K227m10j570K650k049k71K101k809K277j54k116K893k069J07K193l020
$$ -1392 835 425 -1145 1505 -544 -815 1286 -1523 754 600 -1516 1377 -692 -585 1608 -1412
2872a412K061O1k017K934k099Q1J776k632J671q5j849K787j721m96K346k505J323
$$ -1412 649 710 -1307 1627 -472 -391 1385 -1247 424 339 -1510 1277 -444 -940 1406 -1099 224
2889B24N37k189K724j345q10K256k349J057R74k668K825j383r97K595k815J458
$$ 224 761 -1428 1296 -49 -859 1397 -952 105 1079 -1589 1236 -147 -1144 1451 -1364 94
2905I4J027k520K516q94j211K714k422N43J333k336J907n76r45K220k435O50J429
$$ 94 1121 -1399 1117 223 -988 1726 -696 -153 1180 -1156 751 175 -770 1450 -985 -335 1094
2922A094k686K252m97j460K792k045M59J527k710K035k83j507K456k081p1J982
$$ 1094 -1592 660 163 -1297 1495 -550 -91 1436 -1274 761 478 -1029 1427 -654 -725 1257
2938A257k820K211k87j928K893j879k66K103k659J821J08j744K287j430l07J858
$$ 1257 -1563 648 361 -1567 1326 -553 -819 1284 -1375 446 554 -1190 1097 -333 -640 1218
2954A218k176J315L21k044K484j443n99K039k137J350Q02k518K632j259p48K397
$$ 1218 -958 357 678 -1366 1118 -325 -924 1115 -1022 328 1130 -1388 1244 -15 -763 1634
2970A634k698J152O62k119K363j175q04K208k231R34J110k473K374q17j124K069
$$ 1634 -1064 88 750 -1369 994 -181 -985 1223 -1008 -74 1036 -1437 937 120 -1004 1065
2986A065k040Q87J287k737K149n45j095K522k180K77J615k482K011j43j533K342
$$ 1065 -975 -88 1199 -1538 611 66 -1029 1493 -687 -410 1205 -1277 734 591 -942 1400
3002A400j935M09J372k525J673O1j743K525j890j63K215k848J916J28j704K426
$$ 1400 -535 -126 1246 -1279 394 455 -1288 1237 -653 -816 1399 -1449 467 595 -1109 1317
3018A317j722n3J537k448J898J67k018K442j574l54K126k418J320N20j822K281
$$ 1317 -405 -458 1079 -1369 529 696 -1322 1120 -454 -808 1318 -1100 220 740 -1082 1199
3034A199j249o44K192k274J053O10j996K270j169r29K196k341R79J010k435K256
$$ 1199 -50 -694 1498 -776 277 887 -1109 1161 -8 -937 1259 -1082 -103 907 -1528 728
3050G28n99j042K223k322R81Q36k119K433j035j284K355j928N33J232k160J903
$$ 728 129 -913 1310 -1012 -31 805 -1314 1119 84 -1200 1155 -773 -240 992 -1168 735
3066G35k94j302K331k075K41J378k228J890m01j391K293j858l7K036k608J906
$$ 735 441 -861 1470 -605 -364 1014 -1214 676 275 -1116 1177 -681 -718 1318 -1290 616
3082F16k74j739K624j808M7J658k232J604K47k118K589j692m82K024k260J473
$$ 616 342 -1397 1227 -581 -534 1124 -1108 496 743 -1375 1214 -478 -960 1064 -1196 277
3098B77N07k184K515j064r12K031k226J220M20j927K395j209p79K229k500J443
$$ 277 784 -1400 1115 51 -861 1170 -1056 164 584 -1343 1052 -157 -936 1293 -1207 236
3114B36N29k290K322q32j000K715k726Q53J167k125K121o50j136K191k099O82
$$ 236 765 -1525 797 -35 -1035 1680 -1046 -193 974 -1151 970 320 -816 1375 -724 -42
3130d2R76k031J829n48r59K189k241M89J806k729J800k78j286K209j804L21J437
$$ -42 934 -1097 732 184 -775 1414 -827 -338 1468 -1261 539 261 -1025 1184 -620 -299 1138
3147A138k354J833k24j726K645j801l7J967k659J920k13j494J993j483N1J891
$$ 1138 -1216 617 393 -1333 1312 -489 -526 1441 -1218 702 489 -1005 988 -495 -444 1447
3163A447k479J434p6j601K633k014k18J911k330J656J65j939K627j446m47J820
$$ 1447 -1032 402 326 -1275 1358 -656 -874 1037 -1293 363 528 -1411 1216 -230 -677 1143
3179A143k165J079R33k205K299j180n14J847k212J055O25k006K293p44r99K193
$$ 1143 -1022 57 990 -1215 1084 -96 -610 1237 -975 80 705 -1301 992 248 -751 1442
3195A442k355P42J156k234J930o64j032K279k211M91J317j962J760n69j541K679
$$ 1442 -913 -171 985 -1249 681 17 -1015 1264 -947 -456 861 -1101 659 90 -1451 1228
3211A228k120P11J391k367J907k94j053J795j763J21J449k275J705l52j597K547
$$ 1228 -892 -181 1210 -1157 750 456 -597 1198 -565 -444 1005 -1270 435 83 -1514 1033
3227A033j658L32J450k208J626mj591K267j745j92J867k285J703j07j902K360
$$ 1033 -625 -293 1157 -1051 575 571 -1020 1247 -498 -690 1177 -1108 595 488 -1414 946
3243I46j175o00K070k548J300P25j983K339j024n80K031k627J276N81k162K598
$$ 946 -229 -829 1241 -1307 -7 718 -1265 1074 50 -530 1501 -1126 150 731 -1431 1167
3259A167j027q35J700j765P41J093k376K202o68j017J859k166R52J052k223K145
$$ 1167 140 -695 1005 -760 -19 1074 -1302 900 232 -785 1074 -1092 -140 912 -1311 834
3275H34o13j366K205j820P06J297k260J820m58j264K219j861J69J679k697J958
$$ 834 221 -1145 1060 -760 -54 1243 -1017 803 345 -919 1300 -561 -392 1287 -1410 548
3291E48j24j562K333j770J01J395k345J792J24j454K316j863k6J904k251J150
$$ 548 424 -1138 1195 -575 -474 921 -1424 368 492 -962 1354 -509 -535 1369 -882 268
3307B68K45j564K021j638J16J484j954J378M14j847K123j033o06J823k348J295
$$ 268 513 -1051 970 -668 -552 932 -1022 356 770 -1077 1046 13 -593 1230 -1118 177
3323A77O84k186K220j047o89K281k423J072R56k360K104o71j028K140j999O52
$$ 177 861 -1325 895 -152 -841 1440 -983 89 1045 -1315 789 118 -910 1230 -769 -117
3339a17R91k087J629k52j196K142j589L80J189k076J630l64j305K537k007K89
$$ -117 874 -1213 416 164 -1032 1110 -479 -99 1090 -986 644 280 -1025 1512 -495 -206
3355b06J439k423J839m34j294K332j940M97J434k230J569m34j384K156j526o7
$$ -206 1233 -1190 649 215 -1079 1253 -687 -190 1244 -986 583 149 -1235 921 -605 -672
3371f72J897k482J172P68j831K166j437k37K066k204J771l4k079K366j704j66
$$ -672 1225 -1257 -85 683 -1148 1018 -419 -656 1410 -794 977 943 -1136 1230 -474 -640
3387f40J864k414J323M32k451K659j016p33K055j965J033N08j560J787p49q44
$$ -640 1224 -1190 133 565 -1886 773 -243 -976 1079 -886 147 655 -905 882 133 -711
3403g11J884k435J219O29j755K040j187o47K019j983N87J210k364K200l92j098
$$ -711 1173 -1262 -43 586 -1169 871 -316 -963 1056 -927 -340 870 -1494 706 314 -784
3419g84K382k344M59J487k460K272q01j030J667j365K85J196k282J957m14j556
$$ -784 1598 -746 -287 1200 -1260 1012 211 -819 848 -517 -232 964 -1318 639 225 -1331
3435a331K076j070J9J145j649J532n8j172J716j354pJ406k063J063N90k206K676
$$ -1331 745 -325 -306 839 -810 722 664 -508 1208 -146 -153 1253 -810 253 843 -1363 1313
3452A313j832K0J569k023J320K21j620J757q05n89J906k340J118O31j684J690
$$ 1313 -519 -499 1070 -953 367 588 -1032 725 -80 -669 1237 -1103 15 646 -1038 652
3468F52p08q72J839j775J281L52k081K293o12r67J870j958N98J244k355J708m62
$$ 652 -56 -928 911 -864 417 769 -1312 981 369 -598 1272 -686 -88 1156 -1199 509 47
3485D7q41K099k029O06J116k364K203q43o43J488j546L89J281k103J707o36r89
$$ 47 -794 1305 -724 -118 998 -1366 837 -6 -649 839 -707 -318 963 -1140 567 -69 -1058
3502a058J737j401M10J046k031J595Kj763K635j666J42J314j779J069M85j434
$$ -1058 679 -722 -312 734 -1297 298 300 -1463 1172 -494 -352 962 -817 252 737 -697
3518f97J778j515o6K032k922J266P45j594J975j188n79J653j638J207K51j747
$$ -697 1081 -434 -500 1532 -1390 -124 621 -973 1002 -186 -765 888 -750 457 708 -1039
3534a039K040j219l30J665j830O41N56j698K045r42q22K052j728P56N51k105J895
$$ -1039 1001 -218 -548 1117 -713 -72 484 -1214 831 -111 -933 1119 -609 147 698 -1407 488
3551D88K4j486K108j871P88Q08j680J352n47o97J586j309J09J075k109J831p07
$$ 488 512 -974 1134 -737 51 859 -821 531 -16 -713 873 -436 -327 748 -1361 470 -237
3568b37p32K083j455n9J412k091J596j87j423K112j467j34J582j923J213J74j417
$$ -237 -969 1114 -341 -400 1012 -1079 517 330 -1093 1019 -448 -582 1000 -923 290 464 -953
3585i53J898j381N32J354k645J387M36j643K059j473R9J459k092J227J28j651
$$ -953 945 -436 96 1450 -1195 192 628 -1015 1044 -429 -330 1129 -963 264 392 -1259
3601a259K341j436j77J778k212J432J20j374J827r70n82J918k043M89P68j783
$$ -1259 1082 -354 -531 1247 -965 467 587 -787 1040 70 -512 1406 -637 -148 620 -1163
3617a163J847q80n91J945j984J030N98k265K158r29q00K056j562K83J566k283
$$ -1163 684 -196 -787 1158 -826 204 802 -1463 695 -234 -1034 1022 -540 -257 1309 -974
3633i74J446m42q32J467j526M63J702k452J777l99j262J847j351M73R43j707J343
$$ -974 472 30 -802 665 -861 -398 1304 -1148 629 230 -1032 815 -536 -63 880 -827 516
3650E16j99j114K028j600K95J221j916J312M58j692J517r57p63J625j744J502
$$ 516 317 -797 1231 -369 -74 1147 -769 543 1001 -691 826 -131 -894 731 -1013 489
3666D89n30r46J953o95j232K059k134J452K81j498J761j314j78J919j581K98R39
$$ 489 -41 -987 966 271 -961 1098 -1036 416 697 -801 960 -354 -532 1387 -194 104 1043
3683A043k316K140p35r75J626j289K29J041k023J906m78j253K070j013n0J103
$$ 1043 -1273 867 132 -843 783 -506 -277 764 -1259 647 169 -1084 986 -27 -77 1026
3699A026k351J741j06p63J007j019q5J007j272J656n59j021J559j136l1J404k206
$$ 1026 -1325 416 310 -453 554 -465 -550 457 -815 841 282 -739 820 -316 -347 1057 -1149
3716a149J659N9j551K035j313J31J424j866Q05J86j102J065j277N55J130j557
$$ -1149 510 569 -982 1053 -260 -129 1295 -571 234 420 -682 383 -894 -339 791 -766
3732g66Q22N06j426J827j216l31J768j986R75L42j503J706r86l69J664j900J011
$$ -766 56 562 -864 963 -253 -584 1184 -802 173 515 -988 718 -268 -637 1027 -873 138
3749A38M13j374J759j080n27J634j880Q05J286k404J789q11n23J690j687P75Q88
$$ 138 551 -823 936 -144 -671 963 -917 -112 1174 -1230 559 -252 -775 915 -772 3 891
3766H91j929J608p32n02J291j319O28J046j795J210kj403J659j346M06O41j509
$$ 891 -1038 570 -162 -664 627 -692 -64 982 -813 397 395 -1008 651 -695 -289 352 -1157
3783a157J315j88q36J363r04L2J111j340J017L26j493J717j022j96J102j842Q82
$$ -1157 158 -30 -866 497 -407 -375 736 -604 413 739 -754 963 -59 -255 847 -995 -113
3800a13N97j399J557j130l15J785j866J294P1j257J593j050r3J219j491Q19M99
$$ -113 484 -915 642 -488 -803 982 -884 410 481 -776 817 -233 -326 893 -598 221 720
3817G20j523J309n60m48J424j610K52Q85j852K007m32r26J622j590P87O75j256
$$ 720 -803 506 -54 -502 922 -688 -436 449 -1403 604 172 -754 868 -722 65 740 -516
3834e16J289k32j059J401j400K27J325k082J499j55j475J991j608L09J053j633
$$ -516 773 541 -518 883 -517 -290 1035 -1047 452 297 -1178 813 -795 -486 567 -1066
3850a066J416jj193J575q96k99J232j529J288j32j189J695j177J00Q58j549R59
$$ -1066 350 349 -844 731 -165 -464 768 -761 527 395 -794 901 -276 -176 682 -867 92
3867I2L47j427J838j447O5J449j132K22L86j154J511o65n78J430j718J009K63
$$ 92 439 -988 850 -597 -532 917 -215 7 393 -761 750 85 -493 937 -781 228 491
3884D91j532J661m81r18J597j641R27N01j402J465n92p03J588j368M91Q39j685
$$ 491 -1041 620 139 -779 818 -823 104 605 -797 668 76 -627 961 -407 84 923 -762
3901g62J445n08o35J389j411L22O45j590J683n29q08J661j459L06P80j415J487
$$ -762 683 175 -460 929 -482 -160 485 -1105 578 49 -759 902 -557 -251 529 -886 601
3918F01m32q99J489j062K93Q94j369Q37K00j331J844j173l02J255j672R35M27
$$ 601 169 -730 759 -303 -10 884 -485 352 552 -779 1065 -108 -410 845 -827 108 535
3935E35j556J957j182k43J227j620R79K65j413J971j018l87J360j712P43M91r41
$$ 535 -1021 936 -246 -489 738 -882 97 362 -1051 920 -98 -485 875 -837 -94 397 -544
3952e44J266q57l62J394j524P80M47j571J475q6j109J500j391P77N91j860J545
$$ -544 722 -135 -497 897 -627 153 600 -971 504 418 -691 809 -582 195 786 -1074 471
3969D71m36o36J440j262K51R11j383J203k47p60J227j157Q1P83j425J335l15j067
$$ 471 35 -601 839 -423 -172 739 -644 559 312 -448 779 -378 -297 486 -939 396 81 -986
3987i86J634j212L50J144j771J216P1j092J536j002P3R08j724J069J83j255J604
$$ -986 648 -564 -214 930 -841 375 446 -646 890 -112 -39 869 -855 214 397 -858 746
4004G46j064n06J588j490P88M02j251J541p33o01J453j151N72K60j479J753r88
$$ 746 -318 -824 764 -726 62 464 -787 754 21 -580 873 -278 294 554 -925 828 -160
4021a60n73J410j275O00K42j241J373l15o14J304j155M22P46j591J679p85o77
$$ -160 -733 677 -598 2 244 -997 376 61 -553 751 -404 18 764 -827 852 67 -610
4038f10J578j478M37Q40j609J181m28p45J548j334N15Q13j281J169l27q83J768
$$ -610 968 -510 -73 767 -842 339 -89 -834 714 -620 -105 708 -573 596 269 -614 1154
4055A154j347J56J018j611J099n13p95J585j282M33P92j415J063J3j169J583r77
$$ 1154 -193 -37 981 -630 469 -44 -839 746 -536 -103 689 -726 337 350 -819 764 -213
4072b13k06J145j511J266k26p71J453j151k26J112j464Q98L77j312J400o51l58
$$ -213 -419 726 -785 481 255 -516 937 -214 -440 672 -792 106 483 -829 571 -80 -438
4089d38J305j400N55M14j074J164p58k65J367j640O16P00j291J363o25n50J072
$$ -438 867 -533 22 436 -638 526 -232 -497 870 -770 -154 546 -745 618 -7 -557 515
4106E15j084Q31K70j206J095l31r01J753j467O00P76j944J224l3o31J177j077
$$ 515 -569 262 532 -674 421 90 -811 942 -525 75 851 -1093 131 98 -533 644 -433
4123d33J21J027j594J223m8j211J795j311J13R85j526J218m0q69J153q34p5Q39
$$ -433 -312 715 -879 344 296 -915 880 -431 -318 667 -859 359 319 -550 603 -231 -306 533
4141E33j368J202J2j290J764p82n60J103j206N84M20j141J473o05m11J337j837
$$ 533 -835 367 379 -911 853 71 -489 614 -592 -8 412 -729 744 139 -272 1065 -772
4158g72R26M56j401J229p86k39J209j449Q11N45j466J335k79q70J448j475O00
$$ -772 154 610 -791 438 -348 -587 622 -827 -16 529 -937 398 119 -751 697 -778 -178
4175a78O42j398J674q88k67J313j487N12Q64j535J081n2j223J691r02Q0O56j361
$$ -178 464 -934 740 -148 -415 898 -589 -77 787 -748 333 281 -942 749 -153 -73 583 -778
4193g78J144L24j272J454j116k0J007j394J207n60p16J249j137O78O81j726J170
$$ -778 366 690 -582 872 -244 -264 743 -651 556 -4 -720 529 -608 70 751 -975 195
4210A95Q4r42J533r53m73J495j737J232J48j410J169n41l42J095j408Q50L96j218
$$ 195 279 -663 870 -83 -556 939 -798 434 582 -828 341 -200 -542 553 -855 -5 391 -827
4228h27J481o30n34J355j342N58L18j168J450n57n25R70j244L64Q60j701J255
$$ -827 654 24 -510 845 -497 61 379 -789 661 104 -421 549 -695 -331 529 -1172 83
4245H3K2o98J611j578R20J19j094R54k13n10J200j412j05J088j357J285o7p80
$$ 83 105 -593 1018 -560 360 479 -615 339 126 -384 816 -596 -701 387 -970 315 248 -532
4263e32J201j205L82J171j937J440k39j180J345n25j74J225j756J088m43m31J072
$$ -532 669 -536 -154 1017 -920 520 281 -899 446 -79 -253 972 -784 304 -139 -570 502
4280E02r05K80O94j192O37M79j024J186p06j58R68j780J555j25j171J452m91o86
$$ 502 -403 -123 571 -621 16 495 -529 657 -49 -207 761 -1019 536 411 -760 692 201 -485
4298d85Q48r72M88M96j251J710q86k84R40j398O63J009j814J694o59q78J702j482
$$ -485 363 -609 -121 375 -876 834 -52 -336 604 -794 -131 878 -936 758 99 -779 923 -559
4316e59M28O63j398J485q33k47J122j204O12L95j163R94l77o27J451j196N7J509
$$ -559 -131 532 -866 619 -214 -461 661 -543 69 464 -699 295 -82 -709 742 -454 -397 1112
4334A112k041J376l93q72J538j004L75N23j349J330n96p12J656r86J8J014j959
$$ 1112 -929 447 54 -818 720 -284 91 614 -735 595 -1 -713 943 -43 -25 989 -970
4351i70J439p4j233J438p72j61Q29j296J193J61j420J870j019l76J457j662M11
$$ -970 469 395 -838 600 -172 -333 496 -800 393 554 -866 1004 -15 -391 1066 -596 -185
4368a85J157j608J323o08m93J043j315M71N53j257J297m87n16J544j890J066Q60
$$ -185 972 -636 687 79 -414 629 -686 -215 338 -919 378 -109 -625 919 -971 95 955
4385I55j622R67j75n22J085j097L71P78j537J173J28q83J362j326K11N19j125
$$ 955 -667 300 125 -397 688 -409 -38 740 -797 376 504 -379 983 -343 -132 387 -738
4402g38J068k69j032J730j157K16R60j291P31o2q17J358j031L35P60j492J176
$$ -738 330 61 -971 759 -398 -182 778 -513 218 156 -661 697 -334 1 761 -731 445
4419D45j64o67J308j484K8J477j539Q27P57j428Q70p24l57J402j448R08J46j027
$$ 445 281 -386 922 -562 -534 943 -596 231 988 -440 430 -294 -651 751 -697 211 357 -670
4437f70J245q85o5R86j353J000K77j428J176k04r24J209p32O64J57j257J172o30
$$ -670 575 -310 -375 611 -742 258 535 -893 283 79 -845 364 -368 296 453 -804 368 -262
4455b62m33J463j105J22Q74j225P88j54p52J476r14q1O35j204J824q89q71J255
$$ -262 -695 768 -337 -215 659 -566 222 68 -684 792 -122 -203 432 -772 1052 163 -708 547
4473E47n96J12Q61j593Q87J57j229K143j596J94R65j568J156j08j039J200l83
$$ 547 -49 63 924 -669 218 375 -854 1289 -307 -113 852 -716 440 332 -707 493 110
4490A10k20R91j343R08l03n72J035j010k53J375j488P82N49j696J784r20j79J145
$$ 110 -110 881 -462 446 143 -429 606 -404 -657 718 -770 12 561 -1135 649 -271 -450 695
$$ [...]
8191b35
##END NTUPLES=NMR FID
##END=
