##TITLE=1H_50-2022
 CDCl3
 8 sc, 
 26.07.2022
##JCAMPDX= 6.0         $$ Bruker NMR JCAMP-DX V2.0
##DATA TYPE= NMR SPECTRUM
##DATA CLASS= NTUPLES
##ORIGIN= UXNMR, Bruker Analytische Messtechnik GmbH
##OWNER= root
$$ XWIN-NMR		Version 3.5
$$ Tue Jul 26 15:40:16 2022 Russian Standard Time (UT+4h)  she@DPX200
##.OBSERVE FREQUENCY= 200.1313499994
##.OBSERVE NUCLEUS= ^1H
##.ACQUISITION MODE= SIMULTANEOUS
##.ACQUISITION SCHEME= undefined
##.AVERAGES= 8
##.DIGITISER RES= 18
##SPECTROMETER/DATA SYSTEM= spect
##.PULSE SEQUENCE= zg30
##.SOLVENT NAME= DMSO
##.SHIFT REFERENCE= (INTERNAL, DMSO, 0, 15.7766)
##AUDIT TRAIL= $$ (NUMBER, WHEN, WHO, WHERE, WHAT)
$$ ##TITLE= Audit trail, XWIN-NMR		Version 3.5
$$ ##JCAMPDX= 5.01
$$ ##ORIGIN= Bruker BioSpin GmbH
$$ ##OWNER= she
$$ F:/spectra/data/she/nmr/H-F/1/pdata/1/auditp.txt
$$ ##AUDIT TRAIL=  $$ (NUMBER, WHEN, WHO, WHERE, WHAT)
(   1,<2022-07-26 15:39:08.75 +0400>,<she>,<DPX200>,
      <created by zg, POWCHK disabled, PULCHK disabled
       configuration hash MD5:
       00 E9 B6 7A A2 85 ED C7 34 08 36 98 17 FE 4E 26
       data hash MD5: 16K
       AA 00 25 DF 90 F7 64 50 E2 9B 72 56 82 85 F0 A4>)
(   2,<2022-07-26 15:39:11.06 +0400>,<she>,<DPX200>,
      <Start of raw data processing
       efp BC_mod = 2 LB = 0.24 FT_mod = 6 PKNL = 1 PHC0 = -18038.4 PHC1 = 9.20068 SI = 16K 
       data hash MD5: 16K
       6D A0 70 BD 73 81 C2 94 90 B9 F1 49 9E F5 BC 34>)
(   3,<2022-07-26 15:39:31.76 +0400>,<she>,<DPX200>,
      <pk PHC0 = -0.4600874 PHC1 = 0.4 
       data hash MD5: 16K
       F0 4F 24 76 0D 7E 66 6E 3D F7 E5 37 47 7F A8 0F>)
(   4,<2022-07-26 15:39:34.65 +0400>,<she>,<DPX200>,
      <abs ABSG = 5 
       data hash MD5: 16K
       AC DC EE 31 B0 4F F7 D7 DC 0F 6B FB 85 F7 73 48>)
$$ ##END=
$$ 
$$ hash MD5
$$ 9C 8F 1E 49 4D FF 42 FA 19 32 D9 E0 99 6C F7 BA
##$RELAX= 
##$RELAX= 
##$RELAX= 
##$RELAX= 
##$RELAX= 
##$RELAX= 
$$ Bruker specific parameters
$$ --------------------------
##$DU= <F:/spectra>
##$EXPNO= 1
##$NAME= <H-F>
##$PROCNO= 1
##$TYPE= <nmr>
##$USER= <she>
##$AMP= (0..31)
100 100 100 100 100 100 100 100 100 100 100 100 100 100 100 100 100 100 
100 100 100 100 100 100 100 100 100 100 100 100 100 100 
##$AQSEQ= 0
##$AQ_mod= 1
##$AUNM= <au_zg>
##$AUTOPOS= <>
##$BF1= 200.13
##$BF2= 200.13
##$BF3= 200.13
##$BF4= 200.13
##$BF5= 200.13
##$BF6= 200.13
##$BF7= 200.13
##$BF8= 200.13
##$BYTORDA= 1
##$CFDGTYP= 0
##$CFRGTYP= 5
##$CHEMSTR= <none>
##$CNST= (0..31)
1 1 145 1 1 1 1 1 1 1 1 1 1 1 1 1 1 1 1 1 1 1 1 1 1 1 1 1 1 1 1 1 
##$CPDPRG= <>
##$CPDPRG1= <>
##$CPDPRG2= <>
##$CPDPRG3= <>
##$CPDPRG4= <mlev>
##$CPDPRG5= <mlev>
##$CPDPRG6= <mlev>
##$CPDPRG7= <mlev>
##$CPDPRG8= <mlev>
##$CPDPRGB= <>
##$CPDPRGT= <>
##$D= (0..31)
0 1.2 0 0 0 0 0 0 0 0.06 0 0.03 0 0 0 0 0.0002 0 0 0 0 0 0 0 0 0 0 0 0 
0 0 0 
##$DATE= 1658835548
##$DBL= (0..7)
120 120 120 120 120 120 120 120 
##$DBP= (0..7)
150 150 150 150 150 150 150 150 
##$DBP07= 0
##$DBPNAM0= <>
##$DBPNAM1= <>
##$DBPNAM2= <>
##$DBPNAM3= <>
##$DBPNAM4= <>
$$ [...]
##$SUBNAM2= <"">
##$SUBNAM3= <"">
##$SUBNAM4= <"">
##$SUBNAM5= <"">
##$SUBNAM6= <"">
##$SUBNAM7= <"">
##$SUBNAM8= <"">
##$SUBNAM9= <"">
##$SW= 18.0517283424941
##$SWIBOX= (0..15)
0 0 2 0 0 0 0 0 0 0 0 0 0 0 0 0 
##$SW_h= 3612.71676300578
##$TD= 16384
##$TD0= 1
##$TE= 0
##$TE2= 300
##$TE3= 300
##$TEG= 300
##$TL= (0..7)
0 120 120 120 120 120 120 120 
##$TP= (0..7)
150 150 150 150 150 150 150 150 
##$TP07= 0
##$TPNAME0= <>
##$TPNAME1= <>
##$TPNAME2= <>
##$TPNAME3= <>
##$TPNAME4= <>
##$TPNAME5= <>
##$TPNAME6= <>
##$TPNAME7= <>
##$TPOAL= (0..7)
0.5 0.5 0.5 0.5 0.5 0.5 0.5 0.5 
##$TPOFFS= (0..7)
0 0 0 0 0 0 0 0 
##$TUNHIN= 0
##$TUNHOUT= 0
##$TUNXOUT= 0
##$USERA1= <user>
##$USERA2= <user>
##$USERA3= <user>
##$USERA4= <user>
##$USERA5= <user>
##$V9= 5
##$VALIST= <valist>
##$VCLIST= <CCCCCCCCCCCCCCC>
##$VD= 0
##$VDLIST= <DDDDDDDDDDDDDDD>
##$VPLIST= <PPPPPPPPPPPPPPP>
##$VTLIST= <TTTTTTTTTTTTTTT>
##$WBST= 1024
##$WBSW= 4
##$XGAIN= (0..3)
0 0 0 0 
##$XL= 0
##$YL= 0
##$YMAX_a= 931973
##$YMIN_a= -793252
##$ZGOPTNS= <>
##$ZL1= 120
##$ZL2= 120
##$ZL3= 120
##$ZL4= 120
##$ABSF1= 15.73587
##$ABSF2= -2.315979
##$ABSG= 5
##$ABSL= 3
##$ALPHA= 0
##$AQORDER= 0
##$ASSFAC= 0
##$ASSFACI= 0
##$ASSFACX= 0
##$ASSWID= 0
##$AUNMP= <proc_1d>
##$AZFE= 0.1
##$AZFW= 0.1
##$BCFW= 0
##$BC_mod= 2
##$BYTORDP= 0
##$COROFFS= 0
##$CY= -3
##$DATMOD= 1
##$DC= 0
##$DFILT= <>
##$DTYPP= 0
##$F1P= 0
##$F2P= 0
##$FCOR= 1
##$FTSIZE= 16384
##$FT_mod= 6
##$GAMMA= 0
##$GB= 0
##$INTBC= 1
##$INTSCL= 0
##$ISEN= 128
##$LB= 0.24
##$LEV0= 0
##$LPBIN= 0
##$MAXI= 10000
##$MC2= 0
##$MEAN= 0
##$ME_mod= 0
##$MI= 1.114404
##$NCOEF= 0
##$NC_proc= -5
##$NLEV= 6
##$NOISF1= 3.799351
##$NOISF2= 2.8
##$NSP= 0
##$NTH_PI= 0
##$NZP= 0
##$OFFSET= 15.77664
##$PC= 1
##$PHC0= -18038.86
##$PHC1= 9.600679
##$PH_mod= 1
##$PKNL= yes
##$PPARMOD= 0
##$PSCAL= 0
##$PSIGN= 0
##$REVERSE= no
##$SF= 200.129998979969
##$SI= 16384
##$SIGF1= 3
##$SIGF2= 2
##$SINO= 5.538805
##$SIOLD= 16384
##$SREGLST= <1H.CDCl3>
##$SSB= 0
##$STSI= 16384
##$STSR= 0
##$SW_p= 3612.71676300578
##$SYMM= 0
##$S_DEV= 0
##$TDeff= 16384
##$TDoff= 0
##$TI= <>
##$TILT= no
##$TM1= 0
##$TM2= 0
##$TOPLEV= 0
##$USERP1= <user>
##$USERP2= <user>
##$USERP3= <user>
##$USERP4= <user>
##$USERP5= <user>
##$WDW= 1
##$XDIM= 16384
##$YMAX_p= 369955479
##$YMIN_p= -264354
$$ End of Bruker specific parameters
$$ ---------------------------------
##NTUPLES= NMR SPECTRUM
##VAR_NAME=  FREQUENCY,     SPECTRUM/REAL,   SPECTRUM/IMAG
##SYMBOL=    X,             R,               I
##VAR_TYPE=  INDEPENDENT,   DEPENDENT,       DEPENDENT
##VAR_FORM=  AFFN,          ASDF,            ASDF
##VAR_DIM=   16384,         16384,           16384
##UNITS=     HZ,            ARBITRARY UNITS, ARBITRARY UNITS
##FACTOR=    0.220516191357247, 1,           1
##FIRST=     3157.37893477022, 0,            0
##LAST=      -455.337828235557, 0,           0
##MIN=       -455.337828235557, -264354,     0
##MAX=       3157.37893477022, 369955479,    0
$$ Real data points
##PAGE= N=1
##DATA TABLE= (X++(R..R)), XYDATA
$$ [...]
6410F3943l2116k3242p4857j9581J1385j5152m0504K8085Q5863M189N0136j2565
6398B5584o637q1491n3064R3426m4524j2741m4541l7459J72274k172n5636O0090
6386A3109O8593q6681m4177K5894k2359k4675j1743k9713Q3148j0793m0736M3401
6374c6732o7186L6289O3030q824K7080k9902m5069k5916O5238J353K3195N5573
6362E8129j8201j4615n9794n4712l7420Q6493K3173p3673J8019j0414L7558Q533
6350c6924j1271O2963N0001r4744n7586L9245R696M3177j4944j1509j4233j3061
6338d9190M5500K8197q192J7003q3477p4790M1292K8570M6895J0287k3176Q671
6326a2410K9177n7279l6631k2258L3986J01167o9230p2856K8781N1134o3300k3629
$$ plain form
6410 63943 31827 8585 -66272 -85853 -74468 -89620 -130124 -102039 -16176 -11987 38149 25584
6398 25584 18947 -62544 -115608 -22182 -66706 -79447 -123988 -161447 10827 8655 -46981 13109
6386 13109 81702 -4979 -49156 -23262 -45621 -70296 -82039 -111752 -28604 -39397 -80133 -36732
6374 -36732 -103918 -67629 -4599 -13423 13657 -16245 -61314 -87230 -21992 -20639 2556 58129
6362 58129 39928 25313 -34481 -89193 -126613 -40120 -16947 -90620 -72601 -83015 -45457 -36924
6350 -36924 -48195 14768 64769 -29975 -87561 -48316 -38620 4557 -10387 -21896 -36129 -49190
6338 -49190 -3690 24507 16315 33318 -50159 -124949 -83657 -55087 -8192 2095 -21081 -12410
6326 -12410 16767 -40512 -77143 -99401 -65415 35752 -33478 -106334 -77553 -26419 -89719 -113348
6314a13348J00439L7854j6253k0401N6165j19074n3637J7011k3061O4801R970
6303e9534K1093K7060N3510J7178m9785m6453q195k89q0800Q2532J01509m2987
6291A4839j400p0133L3117j9835K2453p7592Q8572m9711M9753J0663N4610l2796
6279B2540n2751K1078K4262J4659j01802K3182J0388K8862n106o6064P311L7624
6267c5817o260n0471L1043M3389q9405J14313j9870MK5415J6998m0055m8860N0051
6254i525J34413m4213j15064j089k0769K9952N8236j1709l0387j870m3027l6548
6242i1600L857N8155Q3013j2813p4019n0514M226n769M6182M6686j8215k0941
6230c1752j0115m8157J6447Q1387J7446j2141n6414j258J9461K1467k3859n1126
$$ plain form
6314 -113348 -12909 24945 8692 -11709 44456 -74618 -128255 -111244 -134305 -69504 -59534
6303 -59534 -38441 -11381 42129 59307 9522 -36931 -45126 -45415 -126215 -43683 57826 14839
6291 14839 13439 -56694 -23577 -43412 -20959 -98551 -9979 -59690 -9937 726 55336 22540
6279 22540 -30211 -9133 15129 29788 -72014 -48832 -38444 -9582 -14688 -80752 -73441 -35817
6267 -35817 -42077 -92548 -61505 -18116 -107521 6792 -13078 -13074 12341 29339 -10716 -59576 -9525
6254 -9525 124888 80675 -34389 -35478 -56247 -26295 31941 20232 -10155 -12025 -55052 -91600
6242 -91600 -87743 -29588 53425 40612 -33407 -83921 -79695 -85464 -39282 7404 -10811 -31752
6230 -31752 -41867 -90024 -73577 7810 25256 13115 -43299 -44557 -25096 -3629 -27488 -78614
6218g8614j8118K0386l570k7119L2622K9969J6762L0782j3117j5520J7676k5844
6206c3705J8433l4874l7054L3895Q5839o8552K6543p006o149Q527M0987K9307
6194E6191p8896Q8315n0516q942p426m4168P5315n4742Q408Q2719l8165L816L7715
6181F9624O242k8531n3802j04708j8093J44826k5942j03622P8118j7202p977l6751
6169i7818k2493L6635M4180K9551q8349l972K5985M0378o8938K7963J5729L2739
6157b8410J10474M1982j78791j0163M4831m4486N6777j0945m8017k1670K8264
6146f0154K7234j1424q0353J0729O1183m451M5539L7346N725q8005L3215R795
6134a3621l4374R283l2154J9198L3965M7869l8257j2744n3216j0406J5676R2639
$$ plain form
6218 -78614 -96732 -76346 -79916 -107035 -74413 -44444 -27682 3100 -10017 -25537 -7861 -33705
6206 -33705 -15272 -50146 -87200 -53305 32534 -36018 -9475 -16481 -22630 -14103 26884 56191
6194 56191 -22705 65610 15094 6152 -1274 -45442 29873 -24869 -16461 66258 28093 31909 69624
6181 69624 75866 47335 -6467 -111175 -129268 15558 -10384 -114006 -35888 -53090 -61067 -97818
6169 -97818 -120311 -83676 -39496 -9945 -98294 -102266 -76281 -35903 -104841 -76878 -61149 -28410
6157 -28410 82064 124046 -54745 -64908 -20077 -64563 -7786 -18731 -66748 -88418 -60154
6146 -60154 -32920 -44344 -124697 -113968 -52785 -57236 -11697 25649 31374 -56631 -23416 -13621
6134 -13621 -47995 -38712 -70866 -51668 -17703 30166 -8091 -20835 -74051 -84457 -68781 23858
6122B3858k5827j6553n9767M7723P280j9916M682J2446J1726r8657R840L7601
6110f5564k9708J0575N6795m1302J0943p0003J127J24178q1039k2931O1773j91
6098d5347O1697L0219k3075O8682p9992p5669L197k7412k435n058L6409r217O9580
6085A579k6684O890l6150j6270L1442q411P2821q9179N2680L8898K2513J2721
6073F2850k6715p517k3255l5659K2373l157r285o776J1452j0556q427P3158J6003
6060E4489M641k9913k5939K5624k0613k1311K2805J5518j7457n9110j6166j5518
6048h2950J2196j937P0668N19j8493l8159r296L2174k4014R0175m0336j8020j9908
6035d7381M771K3690L874P6287P2558P751n8086k4519L128l1852j20454l281r124
$$ plain form
6122 23858 -1969 -18522 -78289 -30566 -23286 -43202 -38520 -26074 -14348 -113005 -103165 -65564
6110 -65564 -95272 -84697 -27902 -69204 -58261 -128264 -127137 -2959 -83998 -106929 -45156 -45347
6098 -45347 16350 46569 23494 92176 12184 -63485 -60288 -87700 -90135 -95193 -58784 -68001 1579
6085 1579 -25105 -18215 -54365 -70635 -39193 -47604 25217 -63962 -11282 27616 50129 62850
6073 62850 36135 28618 5363 -30296 -7923 -11080 -20365 -27141 -15689 -26245 -34672 38486 54489
6060 54489 59130 29217 3278 28902 8289 -13022 9783 25301 7844 -51266 -67432 -82950
6048 -82950 -70754 -72691 -2023 -1504 -19997 -58156 -67452 -35278 -59292 30883 -9453 -27473 -47381
6035 -47381 -42610 -18920 -15046 61241 133799 141550 83464 58945 62073 30221 -90233 -93514 -102638
6022a02638k144N7133K3122j1139q0012j9854O4735j3647K4794P1439Q4434n1253
6010D4970n0874M479J2337p086m6288M279N968J6233j7486N6948k4462k2346K8075
5997D747q7545K5369M8492n2861J1849j094M8154Q5154L906p1293L955o8149K8155
5984b1161k7729m9583M7626J9893M4734l4403k3303l1435L4210L7588k9662q6056
5972a19281Q0199J7288K0541j0049N227m4498j7277Q098k5206K6351R8856J6366
5960E6615q2566j6832q469Q5177l0764n8917J1096N440o5328P186P6542J2618
5948h202M277m7678l7441L9794L4253K2852j3750m6652m1763p84N619Q656O2325
5935a8494n9520J3626M1166J5906J390J3142N6643P6781p2253j03703M2365J8110
$$ plain form
6022 -102638 -104782 -47649 -24527 -35666 -115678 -135532 -70797 -84444 -59650 11789 96223 44970
6010 44970 -5904 -1425 10912 3826 -42462 -38183 -32215 -15982 -33468 23480 -982 -23328 4747
5997 4747 -82798 -57429 -8937 -61798 -49949 -51043 -2889 82265 86171 14878 18833 -49316 -21161
5984 -21161 -48890 -98473 -50847 -30954 13780 -20623 -43926 -75361 -41151 -3563 -33225 -119281
5972 -119281 -39082 -21794 -1253 -11302 -6075 -50573 -67850 -59752 -84958 -58607 40249 56615
5960 56615 -25951 -42783 -51252 33925 3161 -55756 -44660 -39220 -104548 -97362 -20820 -8202
5948 -8202 -3925 -51603 -89044 -49250 -14997 7855 -5895 -52547 -94310 -95094 -89475 -80819 -18494
5935 -18494 -78014 -64388 -23222 -7316 -5926 7216 63859 140640 68387 -35316 7049 25159
5923B5159N659r91N2427r3656l6616K1231p0991R1969L4109l3271M1833q023j03751
5910g4912L2832K2286o128J5211n696K6208m0512k2802k662K8576R4523M7634
5898A14558q7799K4360M7776l2225l9677q3923K8357O910N2246J8097j199o728
5886D0753l2770L0957q9185K6756J6232j6228N160K5416j03225O0752J8902l9361
5874e5841L6336Q4758r029L191k3278j28004J6989R6259K5914o4976p9822j0877
5862a08380O2612N2480l1836j9738m0291j02383J03281j8756M509J00401O5304
5851F7203J5672q8904O1005p8361n1406O9091J5899N9688j9050m288K3460l3815
5839C6194r7680K3382l8889N0741O6819o3883M8227J5305q050k0147K6682q1535
$$ plain form
5923 25159 30818 29827 82254 -11402 -48018 -26787 -97778 -5809 28300 -4971 36862 28839 -74912
5910 -74912 -42080 -19794 -25922 -10711 -16407 9801 -30711 -53513 -56175 -27599 66924 114558
5898 114558 26759 51119 98895 66670 26993 -56930 -28573 -21663 30583 48680 47481 40753
5886 40753 7983 38940 -50245 -23489 -7257 -23485 -18325 7091 -96134 -35382 -16480 -55841
5874 -55841 -19505 65253 56224 59415 36137 -91867 -74878 21381 47295 -17681 -97503 -108380
5862 -108380 -45768 6712 -25124 -44862 -85153 -187536 -84255 -103011 -98502 1899 67203
5851 67203 82875 -6029 54976 -23385 -74791 -5700 10199 69887 50837 46549 70009 36194
5839 36194 -61486 -38104 -76993 -26252 40567 -23316 24911 40216 32166 12019 38701 -42834
5827d2834M1809P4249j8259k5682l3394L8863j6829O9315r3540n6100K3665L348
5815c5389j1020K8221m1147M5387K8212j7472k9081L2337m2176l7147k1317j6416
5803a17008J01235l1047J5404m9413J14045R616p1240l9677N3664L5079P5852
5792I6510r2638L8020m5540k8477P4783q9258o6502P8107P9615n5165k6137m328
5780d1010M861j1818L6374J8891J4487R381q179m9891O310p0659Q8924M9113O2535
5767A09319l5989m0992q4350j9384P9900P0117l1676J5250o3529l698K3659M7196
5755F5823j4613m9150J9189j4082P91k5527m9163j0015j4032j647N0617j7908
5743e9717J2529M9644L5850m6035P5198j5532j03108O0370P0931j08349n5151
$$ plain form
5827 -42834 -1025 73224 54965 29283 -4111 34752 17923 87238 -6302 -62402 -38737 -35389
5815 -35389 -46409 -18188 -59335 -13948 14264 -3208 -32289 48 -42128 -79275 -100592 -117008
5803 -117008 -15773 -46820 -31416 -80829 33216 42832 -28408 -68085 -14421 20658 96510
5792 96510 3872 41892 -3648 -32125 42658 -46600 -113102 -34995 44620 -10545 -36682 -41010
5780 -41010 -36149 -47967 -11593 7298 21785 31166 22987 -26904 -20594 -91253 -2329 46784 109319
5767 109319 73330 32338 -52012 -71396 8504 78621 46945 62195 -1334 -5032 18627 65823
5755 65823 51210 2060 21249 7167 7958 -17569 -66732 -76747 -90779 -92426 -41809 -59717
5743 -59717 -47188 2456 38306 -7729 67469 51937 -51171 9199 80130 -28219 -83370
5732h3370L7999N6564R983k8675k4018k1588O9058O0385j1151J5135n5338l5107
5720a0123k7792L2782k5480K3150K456m0720M2286o736n1485M315l8202P4972
5708b0577K8604k7785P8563m7287J4899K1961K3111Q5015q8182l4626O727M384
5696D4807J0703j8038Q2971m2249l1791r6723L0132L3701J8942J652p3390K8904
5684a0379L8338O133L2136j9156n4626R1119p3378K3097l6992L4765m716o8612
5672d2271N9992p882K2078k1494j667K7251n782M240J7493m8282M096K6749k0449
5659A4072j1838k0948K3715K2388J8239n9572J3940j8586l4055K7033r1213P5245
5647d1580J12100j3810m0683l415j9662J4656k6267P9293J0362n531k0957n7995
$$ plain form
5732 -83370 -45371 11193 21176 -7499 -31517 -53105 15953 76338 65187 80322 24984 -10123
5720 -10123 -37915 -5133 -30613 -7463 -5007 -45727 -3441 -10177 -61662 -57347 -95549 -20577
5708 -20577 8027 -19758 58805 11518 26417 48378 71489 156504 68322 33696 40423 44807
5696 44807 55510 37472 120443 78194 46403 -50320 -20188 13513 32455 34107 -39283 -10379
5684 -10379 27959 34092 66228 47072 -7554 83565 10187 33284 -3708 31057 26341 -42271
5672 -42271 17721 9839 31917 10423 8756 36007 30225 34465 51958 3676 7772 34521 14072
5659 14072 2234 -18714 5001 27389 45628 -13944 -4 -18590 -52645 -25612 -116825 -41580
5647 -41580 70520 56710 16027 12612 -7050 7606 -18661 60632 70994 65463 44506 -13489
5635a3489o251K3006M271M5926N4532J21j2926n9566m8184O600j8343J3910L765
5622f628M0693j0584k3712J02357K5458l9384k9835J422m2342M2686O6096n6239
5610F9988p4558Q795j0972l1082o388l159K8924O68l0943N2567K9889j8741n1276
5597c6288k931Q6771k9463j8089R2243k2561j1417n2015k8347K9935l513p224
5585b899K3861l3183q324J7290l2005J9369L4824N1899l2415K6808J0318l1157
5573D4386M7893p6427j036m6032K2686J07356l4041q8523K0783Q8488j613m8474
5561C5446j1686Q5683J5499k6213j9039m496L0018k6994j6681l8978N4517n6258
5549B0818l9021P075m0579O3667J1360M076o955k863O096j0434M9800j6296r861
$$ plain form
5635 -13489 -19740 3266 7537 53463 107995 108116 95190 35624 -12560 -5960 -24303 -10393 -6628
5622 -6628 34065 23481 -231 102126 127584 88200 58365 59787 17445 60131 126227 69988
5610 69988 -4570 4225 -6747 -37829 -44217 -47376 -18452 -17784 -48727 3840 33729 14988 -36288
5597 -36288 -39219 47552 18089 0 92243 69682 58265 6250 -22097 7838 4325 -2899
5585 -2899 20962 -12221 -20545 -3255 -35260 -15891 18933 70832 38417 65225 75543 44386
5573 44386 92279 15852 14816 -31216 -8530 98826 64785 -23738 -2955 85533 83920 35446
5561 35446 23760 109443 124942 98729 79690 75194 105212 78218 61537 22559 77076 20818
5549 20818 -18203 -11128 -51707 11960 23320 27396 20441 17578 23674 13240 63040 46744 36883
5536C6883K2857q9906O3764K0302l2310N3804L916n9440Q3040l9396l8046m0382
5524a4914k8463J235J3040O5899R355m545J2755K817r9142Q1217q8682J6795M9991
5511A7358q0110O4843l6945R938N158j5969J01497p0375l6672O631L7376O9860
5499G2590Q0340M0999j30951o0537r46j17184j0690J39866m983J4469n6221k191
5487c5439M2505n4173L4863N5596m8468j7518L8554L3856n2183O0727M1715J2689
5475A12724l7606O392M929o2948N8635j2213p7768L4856O8862J4702R646q7144
5463C3067j4466P74K4019P976k1824k0317J6920J3511N2201O320J6589p817J986
5450A08939K1994l9253q816j25613Q6543Q7168J0219p6241j8792L3613l894o315
$$ plain form
5536 36883 59740 -30166 33598 53900 21590 75394 79310 19870 102910 63514 25468 -14914
5524 -14914 -43377 -42142 -29102 36797 46152 41607 54362 57179 -41963 39254 -49428 -32633 17358
5511 17358 -62752 2091 -34854 -24916 -19758 -35727 65770 -4605 -41277 -34646 2730 72590
5499 72590 152930 193929 62978 2441 1495 -115689 -126379 13487 8504 22973 -33248 -35439
5487 -35439 7066 -47107 -12244 43352 -5116 -22634 15920 49776 -2407 58320 100035 112724
5475 112724 75118 81510 86439 23491 82126 69913 -7855 27001 95863 110565 120211 33067
5463 33067 18601 19375 43394 51370 29546 9229 26149 39660 91861 98181 114770 106953 108939
5450 108939 130933 91680 82864 -42749 43794 130962 141181 64940 46148 79761 75867 69552
5438F9552M8324n4406J4021N2383p5999j9628Q7736p5615O2398o731r554N3866
5426A46347r3192p1511J8443N07M6118J11108p7396M7794j3376K3967Q2393k059
5414B19143q1163p9550k0936Q4169M4215j6857p3931k6794J8488Q510Q897N2708
5402A36899J0260L905M5687l0233k8841J6366q84k4027Q762k3167m067O0565L0599
5389B01824j3609k1960q4212J1669k0157p7996R3264M2025K9066j028M6803r2023
5377A13666J9674n8208M1442p297N6015Q7023j15342r7939L957J14897p3356l6905
5365D7627L3563P031K3049m0360K8853K2071N6211l6903l3436l3040N2430M2221
5353A69317l6060K2653k3090j0400K1843M6549O385m1167n3144J519j1067N4833
$$ plain form
5438 69552 117876 63470 77491 129874 53875 34247 121983 46368 108766 102035 92481 146347
5426 146347 53155 -18356 87 594 46712 157820 80424 128218 114842 138809 221202 219143
5414 219143 137980 58430 37494 121663 165878 149021 75090 48296 66784 75294 84191 136899
5402 136899 147159 151064 196751 166518 137677 154043 153159 129132 137894 114727 110660 171225 201824
5389 201824 188215 166255 82043 93712 73555 -4441 88823 130848 159914 158886 205689 113666
5377 113666 133340 75132 116574 109277 165292 252315 136973 39034 42991 157888 84532 47627
5365 47627 81190 88221 111270 70910 99763 121834 178045 141142 107706 74666 127096 169317
5353 169317 133257 155910 132820 122420 144263 190812 197197 156030 102886 104405 93338 148171
5341A48171n4403N4753O92j9188J35257L4986l3324q5655l4898N7028L8946k5574
5329B16791N795K4916n4464N7313l383n172J4711m883o1420m8227R8998J4170
5317B55145o0644o809m3788k6694J8746K1895n0223N2995o149J7171j6472k6856
5305A28317o81K5526K3083M2619n6085l3734k2389J4287K2490j6875j4533n7364
5293E4661Q6775K202J413l8688N0647o5997K707N1076K9090k2196j10837L0294
5281G1147L7771L0543L4716J1882J7449R377n2555O178K0302j4690m5225k1547
5269A05348L0376N9930m2273p1254K9375J3898N3770j842N260K4610j07714M8710
5257A48194J1301m99J7380J0930r5630N3345R9720o90j3033m0107N8838n7927
$$ plain form
5341 148171 93768 148521 149213 130025 265282 300268 266944 181289 146391 203419 242365 216791
5329 216791 222586 247502 193038 250351 246968 241796 256507 251624 190204 141977 240975 255145
5317 255145 194501 187692 143904 117210 135956 157851 107628 160623 154474 171645 155173 128317
5305 128317 127636 153162 176245 218864 162779 129045 106656 120943 143433 126558 112025 54661
5293 54661 141436 143638 145051 106363 157010 91013 93720 144796 173886 151690 40853 71147
5281 71147 108918 139461 174177 186059 203508 212885 160330 166508 186810 172120 126895 105348
5269 105348 135724 195654 153381 82127 111502 125400 179170 177328 182588 207198 99484 148194
5257 148194 159495 158996 176376 187306 91676 145021 244741 244051 231018 190911 249749 191822
5245A91822m3110K8368q753O8312p8507R808J6197K2239N2434p3009L8608j9036
5233B05373r299r824k9139j2936L4351k7580J8162n1440l6103Q7477M1051p5666
5221A34427K8574l1919l2777L9149J12658n7269j28974P6842J04712n4532n9917
5210A30974K3222N0828k4740p7678P6674N4451k528K0043m7950l3924M8469m0553
5198A77288L0840J4085J9559l8036j0180K8253K3027J3645r6154o8332K8253O3392
5186A85640k4784L943k1950K6915O9762N945J6671o9980J1562P7632J6237p3996
5174B23597l7754o1296j7834J13140k7952j3649O1474m7357k6920O3140K2595
5163B51184k1779l4084l2722J3000n0789p947K9703j4141N6908m8827p481N8260
$$ plain form
5245 191822 148712 177080 168327 236639 158132 167940 184137 206376 258810 185801 224409 205373
5233 205373 196074 186250 157111 144175 178526 150946 169108 117668 81565 169042 210093 134427
5221 134427 163001 131082 98305 137454 250112 192843 63869 140711 245423 190891 130974
5210 130974 154196 205024 180284 102606 179280 233731 231203 251246 203296 169372 217841 177288
5198 177288 208128 222213 241772 203736 193556 221809 244836 258481 162327 93995 122248 185640
5186 185640 160856 164799 142849 169764 239526 245471 262142 192162 203724 281356 297593 223597
5174 223597 185843 124547 106713 219853 191901 178252 239726 192369 165449 228589 251184
5163 251184 229405 195321 162599 175599 124810 116863 146566 132425 189333 140506 133025 191285
5151A91285N6912N2830J70l6387o279J7608J36163L593n7583l5158m2621M6029
5139C26562o5631n7821O4980L5150n9076J3087L5991o7506J1434Q3651P178k1555
5127C06444j5695K9540P4599o2244K6576p8212j738O1942j0199k434j9310N0195
5115C59464K9928l2575P9508k427o7941j256j479m013q1848j5996M8142N7484
5103C66991O580n0872q1715N9944L0997N1422k4003M4333k0151M9733R251K52
5091D42762J6182K1507J0877N036L0695n3936N217J1728p8388m7369K5111q041
5079C81381J1749M0648N3737J5409M284k7086L703O214M417n1600Q8103L2199
5067E63158j1322j9895j1232k808R3565J4400o6428M1967J3594Q637r617O3390
$$ plain form
5151 191285 248197 301027 301197 264810 258531 276139 412302 415895 358312 323154 280533 326562
5139 326562 260931 203110 268090 303240 244164 257251 293242 225736 237170 320821 327999 306444
5127 306444 290749 320289 394888 332644 359220 281008 279270 341212 331013 328579 309269 359464
5115 359464 389392 356817 436325 433898 365957 364701 363222 359209 277361 261365 309507 366991
5103 366991 373571 322699 240984 300928 331925 383347 359344 403677 383526 433259 442510 442762
5091 442762 458944 480451 491328 496364 527059 473123 478340 490068 411680 364311 389422 381381
5079 381381 393130 433778 487515 502924 507208 480122 483825 490039 494456 442856 530959 563158
5067 563158 551836 531941 520709 517901 611466 625866 559438 601405 614999 623636 614019 677409
5055F77409M933o0686l3058M3970n3299L0318O9087l5014J2315o276k8639L6784
5043F57844l892M6349j0970m7800n480P8350l522j5497L4936L2325j5445J643
5031G48841j4329q8894l1059K0372K1114K2621K5647m2031k9803O6322J09660
5020H08461j1342o4040J1863p7345K1977Q4264L039m44m4814j5584R226J3814
5008G39075R291j2424M3940k0616o2971O641j4426j8502J4724k6943m1304J02007
4996G18492L0213M490M3706n1146n5583o986K6828K2214J3766r0555m4614k814
4984F08011O6073P9897j1856k6761q6461L7688j1608O5752O7377r634j1066k6557
4972G40855l9998L8389J987k7174M976q579P0253K0996m8865M1983k5700J676
$$ plain form
5055 677409 682342 621656 588598 632568 579269 609587 678674 643660 655975 649699 621060 657844
5043 657844 653952 700301 689331 641531 636051 714401 710879 695382 730318 762643 747198 748841
5031 748841 734512 645618 614559 634931 656045 678666 704313 662282 632479 698801 808461
5020 808461 797119 733079 744942 667597 689574 773838 776877 776433 731619 716035 725261 739075
5008 739075 748366 735942 779882 759266 696295 702936 688510 670008 684732 657789 616485 718492
4996 718492 748705 753195 796901 745755 690172 683186 710014 732228 745994 655439 610825 608011
4984 608011 674084 753981 742125 715364 628903 666591 654983 720735 788112 778478 767412 740855
4972 740855 700857 739246 741233 714059 719035 710456 780709 801705 752840 794823 769123 770799
4960G70799J266J7616m933m5934k7151K8114M972O120n6488L3356M0628k3390
4948G44975n0519N0237P6042j703J3127l3696l9259P2335L1973J4281J5796j1617
4936H81972m582q4864J2457N3116q180n9628O4207N5355p7739L0479J14141o7488
4924I09246J69P6917P467n4275K224K0494K709J1051N8578r3031r099O1684J8210
4911A012344J1387q4967j4339M1892O7462O6996Q9090L818L7638K5137j2778l1735
4899A211945N3407o831q0323l346M0435R7839K1131K0040K4768L6921l01n0471
4887A365214o1525P2725P8489j7849J8909n2531p2597J10528R4175O1031J9303
4876A615872L4869j6929J4849Q8600J0710K2056O7421k8868J8244k8576L6881
$$ plain form
4960 770799 772065 789681 784748 738814 711663 739777 744749 750869 694381 727737 768365 744975
4948 744975 694456 744693 820735 819032 832159 798463 759204 831539 863512 877793 893589 881972
4936 881972 877390 792526 804983 858099 849919 790291 854498 909853 832114 862593 976734 909246
4924 909246 909415 986332 993799 939524 941748 962242 964951 976002 1034580 941549 932450 994134 1012344
4911 1012344 1023731 938764 924425 966317 1033779 1100775 1189865 1193683 1231321 1256458 1243680 1211945
4899 1211945 1265352 1258521 1178198 1174852 1215287 1313126 1334257 1354297 1379065 1415986 1415685 1365214
4887 1365214 1303689 1376414 1454903 1437054 1455963 1403432 1330835 1441363 1535538 1596569 1615872
4876 1615872 1650741 1633812 1648661 1737261 1747971 1770027 1837448 1808580 1826824 1798248 1835129
4865A835129J23238p68M8937R8106J2249k9644J0466N6794J16503J01561K9524
4854B402095K159l1055n054R7063J8391J01677N2461O256M7897R3298M0153R3268
4842B918609Q0997P7360M7091J1371O7522P328P1456N6566J22452M0000J46680
4831C647432P7971P4682J23149l1726J00261J33017P1762R4139J45940J49590
4821D586217N5015J16028J44990J50667Q8786J05697J46715Q8751J22410J04761
4811E710037J39070K07165J87277R5782J29062J99610K07019J78001J88985K23072
4801G465080K46060J93902K13177K25205L42448K77106K43506K93390L85227K92506
4791A0177607K76352M21699M61711M09388L91600M41275M43842N41315M97214
$$ plain form
4865 1835129 1958367 1957599 2006536 2104642 2116891 2087247 2097713 2154507 2271010 2372571 2402095
4854 2402095 2404254 2373199 2368145 2465208 2483599 2585276 2637737 2643993 2691890 2785188 2825341 2918609
4842 2918609 2999606 3076966 3124057 3135428 3202950 3210278 3281734 3338300 3460752 3500752 3647432
4831 3647432 3725403 3800085 3923234 3891508 3991769 4124786 4196548 4290687 4436627 4586217
4821 4586217 4641232 4757260 4902250 5052917 5141703 5247400 5394115 5482866 5605276 5710037
4811 5710037 5849107 6056272 6243549 6339331 6468393 6668003 6875022 7053023 7242008 7465080
4801 7465080 7711140 7905042 8118219 8343424 8685872 8962978 9206484 9499874 9885101 10177607
4791 10177607 10453959 10875658 11337369 11746757 12138357 12579632 13023474 13564789 14062003
4782A4062003M73405N06901O60684P08870O78411O74736P28002O58091Q12550
4773A9963653P48247P29731P39711P72043P47760P27627P96766O77060O92968
4764B6595566P64676P58156P32007P04179P04946Q72591Q55761Q98869P84654
4755C3671405R19679R70683R81879J033875R97422J057943J026973R51913J120133
4746D2731905J068561R10941R54909R66452R13725Q62444P88728P56742Q08613
4737E0763020P73771P56365O83143O35625P65864P05986O57063O39338O84608
4728E7064783O81663O77794O91430P52845P42903O45148N71784O39143N65051
4719F3032544M49062N07344L91704M15237K05534K59252J42878Q4470J08539J2200
$$ plain form
4782 14062003 14535408 15042309 15702993 16411863 17090274 17765010 18493012 19151103 19963653
4773 19963653 20711900 21441631 22181342 22953385 23701145 24428772 25225538 25902598 26595566
4764 26595566 27360242 28118398 28850405 29554584 30259530 31132121 31987882 32886751 33671405
4755 33671405 34591084 35561767 36543646 37577521 38574943 39632886 40659859 41611772 42731905
4746 42731905 43800466 44711407 45666316 46632768 47546493 48408937 49197665 49954407 50763020
4737 50763020 51536791 52293156 52976299 53611924 54377788 55083774 55740837 56380175 57064783
4728 57064783 57746446 58424240 59115670 59868515 60611418 61256566 61828350 62467493 63032544
4719 63032544 63481606 63988950 64380654 64795891 65001425 65260677 65403555 65488025 65596564 65608764
4709F5608764j9200K2049O0812k741m415k3065J8149M9479l1708o9781p1259J8966
4697F5556050n3784p2525j09485j53848o2755k74593k85994k14000l47192m16421
4687F3565453m96889n34892o23788o48752o65255o85338o86989p07470o99553
4678E7816527p84610o64231p49545p45200p39428p56132p43447p45167q44140
4669E1044627p86860r14927q89432q80877j001454r72642j045208j038283j005662
4660D2509282j057963j071372j103586j127928j040388r56817r98680j067044
4652C4085504r79872r77105q49536q87791r12848p88923p57778o55526p50403
4643B6525722q40732p63818p07382p40884q01639p75875q05016p92284p78271
$$ plain form
4709 65608764 65589564 65611613 65672425 65669684 65665269 65642204 65660353 65709832 65678124 65608343 65537084 65556050
4697 65556050 65502266 65429741 65320256 65166408 65103653 64829060 64543066 64329066 63981874 63565453
4687 63565453 63068564 62533672 61909884 61261132 60595877 59910539 59223550 58516080 57816527
4678 57816527 57031917 56367686 55618141 54872941 54133513 53377381 52633934 51888767 51044627
4669 51044627 50257767 49342840 48453408 47572531 46571077 45598435 44553227 43514944 42509282
4660 42509282 41451319 40379947 39276361 38148433 37108045 36151228 35152548 34085504
4652 34085504 33105632 32128527 31278991 30391200 29478352 28689429 27931651 27276125 26525722
4643 26525722 25684990 24921172 24213790 23472906 22671267 21895392 21090376 20298092 19519821
4634A9519821o79777q37293q56906p26957p33667p45411n75381o52431o02968
4625A3109030n52692n38246m15251m51576m85237l62979k55580l51951l86011
4616I309507k87722k91135l56885k29842l44548k88215k35357k51311j69009j28761
4606F726722j57870k05692j87641j45110j11758j75742j13452k17481r1879j43342
4596E176755j26492j13959j43349j07468p5124k06530r5394l1094j02059q0326
4586D094960k8236q5381j20954j30557m1572j7653m9120o9502k11594m8606p6392
4575C215393p7056o5725R095j04301j02912j24394K6303q771o1001k3568j00620
4564B582443j35332m1450j4528J2833l7582j11315l9768M6597L8049j68821q7989
$$ plain form
4634 19519821 18840044 18002751 17145845 16418888 15685221 14939810 14364429 13711998 13109030
4625 13109030 12556338 12018092 11602841 11151265 10666028 10303049 10047469 9695518 9309507
4616 9309507 9021785 8730650 8373765 8143923 7799375 7511160 7275803 7024492 6855483 6726722
4606 6726722 6568852 6363160 6175519 6030409 5918651 5742909 5629457 5411976 5320097 5176755
4596 5176755 5050263 4936304 4792955 4685487 4610363 4403833 4308439 4277345 4175286 4094960
4586 4094960 4066724 3981343 3860389 3729832 3688260 3670607 3621487 3551985 3340391 3291785 3215393
4575 3215393 3138337 3072612 3081707 2977406 2874494 2750100 2776403 2767632 2706631 2683063 2582443
4564 2582443 2447111 2405661 2391133 2403966 2366384 2255069 2215301 2261898 2299947 2131126 2043137
4553B043137l514p1882J1314P650r4904o9040m851J7814L4871j07109n1693j3914
4541A697879Q445n0595k6957q099o1220M1433K5114n6665n9671m7732j9073j8082
4529A424777j6476J846k7667q6149n2871M4034M4580r9385p7528n3721j0991J097
4517A091546o6544q775R6521N0754l7629l0927m696K7375m090N638p4681k8493
4505A015999j7621M2627m7207m1311L6518J1782P0248k0570r8387O1000n6022
4494I57056m3305M8374m2706l1375R085P8681m3436q4098M1150N9459l7087l728
4482I08070L1148o1471N239k3508J0806J8159j8648n4956j1758M0640m0639l7576
4470G65506O2486K2076l7041L4424n6463J9237J2774l6687J8930q274j9897Q0590
$$ plain form
4553 2043137 2039623 1967741 1979055 1986705 1891801 1822761 1817910 1835724 1870595 1763486 1711793 1697879
4541 1697879 1706324 1655729 1628772 1620673 1559453 1600886 1626000 1569335 1509664 1461932 1442859 1424777
4529 1424777 1408301 1410147 1382480 1296331 1243460 1287494 1332074 1232689 1155161 1101440 1090449 1091546
4517 1091546 1025002 1016227 1112748 1163502 1125873 1094946 1090250 1117625 1113535 1119173 1044492 1015999
4505 1015999 998378 1041005 993798 952487 989005 1000787 1071035 1050465 952078 1013078 957056
4494 957056 913751 962125 919419 888044 897129 975810 932374 848276 889426 948885 911798 908070
4482 908070 939218 877747 882986 859478 870284 888443 869795 814839 803081 843721 803082 765506
4470 765506 827992 850068 813027 847451 790988 810225 822999 786312 805242 796968 777071 857661
4458H57661p0790q9101J02044L5644L787N7813J15683q4422n4876j9496Q6564
4447I40511n4656r036J661j6841J6813m8606J03251n8751M1875J4794M3160o4197
4435I09978k8829P3790J7948j0004L8229j0782J311O8497q3908r4806J01321O6829
4423A049574M1933K5772J0193l9047J6308O0314K2074j6987o4768n1615Q4140
4412A137891M8478j2438M7450j4662P5705o7713N669N7673L79K6493J5597L2446
4400A352968J9757K735K4383J0990M8402r803l0235m858J9118l2045L4332M1397
4388A477141L1797k9130Q4365L266l100K4916p542K2464J8528k0922p879k1740
4376A572164R5498L5053J6182J8446j5660q830O2128O6193l4025k120j0907K50
$$ plain form
4458 857661 786871 697770 799814 835458 839245 897058 1012741 928319 873443 853947 940511
4447 940511 885855 876819 878480 861639 878452 829846 933097 874346 916221 931015 974175 909978
4435 909978 881149 954939 972887 962883 1001112 990330 991641 1060138 976230 881424 982745 1049574
4423 1049574 1091507 1117279 1127472 1088425 1104733 1165047 1187121 1170134 1105366 1053751 1137891
4412 1137891 1186369 1173931 1221381 1206719 1282424 1214711 1220380 1278053 1278432 1304925 1320522 1352968
4400 1352968 1372725 1375460 1399843 1410833 1459235 1449432 1419197 1414339 1433457 1401412 1435744 1477141
4388 1477141 1508938 1479808 1564173 1567439 1564339 1589255 1581713 1604177 1622705 1601783 1593904 1572164
4376 1572164 1667662 1702715 1718897 1737343 1721683 1712853 1774981 1841174 1807149 1805029 1794122 1794372
4364A794372L3373N5641O1229J21328j1088J8654K4038M4663J4400j2231N830
4353B150209M9005N5401Q3122K3267R3662m4543L073R7826N7040R4250L9523Q7180
4341B789015R0240L9044J1344K0720J61477Q3629N7494M4615J27867R4593J25180
4330C645218O7396J14708J07756K6849N9689Q6070N8266Q7115K8499N3012N4845
4319D389423P242Q2689L4800M7654J0357N8699Q3150M6906k5018j1752L7239P6210
4307D837599N0114M8732K018P7733M1248N1575L0401J10537j3441o6391K2639
4296E192764P3262l6591R347M0531N2648P813k11759m9541k9987k2889K2226m0117
4284E007707j19970r0154l6086j9851j27454q5454l8793p1147j15222j15111m5218
$$ plain form
4364 1794372 1827745 1883386 1944615 2065943 2054855 2073509 2097547 2142210 2156610 2144379 2150209
4353 2150209 2199214 2254615 2337737 2361004 2454666 2410123 2413196 2511022 2568062 2662312 2701835 2789015
4341 2789015 2879255 2918299 2929643 2950363 3111840 3195469 3252963 3297578 3425445 3520038 3645218
4330 3645218 3712614 3827322 3935078 3961927 4021616 4107686 4165952 4253067 4281566 4334578 4389423
4319 4389423 4396665 4479354 4514154 4561808 4572165 4630864 4714014 4760920 4735902 4724150 4761389 4837599
4307 4837599 4887713 4936445 4938463 5016196 5057444 5109019 5139420 5249957 5236516 5170125 5192764
4296 5192764 5266026 5229435 5238782 5279313 5331961 5339774 5128015 5078474 5048487 5025598 5047824 5007707
4284 5007707 4887737 4797583 4761497 4741646 4614192 4528738 4489945 4418798 4303576 4188465 4143247
4273D143247o6161r5277M4429j12314p9670q2462K0572j8810m9423K0722m6421
4262C678432l4379o0956P8610m7318n5281k9518J4035J6810O2256j1111q4598
4251C526982n0915M0834m4483m866J48621J891P805P4109q2947q5849o9378O0355
4239C522159p045k7512K1490q6465l0108L6013k0147l389r8591o2282r525n1129
4227C183469j0771p3134l0741O949j8812r9455n5768j7956p1556m8433L363O7543
4215B834698n5691p1763j12302l639L1016p6838j5528o616K2810n8126o7624l4366
4203B386031l165o4431k3135j05276j7318M965l9913N7990n2201l0745r0513o6933
4191A955356J2830n4635l9475o5414n5101M420K887K6602q575J693j44432m8882
$$ plain form
4273 4143247 4077086 3981809 4026238 3913924 3834254 3751792 3772364 3753554 3704131 3724853 3678432
4262 3678432 3644053 3583097 3661707 3614389 3559108 3529590 3543625 3560435 3622691 3611580 3526982
4251 3526982 3476067 3516901 3472418 3467552 3616173 3618064 3625869 3699978 3617031 3531182 3461804 3522159
4239 3522159 3515114 3487602 3509092 3422627 3392519 3428532 3408385 3404996 3306405 3244123 3234598 3183469
4227 3183469 3172698 3099564 3068823 3075772 3056960 2957505 2901737 2883781 2812225 2763792 2767155 2834698
4215 2834698 2779007 2707244 2594942 2591303 2622319 2545481 2529953 2523337 2546147 2488021 2420397 2386031
4203 2386031 2382866 2318435 2295300 2190024 2172706 2177671 2137758 2195748 2143547 2112802 2022289 1955356
4191 1955356 1968186 1913551 1874076 1808662 1753561 1757981 1760868 1787470 1778895 1780588 1636156 1587274
4179A587274r468m9919n8612m0499k3610M4622l152j7077j6316p6316L6951n6339
4167A317539l908l9307n1784n045o098p9958N0886l1007n6236N8678O1713q1578
4155A133895j1362N7804R636l063K8241P619n6594K9630M3453o9194O669k4295
4143A152439l4403L292N3293q3057N139M4772K2357K3775q0055P1685m0004j4898
4131A124335J3106k2821J3309J0220J4413K8648j5921k9770k1747J6018J37j5500
4119A114427Q4382n6247k717j8139N634k7586k0650M1542j3201K0674q527N6224
4107A175816n9104j8523m1327J20397k7669l0474m9644n7348K0782J6608O3408
4096A112922M903Q9984k4754n4846j1575P2055L3038k3563q691J1509P3166j3289
$$ plain form
4179 1587274 1577806 1527887 1469275 1428776 1405166 1449788 1446636 1429559 1413243 1336927 1373878 1317539
4167 1317539 1313631 1274324 1222540 1217495 1211397 1131439 1182325 1151318 1095082 1153760 1215473 1133895
4155 1133895 1122533 1180337 1189973 1186910 1215151 1222770 1166176 1195806 1239259 1170065 1176734 1152439
4143 1152439 1118036 1121328 1174621 1091564 1096703 1141475 1163832 1187607 1107552 1179237 1139233 1124335
4131 1124335 1137441 1114620 1127929 1138149 1152562 1181210 1165289 1135519 1113772 1129790 1129927 1114427
4119 1114427 1198809 1142562 1139845 1121706 1127340 1099754 1079104 1120646 1107445 1128119 1119592 1175816
4107 1175816 1116712 1098189 1056862 1177259 1149590 1119116 1069472 1012124 1032906 1049514 1112922
4096 1112922 1117825 1207809 1183055 1128209 1116634 1188689 1221727 1198164 1189473 1200982 1274148 1260859
4084A260859p7543K0015n1356k8862l2889M0992M6299l7401j2017n3116J07246
4073A182227M6975K934l4398p7793N9042K5393j4002K2688j7433K1774j3252K827
4061A206982n6320l3044K2930J8360p3314k2444K318L9600J19497n418o3286J2309
4049A168170L027q105m0506K6357l8071O2073o2280M4881M3040l3376p236q7018
4037A070956k9789k8066J30761J0522o0170j6106O0955l2010J1195k8004L9394
4026A129638j4257m2458J9356Q5466J0727l0637K0607n5544o5194L3453L1956
4015A123113M5268Q3408m3026k407l2070p0915j3473K675M9731N2823R6577m8683
4003A243021j04N3783q8740r37k8176L0076P7140M28K2656J3245o5635O451O1132
$$ plain form
4084 1260859 1183316 1203331 1151975 1123113 1090224 1131216 1177515 1140114 1128097 1074981 1182227
4073 1182227 1229202 1232136 1197738 1119945 1178987 1204380 1190378 1213066 1195633 1217407 1204155 1206982
4061 1206982 1150662 1117618 1140548 1158908 1085594 1063150 1065468 1105068 1224565 1219147 1155861 1168170
4049 1168170 1171197 1163092 1122586 1148943 1110872 1172945 1110665 1155546 1198586 1165210 1157974 1070956
4037 1070956 1041167 1013101 1143862 1154384 1094214 1078108 1139063 1107053 1118248 1090244 1129638
4026 1129638 1115381 1072923 1092279 1177745 1188472 1157835 1178442 1122898 1057704 1091157 1123113
4015 1123113 1168381 1251789 1208763 1206356 1174286 1103371 1089898 1092573 1142304 1195127 1291704 1243021
4003 1243021 1242917 1296700 1207960 1207023 1178847 1208923 1286063 1286491 1309147 1322392 1256757 1263208 1324340
3990A324340m8727M8592L664P099j4693M1899J4555R266O163p076M1186P304K6430
3977A460002J04541O6064k0430k5554N6471k1826l2062R6694N6203j2017L727
3966A731813R5017n8487O5624j503L8212L2827K0841O9535j581P129P2139K8663
3954B100229N7395o0326J25422J08423p7895P1923L9806M373j0428J6398P7046
3943B452366J74238N5004L9772o348M7240M6403P5775M3526M6089Q1673N415P6969
3931C138122M5715J03720R9106R7790N5379J8266Q0707J05135R3111R8497N6910
3920C992458O0147N4462O4094J90462M9168J51087l329J21722J80203J15229J41835
3909E117538J41483M2509J06824J28941R5103J52082J08331J93235J41662J27475
$$ plain form
3990 1324340 1275613 1324205 1327869 1334968 1320275 1362174 1376729 1385995 1392158 1385082 1426268 1433572 1460002
3977 1460002 1564543 1630607 1610177 1584623 1641094 1619268 1587206 1683900 1740103 1728086 1731813
3966 1731813 1826830 1768343 1833967 1832464 1870676 1903503 1924344 1993879 1992298 1999427 2071566 2100229
3954 2100229 2157624 2097298 2222720 2331143 2253248 2325171 2364977 2369350 2358922 2375320 2452366
3943 2452366 2626604 2681608 2721380 2715032 2762272 2808675 2884450 2927976 2974065 3055738 3061153 3138122
3931 3138122 3183837 3287557 3386663 3484453 3539832 3558098 3638805 3743940 3837051 3935548 3992458
3920 3992458 4052605 4107067 4171161 4361623 4410791 4561878 4558549 4680271 4860474 4975703 5117538
3909 5117538 5259021 5301530 5408354 5537295 5632398 5784480 5892811 6086046 6227708 6355183
3899F355183J20942J41227J67900K19460K37610K07579J85501J90507K50963L09718
3889H386590K18237J88712K41800K43602K99897L28406L61634K94806L35922M08945
3879A1308551L32911L66294L65102M28107M65869M81591M44911M55096M97367
3870A5145799N34839N75510O77667N56852O73259P17358O08628O33449P00665
3861B0824026O40551O29047P28831P13701O11183O99900O63563O63944O41440
3852B6816186P70988P53315O24472P94898P92173Q60038Q09511Q27993Q70094
3843C3919668R30001J006941R82175R29572J013633J029835J086438J044969J018570
3834D2961802R68407J027331J012177Q64173Q75091O73272P91568Q24954P08100
$$ plain form
3899 6355183 6476125 6617352 6785252 7004712 7242322 7449901 7635402 7825909 8076872 8386590
3889 8386590 8604827 8793539 9035339 9278941 9578838 9907244 10268878 10563684 10899606 11308551
3879 11308551 11641462 12007756 12372858 12800965 13266834 13748425 14193336 14648432 15145799
3870 15145799 15680638 16256148 16933815 17490667 18163926 18881284 19489912 20123361 20824026
3861 20824026 21464577 22093624 22822455 23536156 24147339 24847239 25510802 26174746 26816186
3852 26816186 27587174 28340489 28964961 29759859 30552032 31412070 32221581 33049574 33919668
3843 33919668 34849669 35856610 36838785 37768357 38781990 39811825 40898263 41943232 42961802
3834 42961802 43930209 44957540 45969717 46833890 47708981 48382253 49173821 49998775 50706875
3825E0706875O59321N75242N01525N29716N13898M86856M14971M96757M51183
3816E5336344N36086M82321N34339N86399N60204M89262N30170O76554N75265
3807F0306944N63629O14023M29024L69739N10789M26682K85351L03335L32341
3798F4141857J96670J61893J07059J61060K5251N6451p3480q4157j01298j60636
3788F4430670k09833j44195j61000k45873l12696l03206l18642l17262l55020
3779F2062943l26345m25872m21564m14002m24278l79843n12715n32673m48187
3770E8177464n53691o17539n36751o48123o67219o04367n45329n10251o40881
3761E2853313o04280o03177o00392n57470o65338o58145p88090p82192p82727
$$ plain form
3825 50706875 51366196 51941438 52442963 52972679 53486577 53973433 54388404 54885161 55336344
3816 55336344 55872430 56354751 56889090 57475489 58035693 58524955 59055125 59731679 60306944
3807 60306944 60870573 61484596 61913620 62283359 62794148 63220830 63506181 63809516 64141857
3798 64141857 64338527 64500420 64607479 64768539 64793790 64850241 64776761 64692604 64591306 64430670
3788 64430670 64220837 64076642 63915642 63669769 63357073 63053867 62735225 62417963 62062943
3779 62062943 61736598 61310726 60889162 60475160 60050882 59671039 59158324 58625651 58177464
3770 58177464 57623773 57006234 56469483 55821360 55154141 54549774 54004445 53494194 52853313
3761 52853313 52249033 51645856 51045464 50487994 49822656 49164511 48376421 47594229 46811502
3752D6811502q43578q81669j014105j015110r45655j001483j012330r83987j040775
3743C8072810j018404r72131j064110r33280r70092r05590p76770q97580q29549
3734B9705304p55329o54272p20155p30449o60770n22712n39701n20850m67490
3725B4133576n45410o44551o40583n91426n13200n82943p00810o29909p55749
3716A8528995o73163o39473o10532n97406o74927n91132n22549n69248n98136
3707A3052429n17905m71365m49229l52062m00999k81399m14592l57926l50589
3698I456363l71795k26690k51409l01628k36027k38609j43540k18020k75261k11212
3688F982172k43276j73954j65358j82586j55585j29878j48496n3239j40954j38849
$$ plain form
3752 46811502 45967924 45086255 44072150 43057040 42111385 41109902 40097572 39113585 38072810
3743 38072810 37054406 36082275 35018165 34084885 33114793 32209203 31432433 30534853 29705304
3734 29705304 28949975 28295703 27575548 26845099 26184329 25661617 25121916 24601066 24133576
3725 24133576 23588166 22943615 22303032 21711606 21198406 20615463 19914653 19284744 18528995
3716 18528995 17855832 17216359 16605827 16008421 15333494 14742362 14219813 13650565 13052429
3707 13052429 12534524 12063159 11613930 11261868 10860869 10579470 10164878 9806952 9456363
3698 9456363 9084568 8857878 8606469 8304841 8068814 7830205 7686665 7468645 7193384 6982172
3688 6982172 6738896 6564942 6399584 6216998 6061413 5931535 5783039 5729800 5588846 5449997
3678E449997j14280j00676j65026j20995n5657j14058k33433j11025m2155n2078
3668D340614j18735q1668q4816r7158n4415j27756n7919o8180o7547k5311n5011
3657C502098p5833n6532j5997n6646q9054L5492M3479j05254n4030j35766j7804
3646B974153k6918o8015P4458l1771n4525p5579p4897n5286J9507k1792n0762
3635B608573L2191o9342K1304j3228q6947K0104j9115l0390q207j4454j08318
3624B332171l2467N9056J01975m5567o9643p1904q591M5859l844o7305n4465Q3262
3612B268537o17k1920L8576l8506J3816k5711q921K4684K8121K7111m2217l1715
3600B231238Q7121K2259r429O493M5298Q907l5276L2982O8083l6241j1123m4265
$$ plain form
3678 5449997 5335717 5235041 5070015 4949020 4893363 4779305 4545872 4434847 4392692 4340614
3668 4340614 4221879 4140211 4055395 3958237 3903822 3776066 3718147 3649967 3582420 3557109 3502098
3657 3502098 3426265 3369733 3353736 3297090 3208036 3243528 3287007 3181753 3127723 2991957 2974153
3646 2974153 2947235 2879220 2953678 2921907 2867382 2791803 2716906 2661620 2681127 2659335 2608573
3635 2608573 2640764 2571422 2592726 2579498 2492551 2512655 2493540 2463150 2454943 2440489 2332171
3624 2332171 2299704 2358760 2460735 2415168 2345525 2273621 2265030 2310889 2307045 2239740 2185275 2268537
3612 2268537 2267920 2246000 2284576 2246070 2259886 2234175 2225254 2249938 2278059 2305170 2262953 2231238
3600 2231238 2318359 2340618 2331189 2337682 2382980 2391887 2356611 2389593 2457676 2421435 2410312 2366047
3588B366047K23k134L6452Q916o24j8621O2456O6391N8824p3573j9701Q4604j2937
3575B556323J13893L5746N0367m7882m6488k773M1857m5393P9259N9409K6404
3564B820722L5577M6196j5051o477Q7866M6363o4180K5089K2099L2591L3855k582
3552C062068L3986L676K2972k5893K5483P0293J9345J3123Q0607M9946M5372M0018
3540C440996l8187L0787N0065l1936P0813J11113k0770m7584N0572J17436J436
3529C734741m9330J74m0806J13168N4033p1675j5868j9936J2864n6675J12150
3518C772840M1335P4251o456q043L1223J01615O4862l2469J2820P1997O5966M3319
3506D233260m2009P5291K0454o870J4369K4511j2583j8704M6421m9389l330K8959
$$ plain form
3588 2366047 2366270 2364136 2400588 2409504 2408880 2390259 2452715 2519106 2577930 2504357 2484656 2569260 2556323
3575 2556323 2670216 2705962 2756329 2708447 2661959 2659186 2701043 2655650 2734909 2794318 2820722
3564 2820722 2856299 2902495 2887444 2880967 2968833 3015196 2951016 2976105 2998204 3030795 3064650 3062068
3552 3062068 3096054 3099730 3122702 3096809 3122292 3192585 3211930 3225053 3305660 3355606 3400978 3440996
3540 3440996 3402809 3433596 3483661 3451725 3522538 3633651 3612881 3565297 3615869 3733305 3734741
3529 3734741 3685411 3685585 3644779 3757947 3811980 3740305 3724437 3704501 3717365 3660690 3772840
3518 3772840 3814175 3888426 3881970 3873927 3905150 4006765 4071627 4039158 4051978 4123975 4189941 4233260
3506 4233260 4191251 4266542 4286996 4280126 4294495 4319006 4306423 4287719 4334140 4284751 4281421 4310380
3494D310380J5826K1933n7873q4420J1643J13551J5905j4550l3877j6370J01165
3483D383313o858K791M4399O2550J5569R565N406K4488L9124Q7716p7896j00225
3471D489942K7717M5499l396j3345k3333L8033Q4257N5841r9326n438O3998J6470
3459D676919q239N3719J36502n3046m1195J36609k1795N9882N0245M1311j7098
3448E013814Q6718M9370J04429J0933Q2749L1735N4275O3336J1159Q6640M4354
3437E639512j9997J3170J03761Q4605J15510m6235M4001R9619J01054P8607R8265
3426F311872J60109O3141q602N3835R4515J07667J34712J68256N4975J22649J83879
3415G447008N9436O1347R5075J64146J18099J58150J53657J77702J31530O2855
$$ plain form
3494 4310380 4326206 4348139 4290266 4205846 4217489 4331040 4346945 4332395 4298518 4282148 4383313
3483 4383313 4376455 4379246 4423645 4486195 4501764 4511329 4516735 4541223 4580347 4668063 4590167 4489942
3471 4489942 4517659 4563158 4559762 4546417 4523084 4561117 4645374 4701215 4601889 4596451 4660449 4676919
3459 4676919 4668680 4722399 4858901 4805855 4764660 4901269 4879474 4939356 4989601 5030912 5013814
3448 5013814 5100532 5149902 5254331 5265264 5348013 5379748 5434023 5497359 5508518 5595158 5639512
3437 5639512 5619515 5632685 5736446 5821051 5936561 5890326 5934327 6033946 6135000 6213607 6311872
3426 6311872 6471981 6535122 6526520 6580355 6674870 6782537 6917249 7085505 7140480 7263129 7447008
3415 7447008 7506444 7567791 7662866 7827012 7945111 8103261 8256918 8434620 8566150 8629005
3405H629005J44956J54401K61679K16242N9303K08124K81255L29829J62872J44265
3395A0591931K65290K08577K01178L08805K85526K34710L51308K82630L34091
3386A3064046L29969K88423L22852L82090M28045L99748L07276M03084L83307
3377A6308840M60162M33950K80148M23734N52811M05979M48326M83227N07296
3368B0304473N30018M23154M71695N86301N69520N87192N94098P13275N53751
3359B5333477P19523O48920P05684O84424P45610P53582Q39495Q31293P08768
3350C1970776Q77597Q98706Q63430J037349R58785R69834J190665J029188J152293
3341D0948623J212652J350540J296253J308650J482060J459486J501335J520542
$$ plain form
3405 8629005 8773961 8928362 9190041 9406283 9465586 9673710 9954965 10284794 10447666 10591931
3395 10591931 10857221 11065798 11266976 11575781 11861307 12096017 12447325 12729955 13064046
3386 13064046 13394015 13682438 14005290 14387380 14815425 15215173 15522449 15925533 16308840
3377 16308840 16769002 17202952 17483100 17906834 18459645 18865624 19313950 19797177 20304473
3368 20304473 20834491 21257645 21729340 22315641 22885161 23472353 24066451 24779726 25333477
3359 25333477 26053000 26701920 27407604 28092028 28837638 29591220 30430715 31262008 31970776
3350 31970776 32848373 33747079 34610509 35647858 36606643 37576477 38767142 39796330 40948623
3341 40948623 42161275 43511815 44808068 46116718 47598778 49058264 50559599 52080141
3333E2080141J554117J596722J746259J699041J650332J781176J727021J646954
3325F5481763J594814J581847J586233J668795J697676J675617J691325J663242
3317G8641312J793095J795174J722278J899854J891202K026505J885969K010984
3309I3666373K195168K090937K238012K342764K408183K454979K560152K631102
3301A12587670K624700K852648K838135K896086K983684L193413L244861L364078
3293A36585275L453144L599689L652456L697997L926842M075102M029489M177711
3285A67197705M322586M316044M413484M380110M370609M307906M412274M273845
3277B01994563M281612M322500M259958M247499M127594M170163M122312M048881
$$ plain form
3333 52080141 53634258 55230980 56977239 58676280 60326612 62107788 63834809 65481763
3325 65481763 67076577 68658424 70244657 71913452 73611128 75286745 76978070 78641312
3317 78641312 80434407 82229581 83951859 85851713 87742915 89769420 91655389 93666373
3309 93666373 95861541 97952478 100190490 102533254 104941437 107396416 109956568 112587670
3301 112587670 115212370 118065018 120903153 123799239 126782923 129976336 133221197 136585275
3293 136585275 140038419 143638108 147290564 150988561 154915403 158990505 163019994 167197705
3285 167197705 171520291 175836335 180249819 184629929 189000538 193308444 197720718 201994563
3277 201994563 206276175 210598675 214858633 219106132 223233726 227403889 231526201 235575082
3269B35575082M083896M134882M135774M136624M260004M330519M518561M623207
3261B69798549M619795M693764M813694M853776M718365M486702M204504L775077
3253C05964226L401700K970169K534256K092232J472023J131053P61392L58956
3245C20686007P5195j98544n85332o21300m71840n58394l98164k07242J58367
3236C17878753L52584P94699J297446J556100J857338K164521K311127K525593
3228C30738161K642411K530663K567395K550364K617591K590385K748553K865434
3220C51850957K979904L032964L027092K862556K374098J965660J391250M70998
3212C69955479o00994j672154k961128m297115n621433p003286q220555r309218
$$ plain form
3269 235575082 239658978 243793860 247929634 252066258 256326262 260656781 265175342 269798549
3261 269798549 274418344 279112108 283925802 288779578 293497943 297984645 302189149 305964226
3253 305964226 309365926 312336095 314870351 316962583 318434606 319565659 320327051 320686007
3245 320686007 320761202 320562658 319977326 319356026 318884186 318325792 317927628 317720386 317878753
3236 317878753 318231337 319026036 320323482 321879582 323736920 325901441 328212568 330738161
3228 330738161 333380572 335911235 338478630 341028994 343646585 346236970 348985523 351850957
3220 351850957 354830861 357863825 360890917 363753473 366127571 368093231 369484481 369955479
3212 369955479 369354485 367682331 364721203 360424088 354802655 347799369 339578814 330269596
3204C30269596j0464964j1114890j1383435j1515737j1549132j1227623j0690489
3197B52323326j0165377r522235q928762q313807p945756p501760p273234o857984
3189A85814411o557233o336276o229141o222954o096353o019447o001871o048299
3181A36302837n904484n742420n572503n354669n003259m627837m420424m232127
3173I5445114l898353l618242l405337l212847k937765k743736k652305k541135
3165G0435394k382262k187247k150520k110831j912116j901623j867827j760861
3157E4162107j663241j747019j647012j488195j601679j395678j370671j369267
3149D1879345j258983j227153j184253j075049j034109r57869r48911r86734q81002
$$ plain form
3204 330269596 319804632 308689742 297306307 285790570 274241438 263013815 252323326
3197 252323326 242157949 232635714 223706952 215393145 207447389 199945629 192672395 185814411
3189 185814411 179257178 172920902 166691761 160468807 154372454 148353007 142351136 136302837
3181 136302837 130398353 124655933 119083430 113728761 108725502 104097665 99677241 95445114
3173 95445114 91546761 87928519 84523182 81310335 78372570 75628834 72976529 70435394
3165 70435394 68053132 65865885 63715365 61604534 59692418 57790795 55922968 54162107
3157 54162107 52498866 50751847 49104835 47616640 46014961 44619283 43248612 41879345
3149 41879345 40620362 39393209 38208956 37133907 36099798 35141929 34193018 33206284 32325282
3140C2325282r18620r27693q91085p70822q68002p31001p47249q20586p74334
3131B4875890o87939p09913o52070n49728o27646n72972m74381n34226n45671
3122A9521344n10278m71282m23340m55927m84015m45689l59216m78539l95473
3113A5497585l83074l67983l05465k83545l08324k89700l41659l91200k85979
3104A2540656k43646l07140k54444k30146k73083j68789j98351j63340j95723
3095A0505994k39452j88312j56126j94169k13786k06440j49038j23748k28936
3086H805987j50779j08346j70721q5444p7742j75368j20520r1881p0419j05126
3076G649641j82705j47078j15754l9458o6325q6476o9289j01766n8131n4575j8096
$$ plain form
3140 32325282 31406662 30478969 29587884 28817062 27949060 27218059 26470810 25650224 24875890
3131 24875890 24187951 23478038 22825968 22276240 21648594 21075622 20601241 20067015 19521344
3122 19521344 19011066 18539784 18116444 17660517 17176502 16730813 16371597 15893058 15497585
3113 15497585 15114511 14746528 14441063 14157518 13849194 13559494 13217835 12826635 12540656
3104 12540656 12297010 11989870 11735426 11505280 11232197 11063408 10865057 10701717 10505994
3095 10505994 10266542 10078230 9922104 9727935 9514149 9307709 9158671 9034923 8805987
3086 8805987 8655208 8546862 8376141 8290697 8212955 8037587 7917067 7825186 7754767 7649641
3076 7649641 7466936 7319858 7204104 7164646 7098321 7011845 6942556 6840790 6782659 6728084 6709988
3065F709988m9689j34287j29668r9497l7818j2396p4657j08215n1016j15471J1329
3054E908603n6997J1454k2054r0078m281n6207q2279n9378J1856p2230k7058j946
3042E459405l722k2980o28k5206k2167J1642k038K3288j5501k2706j4836K2599
3030E387150L0756k391K420L2482j2755j8003J41592j3122j380j02993k8580L6375
3018E451551N2603N3659o149N570N7508P0474L8332L0756J8616l399P1319O6326
3006E907166L7267K5088P3222K4333J8991Q5119M3105K0818N4520P8478o48R2118
2994F459577K9000J5903M7364M7597Q5246J09901M5910N7631N2670J20658J62854
2983G234311M1519J78334J51092J2792Q9428Q1975J24739J15669J25569J92170
$$ plain form
3065 6709988 6660299 6526012 6396344 6296847 6259029 6246633 6171976 6063761 6012745 5897274 5908603
3054 5908603 5851606 5863060 5841006 5750928 5746647 5690440 5608161 5548783 5560639 5488409 5461351 5459405
3042 5459405 5455683 5432703 5432075 5406869 5384702 5396344 5394306 5417594 5402093 5379387 5364551 5387150
3030 5387150 5417906 5415515 5417935 5450417 5437662 5419659 5561251 5548129 5546749 5443756 5415176 5451551
3018 5451551 5504154 5557813 5551664 5557234 5614742 5685216 5723548 5754304 5772920 5769521 5840840 5907166
3006 5907166 5944433 5969521 6042743 6067076 6086067 6171186 6214291 6235109 6289629 6368107 6367459 6459577
2994 6459577 6488577 6504480 6551844 6599441 6684687 6794588 6840498 6898129 6950799 7071457 7234311
2983 7234311 7275830 7454164 7605256 7618048 7707476 7789451 7914190 8029859 8155428 8347598
2973H347598J10863J18951J39616R1182J53217J23119J61681J90248K07959J46857
2963I791291J33404J70665K19934K59235K23878J90480J91126L23489L27702J74326
2953A2005530K40414L27694K73607J74601K59421L03998L34372L23577M30024
2944A4673238L47316K89477L73912L88235M16274M54679L94875M18204M66353
2935A8222563M32066N54108M65934M12158O04685O09604N43805O48345P00341
2926B3193609O11785O28851P52600O89973P40636R02362Q75571Q95202R13781
2917C0204370J056816J079958J141010J335107J301599J430683J538359J727712
2909D0815614J805653J885097K118387K280151K354391K591692K810058L147073
$$ plain form
2973 8347598 8458461 8577412 8717028 8808210 8961427 9084546 9246227 9436475 9644434 9791291
2963 9791291 9924695 10095360 10315294 10574529 10798407 10988887 11180013 11503502 11831204 12005530
2953 12005530 12245944 12573638 12847245 13021846 13281267 13585265 13919637 14243214 14673238
2944 14673238 15020554 15310031 15683943 16072178 16488452 16943131 17338006 17756210 18222563
2935 18222563 18654629 19208737 19674671 20086829 20691514 21301118 21844923 22493268 23193609
2926 23193609 23805394 24434245 25186845 25876818 26617454 27519816 28395387 29290589 30204370
2917 30204370 31261186 32341144 33482154 34817261 36118860 37549543 39087902 40815614
2909 40815614 42621267 44506364 46624751 48904902 51259293 53850985 56661043 59808116
2901E9808116L213631L475363L741697L909443M209374M277903M348263M425507
2893I1409297M302227M135222L779226L463157K874150K247713J754478J242115
2885A15207585Q33095N65875N34977N14117O16593O04590O86953Q02548J006329
2876A21372662J267753J589757K087769K718600L291774M066242M890325N647006
2868A46931888O202083O562880O990697P468309P834647O813481M199043J023959
2860A94026987j449470l508626p046997j1927200j4518067j3596210j1299122
2853A30681295q901968p037933n684273m579268l735703l218164k714065k339121
2845I2470800j993523j588520j177348q49711n02316j13699J62829K72468M44654
$$ plain form
2901 59808116 63021747 66497110 70238807 74148250 78357624 82635527 86983790 91409297
2893 91409297 95711524 99846746 103625972 107089129 109963279 112210992 113965470 115207585
2885 115207585 116040680 116606555 117141532 117655649 118272242 118876832 119563785 120366333 121372662
2876 121372662 122640415 124230172 126317941 129036541 132328315 136394557 141284882 146931888
2868 146931888 153133971 159696851 166687548 174155857 181990504 188803985 193003028 194026987
2860 194026987 192577517 189068891 182021894 170094694 155576627 141980417 130681295
2853 130681295 121779327 114741394 109057121 104477853 100742150 97523986 94809921 92470800
2845 92470800 90477277 88888757 87711409 86861698 86359382 86245683 86408512 86680980 87125634
2836H7125634O71179P07154N86942L37834o2631n60162j303164k054460k817022
2827H2631304l525188m120541m436919m632483m571171m352701l993141l653973
2819D9345187l285710k943571k678292k333318k101180k058733j827511j711708
2811C0405164j645663j439851j360486j339937j206810j007001r18042r37664
2803B0549710r06615p18184p33762o61953o61777o51811o60318n52983n03802
2794A4498505n08482m75056m36588m08076l77828m35262m28418l56218k69152
2785A0803425m00557k98987k71212l75454l38216l05179k19701k29639k08816
2776H155664k02608l44327k37153j04588j72200j36997j67173k17683r3774j37259
$$ plain form
2836 87125634 87796813 88503967 89090909 89428743 89366112 88805950 87502786 85448326 82631304
2827 82631304 79106116 74985575 70548656 65916173 61345002 56992301 52999160 49345187
2819 49345187 46059477 43115906 40437614 38104296 36003116 33944383 32116872 30405164
2811 30405164 28759501 27319650 25959164 24619227 23412417 22405416 21487374 20549710
2803 20549710 19643095 18924911 18191149 17529196 16867419 16215608 15555290 15002307 14498505
2794 14498505 13990023 13514967 13078379 12670303 12292475 11857213 11428795 11072577 10803425
2785 10803425 10402868 10103881 9832669 9457215 9118999 8813820 8594119 8364480 8155664
2776 8155664 7953056 7608729 7371576 7266988 7094788 6957791 6790618 6572935 6479161 6341902
2766F341902j98061k13670j92933o7233j73382j30929j26711j07692j21482k9103
2756D980706j02981j83290m2272n5429j35023j21570j73710p3724o6917m6877
2746C978913n1109j55986q8606k154l6476j26709j28116l4803n2808q5339J7748
2735C234555k4165r8882j03652P299J0492l0618j34958n7090p4826q9996l1535
2724B606624K7977l5043q4246r9234p5310J5384p0767j9103n3550r2277L3089
2713B153544n0548l9937o8084q2148k9733n3669N506K5097j7619M311l1835p9053
2701A735832n5863o5542J8450n1786m5375J6579j4325M2825L0236o6890p9212
2690A464929l5496l622j5518k3080P757m3447l8101j2892M6287j3039o6003J0049
$$ plain form
2766 6341902 6143841 5930171 5737238 5670005 5496623 5365694 5238983 5131291 5009809 4980706
2756 4980706 4877725 4694435 4652163 4596734 4461711 4340141 4166431 4092707 4025790 3978913
2746 3978913 3927804 3771818 3683212 3681058 3644582 3517873 3389757 3354954 3302146 3216807 3234555
2735 3234555 3210390 3111508 3007856 3015155 3025647 2995029 2860071 2802981 2728155 2638159 2606624
2724 2606624 2634601 2599558 2515312 2416078 2340768 2356152 2285385 2266282 2212732 2120455 2153544
2713 2153544 2102996 2063059 1994975 1912827 1883094 1829425 1834931 1860028 1842409 1846720 1814885 1735832
2701 1735832 1679969 1614427 1632877 1581091 1535716 1552295 1537970 1580795 1611031 1544141 1464929
2690 1464929 1429433 1425811 1410293 1387213 1394970 1351523 1313422 1300530 1346817 1333778 1267775 1277824
2678A277824j5258l5868p2585j9969K5062r8094J5759N9404l8545l129N4265N508
2666A154374j916n0335n7399n8010Q088J1575k238K7265n2191J6422R974J4592
2654A020201j5996p655k4392M1509n190q0697l2806M7990o4503j6332J9695j2835
2642H68989J1231j955q945N653N2046j4366k1372o6392n0150J9640j8942O7420
2630H42857K7573J3930M3923j5661K0019l7086j5711Q154q827L9271r648J5204
2618I23998o1273p117N8304k3180J2766J4184O1270J66N3014L1874n9845j4005
2606I90156M0717j4255j7785M4971o890n4827j3624O5865L806K5122n5638j6539
2594I91079K5767l4120q0302L2527J3471M6594K6039j2664K8552R4364Q4837q7179
$$ plain form
2678 1277824 1262566 1226698 1154113 1134144 1159206 1061112 1076871 1136275 1097730 1094601 1148866 1154374
2666 1154374 1152458 1102123 1044724 986714 994802 1006377 1004139 1031404 979213 995635 1005609 1020201
2654 1020201 1004205 996550 972158 1013667 1008477 927780 894974 942964 878461 862129 881824 868989
2642 868989 880220 878265 869320 874973 927019 912653 891281 824889 774739 794379 775437 842857
2630 842857 870430 884360 928283 912622 932641 895555 879844 887998 879171 918442 908794 923998
2618 923998 862725 855608 913912 890732 903498 917682 978952 979118 1032132 1064006 1004161 990156
2606 990156 1030873 1016618 998833 1043804 1036914 982087 968463 1034328 1038134 1063256 1007618 991079
2594 991079 1016846 982726 902424 934951 948422 995016 1021055 1008391 1036943 1131307 1216144 1128965
2582A128965L387J13895N6320L4269L4958j6277P7966l9075o2737q1312j69134
2571A081225q4632n5864n5676n9950J0575k8496J6893k7109p8735m8468n5167
2560F14596M656n1565J0849J09682l741o4099Q4786K0193j1654l6619L5262j5286
2548F97060O0875m091j3267J2952p2978K8826k9179o0824N549n1689L7671j5622
2536E95283n6583o2351j6525j6713n4779k3779L0462K5245m3393k475o1081K0175
2524C33486N765j6124m5361k237P327R690r874N5688M8386k6536J0525p4205n48
2511B95982K5445M7219N4942k4061p0265J881l5076l6507m2569o6306P4403O2536
2499B87624L5840l8294l8270l2907J6375L3270j8945K0318o2743M5799k0658k3817
$$ plain form
2582 1128965 1132352 1246247 1302567 1336836 1371794 1355517 1433483 1394408 1331671 1250359 1081225
2571 1081225 996593 940729 885053 825103 835678 807182 824075 796966 718231 669763 614596
2560 614596 619252 567687 578536 688218 684477 620378 705164 725357 713703 677084 712346 697060
2548 697060 757935 753844 740577 753529 680551 709377 680198 619374 624923 573234 610905 595283
2536 595283 538700 476349 459824 443111 388332 364553 395015 420260 376867 374392 313311 333486
2524 333486 339251 323127 277766 275529 282856 292546 282672 338360 386746 360210 370735 296530 295982
2511 295982 321427 368646 423588 399527 329262 331143 296067 259560 216991 150685 225088 287624
2499 287624 323464 285170 246900 213993 230368 263638 244693 265011 202268 248067 227409 203592
2487B03592N5729k9351m6283k1579M1503m6143o0488L709P1130M4836j1972p705
2475A96978O40P5814n4933q285Q1663m4989K1376K0060J1878M7731p475m4493
2463B95965r5607j6505L3090K8282l9890j2745M3932m2289M0906o0005J4019K6686
2451B15839J023J3753n0441M009M9907n827p1140m4879L1339Q8386k4921K7763
2439B34811J4013l2696n7652n3593L1987J4390K1163M0309J1505q7268l8123J0035
2427A08881k72M8088M1558L1574L9319o0100l725l8187M4357l4094K4122p986
2415A93535l9218k83k9844l9701l2435L6566L4790j4649j3787K993M920j1789
2403I1098p580O2774N567l3920m7866K52J5714J3746P2806k3556o2457j3342l2458
$$ plain form
2487 203592 259321 229970 183687 162108 203611 157468 96980 100689 171819 216655 204683 196978
2475 196978 197618 273432 218499 210214 291877 246888 268264 288324 300202 347933 340458 295965
2463 295965 200358 183853 216943 245225 205335 192590 236522 194233 235139 175134 189153 215839
2451 215839 216862 230615 180174 184183 234090 228263 157123 112244 143583 231969 207048 234811
2439 234811 248824 216128 158476 104883 136870 151260 172423 212732 224237 136969 98846 108881
2427 108881 108609 156697 198255 229829 269148 209048 205323 167136 211493 177399 201521 193535
2415 193535 154317 154034 124190 84489 52054 88620 123410 108761 94974 97967 102887 91098
2403 91098 83518 146292 151859 117939 70073 70325 86039 99785 172591 149035 86578 73236 40778
2390D0778j356R1701L823P271k1318k7810L6147k6529r505n8221N1652L2921K3708
2377A43262L3733L4838o321N6598n2592r4472P7793m6618l7333n6511K5772O0832
2365A38981j1197L5076o4111J0210n7627K7461J420l3377n539j5084J05076O0536
2353A91825k6963j0326m4127K7450k6377K6571Q6419K8089k0831m1343P405r12
2341A96880l7008K4604R4044J38879Q780n730L2385M8037l6961m3134n0458n0186
2329C20132j5422l6505n5512j5117J2863p4216M3844m5442M4908L8533k70J1080
2317B28876q5162j8566j1018j9932J8719L2964q095K9694Q1757k5660M1239q3575
2305A81241K0996j03413J2303K7389k8199O6642P3981r06n7497o4916k1464O3223
$$ plain form
2390 40778 39422 131123 134946 142217 120899 93089 129236 102707 93202 34981 86633 119554 143262
2377 143262 176995 211833 205512 262110 209518 115046 192839 146221 108888 52377 78149 138981
2365 138981 127784 162860 98749 108959 51332 78793 80213 46836 41297 26213 131289 191825
2353 191825 164862 154536 110409 137859 111482 138053 224472 252561 231730 190387 197792 196880
2341 196880 159872 184476 278520 417399 426179 420449 452834 500871 463910 420776 370318 320132
2329 320132 304710 268205 212693 197576 210439 136223 180067 134625 179533 218066 217796 228876
2317 228876 143714 125148 114130 94198 112917 145881 137786 167480 249237 223577 264816 181241
2305 181241 202237 98824 111127 138516 110317 176959 250940 250034 192537 127621 106157 169380
2293A69380j4804m208L3034l7823k8400K8522m7596K7223J0247n59J8815k1848
2281A31983p3487R562M0008j0806l9821M4066J356l9127L4029L3734p0023n9850
2269A624J28246K8550J1426K8991j17430J16499l5482m8745N8316n3021k9077
2258H9897P0634R2991L5077n0753m0236J4930k7340K9298L1045k7626N4852l4608
2246B38161q8105K738O1259J4754k574p576k3684o5433Q7694J0547N0082p423
2234B70440m4114P8286J1037k8n9338L2946L5236L7851n874k7627k2789J2783
2222C18809j7585K9197k412J1937M3101l7486r874R1527M6298M2028p7047L924
2210D42417O6021O3269J4613m4330n0728K1409L7336p9456K0784n700o0604J01015
$$ plain form
2293 169380 154576 150368 183402 145579 117179 145701 98105 125328 135575 135016 153831 131983
2281 131983 58496 68058 108066 97260 57439 101505 102861 63734 97763 131497 61474 1624
2269 1624 129870 158420 169846 198837 81407 197906 162424 113679 171995 118974 89897
2258 89897 160531 253522 288599 237846 197610 212540 185200 214498 245543 217917 272769 238161
2246 238161 150056 152794 214053 228807 226233 218657 194973 129540 217234 227781 277863 270440
2234 270440 226326 304612 315649 315621 256283 289229 324465 362316 356442 328815 306026 318809
2222 318809 301224 330421 328009 339946 383047 345561 335687 427214 473512 515540 438493 442417
2210 442417 508438 571707 586320 541990 491262 512671 550007 470551 491335 485635 425031 526046
2198E26046Q6550l5625j016K5272j1378L7956N4043O424M0660q95L9488j1115
2186G56410K5443J18563O3345l8436m1315N2637L6518m3439o7301O609J5363Q080
2174H92477j07181j11594K9071O8159j0579J772K5785L6724P8850n4913m0173
2163H08398P8228K942K1824j0904K2479Q4691O2809N4979j5943k2550J67143O8001
2151A322097o0959J4568O2320J1442M0518J03095r363j1397L537J769J01169J36496
2139A715292L6034N6066P0267J05903J3402J31965J38900J22734L6257P9699J66981
2128B673500L6621M0644O3691R4144N9494Q555J9618M8738N717N8466K1447J43460
2116C274095J6225M4175J41661J26310O6100L6183J91700J81737J07814J22502
$$ plain form
2198 526046 612596 576971 575955 601227 589849 627805 681848 688272 728932 728037 767525 756410
2186 756410 781853 900416 963761 925325 884010 936647 973165 929726 862425 869034 884397 892477
2174 892477 785296 673702 702773 770932 760353 762125 787910 824634 903484 848571 808398
2163 808398 886626 889568 911392 900488 922967 1007658 1070467 1125446 1109503 1086953 1254096 1322097
2151 1322097 1261138 1275706 1338026 1349468 1389986 1493081 1483718 1472321 1475858 1477627 1578796 1715292
2139 1715292 1751326 1807392 1877659 1983562 1996964 2128929 2267829 2390563 2426820 2506519 2673500
2128 2673500 2710121 2750765 2814456 2908600 2968094 2976649 2996267 3045005 3050722 3109188 3130635 3274095
2116 3274095 3290320 3334495 3476156 3602466 3668566 3704749 3896449 4078186 4186000 4308502
2106D308502J45530J16596J93174K10723K18063K02227J68337K42049L23733M33017
2096F561951L07853L25898L87523M10093M22997N64646O82491O65465N83751P03991
2086A1616659Q40743Q15756R16135R62082J128032J356327J593801J821486K120352
2077B3171373K613035L312389M100806M363401M190036M390598N358498O768708
2069E8268844N506714J550623j443187j457278m53236m409413j1270913j0850303
2061C5441851o905612m259023l026734k452097j818704j345874j071514r48926
2053A3613367q38883r21747q12601o50347o39383q18977p88393o73408m33695
2044G035933m04066l65124k30407l25246k82784r8112j49433k69253k58550j26712
$$ plain form
2106 4308502 4454032 4570628 4763802 4974525 5192588 5394815 5563152 5805201 6128934 6561951
2096 6561951 6869804 7195702 7583225 7993318 8416315 8980961 9663452 10328917 10912668 11616659
2086 11616659 12457402 13273158 14189293 15151375 16279407 17635734 19229535 21051021 23171373
2077 23171373 25784408 29096797 33197603 37561004 41751040 46141638 51500136 58268844
2069 58268844 63775558 65326181 63882994 62425716 61972480 57563067 46292154 35441851
2061 35441851 28536239 24277216 21250482 18798385 16979681 15633807 14562293 13613367
2053 13613367 12774484 11852737 11040136 10389789 9750406 8931429 8143036 7469628 7035933
2044 7035933 6631867 6266743 6036336 5711090 5428306 5330194 5180761 4911508 4652958 4526246
2034D526246k40327k10026j75200q4465j64646j66465j19619r5635j43970p8076
2024C047817j07969r6251j4860p3907n9665j30418r6651j18299l3371n6555p6114
2013B183757l0170k04019r5939k9700m1065l3520k3392j38015q1171q6326K4987
2002A445427m0236l5787p2347l5367j9133j12392l7802o962J1871K1703m0582
1991A078393q1524P448J0916J7563j04217p3496m3878n3415n4997L1973O2562
1980G97328r978K1570k244l5564r6451k3146o193m3004J1111Q7l3622P4648p4872
1967E79670k3061M8331o2653j01483p329O0818M9912j10709J8072L847j8337L8732
1955D75810m2165p507m2235m6717M9568M4584o1913L2180k1062K1052m831k083
$$ plain form
2034 4526246 4285919 4075893 3900693 3816228 3651582 3485117 3365498 3269863 3125893 3047817
2024 3047817 2939848 2843597 2828737 2754830 2695165 2564747 2468096 2349797 2316426 2259871 2183757
2013 2183757 2153587 1949568 1853629 1823929 1782864 1749344 1725952 1587937 1506766 1420440 1445427
2002 1445427 1405191 1369404 1297057 1261690 1242557 1130165 1092363 1085401 1097272 1118975 1078393
1991 1078393 996869 1004317 1015233 1032796 928579 855083 811205 757790 702793 734766 797328
1980 797328 787350 808920 806676 771112 674661 651515 645322 602318 613429 613516 579894 654542 579670
1967 579670 556609 604940 542287 440804 433475 494293 544205 433496 451568 455415 437078 475810
1955 475810 433645 426138 383903 337186 386754 431338 369425 401605 380543 401595 396764 394681
1943C94681l8305M8861L9378K641o5597k4731p1175j4869O282K7622l909n866
1931B95013k2061l5777m1101m657J024P4553n1887q3188l4608N1940Q3790q592
1919B24449k6902k4755K1651j7320n0745j3587Q5126j13492J06689q191j09466
1908G3457P8530N3909L4776j3242o5644q2262K0790o1517O916J1760J23861p1841
1896A09493j4047N889q201M4481l115q7140n8034J30892N1008l6885j03725K5997
1884E6613j3626P5167O462n5353k2282N0641q3453m4893M9210M15n1210O6414
1872C4105N4002j2098m7322K072k3417L596J3144j5449L8190L5524r3421Q7956
1860G6882q517p8129M8496L9981M008N7544o4746q799J5351m8412J0370r5299
$$ plain form
1943 394681 356376 405237 444615 447256 381659 356928 285753 270884 277166 304788 300879 295013
1931 295013 272952 237175 196074 191417 192441 266994 215107 131919 97311 149251 233041 224449
1919 224449 197547 172792 194443 177123 126378 112791 197917 84425 191114 182923 73457
1908 73457 151987 205896 240672 227430 161786 79524 100314 38797 45713 57473 181334 109493
1896 109493 95446 101335 93134 137615 134500 47360 -10674 120218 171226 134341 30616 56613
1884 56613 42987 118154 124616 69263 46981 97622 14169 -30724 18486 18901 -32309 34105
1872 34105 88107 76009 28687 30759 7342 10938 24082 8633 46823 82347 -11074 76882
1860 76882 68365 -9764 38732 78713 82721 140265 75519 66720 82071 33659 44029 -51270
1848e1270k7894L1145J5131j0266L0869J0251J2667j4438K6640m5948l533M1948
1836A5302j7587q1009M3903N0327J621L7070k5753J2263J0621k3699l9232k3187
1824c9360O8354j00636L8350Q2160N6039q765L6594o5723l5824M442M0935J0830
1812H7396L3673n2180N294O2578K8687J6437L801P3187j5598m2702N3248K4562
1800B78383k2182Q0421r614j9119j8183m7095k0109j0114k4560r0976l1216M8141
1788A13777O221q7678n9299K7933L4550O6859k7504l6919k9729j5162o8515J32022
1776E6556J4221j12685n509M7219k5184j2584R395K508O0030J3417n1076j5773
1764a9465J334j00120J7048P76J8488k9798j6600J17537K0152L5515K1614l0638
$$ plain form
1848 -51270 -79164 -48019 -32888 -43154 -12285 -2034 10633 -3805 22835 -23113 -26646 15302
1836 15302 -2285 -83294 -39391 10936 12557 49627 23874 36137 46758 23059 -16173 -39360
1824 -39360 28994 -71642 -33292 48868 104907 96142 132736 67013 31189 35631 76566 87396
1812 87396 121069 68889 74183 136761 165448 181885 185686 258873 243275 200573 253821 278383
1800 278383 256201 336622 327008 307889 289706 242611 222502 212388 187828 96852 65636 113777
1788 113777 119998 32320 -26979 954 35504 102363 74859 37940 8211 -6951 -75466 56556
1776 56556 70777 -41908 -47417 -198 -25382 -37966 -28571 -26063 33967 47384 -3692 -19465
1764 -19465 -18131 -118251 -101203 -100427 -81939 -111737 -128337 -10800 9352 44867 66481 35843
1752C5843L5227J8838k2499m4734n1491J5928k6008m5104L0335j6031L5379M1585
1740G268N7071m3761k6286l998l5842N4766p8418P2143J7365m0714j11201N5281
1728g6326O2328n592n5334K4630M2008k9614n9979J3R3100j5292p83p3904m9100
1715a43845L050O7867J9781P2428p6619J051N727l8652O3705n1576l7063j7446
1703a31592o38N4368Q6861L3974j14016p0535J17693J3326j19706J2173K4966
1692i3126n278P8194n3406O6053j3672k3989j3453J5034K6676K3673m9514l4027
1680g6835J6210p9942N4707N1519r1499O1287K3374M3071k5076o52N8452p2471
1668c7855K9629o055j5692r6771m8242Q6601L7885k1136k936J811L4870J2634
$$ plain form
1752 35843 71070 89908 67409 22675 -28816 -12888 -38896 -84000 -53665 -69696 -34317 7268
1740 7268 64339 20578 -5708 -9706 -45548 9218 -69200 2943 20308 -20406 -131607 -76326
1728 -76326 -13998 -19590 -74924 -50294 -8286 -37900 -97879 -97866 -4766 -20058 -20841 -94745 -143845
1715 -143845 -140795 -72928 -53147 19281 -57338 -56287 -50560 -89212 -25507 -77083 -114146 -131592
1703 -131592 -132230 -77862 8999 42973 -71043 -141578 -23885 -10559 -130265 -118092 -93126
1692 -93126 -98404 -20210 -73616 -7563 -21235 -45224 -58677 -43643 -16967 6706 -42808 -76835
1680 -76835 -60625 -140567 -85860 -34341 -125840 -64553 -41179 1892 -23184 -23836 34616 -37855
1668 -37855 -8226 -14281 -29973 -126744 -174986 -88385 -50500 -71636 -74572 -72761 -37891 -25257
1656b5257J4308j02987Q116J7829Q7574M1558n1774K7039L0686p9202j076J3277
1644a9909l8804K7825M8408J3107o836k3510j8236j01425j9628N1801R6224j7499
1632h482j4699J9269q8545k0287O6126N0983j1680m2441r800N0626N5133n851
1620D0352m6291j04978K0315P3046o5762N0797q448m5973J7386J15422l8395n4537
1608d7066j087l9346L1743O9064l2370n0720J2090Q693L8328k5584l9440l4052
1596a09747K9784Q2543J7095r5946l491j7831j0752K7317m8181k4794M8965o49
1584a05687l0358M5439k0286n809N4623m943M3095l3781m5174j3742j8362J6662
1572a18323L2115M6925N693L3227q1750J593K0343j3770p964o7511J1292K5036
$$ plain form
1656 -25257 -10949 -113936 -105820 -87991 -417 41141 -10633 16406 47092 -32110 -33186 -19909
1644 -19909 -58713 -30888 17520 30627 23791 281 -17955 -119380 -139008 -87207 9017 -8482
1632 -8482 -23181 -3912 -92457 -112744 -46618 4365 -7315 -49756 -59556 -8930 46203 40352
1620 40352 -5939 -110917 -90602 -17556 -83318 -32521 -40969 -86942 -69556 45866 7471 -47066
1608 -47066 -48153 -87499 -55756 13308 -19062 -69782 -57692 -48999 -10671 -36255 -75695 -109747
1596 -109747 -79963 2580 19675 -76271 -79762 -97593 -108345 -81028 -129209 -154003 -105038 -105687
1584 -105687 -136045 -90606 -110892 -116701 -62078 -67021 -23926 -57707 -102881 -116623 -134985 -118323
1572 -118323 -86208 -39283 -33590 -363 -82113 -80520 -60177 -73947 -81911 -149422 -138130 -113094
1560a13094R9013N3526J2002m7664p8429Q423J5451M1369l7838q322M536l4960
1548h5987L6129n732J2603k6003M2192K1006p9539L509K2450N8145m3977o6081
1536a11285L515N7843O1056o3149o6880K6903K8726j0180m9721n6504M0387l7238
1524a76527L6150J7103P3527K6438K7749K0137k3785q2520n0294M9969o3458O3220
1512h2291q693P7588k2552n4075J8520M8088k207k3088o3051L40o96j4266j37971
1499b64354R6701R8512q745L9581K7667n3770m8980N8406O190j587L6360N740
1487h279K4189q0482k8503N5254k2451n3416J7355K7949P2142P225k7423k4961
1475d1401k970j4430n0247J01177m0353K8555n1246k4929m2619K3693N6173L3171
$$ plain form
1560 -113094 -14081 39445 51447 3783 -74646 -66223 -50772 -9403 -47241 -55563 -51027 -85987
1548 -85987 -49858 -55590 -42987 -68990 -26798 -5792 -85331 -81822 -59372 -1227 -45204 -111285
1536 -111285 -107770 -49927 11129 -52020 -118900 -91997 -63271 -73451 -123172 -179676 -139289 -176527
1524 -176527 -140377 -123274 -49747 -23309 4440 24577 792 -81728 -132022 -82053 -145511 -82291
1512 -82291 -90984 -13396 -35948 -90023 -71503 -23415 -25622 -48710 -111761 -111421 -112117 -126383 -264354
1499 -264354 -167653 -69141 -77886 -38305 -10638 -64408 -113388 -54982 -48792 -50379 -14019 -8279
1487 -8279 15910 -64572 -93075 -37821 -60272 -113688 -96333 -68384 3758 10983 -16440 -41401
1475 -41401 -44371 -58801 -109048 -7871 -48224 -19669 -70915 -95844 -138463 -114770 -58597 -25426
1463b5426q7370R768P4250n9407j2217j608R6518k9075j6428p0737J9807O4148
1451c7777o4252J7284o6327p5783J06579L2266l4711K6684K0570k6792j3045o945
1439a22249Q173J9875N7698n049n8855k5343l8077j9909j9506N9969N7259L9502
1427d6512L1078q048P013k5656n1949j2074K2627L385r6390N6672M7054k2079
1415i4879k3044k1026L5309J1501o7634Q3270O1345M0383j6412k6065n42q7893
1403a05687n948K1878j9736l7607J9768N8655k4491J2900K4549M0919k1969k4843
1391f1612m9683M8033O153J697m7159J8049L4803L02J732k0249p2637L3042P309
1378a00220L0161J1204K6154j77M276N5776o9637p383M935k0916L807m0497Q969
$$ plain form
1463 -25426 -112796 -103028 -28778 -88185 -100402 -102010 -5492 -34567 -50995 -121732 -101925 -37777
1451 -37777 -102029 -84745 -151072 -226855 -120276 -88010 -122721 -96037 -75467 -102259 -115304 -122249
1439 -122249 -114076 -94201 -36503 -41552 -100407 -125750 -163827 -183736 -203242 -143273 -86014 -46512
1427 -46512 -15434 -23482 -16469 -42125 -94074 -106148 -83521 -80136 -176526 -119854 -72800 -94879
1415 -94879 -117923 -138949 -103640 -92139 -159773 -76503 -15158 25225 8813 -17252 -17794 -105687
1403 -105687 -111635 -89757 -109493 -147100 -127332 -68677 -93168 -80268 -55719 -14800 -36769 -61612
1391 -61612 -111295 -63262 -57109 -55412 -102571 -84522 -49719 -49417 -47685 -67934 -140571 -107529 -100220
1378 -100220 -70059 -58855 -32701 -32878 -28602 27174 -42463 -49846 -44911 -65827 -62020 -102517 -93548
1365i3548L1169M358J0880p2921L4536K4021P3089J2239n7402m0458L820M2109
1353b8108P8855m8974l5257L945J745j4710L1160J876o0371j9978k5744P0054
1341d5507m5954J9705k222m1649n8614j0540J06923m876k5192k0917M2244P4326
1329a2273K8902N666j3887o4423M0698N856J5346K9297n39L2823p0614p0538R3404
1316A9718q365p1686k1175O2412l0295m8962n8566P8845n6150L3700m1586O7791
1304g4319K1656p1212j4131J5908M9917R1631k975m2284l0546L2862K002l8265
1292e9756Q125n0156R395L1992k6092L3860K3511p5534R3085j0835K381j3394
1280c3418k2798j8227j1520p021K7587m7298R3368l5886k5247P3222o1225n712
$$ plain form
1365 -93548 -62379 -58021 -47141 -120062 -85526 -61505 11584 23823 -33579 -74037 -70217 -28108
1353 -28108 50747 1773 -33484 -29539 -27794 -42504 -11344 -9468 -69839 -89817 -115561 -45507
1341 -45507 -91461 -71756 -73978 -115627 -174241 -184781 -77858 -82734 -107926 -128843 -86599 -12273
1329 -12273 16629 22295 8408 -56015 -15317 -9461 5885 35182 34643 67466 -3148 -73686 19718
1316 19718 11353 -60333 -81508 -19096 -49391 -98353 -156919 -78074 -134224 -100524 -142110 -74319
1304 -74319 -52663 -123875 -138006 -122098 -72181 19450 16475 -25809 -56355 -23493 -21491 -59756
1292 -59756 -51631 -101787 -92392 -60400 -86492 -52632 -29121 -104655 -11570 -22405 -20024 -33418
1280 -33418 -56216 -74443 -85963 -92984 -65397 -112695 -19327 -55213 -80460 -7238 -68463 -74175
1268g4175M007J6376K5325k4962L0240L5557q652K5153j02158O5868k3183j09075
1256a39679k8389O673M7588P2895K3430R982n7676L853j4383q914K4736n899L295
1243f2488k4164O4085j0383jk1296o2486o2739N7774K1442J2005J851M4015j126
1230d3511q879n0558j1355J5582J00563j8089p2836K6271N527l885R12M9919O067
1217d272m371N8126r7845N9365m6351l3276l0640m1286N9301L8337l885l8316
1205h5113l4238M8450N8722J0033R45m3752p6902O804L7070m2769l2612J5920
1193a37442L731k074n978j5186k9941J0935J11493J9803n460j3221M9380K1943
1181G983k8354J632m9459n3203O3462M7271M104k4852o600J2042L9982j40322
$$ plain form
1268 -74175 -70168 -53792 -28467 -53429 -23189 12368 3716 28869 -73289 -7421 -30604 -139679
1256 -139679 -168068 -161395 -113807 -40912 -17482 -7500 -65176 -61323 -75706 -84620 -59884 -65783 -62488
1243 -62488 -86652 -22567 -32950 -32951 -54247 -116733 -179472 -121698 -100256 -88251 -86400 -42385 -43511
1230 -43511 -52390 -102948 -114303 -98721 1842 -16247 -89083 -62812 -57285 -61170 -60258 -10339 -4272
1217 -4272 -8643 49483 -48362 11003 -35348 -68624 -99264 -140550 -81249 -42912 -46797 -85113
1205 -85113 -119351 -70901 -12179 -2146 -1201 -44953 -121855 -115051 -77981 -120750 -153362 -137442
1193 -137442 -133711 -135785 -141763 -156949 -186890 -175955 -64462 -44659 -50119 -63340 -13960 7983
1181 7983 -20371 -18739 -68198 -121401 -57939 -10668 -6564 -31416 -38016 -25974 14008 -126314
1169a26314O343O4815K9222k5279k2686l8722k0885Q1589L6348q9829K3279O2305
1157a9814r2682P1032R1749m2384k9918M0460j0310r6196n1397M4123R066j5169
1145a01440N3303J2432M4261k0599n6854j854j5559J1670P1983L9653j2963J7492
1133D1525n1388k9704j3468K2075j014k2279m0451J9701O6012o1769l6665J8526
1121h8899N781O0283M7625j9053K5288o0862l2073r978M5087O014k1107M7023
1109E129k0859K9171k5629k5178j633P7722n2938m1838K840N7690K8272o6838
1097c4089M0672l3899m1163Q8909j5334k134k4036k2738K5109p441Q4561J8061
1085G6478m1596r8592N956P534M5571L2868n0872J0761m0093L839O1230J2625
$$ plain form
1169 -126314 -119971 -55156 -25934 -51213 -73899 -112621 -133506 -51917 -15569 -105398 -82119 -19814
1157 -19814 -112496 -41464 50285 7901 -22017 18443 8133 -88063 -139460 -95337 -86271 -101440
1145 -101440 -48137 -35705 8556 -12043 -68897 -70751 -86310 -74640 -2657 36996 24033 41525
1133 41525 -9863 -39567 -53035 -30960 -31974 -54253 -94704 -75003 -8991 -70760 -107425 -88899
1121 -88899 -83118 -22835 24790 5737 31025 -29837 -61910 -71888 -26801 -20787 -41894 5129
1109 5129 -15730 13441 -12188 -37366 -38999 38723 -14215 -56053 -53213 4477 32749 -34089
1097 -34089 6583 -27316 -68479 20430 5096 2962 -21074 -43812 -18703 -26144 58417 76478
1085 76478 34882 -63710 -57754 -50220 -4649 28219 -22653 -11892 -51985 -48146 13084 25709
1073B5709K2838m8377n4059M4604m0649m6812L4084O6695j1357M2261m9246J5996
1061A687J8006j04631M3901l248o2387P4476K3257j25264J0015O0784J15644k294
1049D9946j9582j7146l4317J1397n9358K4822n6541M209P5925m0399L1407O433
1037b3204l285k8770K2873J15698O9722j06499p0400J3809l6298l3465L7049q1770
1025a24540K0228Q2558Q689r957J31992o4591o7872l9861L4781q969k829j1991
1013e2362L991O9736k4651J155n3k1176l360J7545l1797M5270l4763M307q4986
1000a11144k5378R4657L6897M5129o6748P284O5745m0755o0639K8032J1077M568
988a1275P5837j06202K609J2426j170l1562Q910M8019p8250M8123N1300R954Q0029
$$ plain form
1073 25709 48547 170 -53889 -9285 -49934 -96746 -62662 4033 -7324 34937 -14309 1687
1061 1687 19693 -84938 -41037 -44285 -106672 -32196 -8939 -134203 -124188 -63404 52240 49946
1049 49946 30364 13218 -21099 -9702 -69060 -44238 -100779 -96570 -20645 -61044 -29637 -23204
1037 -23204 -26489 -55259 -32386 83312 153034 46535 -23865 -10056 -46354 -79819 -42770 -124540
1025 -124540 -104312 -21754 -13065 -23022 108970 44379 -23493 -63354 -28573 -37542 -40371 -52362
1013 -52362 -48371 21365 -3286 -2131 -2184 -23360 -26720 -9175 -40972 4298 -30465 -26158 -111144
1000 -111144 -136522 -41865 -4968 40161 -26587 -19303 46442 5687 -54952 -26920 -15843 -11275
988 -11275 64562 -41640 -39031 -26605 -27775 -59337 -50427 -2408 -80658 -32535 18765 28719 108748
975A08748p0585q6621J607M062L5007k111j5794p8828M2717K6810q1803J15299
963a492J9823n0664l8865N6133l7712O6588n5955J5191j7983L246l1409j5618
951h8717P9904L9551j6065n9146M4593p062R591O344l9287k6323l2339P2382R415
938g159l0613J4784K8110m0530J9300m1900m7028M8480q2896L1743R3230K3020
926H541N5416o1550K3301j6310k5939K0428p6759M3898j4223J6357L7324o6676
914e6192n3038J03362K0123j7979p1846j7696L0647K8549n0731l5579N0492q2031
902a51919N5997N7037N0850N9021l5318j4566L276L3252O6999J2216o4073q3799
890a1027k5173L3060o9040K4424K1801L9801j2057j7190j7486N0165O5606j7599
$$ plain form
975 108748 38163 -48458 -46851 -42789 -7782 -9893 -25687 -104515 -61798 -34988 -116791 -1492
963 -1492 18331 -32333 -71198 -15065 -52777 13811 -42144 -26953 -44936 -41690 -73099 -88717
951 -88717 -8813 30738 14673 -44473 120 -6942 2649 8993 -30294 -56617 -88956 -16574 -7159
938 -7159 -37772 -22988 5122 -35408 -16108 -58008 -105036 -56556 -139452 -107709 -14479 8541
926 8541 63957 2407 25708 9398 -16541 3887 -72872 -28974 -43197 -26840 10484 -56192
914 -56192 -109230 -5868 14255 -3724 -75570 -93266 -62619 -34070 -84801 -120380 -69888 -151919
902 -151919 -95922 -38885 11965 70986 35668 21102 24378 57630 124629 136845 72772 -11027
890 -11027 -36200 -3140 -72180 -47756 -25955 13846 1789 -15401 -32887 17278 82884 65285
878F5285j00760m9106M1124J6404L4640l961L2322j2869p2001J3412N7106K1949
866D3545n2612J5794j4752m0206j9738L7023k0014M5495J3219j03074L2910N0665
854a1745Q293l1388j0678J1067n710M193n292L0628L4328J9562J385m0320n7504
841e3181J8555l5913K4297j3631j8328k7235j9833K3184M7375o3231M8124N586
829f4231J45183o4892o9435K5287k0449k869n2388Q5400Q0566l9452l2881M6503
817C6342J714m1715m4047J3023j1392Q000L8017j5137j0664k2582K772j7699n798
804f9166P6803n682j5809k8731L5951j6628N7533l2579n9325P3100L5688j10764
792e9609r2M4406J5734j5766K5070j2008L8347m2926m6263j1070N7139p7888R0421
$$ plain form
878 65285 -35475 -84581 -43457 -27053 7587 3626 35948 23079 -48922 -35510 21596 43545
866 43545 -9067 6727 -8025 -48231 -67969 -30946 -50960 -5465 7754 -95320 -62410 -11745
854 -11745 -3452 -34840 -45518 -34451 -40161 -35968 -41260 -10632 23696 43258 44643 4323 -53181
841 -53181 -34626 -70539 -46242 -59873 -78201 -105436 -125269 -102085 -54710 -117941 -69817 -64231
829 -64231 80952 16060 -53375 -28088 -48537 -51406 -103794 -18394 62172 22720 -10161 36342
817 36342 38056 -3659 -47706 -34683 -46075 -38075 -58 -15195 -25859 -48441 -45669 -63368 -69166
804 -69166 7637 1955 -13854 -42585 -6634 -23262 34271 1692 -57633 15467 51155 -59609
792 -59609 -59701 -15295 439 -15327 9743 -2265 36082 -6844 -53107 -64177 -7038 -84926 5495
779E495J1142j06902l134l5183J03521J224M1219N8353j0481N6080l8112n6780
767B6442l0358j2563Q2183j680k7637M1397k1713p4190L119L9296L3030j5162
755D2164l2633n8404L264P4739l1081J558r8981L2853R9962j4123j7676Q920L1472
742D2034K0759J5850n8066j9371m0155O832R7480n0373l9471k6125Q786l4403
730g6223j1307L0394M0200j3952J2009p6215P276O8019N0725N4692q5472p356
718g210N0914l4682L0159j5192k94o2138k7051k985L4930m945j03683Q3331N1665
705g181n0745m6961L1307J5666J6946Q747m1502N3426O0503j2971p024p2499K6062
692b6226j8975P2165k8093O666j2192k3838R2374K8515o4432M0816N3270o3040
$$ plain form
779 5495 16637 -90265 -93399 -128582 -25061 -23837 17382 75735 65254 121334 83222 26442
767 26442 -3916 -16479 65704 64024 36387 77784 56071 -18119 -15000 24296 57326 42164
755 42164 9531 -48873 -45609 29130 -1951 -393 -99374 -66521 33441 19318 1642 10562 42034
742 42034 62793 78643 20577 1206 -38949 -32117 65363 14990 -24481 -50606 -41820 -76223
730 -76223 -87530 -57136 -16936 -30888 -18879 -95094 -87818 -19799 30926 85618 146 -7210
718 -7210 43704 9022 39181 23989 23695 -38443 -65494 -68479 -33549 -38494 -142177 -58846 -7181
705 -7181 -57926 -104887 -73580 -57914 -40968 -32221 -73723 -20297 40206 27235 20211 -52288 -26226
692 -26226 -45201 26964 -1129 5537 -6655 -30493 61881 90396 25964 66780 120050 57010
680E7010m6967k8465j1822n3726K7314J8184j1390N4233k4795K3912o5731M4649
668a7594L222L4928K0223O1041n6036J0847m9331r901P1696Q585J9969j4461n9900
655B3288q3937k1398K4564M6301K7999M8424n4293M4277K7634m7575j05633M9924
643b0425Q2029p1940K9332m438p3988P933M945P3982m3962l4669P4203m26n4299
630c1723o7060R1118K9182j7960p655L0478J8417o3765K157L721R831o329K8608
617A9020n1334M0086N0769j21622K1698N4229j4546N8742l0502J2064O1144j2242
605H7506j19325l9202O8531K4202J9071J141Q6397o7995k6130k4224J3548j132
593B2388L9916n0665l0197K6582j7036M9500k5997o7717K1646N4847l0820P642
$$ plain form
680 57010 10043 -18422 -30244 -83970 -56656 -38472 -49862 4371 -20424 3488 -62243 -17594
668 -17594 -14372 20556 40779 101820 45784 56631 7300 -2601 69095 77680 97649 83188 23288
655 23288 -60649 -82047 -57483 -11182 16817 65241 10948 55225 82859 35284 -70349 -20425
643 -20425 61604 -10336 18996 14558 -59430 -51497 -46552 27430 -16532 -51201 23002 22576 -31723
630 -31723 -98783 -7665 21517 3557 -4098 26380 44797 -18968 -16811 -13090 -3259 -9588 19020
617 19020 -32314 7772 58541 -63081 -41383 12846 -1700 57042 26540 38604 99748 87506
605 87506 -31819 -71021 -2490 21712 40783 41924 128321 60326 34196 9972 23520 22388
593 22388 62304 11639 -18558 8024 -9012 40488 14491 -53226 -31580 23267 -7553 89
581H9j389J18058n575q8679n50Q59m1101P536K7250o4528j1430P0022k9378p0390
567h9206N7235R1446q980O2785j6203r0393j5861K6838N1062Q80K4539j4924l0157
554D9061M610n2214L8597o4488J3839k5741O0773l4501P646k9451K0859j5750
542b6760L083J8125K7295j0769r495q7079K8220P7406l4529K7206K9888k4815
530A7776j2226K2027q9097P9437M9230L0833o8105l5905j7744J49715L4027j4825
518A45143j922k9547j03890J3870q7188J5193R6649j3512n5070j54443N2454J19702
506b561Q4854J0314m3379o135J7048r1090M9953K5098J0547O6006j160q1842M8572
493H6225Q0725j30173k7079K2325J7614l8988m845J8149K4533j9327J3237l9671
$$ plain form
581 89 -1300 116758 111183 22504 21954 22813 -18288 -10752 16498 -48030 -59460 10562 -18816 -89206
567 -89206 -31971 59475 50495 113280 97077 6684 -9177 17661 68723 69603 94142 79218 49061
554 49061 53671 1457 40054 -24434 -10595 -36336 24437 -10064 -2418 -31869 -11010 -26760
542 -26760 -23677 -5552 21743 10974 1479 -85600 -57380 20026 -14503 12703 42591 17776
530 17776 5550 27577 -61520 17917 67147 97980 29875 -6030 -23774 125941 159968 145143
518 145143 143221 113674 9784 23654 -63534 -48341 48308 34796 -20274 -174717 -122263 -2561
506 -2561 82293 92607 49228 43093 60141 -30949 19004 44102 54649 120655 119495 37653 86225
493 86225 166950 36777 9698 32023 49637 10649 5804 23953 48486 29159 42396 2725
481B725K4362J04602q1567j7445p331p0784o130P9499l2529P1783k4119l445M856
468D4477l2438M6860m2837R884K8596l8081m9063O2862O1m3691M4264J1019o2802
455b0889M1118K6370n3345J3088L1100L6245M3395o3981p6805K9448j4553L8872
443C0063j5919L1570K8993n9522M9316j9692L8609L8571m7069q2917m2324J0888
431c9433J10467l8182k4353n473l9171l5446R4950k0247l6231L2023L8471J2521
419D9896J01041m4861o7115N5499q6799m7091P9813L6420r963J0093m3427n5035
407b1529L5701M5055l8957l322M35n3344N210M0478m0086l347J3624O699P547
394e836M4368L7328l9638o1976n9151L7568R2530O658j3010l5838P2741n67L5030
$$ plain form
481 2725 27087 131689 50122 32677 25346 -45438 -51568 27931 -4598 67185 43066 39621 44477
468 44477 12039 58899 16062 25946 54542 16461 -32602 30260 30321 -13370 30894 41913 -20889
455 -20889 20229 46599 -6746 6342 37442 73687 117082 53101 -23704 5744 -8809 30063
443 30063 14144 45714 74707 15185 64501 44809 83418 121989 74920 -7997 -50321 -39433
431 -39433 71034 32852 8499 3026 -36145 -71591 23359 3112 -33119 -1096 37375 49896
419 49896 150937 106076 38961 94460 7661 -39430 40383 76803 66840 76933 33506 -21529
407 -21529 14172 59227 20270 16948 17383 -35961 -30751 9727 -30359 -33706 -20082 -13383 -5836
394 -5836 38532 75860 36222 -25754 -84905 -47337 45193 51851 38841 3003 75744 75177 110207
381A10207l8406l4799j0881L309O8870k7951m9425J2987K5745M8142o1950q7008
369d1160L753M1998P0507M6232n680M0173m0415o274M2889K6851j27575p7889
357b6590m9512R1364P5768m2693j4444J7977N0515k9763m1398j0804N1620j1673
345F0367K3439m0529K4977l8678m0231k185k1999P3215M8246m9780K2253L2695
333I1790p0810n8146L4031P3782J7358l0044j2759P898k8571N0745M3356J1016
321A29646q8415o8853m62j58O2525J02313k1407n731J1345n0969r191M5479J2542
308A18664m2000K2729R229L8012p0976j7215K9467k5725R389o889k6750m0739
296b804j3416O7264j6198j4860K139n753q3048J06272J5129k984L8918j0343K143
$$ plain form
381 110207 71801 37002 26121 29430 98300 70349 20924 33911 59656 107798 45848 -41160
369 -41160 -37407 4591 75098 121330 115650 155823 115408 109134 152023 178874 51299 -26590
357 -26590 -76102 15262 91030 48337 33893 51870 102385 72622 31224 20420 72040 60367
345 60367 83806 43277 68254 29576 -10655 -12840 -34839 38376 86622 36842 59095 91790
333 91790 20980 -37166 -3135 70647 88005 57961 45202 53100 24529 75274 118630 129646
321 129646 41231 -27622 -28084 -28242 34283 136596 115189 109458 120803 69834 60643 106122 118664
308 118664 76664 99393 108622 146634 75658 58443 87910 62185 71574 64685 37935 -2804
296 -2804 -16220 51044 34846 19986 22125 16372 -66676 39596 54725 51741 90659 80316 82459
283H2459J0733o2688n1017L9171P2323j2765l4337M5195o4642n9840N7585O4076
271H6253M988m4082J7412j9939L5130k071m4481Q963L9357L5261O3341N1764n1789
258A80107k565m9308j6913o8639O956K2875M234p0942R7449l9482L3818j3905
246H3685K312m5802M5099n613l0235q130J3826K5735k2384m5301O542M1426q5401
233b4241K2723N0065p0434N4964L1807p612L7262l8120N3499j8108p1406K7190
221D7589P7708k9335k0624Q1956n3469j20224N1841j0016j2795N2705O5914m3332
209H7918l3015k2205l1358j7937M6726k843o4013N0770j730R572k8020j9441L2547
196F971j3986O7808m6188O4086R935m9775k8449k682L7506j0373r359J2891M4905
$$ plain form
283 82459 93192 30504 -20513 18658 90981 78216 43879 89074 24432 -35408 22177 86253
271 86253 91241 47159 64571 44632 79762 77691 33210 42173 81530 116791 180132 231896 180107
258 180107 177542 128234 111321 42682 49638 72513 76747 5805 103254 63772 97590 83685
246 83685 85997 40195 85294 79681 49446 41316 55142 80877 58493 13192 19734 61160 -24241
233 -24241 -1518 48547 -21887 33077 64884 57272 94534 56414 109913 91805 20399 47589
221 47589 125297 95962 75338 157294 103825 -16399 35442 25426 12631 65336 131250 87918
209 87918 54903 32698 1340 -16597 30129 27286 -36727 14043 12313 21885 -6135 -25576 6971
196 6971 -7015 60793 14605 78691 88626 38851 10402 7720 45226 34853 25494 38385 83290
183H3290M2080J108O215L9061k5702N112n629p6966L8334L3755m2829p8580J7299
170C6548K9755L5272j1564k5591m6420N053N670p333m395N8781M3150Q021n6762
157G0185o5723k5498j8329m2762O5529J08568l4842J9270M7767k9348n3238k9760
145A1819M0820q7508n626L3585J8227J9970k6373K9378j5711J1160n074r139k6821
132a1293N4094n840l6410K7146J8524j12n8526n359J7403O4858l4361o0657N7069
119B6536m9119m7553k8267K0897J22360m5673n1575j063J5676O1656J5536N3576
107I2987l2086m8734r75k9164l4643M890K7640P5461K4817m4061o5550K9894o666
94f190M0803L0374Q121q5289K2443M8669k9395j1123K75j8130N583j4417J3320
$$ plain form
183 83290 125370 126478 132693 171754 146052 151164 145535 68569 106903 140658 97829 19249 36548
170 36548 66303 101575 90011 64420 18000 23053 28723 21390 16995 75776 118926 126947 70185
157 70185 4462 -21036 -39365 -82127 -16598 91970 57128 76398 124165 94817 41579 11819
145 11819 52639 -34869 -40495 -6910 11317 31287 4914 34292 18581 29741 24667 15528 -11293
132 -11293 42801 36961 551 27697 46221 46109 -12417 -17776 -373 64485 30124 -30533 26536
119 26536 -22583 -70136 -98403 -77506 44854 -819 -52394 -53457 -37781 23875 39411 92987
107 92987 60901 12167 11192 -17972 -52615 -47725 -20085 55376 80193 36132 -29418 476 -6190
94 -6190 34613 64987 73108 -12181 10262 58931 29536 18413 18688 558 6141 -8276 5044
81E044k0273n9486K9036Q0848r363j8300q0207J755k190J3677Q3565j8287n5787
68d9968l310N4684q247n9721M4040J2980L8738n172M235K2811o5666p7821J7455
55g4962O3791K3275J3673j0311m9904l7571N3643j2090K7244J0977k9367j1052
43c2654j2126m2656M1477L7577j7516o2006O84M2533L7625K9350k7416j6268n464
30b6860l4495J2195J6141L360l5672k5320M0747N632J65k6522j9578K2504k8090
17i5793k2379M4303j8713k1566L44K6819K2628m3369J8798K0431J5164j8294L246
4f8381j7269M9378K0710J5599
$$ plain form
81 5044 -15229 -74715 -45679 35169 25806 7506 -72701 -70946 -73136 -59459 24106 5819 -49968
68 -49968 -53278 1406 -6841 -66562 -22522 -9542 29196 24024 28259 51070 -14596 -92417 -74962
55 -74962 -11171 12104 25777 15466 -34438 -72009 -18366 -30456 -3212 7765 -21602 -32654
43 -32654 -44780 -87436 -45959 -8382 -25898 -87904 -87220 -44687 -7062 22288 -5128 -21396 -26860
30 -26860 -61355 -49160 -33019 -29659 -65331 -90651 -49904 -44272 -44107 -70629 -90207 -67703 -95793
17 -95793 -118172 -73869 -92582 -114148 -113804 -86985 -64357 -107726 -88928 -68497 -53333 -71627 -68381
4 -68381 -85650 -36272 -15562 37
0C7
$$ Imaginary data points
##PAGE= N=2
##DATA TABLE= (X++(I..I)), XYDATA
16383b445755M9766J3174O4741k387K2083M5532J01916L6966k9488L4686M9121
16372b059645k087Q713L1562O3544j199J5962N3020N1575o2062L3528O1332J9841
16360a785916O4257O5367R092k0094K9582K0113R4922N23N4570J0636j1699L1621
16348a437026J20269m5781j2786J4899J9542M1997N9531P3704j7837O7740N087
16337a110661J8117N6372L0550M9517Q3084j2639N0954J3403j02J3232N579N7605
$$ plain form
16383 -2445755 -2395989 -2382815 -2318074 -2320461 -2298378 -2252846 -2150930 -2113964 -2143452 -2108766 -2059645
16372 -2059645 -2061732 -2053019 -2021457 -1957913 -1959112 -1943150 -1890130 -1838555 -1900617 -1867089 -1805757 -1785916
16360 -1785916 -1721659 -1656292 -1647200 -1667294 -1637712 -1617599 -1522677 -1522154 -1467584 -1456948 -1468647 -1437026
16348 -1437026 -1316757 -1362538 -1375324 -1360425 -1340883 -1298886 -1239355 -1165651 -1183488 -1115748 -1110661
16337 -1110661 -1092544 -1036172 -1005622 -956105 -873021 -885660 -834706 -821303 -821405 -808173 -802594 -744989
$$ [...]
##END NTUPLES=NMR SPECTRUM
##END=
