##TITLE=1H_50-2021
 DMSO-d6, 8 sc, 
 5.07.2021
##JCAMPDX= 6.0         $$ Bruker NMR JCAMP-DX V2.0
##DATA TYPE= NMR FID
##DATA CLASS= NTUPLES
##ORIGIN= UXNMR, Bruker Analytische Messtechnik GmbH
##OWNER= root
$$ XWIN-NMR		Version 3.5
$$ Mon Jul  5 10:21:41 2021 Russian Standard Time (UT+4h)  she@DPX200
##.OBSERVE FREQUENCY= 200.131506
##.OBSERVE NUCLEUS= ^1H
##.DELAY= (6, 6)
##.ACQUISITION MODE= SIMULTANEOUS
##.ACQUISITION SCHEME= undefined
##.AVERAGES= 8
##.DIGITISER RES= 18
##SPECTROMETER/DATA SYSTEM= spect
##.PULSE SEQUENCE= zg30
##.SOLVENT NAME= CDCl3
##.SHIFT REFERENCE= (INTERNAL, CDCl3, 0, 15.7039)
##AUDIT TRAIL= $$ (NUMBER, WHEN, WHO, WHERE, WHAT)
$$ ##TITLE= Audit trail, XWIN-NMR		Version 3.5
$$ ##JCAMPDX= 5.01
$$ ##ORIGIN= Bruker BioSpin GmbH
$$ ##OWNER= she
$$ F:/spectra/data/she/nmr/H-F/1/audita.txt
$$ ##AUDIT TRAIL=  $$ (NUMBER, WHEN, WHO, WHERE, WHAT)
(   1,<2021-07-05 10:20:17.87 +0400>,<she>,<DPX200>,
      <created by zg, POWCHK disabled, PULCHK disabled
       configuration hash MD5:
       00 E9 B6 7A A2 85 ED C7 34 08 36 98 17 FE 4E 26
       data hash MD5: 16K
       32 CB EA 30 2F 76 75 24 93 9F 6D C4 5B D1 21 6A>)
$$ ##END=
$$ 
$$ hash MD5
$$ 67 D7 F8 B0 20 AE B6 10 61 BE 41 A7 2A B1 56 B7
##$RELAX= 
##$RELAX= 
##$RELAX= 
##$RELAX= 
##$RELAX= 
##$RELAX= 
$$ Bruker specific parameters
$$ --------------------------
##$DU= <F:/spectra>
##$EXPNO= 1
##$NAME= <H-F>
##$PROCNO= 1
##$TYPE= <nmr>
##$USER= <she>
##$AMP= (0..31)
100 100 100 100 100 100 100 100 100 100 100 100 100 100 100 100 100 100 
100 100 100 100 100 100 100 100 100 100 100 100 100 100 
##$AQSEQ= 0
##$AQ_mod= 1
##$AUNM= <au_zg>
##$AUTOPOS= <>
##$BF1= 200.13
##$BF2= 200.13
##$BF3= 200.13
##$BF4= 200.13
##$BF5= 200.13
##$BF6= 200.13
##$BF7= 200.13
##$BF8= 200.13
##$BYTORDA= 1
##$CFDGTYP= 0
##$CFRGTYP= 5
##$CHEMSTR= <none>
##$CNST= (0..31)
1 1 145 1 1 1 1 1 1 1 1 1 1 1 1 1 1 1 1 1 1 1 1 1 1 1 1 1 1 1 1 1 
##$CPDPRG= <>
##$CPDPRG1= <>
##$CPDPRG2= <>
##$CPDPRG3= <>
##$CPDPRG4= <mlev>
##$CPDPRG5= <mlev>
##$CPDPRG6= <mlev>
##$CPDPRG7= <mlev>
##$CPDPRG8= <mlev>
##$CPDPRGB= <>
##$CPDPRGT= <>
##$D= (0..31)
0 1.2 0 0 0 0 0 0 0 0.06 0 0.03 0 0 0 0 0.0002 0 0 0 0 0 0 0 0 0 0 0 0 
0 0 0 
##$DATE= 1625466017
##$DBL= (0..7)
120 120 120 120 120 120 120 120 
##$DBP= (0..7)
150 150 150 150 150 150 150 150 
##$DBP07= 0
##$DBPNAM0= <>
##$DBPNAM1= <>
##$DBPNAM2= <>
##$DBPNAM3= <>
##$DBPNAM4= <>
##$DBPNAM5= <>
##$DBPNAM6= <>
##$DBPNAM7= <>
##$DBPOAL= (0..7)
0.5 0.5 0.5 0.5 0.5 0.5 0.5 0.5 
##$DBPOFFS= (0..7)
0 0 0 0 0 0 0 0 
##$DE= 6
##$DECBNUC= <off>
##$DECIM= 32
##$DECNUC= <off>
##$DECSTAT= 4
##$DIGMOD= 1
##$DIGTYP= 9
##$DL= (0..7)
0 120 120 120 120 120 120 120 
##$DP= (0..7)
150 150 150 150 150 150 150 150 
##$DP07= 0
##$DPNAME0= <>
##$DPNAME1= <>
##$DPNAME2= <>
##$DPNAME3= <>
##$DPNAME4= <>
##$DPNAME5= <>
##$DPNAME6= <>
##$DPNAME7= <>
##$DPOAL= (0..7)
0.5 0.5 0.5 0.5 0.5 0.5 0.5 0.5 
##$DPOFFS= (0..7)
0 0 0 0 0 0 0 0 
##$DQDMODE= 0
##$DR= 18
##$DS= 0
##$DSLIST= <SSSSSSSSSSSSSSS>
$$ [...]
##$SUBNAM2= <"">
##$SUBNAM3= <"">
##$SUBNAM4= <"">
##$SUBNAM5= <"">
##$SUBNAM6= <"">
##$SUBNAM7= <"">
##$SUBNAM8= <"">
##$SUBNAM9= <"">
##$SW= 20.0188882624521
##$SWIBOX= (0..15)
0 0 2 0 0 0 0 0 0 0 0 0 0 0 0 0 
##$SW_h= 4006.41025641026
##$TD= 16384
##$TD0= 1
##$TE= 0
##$TE2= 300
##$TE3= 300
##$TEG= 300
##$TL= (0..7)
0 120 120 120 120 120 120 120 
##$TP= (0..7)
150 150 150 150 150 150 150 150 
##$TP07= 0
##$TPNAME0= <>
##$TPNAME1= <>
##$TPNAME2= <>
##$TPNAME3= <>
##$TPNAME4= <>
##$TPNAME5= <>
##$TPNAME6= <>
##$TPNAME7= <>
##$TPOAL= (0..7)
0.5 0.5 0.5 0.5 0.5 0.5 0.5 0.5 
##$TPOFFS= (0..7)
0 0 0 0 0 0 0 0 
##$TUNHIN= 0
##$TUNHOUT= 0
##$TUNXOUT= 0
##$USERA1= <user>
##$USERA2= <user>
##$USERA3= <user>
##$USERA4= <user>
##$USERA5= <user>
##$V9= 5
##$VALIST= <valist>
##$VCLIST= <CCCCCCCCCCCCCCC>
##$VD= 0
##$VDLIST= <DDDDDDDDDDDDDDD>
##$VPLIST= <PPPPPPPPPPPPPPP>
##$VTLIST= <TTTTTTTTTTTTTTT>
##$WBST= 1024
##$WBSW= 4
##$XGAIN= (0..3)
0 0 0 0 
##$XL= 0
##$YL= 0
##$YMAX_a= 73102
##$YMIN_a= -50254
##$ZGOPTNS= <>
##$ZL1= 120
##$ZL2= 120
##$ZL3= 120
##$ZL4= 120
##$ABSF1= 10
##$ABSF2= 0
##$ABSG= 5
##$ABSL= 3
##$ALPHA= 0
##$AQORDER= 0
##$ASSFAC= 0
##$ASSFACI= 0
##$ASSFACX= 0
##$ASSWID= 0
##$AUNMP= <proc_1d>
##$AZFE= 0.1
##$AZFW= 0.1
##$BCFW= 1
##$BC_mod= 2
##$BYTORDP= 1
##$COROFFS= 0
##$CY= 11.3945322036743
##$DATMOD= 1
##$DC= 2
##$DFILT= <>
##$DTYPP= 0
##$F1P= 15.9154993809931
##$F2P= -4.1035820241983
##$FCOR= 0.5
##$FTSIZE= 0
##$FT_mod= 4
##$GAMMA= 1
##$GB= 0.15
##$INTBC= 1
##$INTSCL= 1
##$ISEN= 128
##$LB= 0.24
##$LEV0= 0
##$LPBIN= 0
##$MAXI= 10000
##$MC2= 0
##$MEAN= 0
##$ME_mod= 0
##$MI= 1.114404
##$NCOEF= 0
##$NC_proc= 0
##$NLEV= 6
##$NOISF1= 3.799351
##$NOISF2= 2.8
##$NSP= 1
##$NTH_PI= 0
##$NZP= 0
##$OFFSET= 15.70392
##$PC= 1
##$PHC0= -12025
##$PHC1= -53.79902
##$PH_mod= 1
##$PKNL= yes
##$PPARMOD= 0
##$PSCAL= 0
##$PSIGN= 0
##$REVERSE= no
##$SF= 200.130013532006
##$SI= 16384
##$SIGF1= 3
##$SIGF2= 2
##$SINO= 400
##$SIOLD= 16384
##$SREGLST= <1H.CDCl3>
##$SSB= 0
##$STSI= 0
##$STSR= 0
##$SW_p= 3612.71676300578
##$SYMM= 0
##$S_DEV= 0
##$TDeff= 0
##$TDoff= 0
##$TI= <>
##$TILT= no
##$TM1= 0
##$TM2= 0
##$TOPLEV= 0
##$USERP1= <user>
##$USERP2= <user>
##$USERP3= <user>
##$USERP4= <user>
##$USERP5= <user>
##$WDW= 1
##$XDIM= 8192
##$YMAX_p= 0
##$YMIN_p= 0
$$ End of Bruker specific parameters
$$ ---------------------------------
##NTUPLES= NMR FID
##VAR_NAME=  TIME,          FID/REAL,        FID/IMAG
##SYMBOL=    X,             R,               I
##VAR_TYPE=  INDEPENDENT,   DEPENDENT,       DEPENDENT
##VAR_FORM=  AFFN,          ASDF,            ASDF
##VAR_DIM=   8192,          8192,            8192
##UNITS=     SECONDS,       ARBITRARY UNITS, ARBITRARY UNITS
##FACTOR=    0.0002496,     1,               1
##FIRST=     0,             0,               0
##LAST=      2.0444736,     0,               0
##MIN=       0,             -50254,          0
##MAX=       2.0444736,     73102,           0
$$ Real data points
##PAGE= N=1
##DATA TABLE= (X++(R..R)), XYDATA
0@%%%%%%%%%%%%%%%qJ6j6J6j6K3l1L2l9M7m8N6p2Q0q8J04j20J36j52J76k00K24
$$ 0 0 0 0 0 0 0 0 0 0 0 0 0 0 0 0 -8 8 -8 8 -8 15 -16 16 -23 24 -24 32 -40 40 -48 56 -64 72 -80 96 -104 120
37A20k54K83l16L51l89M31m77N30n86O45p12P87q67R54j050J156j274J408j560
$$ 120 -134 149 -167 184 -205 226 -251 279 -307 338 -374 413 -454 500 -550 606 -668 740 -820
56h20J728j919K142k403K713l089L556m154M954o084P814j0816J7505o1381K0423
$$ -820 908 -1011 1131 -1272 1441 -1648 1908 -2246 2708 -3376 4438 -6378 11127 -50254 -29831
71b9831Q0179m3505o914j6672J516J7629N964j1608Q273q542r684J3603J6903
$$ -29831 50348 6843 -71 -16743 -15227 2402 8366 -3242 5031 -3511 -13195 408 17311
84A7311j9698p439J2382Q94n284J246k406Q532k814r801O206O499n547l678K010
$$ 17311 -2387 -9826 2556 3450 -1834 -588 -2994 5538 2724 -7077 -871 5628 81 -3597 -1587
99a587P931o077q292R379M809p421k097L109L763k914n047L704N165l051p315
$$ -1587 6344 267 -8025 1354 6163 -1258 -3355 -246 3517 603 -4444 -740 4425 1374 -5941
114e941M961Q953r814m405R939j839k967L63j632O889k143r115P298N086p280
$$ -5941 -980 7973 -1841 -6246 3693 1854 -1113 -750 -2382 4507 2364 -6751 547 5633 -1647
129a647k410M876L141m641k677L571K132j046n142K109P665o749m688P618M46
$$ -1647 -4057 819 3960 -681 -3358 213 2345 1299 -3843 -1734 5931 -818 -5506 2112 2558
144B558k742j978M03O010l757n499O326K128m148k082K213M489l725l876L940
$$ 2558 -184 -2162 -1759 4251 494 -5005 1321 3449 -699 -2781 -568 3921 196 -3680 260
159B60K465k349l701K852N120n703k313M566K52m75l294N42O234m528l994N438
$$ 260 2725 376 -3325 -473 4647 -1056 -3369 1197 1449 974 -2320 -1778 4456 -72 -4066 1372
175A372R44k402k151J268M114k898l369L336K185j748l745K768M199m787j566
$$ 1372 2316 -86 -2237 -969 3145 247 -3122 214 2399 651 -3094 -326 3873 -914 -2480
190b480L310N19l61l501J345N088m309k674M235M14j484j980J032L865l058k517
$$ -2480 830 1349 988 -2513 -1168 3920 -389 -3063 1172 1586 102 -1878 -846 3019 -39 -2556
206b556K770J606j237l105K008L635l788j145K112P82Kl300J297M165l770j760
$$ -2556 214 1820 583 -2522 -514 3121 -667 -1812 300 1082 1084 -2216 -919 3246 -524 -2284
222b284K925N08n70k410J044L557l112j651K300J175r24k707J835K690k950r83
$$ -2284 641 1149 579 -1831 -787 2770 -342 -1993 307 1482 558 -2149 -314 2376 -574 -1557
238a557J599J036M8l327J665L226l380r08K019L76l8k612J222L032k786j226J725
$$ -1557 42 1078 1126 -2201 -536 2690 -690 -1598 421 797 759 -1853 -631 2401 -385 -1611 114
255A14R48l90k549J636K251k511n59Q82J196l0k903J668K439k872m15J238O44
$$ 114 1062 672 -1877 -241 2010 -501 -1060 -178 1018 988 -1915 -247 2192 -680 -1095 143 787
272G87R9k580J334K442k496n85J056P71q0k453J429J945k180m16O65J051K8k555
$$ 787 886 -1694 -360 2082 -414 -999 57 828 748 -1705 -276 1669 -511 -927 -262 789 817 -1738
290a738J585J830k164k92N73Q31K39k575J539J880k119l08O23R17l1k422J508
$$ -1738 -153 1677 -487 -779 -206 625 864 -1711 -172 1708 -411 -719 -96 821 790 -1632 -124
307a24J637j899j48J54J159J02k444J609J304j805L6J00J013O3k237J507J263
$$ -124 1513 -386 -534 -380 779 881 -1563 46 1350 -455 -419 -319 694 757 -1480 27 1290
324A290j674j01K49P65K13k094J436J082j568J30m7R69J6k030J411R04j288Q2
$$ 1290 -384 -485 -236 529 742 -1352 84 1166 -402 -272 -319 650 666 -1364 47 951 -337 -255
342b55k23J089O3k020J491Q80j384P1j67R62J09j893J513N14j023R5k98J212k83
$$ -255 -478 611 674 -1346 145 1025 -359 -288 -455 507 616 -1277 236 750 -273 -178 -476 736 453
361D53j749J553K63p27ll12J149p4j629J187N73r18J24l52J104k45j545J441K59
$$ 453 -1296 257 520 -207 -210 -522 627 553 -1076 111 684 -234 -110 -462 642 397 -1148 293 552
380E52q38K05m25J147j97j438J177K15n09K5l63J127l14j367J164K84n57Q2n18
$$ 552 -286 -81 -506 641 444 -994 183 398 -111 -86 -449 678 364 -1003 161 445 -112 -30 -548
399e48J205k33j345J143L8l46J02o04J127k27j186J203j86j42J03o47J172m25
$$ -548 657 424 -921 222 260 -86 16 -588 539 312 -874 329 143 1 104 -543 629 204
417B04j009J115o1k81p3m74J277n39q92J134k53k98J36n30J099l18r51R89j84
$$ 204 -805 310 249 -32 -105 -579 698 159 -733 401 148 -150 -14 -544 555 237 -714 275 91
436I1l4M0n37J079n50o54R70l66O1q6m68J026l78q23R53k82m1J0m12J006n35o27
$$ 91 57 97 -440 639 89 -565 405 39 100 14 -454 572 194 -629 324 42 1 11 -401 605 70 -557
458e57R32m58J38o9n22J138n92m83Q91m97K71k15m19J024n34m66O29l37K57n2
$$ -557 375 -83 55 -14 -536 602 10 -473 418 -79 192 -23 -442 582 48 -418 211 -126 131 79
478G9n33J066o03l34N74l87L59l90k16R49o34k21N68m96O05m69k95J010p03r7
$$ 79 -454 612 9 -325 249 -138 221 -169 -385 564 -70 -291 277 -219 386 -83 -378 632 -71 -168
498a68N06m92M14k56l33P63n23j82M57l35M86m33k76Q27n27j44M03k67L74m39
$$ -168 338 -154 260 4 -329 434 -89 -271 186 -149 337 -96 -372 455 -72 -216 187 -80 294 -145
518a45j69P43o26R9K49l26M28m53j3O61o25J14K62l86L40m05N3P55p53J8K70l09
$$ -145 -314 429 -197 -98 151 -175 253 -200 -213 448 -177 -63 199 -187 153 -252 -199 556 -197 -179 91 -218
540b18O27m91j38O17n24P1P4j24M16n29QN58n58K16K10m97N45m55k7O26o14J86
$$ -218 409 -82 -220 397 -127 -56 18 -106 310 -219 -211 347 -211 5 215 -282 263 -192 -219 407 -207 -21
562b1J35l44O23o35J07M35n92L36j2k58O10n97R6M25n69L85q1j83L74m35K16L40
$$ -21 114 -230 393 -242 -135 300 -292 44 32 -226 384 -213 -117 308 -261 124 43 -140 234 -201 15 355
584C55n20K93j29j16M40n62J67L70m87K65j8q5K41n27L83K35n36L13q0j03M14
$$ 355 -165 128 -1 -117 323 -239 -72 298 -189 76 58 -27 214 -313 70 305 -231 82 2 -101 313
605C13m95J52K04l76L12k49J5M02n03K26J37m23M21k74J43K30m69K33P7l89M57
$$ 313 -182 -30 174 -202 110 -139 -124 278 -225 1 138 -285 136 -138 5 235 -234 -1 76 -313 144
626A44j44r4L60m98K90P2l94O06m83K9M22o02L91O2l03K18j98N6K99n35M52rk99
$$ 144 0 -94 266 -232 58 130 -264 342 -141 -112 310 -292 99 161 -142 76 -122 -66 233 -302 150 141 -158
649a58L14l18Q2M19n41L60p1k09K91k75N2K57m75L90l0k42L85m51J79J38l99M81
$$ -158 156 -162 -80 339 -202 158 87 -122 169 -106 -54 203 -272 118 88 -154 231 -220 -41 97 -302 179
671A79j38j22L23m04J23J68k73K64Jk26K34k47J44M2l08M89k79j14L75m32K16
$$ 179 41 -81 242 -162 -39 129 -144 120 121 -105 129 -118 26 68 -240 249 -30 -144 231 -201 15
692A5J51m31L64q6j76K93k35J98L9k72L88l55ML90m89L31n4l25M48k44j6L09l55
$$ 15 166 -265 99 13 -163 130 -105 93 132 -140 248 -107 -103 287 -202 129 75 -250 198 -46 -62 247 -108
715a08J73j0k24K32j77J04J04l02L58j00k19L83l52O4K45l56L01m2k44M28m03
$$ -108 65 55 -169 63 -114 -10 94 -208 150 50 -169 214 -138 -74 171 -185 116 74 -170 258 -145
736a45J95J03l44K97j46m8J93k61J46J33k51K67j64l1J83k05Q6O2k26K77n9k07
$$ -145 50 153 -191 106 -40 -88 105 -156 -10 123 -128 139 -25 -56 127 -78 8 70 -156 121 62 -145
758a45M17m28J41J83n11N39j94j13K07k36J38J17l55M70k82m4K81l48K09pj89
$$ -145 272 -156 -15 168 -343 196 2 -111 96 -140 -2 115 -240 230 -52 -96 185 -163 46 39 -150
779a50K64j27l0K19m47L15J8j70K13m3r8J55l80K44J63k82K76j06n7J88l33K67
$$ -150 114 -13 -43 176 -271 44 62 -108 105 62 -36 119 -261 -17 146 -136 140 34 -23 165 -168 99
801I9p2k43M39l24L7J71k35J29R6k67M05l72P9K46l47J42J35k21K96l65J13J85
$$ 99 27 -216 223 -101 -64 107 -128 1 97 -170 235 -137 -58 188 -159 -17 118 -103 193 -172 -59 126
823A26l60L25j38m8K95k97J13R9k03J46nj23L27m13J65Q0k68L47j11r1J48j99
$$ 126 -234 91 -47 -95 200 -97 16 115 -88 58 53 -70 257 -156 9 89 -179 168 57 -34 114 -85
845h5P7J01k22J76Pn2K04l49J15L0j36J95j75O3K44l43J23O4j76K57j22MJ34k18
$$ -85 -8 93 -129 47 54 2 206 -143 -28 2 -134 61 -114 -51 193 -150 -27 37 -139 118 -4 0 134 -84
869h4K22m7k79L58k24N0J20j86Q5o4oK65l84L1J86j15J17o2M0K07m01O3J51k48
$$ -84 138 91 -188 170 -54 -4 116 -70 15 -49 -55 210 -174 -143 43 -72 45 -17 23 230 -171 -108 43 -205
893b05L23j35j22M36l68rK23k66K47o5r1J34k47J66M3k58K44N0k15J64j08k5J97
$$ -205 118 -17 -139 297 -71 -80 143 -123 124 59 -32 102 -145 21 64 -194 50 100 -115 49 -59 -84 113
916A13k34K31o2o6O2j8O5N7j53nj9k4K58k11m6J22k06J93r7r7K70k12J35n4m6
$$ 113 -121 110 48 -18 44 26 91 148 -5 -10 -29 -53 205 -6 -52 70 -136 57 -40 -137 133 -79 56 2 -44
941d4R2q0j13L00m08K89Ok52M06k29j8J79k84K49j48m3J63o9K8J26k41J71p4k7
$$ -44 48 -32 -145 155 -253 36 42 -210 196 -33 -51 128 -156 93 -55 -98 65 -4 24 150 -91 80 6 -21
965b1J04q2o4K11k31J93j34q5J78p0o3J28k61K17n9LK24k13R5Oj53J77j56p9K14
$$ -21 83 1 -63 148 -83 110 -24 -109 69 -1 -64 64 -197 20 -39 -36 188 -25 70 76 -77 100 -56 -135 79
990G9k12P7J10j74J03J2j78J97j3oJ63k20J23J6j06J89j21O0Mk30L83k22j41J71
$$ 79 -133 -56 54 -120 -17 -5 -183 14 1 -5 158 -62 61 77 -29 160 39 99 103 -127 256 34 -107 64
1014F4j49K12l1k21K53k00O3J01j54J67j09K8J13k30J6J56j32J92j87M7R5j31
$$ 64 -85 127 96 -125 128 -72 -9 92 -62 105 -4 24 137 -93 -77 79 -53 139 -48 -1 94 -37
1036c7nK01m38L03j3o9K20k42J42Pk39J88j8j60J84q6N3J57l34L15q6rJ56k20
$$ -37 -42 159 -279 24 11 -58 162 -80 62 69 -170 18 0 -160 24 -62 -9 148 -186 129 43 34 190 -30
1060c0R1O3k28J81r5K0J32j56k4O1j04J14n0l8K11k95K32l7l4J20j66l9N7j11
$$ -30 61 124 -104 77 -18 2 134 -22 -46 15 -89 25 -25 -63 148 -147 85 48 14 134 -32 -71 -14 -125
1084a25K32j00nJ20k24J23K5r2RR7j57J99r0pJ00j72J33j24n4K02k04J07L4j23
$$ -125 107 7 2 122 -102 21 46 -46 -37 60 -97 102 12 5 105 -67 66 -58 -112 90 -114 -7 27 -96
1108i6K44K0k25J13p7J1O6j46K31kj21K9r4m8R1n8J44q0j37J90j39P5J8o0J09
$$ -96 148 168 -57 56 -21 -10 56 -90 141 139 18 47 -47 -95 -4 -62 82 2 -135 55 -84 -9 9 -51 58
1133E8j53P8N4j05J1J33k03J57m1KR3o1O9Jj14R4o6pJ44l16J29R9j66J63mp5K11
$$ 58 -95 -17 37 -68 -57 76 -127 30 -11 -9 84 23 92 93 -21 73 7 0 144 -172 -43 56 -110 53 49 -26 185
1160A85k77J16K8j90K50k11m0K18p9R7k18P2R3p6J5J74k37J20o3RQ5j23N8M3j58
$$ 185 -92 24 52 -138 112 -99 -139 79 0 97 -121 -49 44 -32 -17 157 -80 40 -23 -14 71 -52 6 49 -109
1185a09M9J87j39k3j30N3J84p4Q2L0k31K65k24j17K08q1Q1p4k8J34n1P4k7j91
$$ -109 -60 127 -12 -35 -165 -112 72 -2 80 110 -121 144 -80 -197 11 -70 11 -63 -91 43 -8 66 39 -152
1209a52K17j27m8N7O0K6j5o4O7J4m1Q1j59M4J97j53O8j19J9J04p8K8K7p6P3j21
$$ -152 65 -62 -110 -53 7 33 18 -46 21 35 -6 75 -84 -40 157 4 72 -47 -28 76 -2 26 53 -23 50 -71
1235g1J49n0j02J09K9j7Qk1p5PnR2m9p8J24l8Qn3k6J36q5k3J31j72N5J22j47M0
$$ -71 78 28 -74 35 64 47 55 34 -41 -34 -39 53 4 -74 50 12 20 -33 -59 77 -8 -31 100 -72 -17 105 -42 -2
1263bk5m0J48j68J23j8p5P7r4o8J27J0M7k7k05K12k1qR6j30m9J93j69L4Q5o0J15
$$ -2 -27 -67 81 -87 36 18 -57 20 -74 -142 -15 -5 42 15 -190 22 1 -7 89 -41 -90 103 -66 -32 53 -7 108
1290A08j27o5O2M8J07j81N2P8p0k4j1n7Q6nO6O5j97J67L8k60J41n0%J09j27R0
$$ 108 -19 -84 -22 26 133 -48 4 82 12 -12 -23 -80 6 1 67 132 -65 102 140 -120 21 -29 -29 80 -47 43
1316D3k3m0J26j54O1J2j13J16p8nQ9m5j31K03p5N1L1j04J08j28J10nj94K25m3
$$ 43 20 -20 106 -48 13 25 -88 28 -50 -55 34 -11 -142 61 -14 37 68 -36 72 -56 54 49 -145 80 37
1341C7l6J33k28M4O0j65K14R7j87J66k06J76p6j9J48k09J42n2j43K03j12l4qo1
$$ 37 1 134 -94 -50 10 -155 59 156 -31 135 -71 105 29 10 158 -51 91 39 -104 99 -13 -47 -55 -116
1365a16N5R0p2N0J17j81J70j96J44q5k1Q4o8J19o3%p2R2MK8o1L6k2j25N7J5L2
$$ -116 -61 29 -43 7 124 -57 113 -83 61 -24 -45 39 -29 90 27 27 -45 47 51 79 18 54 32 -93 -36 -21 11
1392A1P2k5q2K2J38k61J92p9J0M1r0O9m6P8P6j59Ro6J04K1pqNk9kM2p2J9M3OO9
$$ 11 83 58 -24 -2 136 -125 67 -12 -2 39 -51 18 -28 50 126 -33 -24 -90 14 35 28 20 25 -4 -6 36 -36 -17 26 32 101
1423A01k74K24j0j13J22q9N5j6J8MP2p8K7j0l4M0J9o5m8k6J09j25J55J3n9K3r1
$$ 101 -173 51 41 -72 50 -39 16 0 18 22 94 16 43 33 -1 39 58 -7 -55 -81 28 -97 58 71 12 35 -56
1450e6M9P4J4j2m2k3N7j02k2Q3j47P0J5k1K01j77L5k4n7J27o4r4J71p3J1M5q5
$$ -56 -7 67 81 69 27 4 61 -41 -63 20 -127 -57 -42 -63 138 -39 -4 -28 -85 42 -22 -116 55 -18 -7 38 -47
1477d7P8l7q2J99j79Q7j07J34k1J8o0M4j7K6P8j83J57j04M3Pj7k4J18k15RO4L3
$$ -47 31 -6 -88 111 -68 19 -88 46 25 43 -17 27 10 36 114 -69 88 -16 27 34 17 -7 111 -104 -95 -31 2
1504Bq7J27M2r5k6K3M3q9k3K6j1J3k0J72q4j89K22j68J51p8p1K38j67l3J08q8
$$ 2 -85 42 84 -11 -37 -14 29 -60 -83 -57 -68 -55 -75 97 13 -176 46 -122 29 -49 -120 118 -49 -82 26 -62
1530f2N5K8n8r5K05q0j2L3NK5j06k2J15K1l7q1J92k27J0M9P2r0M3M4OpL7J3j20
$$ -62 -7 21 -37 -132 73 -7 -19 14 19 44 -62 -84 31 52 15 -66 126 -101 -91 -42 30 -60 -17 27 33 26 63 76 -44
1559d4l7K09j49j4J0k1O7j3J1L8j59J34M4j07K4N3Kmj56J97p2m1J39j01o2J55
$$ -44 -81 128 -21 -35 -25 -46 21 8 19 57 -102 32 76 -31 -7 46 48 44 -112 85 13 -28 111 10 -52 103
1585A03j38J28mj61P1j8L5m0P6M1j19j8J50j52Q3P9p2J7q0j00oJ02n2N0M2L2p5
$$ 103 -35 93 89 -72 -1 -19 16 -24 52 93 -26 -44 106 -46 37 116 44 61 -19 -119 -125 -23 -75 -25 17 49 -26
1612b6Q5p7k2K7l2L9N9n2%M2j26K09r8o5N5oJ49j08p1J48j48L8k8j56J17J45j47
$$ -26 59 -18 -40 -13 -45 -6 53 1 1 43 -83 126 28 -37 18 12 161 53 -18 130 -18 20 -8 -164 -47 98 -49
1639d9R1M7j07M7M2r2m6K2J6P9j39K00m2j08M4L9q2mQ6k2n1P1ll0p2L8o1J21l5
$$ -49 42 89 -18 29 71 -21 -67 -45 -29 50 -89 111 69 -39 5 44 -38 -42 44 22 -29 42 39 9 -63 -25 -86 35 0
1668@K7K7o3L6M0q7N7r0L2O5j0O7j51l4R0J03j49J57j15l6J1k3M6R9j27K5p8R5
$$ 0 27 54 -9 27 67 -20 37 -53 -21 44 34 101 -50 -84 6 109 -40 117 2 -34 -23 -46 0 99 -28 -3 -81 14
1696A4j08m5J43K7j6n8m2J53Rr6j2p4J07Ll3J07l1p2Q9k5r4R4k9o4R2j46J39m4
$$ 14 -94 -139 4 31 15 -43 -85 68 77 -19 -31 -105 2 5 -28 79 48 -24 65 40 -54 40 11 -53 39 -107 32 -12
1724a2J37j64L1k3M0RQm5O6n9P1oJ4j81m3J54j74K68r7L6o9R2o3ro7J15q3J6j5
$$ -12 125 -39 -8 -31 9 18 26 -19 47 -12 59 53 67 -114 -157 -3 -177 91 -6 30 -39 53 -10 -19 -86 29 -54 -38 -53
1753e3k7J12j27J08k8n5J22j05k1J48j15L7Q1m5m3m9No4J14P8l7p9J01k07J62
$$ -53 -80 32 -95 13 -15 -70 52 -53 -74 74 -41 -4 77 32 -11 -60 -55 -119 -5 73 36 -43 58 -149 13
1778A3Lj31K09j69N6M7l9Q2K2j54N9O6m8p6rO1Lq2N1o0J32j21L8j9J59j35Q3j09
$$ 13 16 -115 94 -75 -19 28 -11 71 93 -61 -2 64 16 -60 -69 -8 -5 -87 -36 -96 36 -85 -47 -66 93 -42 41 -68
1806f8R7j12QR3J21j05N9j75nJ76j36K7L3l7m2oO4m6O1k7j3M5m6M3M4Kk6k6J06
$$ -68 29 -83 -75 18 139 34 93 -82 -87 89 -47 -20 13 -24 -66 -72 -8 -54 7 -20 -33 12 -34 9 53 55 29 3 109
1835A09k8r6N2o5N9k7Q7j67L3MK4o5J25j02rQ1n7M1q5j1J41j1l2q3J02J53j04
$$ 109 81 -15 37 -28 31 4 91 -76 -43 -39 -15 -80 45 -57 -66 15 -42 -1 -86 -97 44 33 1 -82 20 173 69
1862F9m1kn4N5m1kN4J1m0l2L4Jp2J2L6Q1m5j12N9Q6j21P3np4N8Mq5R7J40j48r0
$$ 69 28 26 -28 27 -14 -16 38 49 9 -23 11 12 -60 -48 -12 69 24 -88 -29 57 -64 9 4 -70 -12 -8 -93 4 144 -4 -94
1893i4J23j1m3l5J88j06j2j08M9J2L9k5k1p4R3k7k7J01rq5O7j0K1JK9P1j15j07
$$ -94 29 18 -25 -60 128 22 10 -98 -49 -37 2 -23 -44 -118 -25 -52 -79 22 13 -72 -5 -15 6 7 36 107 -8 -115
1921a15J19O8m8L6J6m2p6MP9J2Mr1m1O9QQ2r4O9r1RQp0N4k9N9M6j7Pm3M8l2O6
$$ -115 4 72 24 60 76 34 -42 -38 41 53 57 -34 -75 -6 2 84 -10 59 -32 -23 -15 -85 -31 -60 -1 45 28 35 -8 40 8 74
1953G4j18k3O5k8K6L7J3n7R2j11Q0jm7P3o6p3N8K3j8L1j62J14P8q0n4P8mP8j07
$$ 74 -44 -67 -2 -30 -4 33 46 -11 81 -30 50 49 2 75 9 -64 -6 17 -1 30 -132 -18 60 -20 -74 4 0 78 -29
1982b9P8o7Q5K4j69J27o8J8L1q6J31q3P1j5q5MJ12j75L6L4L0o3Rl5N1J15p3M4
$$ -29 49 -18 67 91 -78 49 -19 -1 30 -56 75 -8 63 48 -37 -33 79 -96 -60 -26 4 -59 -50 -85 -34 81 8 52
2010E2k8p2N6p9J83o3O7j33k7K3J00j0p0M1m1r0P9J34r0j6j07J81r0m2L5k9J15
$$ 52 24 -48 8 -71 112 49 116 -17 -44 -21 79 69 -1 40 -1 -91 -12 122 32 16 -91 90 0 -42 -7 -36 79
2037G9o4o3M4P4n8N1j06j7M9Q5r1oL3p7R6o6RR8Jo1k9N6r3K29j15Q8j25j7O8j56
$$ 79 15 -48 -4 70 12 63 -43 -60 -11 74 -17 -23 10 -67 29 -37 -28 70 71 10 -19 37 -56 173 58 146 21 4 72 -84
2067h4M2L5M9Q1l41L30j25l2L9OM4kMn3K3j08K29l3j85J35J00j77l0O1r9J25J1
$$ -84 -42 -7 42 123 -218 112 -13 -45 -6 0 44 42 46 -7 16 -92 137 104 -81 54 154 -23 -53 8 -91 34 45
2094D5rO5j41P0%o7KL9L8p3K9l6K23j58q6k3KJ28o1P0q2Q7n4op2R1QL4J02k45
$$ 45 36 101 -40 30 30 -37 -35 4 42 -31 -2 -38 185 27 -59 -82 -80 48 -13 57 -25 62 8 2 -70 21 29 63 165 -80
2124h0J31j23J1LO6J6r2R1R4j16O9r0K6p3J01%Kk9O8k3n4R6n4q4J22l5n7ll6m4
$$ -80 51 -72 -61 -58 8 24 -68 23 117 1 70 -20 6 -67 34 34 36 7 75 52 -2 94 40 -44 78 43 -14 -17 -53 -97
2154i7J33j9Rj3j7N4p8k7K3L1o0PK7J4N1J2j5K5j50R3Kp9J59j48P7O8r0m7L5O6
$$ -97 36 17 26 13 -4 50 -28 -55 -32 -1 -61 -54 -27 -13 38 50 35 60 -90 3 5 -74 85 -63 14 82 -8 -55 -20 46
2184D6k0l6J11o7l3K8K0j96J15K9j6m4P9N3p9j7N0j54J94M8r1n6O7M3N5j00m3
$$ 46 26 -10 101 34 1 29 49 -147 -32 -3 -19 -63 16 69 -10 -27 23 -131 63 111 20 -36 31 74 129 29 -14
2211a4l5K6O7p8P6r0J33n0o4l4R2r3P7l3p5P1J00p1l0Q0q4p3J36j4j08P8P5J3
$$ -14 -49 -23 44 -34 42 -48 85 35 -29 -63 29 -64 13 -20 -95 -24 76 5 -25 55 -29 -102 34 20 -88 -10 65 78
2239G8j24L2L1L5K3n7M5k06N8j1N7K9J6o4M7J9JJ07j45J26j62J62j08LJ32j46
$$ 78 -46 -14 17 52 75 18 63 -143 -85 -96 -39 -10 6 -58 -11 8 9 116 -29 97 -65 97 -11 -8 124 -22
2265b2r1J09pJ6m2J6M3l1j05Q2K1p4K8M8K4q5l7J51n4R3q5o1RL2rK7M2r3P3r4
$$ -22 -113 -4 -11 5 -37 -21 22 -9 -114 -32 -11 -85 -57 -9 15 -70 -107 44 -10 83 -2 -63 -54 -22 -31 -4 38 -55 18 -76
2295g6J32j90J94p7mJ6j2j0K01q2j64J34J2p0lK2m6Q1p5P0j00J47k18O7P2p1o8
$$ -76 56 -134 60 -17 -21 -5 -17 -27 174 92 -72 62 74 4 1 23 -23 58 -17 53 -47 100 -118 -51 21 -50 -118
2322a18J49p6J6qp1Q1L9qN0J2j23q7N8L3J64j04m9J37n1o8K2Mmj4K8j1j0Q1j84
$$ -118 31 -45 -29 -37 -108 -27 12 4 54 66 -57 -144 -86 -53 111 7 -42 95 44 -24 -2 2 -2 -16 12 1 -9 72 -112
2351a12J09N6Jq5QQ5l5n8J18Mq4k1O6q8j2N5j0Mm2J36r8M3oL4M5j67K3l0N6K9
$$ -112 -3 53 54 -31 -23 62 27 -31 87 91 7 -14 52 -36 -48 7 -3 1 -41 95 -3 40 34 68 113 -54 -31 -61 -5 24
2381B4k9m9M8O7n3n8J11r5M0m2N9j09J6jN6k5N8J01k06J9P6P1r4O4j24O4j2p2
$$ 24 -5 -54 -6 61 8 -50 61 -34 6 -36 23 -86 -70 -71 -15 -40 18 119 -87 -68 8 79 -15 49 -75 -11 -23 -95
2409i5O1o8J23M1j85N7K36j95Lk0P2p2o1R7j8k3R6L6r0K4N4p5K2L5o7P7o2n7J10
$$ -95 -34 -102 21 62 -123 -66 170 -25 -22 -42 30 -42 -103 -6 -24 -47 49 85 -5 19 73 -2 20 55 -12 65 3 -54 56
2438E6r2j9M7j33J16J07n0j0P3m3j79Q8M2j12L5Q7l5K3J2o2l9J16O5q1j28J78
$$ 56 -36 -55 -8 -141 -25 82 32 22 95 52 -127 -39 3 -109 -74 13 -22 1 13 -49 -88 28 93 12 -116 62
2464F2l9M7q0K6M4q2P9j14K5k7nN7m4P4m0Q0rj9m6o6M8p4J6L7RN5r6J24N1m5r0
$$ 62 23 70 -10 16 60 -22 57 -57 -32 -59 -64 -7 -51 23 -17 63 54 35 -11 -77 -29 -103 -87 -50 -41 14 -82 42 93 48 -42
2495d2J15p0R9j34k5L4o3J12J7j49J85mj26K9m4%J6m9N8%L6n8L2o8J60l3k6j43
$$ -42 73 3 102 -32 -57 -23 -86 26 43 -106 79 75 -51 -22 -66 -66 -50 -99 -41 -41 -5 -63 -31 -99 61 28 2 -141
2523a41K45r3j06J23J9J9j3q2k1J30j02jK6n4L6P9M2j73N6L9p5R6k6q7M0k1O2
$$ -141 104 11 -95 28 47 66 53 -29 -50 80 -22 -23 3 -51 -15 64 106 -67 -11 28 -47 49 23 -64 -24 -45 17
2550A7j7nl6J08r6N7J2l9p3R7QJ06o7Rn4r4K2l0J3J49p9K3j43J49J6oqr2J51q5
$$ 17 0 -5 -41 67 -29 28 40 1 -72 25 33 139 72 81 27 -67 -45 -75 -62 87 8 31 -112 37 53 47 39 -53 98 13
2580A3j4J0j7RL1n9K5N2r2J99k11P4P3n8j5m3K4j25J85o1ON2j78J63K6l6r4J02
$$ 13 -1 9 -8 1 32 -27 -2 50 -42 157 -54 20 93 35 20 -23 1 -124 61 0 6 58 -120 43 69 33 -61 41
2608D1ln6N8j25J86j65JpL2m8Q6L9o0LR0j51N0%R5L3n6l8LJ6l1LoJ79j11K7j48
$$ 41 38 -18 40 -85 101 -64 -63 -70 -38 -86 0 39 -21 -18 72 -79 -29 -29 66 99 43 5 8 24 -7 -4 -10 169 58 85 -63
2639f3j9J0J09l9Jom5R0J7j41J08O0m5l7p7K8R7j45O8k9p7K49j37L5M0J9o0o6
$$ -63 -82 -72 37 -2 -1 -7 -52 38 55 -86 22 82 37 0 -77 -49 48 -97 -29 -58 -135 114 -23 12 52 71 11 -55
2667e5N5n0L1K0J5p8M1J2L3Q3k3k1j00O2r9J60q5k9J06j10rJ30Kj26P2q1j2N9
$$ -55 0 -50 -19 1 16 -62 -21 -9 24 107 84 63 -37 25 -74 86 1 -28 78 -32 -41 89 91 -35 37 -44 -56 3
2695Ckl1Q9j31J37n9p6N4Qj66P2K39j20l5K9P5j50N3m9J4J24o7o9Q5o6J26nj6
$$ 3 1 -30 59 -72 65 6 -70 -16 -8 -174 -102 137 17 -18 11 86 -64 -11 -60 -46 78 11 -58 27 -39 87 82 66
2723F6n4J6m1L3l3o7J03p1P8j22J50q3J11n4j9jQ6n0K3j30m7M3J1N2J20j75m2
$$ 66 12 28 -13 20 -13 -80 23 -48 30 -92 58 -25 86 32 13 12 98 48 71 -59 -106 -63 -52 0 120 -55 -97
2750i7J42k5l8K8J0p1O9N0r1n4J43j2p2l5O8m5m7P0kkR0m6l7o3L3j26J28L5J5
$$ -97 45 20 -18 10 20 -51 18 68 -23 -77 66 54 -18 -53 15 -30 -77 -7 -9 -11 79 33 -4 -67 -34 -160 -32 3 18
2779A8l1p1J58r9Oq6P5JR7k05J30P6l6j9M9j69Q9P1l2j3k3p7K04k88P8M6L4k5
$$ 18 -13 -84 74 -25 -19 -105 -30 -29 68 -137 -7 69 33 14 63 -106 -17 54 22 9 -14 -91 113 -175 -97 -51 -17 -42
2807d2K9M9j35K2J00Lo4P6q6K4lk5Q1j34M6R3j6J01p8K7k7j3o1J24j55M8Q7p9
$$ -42 -13 36 -99 -77 23 26 -38 38 -48 -24 -27 -52 29 -105 -59 34 18 119 41 68 41 28 -33 91 -64 -16 71 -8
2835hJ7P0j41OL9j7l3J66r7L1o0N3j18R9O1p8J07m2p8L4O5r7J7N6q0L3pj21K08
$$ -8 9 79 -62 -56 -17 -34 -67 99 2 33 -27 26 -92 7 68 -10 97 55 -23 11 76 -21 -4 52 -28 5 -2 -123 85
2864H5rj80RJ64l3j8K8j4P0r7k4K2k9O3k7M3j00k3M6L9j4K3K5l3m1o6P5L3r4j8
$$ 85 76 -104 -95 69 36 18 46 32 102 5 -19 3 -26 37 10 53 -47 -70 -24 15 1 24 49 16 -25 -91 -16 17 -77 -95
2894i5J00K0l0o5J36j65K13j48M5Kj49J95j78J34%Q7p4K1lK6n3p9R1lR3o5j2q1
$$ -95 5 25 -5 -70 66 -99 114 -34 11 13 -136 59 -119 15 15 102 28 49 46 72 19 -60 31 28 121 56 44 -37
2922c7L8o0Q6J3o5K3R1r9k3K5q2J08m9J7j3r1M4R4j2P4K4n0l8l9Pj2M2l0L1j1
$$ -37 1 -59 27 40 -25 -2 89 -10 -33 -8 -90 18 -31 -14 -27 -118 -74 20 8 82 106 56 18 -21 -14 -26 16 -14 17 6
2952FMj50J23NJ4J1K7N1k1Mk24R2N2N0q6J22k02K0J17j58R6J13j54O3L8n9J3J01
$$ 6 10 -140 -17 -12 2 13 40 91 70 74 -150 -58 -6 44 -42 80 -122 -102 15 -143 -47 66 -88 -25 13 -46 -33 68
2980F8L%j29J63j20p4J54j06J41j34P5j8m0M6p0J0nK6M7p9O3P5m0j17L7Q3j24
$$ 68 71 71 -58 105 -15 -89 65 -41 100 -34 41 23 -17 29 -41 -31 -36 -10 37 -42 21 96 56 -61 -24 59 -65
3007f5K3J20m4J2Rr5M7k7J08j28j2J6J20M8j05q1M8PJ33j01Mn6j2J51l5j11J15
$$ -65 -42 78 34 46 55 -40 7 -20 88 -40 -52 -36 84 132 27 -54 -6 1 134 33 37 -19 -31 120 85 -26 89
3034H9o8L5j14R8q0j8k9L4N7R7r9N3j03jM4L9p9M0O8j0lr7nM6n5O7M5n8J00j05
$$ 89 21 56 -58 40 -40 -58 -87 -53 4 101 2 55 -48 -49 -5 34 -45 -5 63 53 50 -47 -52 -6 -61 6 51 -7 93 -12
3064a2J40j86J24K0p7qO9k3l2n2J37o2n5P8k7M9j27J3L3M2L1l6j6m3L8r7M9Q6
$$ -12 128 -58 66 86 9 1 70 47 15 -37 100 38 -17 61 34 83 -44 -31 2 44 75 39 23 -20 18 -79 -30 56
3092E6J5j45Q6O9j3j11Q9P0j64J24On1j4PJ15j00rj68J84k0m0P9m7R6q5r9J43
$$ 56 71 -74 12 81 68 -43 46 116 -48 76 82 31 17 24 139 39 30 -138 46 26 -14 65 18 114 29 -70 73
3119G3n0J22j77O4KJ0k5o0P9p4j7j2J66p3J2K9q8o5J06n3J25j53JJ5j3R5j28K4
$$ 73 23 145 -32 32 34 44 19 -41 38 -36 -53 -65 101 28 40 69 -19 -84 22 -31 94 -59 -58 -43 -56 39 -89 -65
3147f5K5L9n3k1J22l8l8OJ7j4L0P7M0q1j04L6L3M4K0p6J14r3J22j07m3K7j9O3
$$ -65 -40 -1 -54 -75 47 9 -29 -23 -6 -20 10 87 127 46 -58 -22 11 55 75 -1 113 20 142 35 -8 19 0 63
3175F3p7r5P9M7j30J20l3mJ23j84J02O8j19J4o6J03ln2L3l2P2Ln3O8m9l5L2j3
$$ 63 -14 -109 -30 17 -113 7 -26 -30 93 -91 11 79 -40 -26 -92 11 8 -44 -11 -43 29 32 -21 47 -2 -37 -5 -18
3203a8L8j9Nj02j2N0J39j76K08k30K00Nj28J9j9K2Q1p1J5n3Q2P1k15O4J48j13
$$ -18 20 1 6 -96 -108 -58 81 -95 113 -117 83 88 -40 -21 -40 -18 63 -8 7 -46 36 107 -108 -44 104 -9
3229ik0Okq5J79r2qL2N1m2L4q1J2Q5m8M5J6j27L8M0L8J06j82P2m9K9N1j56Q8N3
$$ -9 -29 -23 -25 -110 69 -23 -31 1 52 10 44 -37 -25 60 12 57 73 -54 -16 24 62 168 -14 58 9 38 89 -67 21 74
3259G4r7R0p1J24r3n9rP0o6J2P9l9PP1j10m2J12j33k6P8P1p5L4P5j23O9K4J8q5
$$ 74 -23 67 -4 120 27 -32 -41 29 -37 -25 54 15 22 93 -17 -59 53 -80 -106 -28 43 -32 2 77 -46 23 47 65 -20
3288b0M2K9j35LN8l6J30j08m2J51l1J4Q5j01k8J3p9K2p4R2L6Mk9k1R0r9l3K5J00
$$ -20 22 51 -84 -81 -23 -59 71 -37 -79 72 41 55 140 39 11 24 -55 -33 -107 -15 21 25 -4 -25 65 -34 -67 -42 58
3317E8n4l7N8J7n9n0P9M0o8k5o6P1n6J08l5J22j73J62r5R0j38l9K2M7N7K3r6l
$$ 58 4 -33 25 42 -17 -67 12 52 -16 -41 -107 -36 -92 16 -19 103 -70 92 -3 87 -51 -90 -68 -21 36 59 -37 -40
3345d0K8k9J28j77J13POo4L9j10L7Nl1K35j7r0R4j90L3L2Q6j55J40r5L4r1L1J41
$$ -40 -12 -41 87 -90 23 30 36 -28 11 -99 -62 -57 -88 147 130 40 134 -56 -23 9 95 -60 80 -15 19 -72 -41 100
3373A00l9o8L7J8M0K3K4j74R1m2O1j73J1J0m5K44j15k2J2j2O0O7o6q4J2J13n4
$$ 100 61 -7 30 48 88 111 135 -39 52 10 71 -102 -91 -81 -126 118 3 -19 -7 -19 41 108 42 -42 -30 83 29
3400B9M7J9j85K4J87p1pp3N3q4J37j51R5k4n1P2M2M0j15l9m7N6KJ7l0R2j29N5
$$ 29 76 95 -90 -66 121 50 43 -30 23 -61 76 -75 20 -4 -55 17 59 99 -16 -55 -102 -46 -44 -27 -57 35 -94 -39
3428c9Q6J9j17j14K21n0kP1o5n9J59K1j47j08K22q2r8J43l2k4Nj7l1N2pq6J26
$$ -39 47 66 -51 -165 56 6 4 75 10 -49 110 131 -16 -124 98 16 -82 61 29 5 10 -7 -38 14 7 -79 47
3455D7N6k26J97n6K4J6n2l4P0Qp8J48j03j29Q8j1q9J57Oj42J32j4r4J24q2P5l5
$$ 47 103 -123 74 18 42 58 6 -28 42 50 -28 120 17 -112 -24 -35 -124 33 39 -103 29 15 -79 45 -37 38 3
3482Cjk9J09J0j20llk0J11K8j23J11j80Q4J34j77N8K9K1P8n4l8q5l5N5l4mM4J3
$$ 3 2 -27 82 92 -28 -31 -34 -54 57 85 -38 73 -107 -23 111 -66 -8 21 42 120 66 28 -57 -92 -37 -71 -75 -31 -18
3511a8j10Q5k7J06m5k5j5J6KJ9k6N2q9N0p7K4J3O3J7k8J4o3M9N9j32J14M5p9k9
$$ -18 -128 -43 -70 36 -9 -34 -49 -33 -31 -12 -38 14 -75 -25 -102 -78 -65 -2 15 -13 1 -62 -13 46 -86 28 73 -6 -35
3540c5R6km8m6K1J0Qq6nN8m5J31r1qQ4m9J36q0j00R7Qn6Q9J6j04J07j27J58j08
$$ -35 61 59 11 -35 -14 -4 4 -82 -87 -29 -74 57 -34 -42 42 -7 129 49 -51 46 54 -2 87 103 -1 106 -21 137 29
3569B9l6k3n1K9K8J14j22K5q9R3Q4q7L2k9j03J56K0o1k9O2l2pP0q3j10J13K2O7
$$ 29 -7 -30 -81 -52 -24 90 -32 -7 -96 -3 81 -6 26 -3 -106 50 70 9 -20 42 10 3 73 -10 -120 -7 15 82
3597H2m6p7J00q7KJ3J05J2j03O5O6j98q7J63M9k9L2p3M7J1m8K6q9J35j25M3M9
$$ 82 36 -41 59 -28 -26 -13 92 104 1 66 132 -66 -153 10 59 30 62 -11 36 47 -1 25 -64 71 -54 -11 38
3624C8n4K3J5m2l3N6O0o3n1J3q6J16jRO0j8j06L6k8k5j1J14k4O0O5j58O5NL0m6
$$ 38 -16 7 22 -20 -53 3 63 0 -51 -38 -124 -8 -9 0 60 42 -64 -28 -56 -81 -92 22 -2 58 123 -35 30 35 65 19
3654A9K2n6j19J38K0J5r9l6O9j2L5p5R5n3K0M7o3R5M4r7j7k3n9Q8M6m3j1j22O6
$$ 19 41 -15 -134 4 24 39 -60 -96 -27 -39 -4 -79 16 -37 -17 30 -33 62 106 9 -8 -31 -90 -2 44 1 -10 -132 -66
3683f6MQ5q5K7M7Mq3P6k4PK0kJ01j35M6j0l8R9k0j66Q4J1M7nn1R4k6j12mQ2k1
$$ -66 -62 23 -62 -35 12 16 -67 9 -15 -8 12 10 111 -24 22 12 -26 73 53 -113 -29 -18 29 24 -27 67 41 -71 -75 7 -14
3714a4L9m9qK5J42j55m7K13j76n5J69j48oQJ4J64r7l6k5L3P3o8n2J08j2k6k9L5
$$ -14 25 -24 -32 -7 135 -20 -67 146 -30 -85 84 -64 -70 -62 -48 116 19 -17 -42 -9 64 -4 -56 52 40 14 -15 20
3742B0M3n7M4k8m6O8p0k8j5j08K13l2m3J0QK7P1o5N1j01kJ8j36P1M9J28j46O1
$$ 20 63 6 50 22 -24 44 -26 -54 -69 -177 36 4 -39 -29 -21 6 77 12 63 -38 -40 -22 -158 -87 -38 90 -56 5
3770EJ4PR5j01j1K7j1LLq7P6M7r8%j19J24kJ4L9q5pP6q7O2Q1n3l0L2K6o1k8M9
$$ 5 19 26 121 20 9 36 25 28 31 -56 20 67 -31 -31 -150 -26 -28 -14 25 -60 -67 9 -78 -16 65 12 -18 14 40 -21 -49 0
3802@k3L0l6l5J01r3N5OK1j57J83o9R1r2m1J16j56J34Jl8ML5o8l7J28L5j23N5
$$ 0 -23 7 -29 -64 37 -56 -1 5 26 -131 52 -17 74 -18 -59 57 -99 35 36 -2 2 37 -31 -68 60 95 -28 27
3830B7p3M4j1j0o9J09j23M4P7m7O2l9n7J9M3p9j9J34l4m5N1l3P4qo5J18Or0k1
$$ 27 -46 -2 -13 -23 -92 17 -106 -62 15 -32 30 -9 -66 -47 -4 -83 -102 32 -2 -47 4 -29 45 37 -28 90 96 6 -15
3859a5lR3l0J2p3m4N6mP8j41J17p4Q6l1m1Q5o3o9R9j6j56M4N1R1r4O4Q0l9Lj08
$$ -15 -18 75 45 57 -16 -60 -4 -8 70 -71 46 -28 58 27 -14 71 8 -61 38 22 -134 -90 -39 52 -42 22 102 63 66 -42
3889d2J07k9j7o9P8l1K2j02O5P2o3O9l8j1j4L0M2j4r3M9p2N2J11j39J7R5p3N7
$$ -42 65 36 19 -50 28 -3 19 -83 -18 54 -9 60 22 11 -3 27 69 55 -38 11 -61 -9 102 -37 -20 75 2 59
3917E9j13L7L5j35J90M2j16k3k1J38l7j67J45K9L7j01n4RR8l0j2p3qL7J40o0q4
$$ 59 -54 -17 18 -117 73 115 -1 -24 -45 93 56 -111 34 63 100 -1 -55 -46 52 22 10 -63 -71 -34 106 46 -38
3944c8J59j16p1R3j3l1O3M3j3p4j2P6m4j9L9n1J0n8M8J8k9M2Ko6L8Kj3J14j86
$$ -38 121 5 -66 27 14 -17 46 89 76 2 -10 66 22 3 42 -9 1 -57 -9 9 -20 22 24 -42 -4 -2 -15 99 -87
3973h7J46l7Oj8J1J3j10Q8q2J37k3j39J8J95k31J95q1k2j2N6k0k2k1J17p7M8j42
$$ -87 59 22 28 10 21 34 -76 12 -70 67 44 -95 -77 118 -113 82 1 -21 -33 23 3 -19 -40 77 0 48 -94
4000i4J36j9p0N8m8Q3L8j0j52O8m3Q3j0l1Q0mj17J66q4k4k6m0R2K4n0o6J13k7
$$ -94 42 23 -47 11 -37 46 84 74 -78 -10 -53 30 20 -11 69 65 -52 114 30 6 -20 -60 32 56 6 -60 53 26
4028B6q5L5o3L1J14j28k2J17r7J26j36J57m9n9m8N1l6J21Nj41Q9j2j2J9m8Q5J1
$$ 26 -59 -24 -87 -56 58 -70 -92 25 -72 54 -82 75 26 -33 -81 -30 -66 55 60 -81 8 -4 -16 3 -45 40 51
4055E1k8l7rp4R9mn6J71j52P3M2q0j1Q8J5j01Mo0M4J5n6M0j15J14n9P7K9p4Q0
$$ 51 23 -14 -23 -97 2 -2 -58 113 -39 34 76 -4 -15 73 88 -13 -9 -69 -25 -10 -66 -26 -141 -27 -86 -9 20 -54 26
4084B6p3N8N1j31J16Q2j35p7J17r4J44j82K06j24M1J8n9k5N9O6p4J15j35pl6O1
$$ 26 -47 11 62 -69 47 129 -6 -83 34 -60 84 -98 108 -16 25 43 -16 -41 18 84 10 125 -10 -17 -53 8
4110HO1k1o0J4l1K9j9j8J3J2o1RK3Q2m4O3j4m0j04J27r3J29l5Lj58J65M0j23L6
$$ 8 69 48 -12 2 -29 0 -19 -37 -24 -12 -73 -64 -41 41 -3 60 46 6 -98 29 -64 65 30 33 -125 40 80 -43 -7
4139gJ6j1n7J91j75M3K9J7o4J9o6J42j67J19q6J74j71J36n3k7L1J4j7j00L0Oj1
$$ -7 9 -2 -59 132 -43 0 29 46 -18 1 -65 77 -90 29 -57 117 -54 82 29 2 33 47 30 -70 -40 -34 -45
4166d5R5l9nJ10j75N7m3ML9q4J41o7j7L7P8j20K3Jj19J04Q7o8j0KM8j4m0m9P3
$$ -45 50 11 6 116 -59 -2 -45 -41 -2 -86 55 -12 -29 8 86 -34 -11 -10 -129 -25 62 -6 -16 -14 34 20 -20 -69 4
4195Dm0j7M9P1l7j05Q6l4l7L0Q0q9K2J2J32j40P4l8j03J14NK4r4L9Oj0Nj00O9
$$ 4 -36 -53 -4 67 30 -75 11 -23 -60 -30 50 -39 -17 -5 127 -13 61 23 -80 34 39 63 -31 8 14 4 9 -91 -22
4224b2M2q2K6M6ko8M6p1O0m7K14p4n1r7O8K2J37j74n2P1LP7o6n0N4r6J2R2p5L3
$$ -22 20 -62 -36 10 8 -60 -14 -85 -25 -72 142 68 17 -80 -12 10 147 -27 -79 -8 -5 72 6 -44 10 -86 -74 18 -57 -24
4254b4Q0j19J59q7ql0J28n1J2J2p6R8j54j6N8L1K2l3o6J62j68J44j36J32q4j1
$$ -24 56 -63 96 9 1 -29 99 48 60 72 -4 94 -60 -76 -18 13 35 2 -64 98 -70 74 -62 70 -14 -25
4280b5J9K9q3R5K1n8m0p9J35k9k9lL9Nm8K1oOJ3RL8P2k51K60l3m6n8l8L4J6mP4
$$ -25 -6 23 -60 35 56 -2 -42 -121 14 -15 -44 -47 -8 -3 -51 -30 -36 -30 -17 -8 30 102 -149 111 78 32 -26 -64 -30 -14 -18 56
4312E6n1o1Q0K4p0L9m7J4n7Q8k7kk4P4n4j0m1J12n1r0J46n1l7KL2O7n8j5lL1o0
$$ 56 5 -56 24 48 -22 17 -30 -16 -73 15 -12 -14 -38 36 -18 -28 -69 43 -8 -98 48 -3 -40 -38 -6 61 3 -12 -15 16 -44
4343d4OrP7o1K0q5L8L7j8p2R1J43j55ql8J0P1N8j25KoR8N1j46P9O8K6j3j91K4
$$ -44 -38 -47 30 -31 -11 -96 -58 -21 -39 -111 -20 123 -32 -40 -78 -68 3 61 -64 -62 -68 30 81 -65 14 82 108 95 -96 -72
4373g2m4P6k7K07j70P1l0ok8qK1J4m3k6oJ66j31J9J9J09p7K1o4M2o3J77j52OQ0
$$ -72 -116 -40 -67 140 -30 41 11 5 -23 -31 -10 4 -39 -65 -71 95 -36 -17 2 111 34 55 -9 33 -30 147 -5 1 81
4402H1p2L6j7L4l1j14K5N0R6Ok47J72N3q2n7qJ78K4j37N3J2pq9J65j98P8J3kj6
$$ 81 9 45 28 62 31 -83 -58 -8 88 94 -153 19 72 -10 -67 -75 103 127 -10 43 55 48 -41 124 -74 4 17 15 -1
4431aj1J7p0kP8K4m4l2O4k9J2r1J07l6N4K1j70P1N2m8JK4J11o4o7Q9K9n1q7Q6
$$ -1 -12 5 -65 -67 11 35 -9 -41 23 -6 6 -85 22 -14 40 61 -109 -38 14 -34 -33 -9 102 38 -29 60 89 38 -49 37
4461C7qJ9l4L7l7%n0j14Q6L5J21k16M6P1L8j03oJ02j11Q6L8r0L1k9J36o9N8K2
$$ 37 29 48 14 51 14 14 -36 -150 -64 -29 92 -124 -78 -7 31 -72 -78 24 -87 -1 37 -53 -22 -51 85 16 74 96
4489I6m8p1m9J26r2K4J04p5j4K9j01P7j08J53n2K1L6j82K19o1qj22K94j40l6j7
$$ 96 48 -23 -72 54 -38 -14 90 15 1 30 -71 6 -102 51 -1 20 56 -126 93 32 24 -98 196 56 20 3
4515CK1n6L9J1j56J09O2m1N7j40R1kq2J51m4l2n6J93j33l4N4J26j30o6Q6P4o4
$$ 3 24 -32 7 18 -138 -29 33 -8 49 -91 0 -2 -84 67 23 -9 -65 128 -5 -39 15 141 11 -55 31 105 41
4542D1L8j59J04N1Q4m3l4r2O8M1p4l7LN8k4n0k4l4N6qM7j01nN1J8r3J33q6k3O3
$$ 41 79 -80 24 75 159 116 82 -10 58 99 25 -12 -9 49 25 -25 -49 -83 -27 -35 12 -89 -94 -43 -25 -118 15 -71 -94 -31
4572c1Q3r4j6R4ln2l4J5M6L4J8l4Oj48J35K4lj24J33m4pQ4q5j9J11j31J8K0J10
$$ -31 52 -42 -58 36 33 -19 -53 -38 8 42 60 26 32 -116 19 43 40 -84 49 5 -2 82 -3 -22 89 -42 -24 -4 106
4601A06j77J19q2P3r5N9j13J42k7j6J04j13J50m3n9r0R6n2P4j24j7N2P2n4l6K7
$$ 106 -71 48 -34 39 -56 3 -110 32 5 -11 93 -20 130 87 28 -62 34 -18 56 -68 -85 -33 39 -15 -51 -24
4627b4J6N1k0M4m7l2J4J6p9J32r7j1l6J61ml9k4k2r4K49j58k3K6k9R6l1j8n0Q0
$$ -24 -8 43 23 67 20 -12 2 18 -61 71 -26 -37 -73 88 84 45 21 -1 -95 154 -4 -27 -1 -30 66 35 17 -33 47
4656D7p7M9nMr7j2J36k6nJo5P2k7p5P6Oj9Lj2K1pm0J15m1L5R7j85J14j08M1j5
$$ 47 -30 19 14 18 -79 -91 45 19 14 15 -50 22 -5 -80 -4 2 -17 -14 -26 -5 -12 -52 63 22 57 154 -31 83 -25 16 1
4687Ar3K72j04m7J0m6J1Q6m4p1M6n2K8Ql4o7Q5J24j40Q6j01p9K20j30J03j26J19
$$ 1 -92 180 76 29 39 -7 4 90 46 -25 21 -31 -3 5 -29 -96 -11 113 -27 59 -42 -121 99 -31 72 -54 65
4714F5r1j5J05k9o4O3J3kl4N6n4N7k4r6k3J1Q5N1j13P4oj3M7k0N5j09p5M5M0l5
$$ 65 -26 -41 64 35 -29 34 47 45 11 67 13 70 46 -50 -73 -62 23 74 -39 35 29 16 63 43 98 -11 -86 -41 -1 -36
4744c6K2L2p9N1p8J39P5j86j4J15k9j07J27J6j9r2R9o3L0PnN0o1Q7lm7j9n4R3
$$ -36 -14 18 -61 -10 -88 51 126 -60 -74 41 12 -95 32 48 29 -63 36 -27 3 10 5 55 -6 81 78 31 12 -42 51
4773E1N2o9j7J8m4l7l7J91j91Q6k5O1p4m8J48j63J76j09J5M9m6J2N7n6KO3o7k0
$$ 51 103 34 17 35 -9 -46 -83 108 -83 3 -22 39 -35 -83 65 -98 78 -31 -16 33 -13 -1 56 0 2 65 -2 -22
4801b2j6j7J8M0m6l5Q7k3M0o0O0m7L8O8o5J7JN2j15j9K6R8m7k7ll2M4k0k5k2M7
$$ -22 -38 -55 -37 3 -43 -78 9 -14 26 -34 26 -21 17 85 20 37 38 90 -25 -44 -18 80 33 6 3 -29 15 -5 -30 -52 -5
4832ej51J92K2Qr8Q4K4r9N7l2j4K5m6L5r6J11j9j4lNk8R8Qn0J9o4k0N9p0J34N2
$$ -5 -156 36 58 66 -32 52 76 -23 34 2 -12 13 -33 2 -94 17 -2 -16 -19 -14 -42 56 64 14 33 -31 -51 8 -62 72 124
4863A24j12N1n7K5j3K7m0pn4P0l2J05j04K2O1M8j01jK1Rpj45K00p6K5O5%j50J04
$$ 124 12 63 6 31 18 45 5 -2 -56 14 -18 87 -17 5 66 114 13 12 33 42 35 -110 90 14 39 104 104 -46 58
4892E8j6J9p8m9M3P9m3p3n1J13O1j13J9l8Q9j4Klo3N3m2N3J3r4J28j21J71j20
$$ 58 42 61 -17 -66 -23 56 13 -60 -111 2 63 -50 -31 -69 20 6 8 5 -58 -5 -47 6 19 -75 53 -68 103 -17
4920a7N2j24K01j2p3lk7j6J03q9J42j46j6J6Q4r3k8K0lJ02o4P7j21O1k1q0P9r4
$$ -17 35 -89 112 100 27 24 -3 -19 84 -5 137 -9 -25 -9 75 -18 -46 -26 -29 73 9 86 -35 26 5 -75 4 -90
4948i0nJ1R1Kp1Q2Q6j42N7K4j55J19o3o2K49j14l1%M5R4j07K3n6%K6lk7Lk4n3
$$ -90 -95 -84 7 9 -62 20 106 -36 21 45 -110 9 -54 -116 133 19 -12 -12 33 127 20 43 -13 -13 13 10 -17 -14 -38 -91
4978i1L4O5o5N3Q3o9Q8j00m0N6K4j59J82j20l6OR3MQ6nj18Q4j61J4J73m0j15R3
$$ -91 -57 8 -57 -4 79 10 98 -2 -42 14 38 -121 61 -59 -95 -89 4 8 94 89 -29 55 -106 -92 81 41 -74 19
5006A9n3k0OO4l1k2j5J41j50J01O3%k0l1n9P9k1J3j5q7o3J75l9j00Q9r5P4j19
$$ 19 -34 -54 -48 16 -15 -37 -52 89 -61 40 103 103 83 52 -7 72 51 64 49 -38 -101 74 35 -65 24 -71 3 -116
5034a16N7J74p5j09N6j9K7o3J00K2j25J00k8L7j56J34L4O1j18j8J23n8j36l3J63
$$ -116 -59 115 40 -69 -13 -32 -5 -68 32 54 -71 29 1 38 -118 16 50 111 -7 -25 98 40 -96 -129 34
5059C4m3l1n5J20p6Q6j03Q9mL1q2m2J9Q0k3J22m0r4M0j2J3l9j8N6OL7o0o5oL7
$$ 34 -9 -40 -95 25 -51 35 -68 21 17 48 -34 -76 -57 23 0 122 82 -12 28 16 29 -10 -28 28 34 71 11 -54 -60 -23
5089b3L0J03j70Q4o9Q1n8M2j06M6o9P9o1%rK11pj77P2r3J04J31j17M5n7j7k0k1
$$ -23 7 110 -60 24 -45 36 -22 20 -86 -40 -109 -30 -91 -91 -100 111 104 -73 -1 -94 10 141 24 69 12 -5 -25 -46
5117d6j5K0R6p5n9R4O0q1r8R7L4q2O0j4qK2l5k9K6p5J8J65n1J7O8j53J32l1k8
$$ -46 -61 -41 55 -20 -79 15 75 -6 -104 -7 27 -55 5 -9 -17 5 -30 -59 -33 -108 -90 75 24 41 109 -44 88 57 29
5146B9m0k2q8R3n9P2J0n1M7K6lq2KL4N8k6n9O0kj1lM7o0j2Q4p3K07j29n2j03J57
$$ 29 -11 -33 -121 -28 -87 -15 -5 -56 -9 17 14 -68 -66 -32 26 0 -59 1 -1 -12 -15 32 -28 -40 44 -29 178 49 -3 -106 51
5177E1j07J95j78m8M3N2K4J5r2J6R9m9o5J1L2lK3R1j63M5M0j26J95j20NL1m9n
$$ 51 -56 139 -39 -87 -44 8 32 47 -45 -29 70 21 -44 -33 -1 -4 19 110 -53 -8 32 -94 101 -19 -14 17 -32 -37
5205c7J01o0p9R2PJ2k2kr3J72l6M7j31o0P5o4J36%o2J5l2J07m2q4L9j38J84%m8
$$ -37 64 4 -75 17 24 36 14 12 -81 91 55 102 -29 -89 -14 -78 58 58 -4 11 -21 86 44 -40 -1 -139 45 45 -3
5234cP3r2Nn2K5J11K5k9o7R7k29R9K3n9J06J1q4L2m5Q1P4j14O4p2J5M6JO0j09
$$ -3 70 -22 -17 -69 -44 67 92 63 -4 93 -136 -37 -14 -73 33 44 -40 -8 -53 28 102 -12 52 -20 -5 41 42 102 -7
5263gN5j21l6J00J30j42n8J12l8J6o3P7m5l1M8P3k2j1o8N1P3n7j38J08k0k0R0
$$ -7 48 -73 -109 -9 121 -21 -79 33 -5 11 -52 25 -20 -51 -3 70 48 37 -31 20 93 36 -102 6 -14 -34 56
5290E6n3P7j09k0K5O1n3M5m0O5p3J04j12M3o7J52k1L2j16N9j49J70Oq9N9p2J28
$$ 56 3 80 -29 -49 -24 37 -16 29 -11 54 -19 85 -27 16 -51 101 80 112 -4 55 -94 76 82 -7 52 -20 108
5317A08l3r5K1K7j28J22J4K6q6k4l1J05k1q3J84j77O8P7p2mJ3n1M7J51j07o3N6
$$ 108 75 -20 1 28 -100 22 36 62 -24 -48 -79 26 5 -78 106 -71 -3 74 2 -2 11 -40 7 158 51 -12 44
5344D4L5p0m6nO7L8j24K3P4j25N0O3p6K2j9oK02k19Q7Q4j64M3l5R3O2m2j65L4
$$ 44 79 9 -37 -42 25 63 -61 -38 36 -89 -39 24 -52 -30 -49 -55 147 -72 15 99 -65 -22 -57 36 98 56 -109 -75
5372g5M5j8l2Q3o5k6J57r4m6O1r3Q3p9P6M7q6L2oJ05o8p0Lk2J20p6K6mR6L6L6
$$ -75 -30 -48 -80 3 -62 -88 69 -25 -71 -10 -103 -20 -99 -23 24 -62 -30 -36 69 1 -69 -66 -88 32 -44 -18 -22 74 110 146
5402A46j12J3j76J37J9k5L2q3M9m2J82k49J89j64J24K0p8J8O2n5J15k62J15M4
$$ 146 34 47 -129 8 27 2 34 -49 0 -42 140 -109 80 -84 40 60 -18 0 62 7 122 -140 -25 19
5426A9n8J1j23J74NL7L6r0j06R1k4N7j08J83n9j50J02J48n7%nr7j0m2P2O8j8k8
$$ 19 -39 -28 -151 23 28 65 101 11 -95 -4 -28 29 -79 104 45 -105 -3 145 88 88 83 -14 -24 -66 6 74 56 28
5454B8J2q8Q6k8j60Q8R4L9q5m7R0j41O7J04j34R9l4j9O0n3o6P4k0N9M9j28J2l
$$ 28 40 -48 38 10 -150 -62 32 71 -14 -61 29 -112 -45 59 -75 24 -10 -29 31 -22 -88 -14 -34 25 74 -54 -42 -45
5482d5Q5j94K31Lo7n3O8P5j32o9M6l9O9%kj19J10K8q2J18j49O8N9p9M8L0K2p3
$$ -45 40 -154 77 80 13 -40 28 103 -29 -98 -52 -91 -22 -22 -24 -143 -33 -5 -87 31 -118 -50 9 -70 -22 8 30 -43
5510d3L5j02M9J02rm2r6P2N9k7M0l3k4q3N9N1L0m7p1k3J24j04m1J91j13LJ50p0
$$ -43 -8 -110 -61 41 32 -10 -106 -34 25 -2 38 5 -19 -102 -43 8 38 -9 -80 -103 21 -83 -124 67 -46 -43 107 37
5538C7r4J10J7j18N9n2Q3j70J51n5Jo2J27P6n3j38J86k00k7J19jJ35j54K8m2K7
$$ 37 -57 53 70 -48 11 -41 42 -128 23 -32 -31 -93 34 110 57 -81 105 -95 -122 -3 -4 131 -23 5 -37 -10
5564a0l5M2l6J5m4J44r0J89k08N9j08N5j0L2K6m0K6l5QM6M6j03j1n2J26j01J05
$$ -10 -45 -3 -39 -24 -68 76 -14 175 -33 26 -82 -27 -37 -5 21 -19 7 -28 -20 26 72 -31 -42 -94 32 -69 36
5591C6p0J33pj41Q5j19Q1n3L1M0k7J4P2j48O6J7j11PJ66Lj41K5kP4nn7O5m0L8
$$ 36 -34 99 92 -49 36 -83 -2 -55 -24 16 -11 3 75 -73 -7 10 -101 -94 72 75 -66 -41 -43 31 26 -31 34 -6 32
5620C2LM2q9N7q4k8J36j6m2rK6Po2p2J61j35J01LP4o3J6J0nj47J30Kq8J00j22
$$ 32 35 77 -12 45 -39 -67 69 53 11 2 28 35 -27 -99 62 -73 28 31 105 42 58 68 63 -84 46 48 -40 60 -62
5649f2J5J0RM5j9J3N4j18M2k0P9j55Q6L4kl7n2J38o6j47R2Jk0N5P3j31L9o4O4
$$ -62 -47 -37 -28 17 -2 11 65 -53 -11 -31 48 -107 -21 13 11 -26 -78 60 -6 -153 -61 -60 -80 -25 48 -83 -44 -108 -44
5678d4O5k0N8K6k3m0J09k09Q8N6j3m3Q8m0j42L2N1r0J21M7n7p9kJ38j00R4j02
$$ -44 21 1 59 85 62 22 131 -78 10 66 53 10 98 58 -84 -52 -1 -91 30 77 20 -59 -61 77 -23 71 -31
5705c1M9n8J2N9n6o1NQ2M4q8Q4j16L7L7J2R4j31rL0j8R1j27Q4j8N6Pm3o5R0p5
$$ -31 18 -40 -28 31 -25 -86 -81 1 45 -43 41 -75 -38 -1 11 105 -26 -35 -5 -23 68 -59 25 7 63 70 27 -38 52 -23
5735b3O3k2QQR6j62J21j15j4J09n0J2N6q5K9m6N9j18M6L1r2Q4K1q7rR2K6R5j37
$$ -23 40 18 26 34 130 -32 89 -26 -40 69 19 31 87 2 31 -15 44 -74 -28 3 -89 -5 16 -71 -80 12 38 133 -4
5764dKkp5Q6k1k3J06j27Q5n1k10K73j50P2P5j14Q8L3J5m0n4K3J2R2j28N6l0j8
$$ -4 -2 -4 -79 7 -14 -37 69 -58 27 -24 -234 39 -111 -39 36 -78 10 43 58 18 -36 -13 -1 91 -37 19 -11 -29
5792b9R1l3q8P5j5R9o7l8Q8r9Rm5R0n8J22j11l7J00j06N3n7O4M2q4N1O4l6J4q3
$$ -29 62 29 -59 16 1 100 33 -5 83 -16 -7 -52 38 -20 102 -9 -46 54 -52 1 -56 8 50 -34 17 81 45 59 -24
5821b4O6j21J41j07N5o6J93n2j74J86p5L6j26Q0O3j31O9LK5j00J39q8M3o5K9r
$$ -24 42 -79 62 -45 10 -56 137 85 -89 97 22 58 -68 12 75 -56 13 16 41 -59 80 -8 35 -30 -1 -10
5847a0k7N2R3j15qr2J05o5j0K2j5P6l9n5J68j18N5k3J00m3J8j0p0n4Q2n7n0J74
$$ -10 -37 15 108 -7 -15 -107 -2 -67 -77 -55 -70 6 -33 -88 80 -38 17 -6 94 51 69 59 -11 -65 17 -40 -90 84
5875H4k6j7o7L7L0j4q4j8L0J3K4N9q7N1K0j10P7J1l4J60k35J15o3N6q1R2p6O7
$$ 84 58 41 -26 11 41 27 -57 -75 -45 -32 -8 51 -36 15 35 -75 2 13 -21 139 -96 19 -44 12 -69 23 -53 14
5903A4N5l7q7P8j0r6J16r9oP4j6L5N4j18OL2j3q9J35rn0k6N4K3OQ5j26l7K6M3
$$ 14 69 32 -55 23 13 -83 33 -66 -72 2 -14 21 75 -43 -37 -5 -18 -107 28 19 -31 -57 -3 20 26 111 -15 -52 -26 17
5933A7Nr0J27km5Mn2K8l8N5p0K85l13J61j29l6Q4q1J8J30Kl4n1m1J38j27O6k7
$$ 17 22 -68 59 57 12 16 -36 -8 -46 9 -61 224 -89 72 -57 -93 -9 -90 -72 58 60 26 -25 -66 72 -55 11 -16
5961a6%J4P1j35J73j07%O3j00M6J1N5k8M4m2Q1r6n5Q1l6m7R6P9j59Nj08J88j9
$$ -16 -16 -2 69 -66 107 0 0 63 -37 9 20 75 47 91 49 130 34 -21 60 24 -23 73 152 -7 -2 -110 78 59
5989E9j02QrN9J7Lj49O8Mk6J68j35Q7l0l8L0p2J9L7P5J7J7q7l2J5O0p1L6j6p0
$$ 59 -43 -35 -44 15 32 35 -114 -46 -42 -68 100 -35 52 22 -16 14 -58 -39 -2 73 90 107 20 -12 3 63 -8 28 12 -58
6019e8Q4l4J43j49R5o4J8N9l7J8on5m0P7pOp8N1M9Po3p4j5O0R5j90k6K18k3q0
$$ -58 26 -8 135 -14 81 17 35 94 57 75 69 14 -26 51 44 50 -28 23 72 79 16 -58 -73 -13 82 -108 -134 84 61 -19
6049a9n6J5J0K22j89P9n5PN2J6o5o3J7n3J26j3Qln3r2J85k09J29po0P2O4rj01
$$ -19 -75 -60 -50 172 -17 62 7 14 66 82 17 -46 -29 -82 44 31 39 36 -17 -109 76 -133 -4 -11 -71 1 65 56 -45
6078d5N9n9J30j59M1l2R4RL9m5l7q2L1P4m6m0LK1M9J3M7m3r5P0KM8j31J13m4P2
$$ -45 14 -45 85 -74 -33 -65 29 38 77 32 -5 -87 -56 18 -28 -68 -65 -44 5 18 65 22 -73 -3 -1 47 -84 29 -15 57
6108E7J6j37K3l1J83k0n4Oj3J4k1J0K2L8o3o7Q0J9Mj37M7JJ01j02N0k0m4R6j5
$$ 57 73 -64 -41 -72 111 91 37 43 30 44 23 33 55 93 30 -37 43 62 66 -71 -24 -23 78 -24 26 6 -38 58 43
6137D3J13j89q0L5J53k5r2L7jO1j04K06j64J65k65J02J12r7L9q2M2J5n0L6M6K7
$$ 43 156 -33 -113 -78 75 50 -42 -5 -6 55 -49 157 -7 158 -107 -5 107 10 49 -33 9 24 -26 10 56 83
6163H3n9m7M5j0r3M9J60j35O6J1l7o4O2k9O7r7K2Q2o3o8k6J67j00R4j68J4R8l3
$$ 83 24 -23 22 12 -81 -32 128 -7 59 70 33 -31 31 2 69 -28 -6 76 13 -55 -81 86 -14 80 -88 -74 24 -9
6191im9P4pQ1p0j29R7k1nN3O1j11J12p7P4r0J36j30K9N9j92J44j08J14KRjr8J72
$$ -9 -58 16 9 90 20 -109 -12 -33 -38 15 76 -35 77 0 74 -16 120 -10 19 78 -114 30 -78 36 38 47 46 -52 120
6220A20j10K8N8p2np6L0j8J48j19M5J10j74J22j13Jj0m9J63k9k2KM0m9N9j28L3
$$ 120 10 38 96 24 19 -57 -27 -45 103 -16 29 139 -35 87 -26 -25 -35 -84 79 50 28 30 70 21 80 -48 -15
6247a5q2K02j42l5J18o2l1R6j38J51M5j55jN2P2p9J25j13O4r5o7P2N2p2O0l4j3
$$ -15 -97 105 -37 -72 46 -16 -47 49 -89 62 107 -48 -49 3 75 -4 121 8 72 -23 -90 -18 34 -38 22 -12 -25
6274b5kL3M5n3K2j43Q2j1K4J7J5p3K2J17m6Jp9J06J5o4M3r2K3N8Kp0L2j5j02J64
$$ -25 -27 6 51 -2 20 -123 -41 -52 -28 -11 4 -69 -47 70 24 25 -54 52 67 3 46 -46 -23 35 37 -33 -1 -16 -118 46
6304D6m7N2p5r7J44p0n9JJ05p4P7j2L1J9r1K3l4P6n8J50j59J9j1J71k40J96j53
$$ 46 -1 51 -24 -121 23 -47 -106 -105 0 -74 3 -9 22 41 -50 -27 -61 15 -43 107 -52 -33 -44 127 -113 83 -70
6331g0P8rnl5Q9n1NP0l6k0Q0p1J37j04j60J41L0r1j2K31k52R0j7%m3Q4r2J04o3
$$ -70 8 -1 -6 -41 48 -3 2 72 36 16 96 25 162 58 -102 39 69 -22 -34 197 -55 35 18 18 -25 59 -33 71 8
6360HL6Np2K2K8j73J57j8k0J43j65Q8K7r4R0n0Q3l9q4Q9o9j6J09n5j01J4J21o5
$$ 8 44 49 -23 -1 27 -146 11 -7 -27 116 -49 39 66 -28 62 12 95 56 -28 61 -8 -24 85 30 -71 -57 64 -1
6388aJ09k00NJ36opK2r2pO9J0o2K5M9k7l5J4j0j5Oj14J81m6o9P7n9K8p3J80q8
$$ -1 108 -92 -87 49 43 36 58 -34 -41 28 38 -24 1 50 23 -12 2 -8 -23 -17 -131 50 4 -65 12 -47 -19 -92 88 0
6418@J22j43J47k11MJ10m7Pk2L%qK0P9q7M1Kj4J2P6o1L0j83J76J3J2k2j8N0j33
$$ 0 122 -21 126 -85 -81 29 -18 -11 -33 -30 -30 -38 -18 61 -26 15 17 3 15 91 30 60 -123 53 66 78 56 38 88 -45
6448d5J06r9N3K5Nk2M1r2J15om7m9M1Q7j51J23n5L5q0j36J44K5po7JK0oJ38j29
$$ -45 61 -38 15 40 45 23 64 -28 87 81 34 -15 26 113 -38 85 30 65 -15 -151 -7 18 11 -56 -55 -35 -41 97 -32
6477c2L3N2n9N7q7M0ON6K5j39P7k4n7K1Q3j66J25omJ5j01Q7q2Q9Nm5N8N3n9k3
$$ -32 1 53 -6 51 -36 4 10 66 91 -48 29 5 -52 -31 52 -114 11 5 1 16 -85 2 -80 9 14 -31 27 80 21 -2
6507bJ4K0o1M1qJ5j08J51r8L3K2l7r8J78j18L0k7L9M0k3m8L6L3n2O8j09J59j2
$$ -2 12 32 -29 12 4 19 -89 62 -36 -3 19 -18 -116 62 -56 -26 -53 -14 26 3 -45 -9 24 -28 40 -69 90 78
6535G8m8j8n6L5l4K19k18J8k3j1J9N4j2M4j52O7Q4j12R1m2Q7k1r0Q2q1N2kj18
$$ 78 30 12 -44 -9 -43 176 -42 -24 -47 -58 -39 15 3 47 -105 -38 46 -66 25 -17 70 49 -41 41 -40 12 10 -108
6563a08J10J20j47OJ12p7j05O1l0nP0j5R2j14L8j03J92j60Qn3K36j78r3R8M9K7
$$ -108 2 122 -25 -19 93 16 -89 -28 -58 -63 7 -8 84 -30 8 -95 97 -63 -55 -108 128 -50 -143 -45 4 31
6589C1j4J7M2m9j09N4N3L4j03J63l8p5q9Q5m3M6K4L1j29J24lj81J55Rl3l8nN4
$$ 31 17 34 76 27 -82 -28 25 59 -44 119 81 6 -83 2 -41 5 29 60 -69 55 52 -129 26 35 2 -36 -41 13
6617A3m1j2K4L1k8L9j8M9j00J3N7l7N3o3O6j06o1J87q2N4no1J23j04M1N2kj56
$$ 13 -28 -40 -16 15 -13 26 8 57 -43 -30 27 -10 43 -20 46 -60 -121 66 -16 38 33 -28 95 -9 32 84 82 -74
6645g4N0J29j07j02J55m8M0o8J9k6J36j79P1jm4j6Om9J28j22P2l0N0oj9O3o8k
$$ -74 -24 105 -2 -104 51 3 43 -25 -6 -32 104 -75 -4 -5 -49 -65 -59 -108 20 -102 -30 -60 -10 -16 -35 28 -40 -42
6673d2qP0M6r1N3p4J15m2l1n1O3qMpk3p8J58k4n6n3n6J75N2k9o3JLO3k9j07J16
$$ -42 -50 20 66 -25 28 -46 69 27 -4 -55 8 0 4 -3 -26 -104 54 30 -26 -79 -135 40 92 63 0 1 4 67 38 -69 47
6704D7n1l7O5J23n5j62k9R0M1P7j09o0P9l8j14J91J8p3OK1m7j9P6K3J6o5L1m1
$$ 47 -4 -41 24 147 92 -70 -99 -9 32 109 0 -60 19 -19 -133 58 76 3 9 30 -17 -36 40 63 79 14 45 4
6732DK5K5n3l6J30j37N1L3N1l7o6O2q2l0J19n7O8nl6r9m1J18L0j51J22O2r2k0
$$ 4 29 54 1 -35 95 -42 9 42 93 56 -10 52 -30 -60 59 2 70 65 29 -70 -111 7 37 -114 8 70 -22 -42
6760d2K0M8J2j16l9J61j20M1M9r3K3O6N5n4J5k6O0r2R0j02K2J33o4kL1j09M3J5
$$ -42 -22 26 38 -78 -117 44 -76 -35 14 -79 -56 10 65 11 26 0 60 -32 58 -44 -22 111 47 45 76 -33 10 25
6788B5r0J26q8K12j35k05K17N4j60L8Q6r2Q7j21O2m3P9M7l6j00K9n0O7j9M2p4
$$ 25 -65 61 -27 185 50 -155 62 116 -44 -6 80 -12 75 -46 16 -27 52 99 63 -37 -8 -58 9 -10 32 -42
6814d2K5L8j07J4P9k1L5k1L6j05J51l4%l2o4J43n5k1l5R9j25j2J08N0K1j69N0
$$ -42 -17 21 -86 -72 7 -14 21 0 36 -69 82 48 48 16 -48 95 40 19 -16 83 -42 -54 54 104 125 -44 6
6841FR2j02n8Q1K1p2j02J50Nj12Q3J31j26l4l6J71q9o5J71j45J03o0k9j7n7J36
$$ 6 98 -4 -62 19 40 -32 -134 16 21 -91 -8 123 -3 -37 -73 98 9 -56 115 -30 73 13 -16 -33 -90 46
6867D6J0j7k3k2M2j80J67K4k00J35kL6k7N8j03K0j1P7j1k0ln8J40j24M9J7m0L4
$$ 46 56 39 16 -6 36 -144 23 47 -153 -18 -20 16 -11 47 -56 -36 -47 30 19 -1 -4 -62 78 -46 3 20 -20 14
6895A4Q1j89J5J54r7mM3L3r5RL7m6k1oL8O0JJ49j99j7J7m0MO1P0n9N5Jj50K32
$$ 14 95 -94 -79 75 -22 -26 17 50 -45 -36 1 -45 -66 -72 -34 26 27 176 -23 -40 -23 -63 -59 2 72 13 68 69 -81 151
6925A51q8o5J6l6PM3j60J87l0J03J0k10Q4p0J16k3j4N2j12J15o3p1%L9P0k4O2
$$ 151 63 -2 14 -22 -15 28 -132 55 25 128 138 -72 12 -58 58 35 21 73 -39 76 13 -58 -58 -19 51 27 89
6952H9p6j4j06J13L4n4No4R9O6p2J7Q0j2j34Q9j9ko9l6J50o5m5J21m1n3J34j14
$$ 89 13 -1 -107 6 40 -14 -9 -73 26 92 20 37 117 105 -29 60 41 39 -30 -66 84 19 -26 95 54 1 135 21
6980B1l7p2Q0Jm2QJ38j66P8lQ7j66J37j41J49r5n1J89j03L4JN8m9mj19kP4r9J35
$$ 21 -16 -88 -8 -7 -49 -41 97 -69 9 6 93 -73 64 -77 72 -23 -74 115 12 46 47 105 56 52 -67 -69 5 -94 41
7009D1m3j8K7j06Q0J25p9L0m0N5l5pq2M6o0P6m5L8N3j3N1j50J4j4l7M9mo8R9J15
$$ 41 -2 -20 7 -99 -19 106 27 57 17 72 37 30 -52 -6 -66 10 -35 3 56 43 94 -56 -42 -56 -93 -44 -48 -116 -17 98
7039I8j3n1l2p8J64j05J3N5q1k8R1j7j16J05J9r5J48j30L3N1K7j51J2m8J11J2
$$ 98 85 34 2 -76 88 -17 -4 51 -30 -58 33 16 -100 5 24 -71 77 -53 -20 31 58 -93 -81 -129 -18 -6
7065fl3Q3r0kN6J32j41r2O7L3j1O2L1k4j40M1J16j57jJ7L0p6J70j31J01Or2j8
$$ -6 -39 44 -46 -48 8 140 -1 -93 -26 7 -4 58 89 65 -75 -34 82 -75 -76 -59 -29 -105 65 -66 35 41 -51 -69
7093f9J08N4p9m5Q4jk08K76j79j4M7L4j0P4o2o1J42j00m7K0N8N4K1j1m8r2OJ32
$$ -69 39 93 14 -31 53 52 -156 120 -59 -73 -26 8 -2 72 10 -51 91 -9 -56 -36 22 76 97 86 38 -54 -48 84
7121H4j06M1J0n8J4J00o7r1N7P3r3l1O9kJ30j80j4lM4Q0m2K9o2n2R7o8o9J10j3
$$ 84 -22 19 29 -29 -15 85 18 -73 -16 57 -36 -67 2 0 130 -50 -64 -67 -23 57 15 44 -18 -70 27 -41 -110 0 -13
7150a3JJ5r5R2q1P4o4R0KJ0j5j03J23n0k4Q9j18N4n6J67n4m0p2pm7J15P5l4q8
$$ -13 -12 3 -92 0 -81 -7 -71 19 21 31 16 -87 36 -14 -38 51 -67 -13 -69 98 44 4 -68 -75 -122 -7 68 34 -54
7179e4J04p9J3J6L1k5J29j01l1m5P7r1P5m2l0J04q7p0R3qL1l7M2jn6Q5j11J24
$$ -54 50 -29 -16 0 31 6 135 34 3 -42 35 -56 19 -23 -53 51 -36 -106 -13 -21 10 -27 15 14 -42 43 -68 56
7207E6o3K0%k3M7n5o5O4R6m8Op7P1L6n2N1j13K8Pm1J88j13J8np3N0j8J3N4k7J12
$$ 56 -7 13 13 -10 37 -18 -83 -19 77 29 35 -42 29 65 13 64 -49 -21 -14 -55 133 20 38 33 -40 10 -8 5 59 32 144
7238A44j26k7J4j34R0O0mk8O6l3P9j61O3q9J68q2O5o5mj4J3P2q7M7j7j1j2j3J1
$$ 144 18 -9 5 -129 -39 21 17 -11 55 22 101 -60 3 -86 82 0 65 0 -4 -18 -5 67 -20 27 10 -1 -13 -26 -15
7267a5j5L8rj1J9J4j01oP3Q0p4oN7j21Q9n6J09q9P5p6J21p9n0K9Q2r9J5K5J2n1
$$ -15 -30 8 -1 -12 7 21 -80 -86 -13 67 -7 -13 44 -77 12 -44 65 -24 51 -25 96 17 -33 -4 78 -21 -6 19 31 -20
7297b0oj2L3J4o4R7l2%J4L8m1j1Rj13J21m1P0o4Kn9P5k0p9J47j4j8J1j8m6J02
$$ -20 -26 -38 -5 9 -55 42 10 10 24 62 21 10 19 -94 27 -14 56 -8 -6 -65 10 -10 -89 58 44 26 37 19 -27 75
7327G5O6j41J0p9J34r2j7J8mJ66j44J7M0j4M4j17PJ2j9K5J3Q4o8L6N1j35m8M3
$$ 75 141 0 10 -69 65 -27 -44 -26 -30 136 -8 9 49 35 79 -38 -31 -19 -38 -13 0 84 16 52 103 -32 -80 -37
7355c7N1L1N1j48N1L7l4M8N4n0j46J40k6m8pM2nqL9n5N2o0j03J24J7J5P3k14P3
$$ -37 14 45 96 -52 -1 36 2 50 104 54 -92 48 22 -26 -33 9 4 -4 35 -20 32 -28 -131 -7 10 25 98 -116 -43
7384d3L5J2m0j9J05J7j04km4R9km9Q3j38P7J05j31N5j46J8J41MKm3R4p2n2o3Q8
$$ -43 -8 4 -36 -55 50 67 -37 -39 -83 16 14 -35 48 -90 -13 92 -39 16 -130 -112 29 33 35 -8 86 14 -38 -101 -13
7413a3j2L8mj5M4k8J2o8M0J1l7M0o2N9Q6j75L0L4oK8P8l9r9J60n5l6l4j5k7R7
$$ -13 -25 13 9 -6 38 10 22 -46 -6 5 -32 8 -54 5 91 -84 -54 -20 -26 2 80 41 -58 102 47 11 -23 -38 -65 32
7443C2O9k15J45mr6m4R4L7L2p9lJ25p4Lp0QL8q8R2M4p5J2j23J62j38P7J1l5J38
$$ 32 101 -114 31 27 -69 -113 -19 18 50 -29 -32 93 19 22 -48 -40 -2 -90 2 46 -29 -17 -140 22 -116 -39 -28 -63 75
7472G5O3j49m1J40J5k03J49rq5Q8l5R4j76J3m7J69n1K1o1J22n5n4k1M6M8l1J4
$$ 75 138 -11 -52 88 103 -100 49 40 -45 43 8 102 -74 -61 -108 61 10 31 -30 92 37 -17 -38 8 56 25 39
7499C9j10O6O3N9n3j0m6M0j1r8K4L4PK7o7N3Jn0l9L3J0N8k13J92L1r3j1q0R2K
$$ 39 -71 -5 58 117 64 54 8 48 37 -61 -37 -3 4 31 -36 17 18 -32 -71 -38 -28 30 -183 9 40 -53 -64 -144 -52 -50
7529e0J0J5l5J01p1L6K7q1K5J1M9j5J7j4Q9j07n9J29j29LJ7L4M1k7j3k3jK7L5
$$ -50 -40 -25 -60 41 -30 6 33 -48 -23 -12 37 22 39 25 114 7 -52 77 -52 -49 -32 2 43 16 3 -20 -21 6 41
7558D1m3k4L2j02J29O8j20L1qJ6M1p3l8PJ46j02K4j57J48K3p6J27k9KoJ9pj78
$$ 41 -2 -26 6 -96 33 101 -19 12 4 20 61 -12 -50 -43 103 1 25 -132 16 39 -37 90 61 63 57 76 69 -109
7586a09J19O0o2l9J81j07q6R2n5L6o7K14k35P7j30K24j80J4J49p1j49J19j0l2
$$ -109 10 70 8 -31 150 43 -43 49 -6 30 -37 177 -58 19 -111 113 -67 -53 96 25 -124 -5 -15 -47
7610d7k9L1J79q5j03J28j79P6P6kP4n3o7QQp8J23j19L1P3n6k9J01Mr2J22r6l5
$$ -47 -76 -45 134 49 -54 74 -105 -29 47 45 119 66 -1 7 15 -63 60 -59 -28 45 -11 -40 61 65 -27 95 -1 -36
7638c6Q0q1N1m1M0N6j55K51j73j42J85L1j24K7N9K2m2K0n3k3M0J34k18jJ61j55
$$ -36 44 -37 14 -27 13 69 -86 165 -8 -150 35 66 -58 -31 28 50 8 28 -25 -48 -8 126 -92 -93 68 -87
7664h7J05O4j28M8K5n0Q0Kr6L2p3P3KOn9J6L2K8k9pM6j40J10Q5Oj26Q3P6j20R
$$ -87 18 82 -46 2 27 -23 57 59 -37 -5 -78 -5 -3 3 -56 -40 -8 20 -9 -16 30 -110 0 85 91 -35 48 124 4 13
7694A3J7lr0NQ0j4k6k05K35p9L2J09n7JQ8j48K1Qr3J51n3K2O1m1M9n0p3kJ5n0
$$ 13 30 27 -63 -58 22 8 -18 -223 12 -67 -35 74 17 18 106 -42 -21 -13 -106 45 -8 14 75 34 83 33 -40 -42 -27 -77
7724g7Q0j19J28km4K46k83L0P7J1k6nJ9k9Q2k8k26P2J01m0JK4LN3j29N1JJ0Q6
$$ -77 3 -116 12 10 -34 212 -71 -41 36 47 21 16 35 6 88 60 -166 -94 7 -33 -32 -8 -5 48 -81 -30 -29 -19 67
7753F7j08n9K27j70J10r6lJ3N5N6m3r9J1M3l9Q6J39l09J42K1o6J30k02Q2M4k0
$$ 67 -41 -100 127 -43 67 -29 -32 -19 36 92 49 -50 -39 4 -35 51 190 -119 23 44 -22 108 -94 -12 32 12
7779A2q8J25j1q9J20r6J2J24k9j25pO6%J1j5M4J0L1n6J9n3j0N9l3k5R4j15L1J
$$ 12 -76 49 38 -51 69 -27 -15 109 80 -45 -52 14 14 25 10 54 64 95 39 58 5 -5 54 21 -4 90 -25 6 7
7808GK5K1l0q9K9jm0J20l3j09K7RJ60j54rP5n8R3l7J2k7J2k2R8m5M3n3k9m2L6
$$ 7 32 53 23 -66 -37 -38 -78 42 9 -100 -73 -64 96 -58 -67 8 -50 43 6 18 -9 3 -19 79 34 77 24 -5 -47 -11
7838a1J5M5p8l8J7O3o5N8O2p1l4RM6O6oj40k2pR7O8j9n5k1m6mK2O0Kk6m8M3k3
$$ -11 4 49 -29 -67 -50 13 -52 6 68 -3 -37 -28 18 84 78 -62 -84 -91 6 74 55 0 -21 -67 -71 -49 11 13 -13 -61 -18 -41
7870d1M6l5R5Nj19k4J17J9J6o7j15K46j16k7nP4r5M1r4J25l0J2o3N0l6nJ45p7
$$ -41 5 -30 65 70 -49 -73 44 63 79 12 -103 143 27 0 -5 69 -26 15 -79 46 16 28 -35 15 -21 -26 119 42
7898D2K6j33R8n5P3j01P5J0m2p2Q0l3m9J02J05o7N9j00P0r2R6j27P9j00j9O8R9
$$ 42 68 -65 33 -22 51 -50 25 35 -7 -79 1 -32 -81 21 126 59 118 18 88 -4 92 -35 44 -56 -75 -7 92
7925I2j15R0Rj14R7k9j1N5p7m3N0j4j9JJ2K7j3N1pL4r5P5p4P1j3l6J7r4J56n2
$$ 92 -23 67 76 -38 59 30 19 74 -3 -46 4 -10 -29 -28 -16 11 -2 49 42 76 -19 56 -18 53 40 4 21 -73 83 31
7955C1m5J7J2q2N6p5J30K4o9N0r1Q9j31L4P6jp2R3j2L7m5j04K1N8L2q6J06J0q5
$$ 31 -14 3 15 -67 -11 -86 44 68 -1 49 -42 47 -84 -50 26 25 -47 46 34 71 26 -78 -57 1 33 -53 53 63 -22
7984b2N6n0L1%j8M7m4P4j28L4l1%K7oN2J1J3j22K3N8l8NL1q5LJ0J5O9j48J14n0
$$ -22 34 -16 15 15 -3 44 0 74 -54 -20 -51 -51 -24 -30 22 33 46 -76 -53 5 -33 -28 3 -82 -79 -69 -54 15 -133 -19 -69
8015f9O0J00j32k1R1r5N3nP1j06J00k8l2K2pO8r1J0L0j0j36J05p4P7Rr9O0J1m
$$ -69 -9 91 -41 -62 29 -66 -13 -18 53 -53 47 19 -13 9 2 70 -21 -11 19 9 -127 -22 -96 -19 -10 -109 -49 -38 -42
8044d2J03q3N6n9L6Q9j7o7n5K4N1k4l8N7j43Q2k6R9k2q6J06n5Q0l9j5j0Qm3O1
$$ -42 61 -22 34 -25 11 100 83 16 -39 -15 36 12 -26 31 -112 -30 -56 43 21 -65 41 -14 66 27 12 2 10 -33 28
8073B8p8J37j12K4o1L6o8J86r1M8j64J10l4J1O9J3l2O2o8m2Ok7l8K3N2m6m7J61
$$ 28 -50 87 -25 -1 -62 -26 -94 92 1 49 -115 -5 -39 -28 41 54 22 84 16 -26 -20 -47 -85 -62 -10 -56 -103 58
8101E8o7N4nK9l9k5j6nJ67j56j24K77k03Q8m1J34lj89O9j00Q0N0N7r2p0Q0K7j8
$$ 58 -9 45 40 69 30 5 -11 -16 151 -5 -129 148 -55 33 -8 126 123 -66 3 -97 -17 33 90 -2 -72 8 35 17
8129A7o7J36m6k4n9l4K0J33k6p5N4K0m7n6N0j40K35q5O7j35L8m5N4n6N1l5J38
$$ 17 -50 86 40 16 -43 -77 -57 76 50 -25 29 49 2 -54 -4 -144 91 6 73 -62 -24 -69 -15 -71 -20 -55 83
8156H3oj04L2KkM9j7j5O9j41m6J57l0o2Q5k3p1J46j54L2P0J6j39j8J10j37O1O2
$$ 83 77 -27 5 7 5 54 37 22 91 -50 -96 61 31 -31 54 31 -40 106 -48 -16 54 70 -69 -87 23 -114 -53 9
8184Il4K1RkM0r4m1
$$ 9 -25 -4 5 3 43 -51 -92
8191i2
$$ Imaginary data points
##PAGE= N=2
##DATA TABLE= (X++(I..I)), XYDATA
0@%%%%%%%%%%%%%%%%%%%%%%%%%Oj3J5j6J6j6J6j6K1k7K9l1L3l9M4m6N4o0O3p0
$$ 0 0 0 0 0 0 0 0 0 0 0 0 0 0 0 0 0 0 0 0 0 0 0 0 0 0 6 -7 8 -8 8 -8 8 -8 13 -14 15 -16 17 -22 22 -24 30 -30 33 -37
45c7P7q5R4j03J16j27J37j51J67j87K09k33K62k95L35l84M47n30O41q02J051j471
$$ -37 40 -45 49 -54 62 -65 72 -79 88 -99 110 -123 139 -156 179 -205 242 -288 353 -449 602 -869
67h69K306m527J9887N6305n9889l6214R780L723K1449N599j7669J24j218r372
$$ -869 1437 -3090 16797 73102 13213 -23001 -13221 -9498 11951 17550 -119 5 -1213 -10585
81a0585J2077J5415j7024j2538J6546L354r802J263K11M010Q46j0266M761Q368
$$ -10585 1492 16907 -117 -12655 3891 7245 -2557 -1294 -1083 2927 3773 -6493 -1732 6636
95F636o569m147L166N805l268r030P918O725r407k560N153L179k529m849L306
$$ 6636 67 -4080 -914 4891 1623 -7407 511 7236 -2171 -4731 422 3601 1072 -3777 -471
110d71M514l542n690L539Q966p145p396J0633N94p024K074m8L361Q73r101N042
$$ -471 4043 501 -5189 -1650 7316 171 -7225 3408 4002 -3022 -948 -996 2365 3238 -5863 -821
126h21P243p991l178N787K752m541k888M287J997k238l214R26P050m504o884Q226
$$ -821 6422 -1569 -4747 1040 3792 -749 -3637 650 2647 409 -2805 -1879 5171 667 -6217 2009
142B009J970n472k53P03M249j628o588N681L625n632j479K591L508k682m409M102
$$ 2009 3979 -1493 -1746 -1043 3206 1578 -5010 671 4296 -1336 -2815 -224 3284 602 -3807 295
158B95K745l286k532K021M999m411m013N554Q99k585j189k51N124k407n630N760
$$ 295 3040 -246 -2778 -757 4242 -169 -4182 1372 2271 -314 -1503 -1754 3370 963 -4667 1093
174A093K114m164j023J415L233j923m047L571K294k279k833J892M411l953l238
$$ 1093 3207 -957 -1980 -565 2668 745 -3302 269 2563 284 -2549 -657 3754 -199 -3437
189c437M539O26j698j471L6M753k801m472M900J204k721r84P55L263k071l371
$$ -3437 1102 1728 30 -1441 -1405 3348 547 -3925 975 2179 -542 -1526 -771 2492 421 -2950
205b950L223J600j643k181J216L581l021k505L583M84r92k016L73M245k862l018
$$ -2950 273 1873 230 -1951 -735 2846 -175 -2680 903 1387 395 -1621 -1248 2997 135 -2883
221b883L852M94j521j267L98L515k427k638K990J051j412j809J013L132k557k082
$$ -2883 969 1463 -58 -1325 -927 2588 161 -2477 513 1564 152 -1657 -644 2488 -69 -2151
237b151K698O23p52j896N26L662k893k092L112om87j484Q1L334k222k258K767
$$ -2151 547 1170 418 -1478 -952 2710 -183 -2275 837 831 344 -1140 -1059 2275 53 -2205 562
254E62N96q21j747Q20K752k303j562K017N13j73k053M65L312k760j286K177K11
$$ 562 1158 337 -1410 -590 2162 -141 -1703 314 827 654 -1399 -934 2378 -382 -1668 509 720
271G20k53j696L56K912k246j316J981L46k72j745N91K478k206j000J559L31Q5
$$ 720 467 -1229 -873 2039 -207 -1523 458 804 532 -1213 -622 1856 -350 -1350 209 540 625
288F25j923O34K542k222p74J545N5K76j868M94K465k072r62J541J81kj622N90
$$ 625 -1298 -664 1878 -344 -1118 427 482 758 -1110 -616 1849 -223 -1185 356 537 535 -1087 -497
306d97K089j871o26R88N12R2k053Q90K133k064m63R57K77L41j857O31K051j872
$$ -497 1592 -279 -905 83 595 687 -1366 -476 1657 -407 -870 87 364 705 -1152 -521 1530 -342
324c42l74Q87J28K41j587O68J790j801l28P78K92L32j844Q04J734j795j44N84
$$ -342 -716 171 299 540 -1047 -379 1411 -390 -718 60 352 684 -1160 -356 1378 -417 -561 23
342B3L37L51j814Q44J543j631j54N08K71L13j599Q30J322j453n9K56N33K49j689
$$ 23 360 711 -1103 -259 1284 -347 -501 7 278 591 -1008 -178 1144 -309 -368 -112 421 670 -1019
361a019Q69J296j617J30K47K98M52j585P61J253j430J09J28L98L72j573Q49J053
$$ -1019 -150 1146 -471 -341 -94 204 656 -929 -168 1085 -345 -236 -108 290 662 -911 -62 991
379I91j409J55Q8L83M31j549Q77Q71j155J98j76O09L63j694J154M98j083L35m1
$$ 991 -418 -263 -175 208 639 -910 -33 838 -317 -119 -295 314 677 -1017 137 635 -448 -113 -154
398a54M02M24j474P57P20j058L07k74N83L06j471J059M54q48K27l85O33K18j190
$$ -154 248 672 -802 -45 675 -383 -76 -350 233 539 -932 127 581 -267 -40 -425 208 426 -764
417g64Q77M08p63L17m19O26K40j339R38L31o95L15m54O52K06j205R84J50o36L33
$$ -764 113 521 -242 75 -344 282 522 -817 121 452 -243 72 -382 270 476 -729 255 405 -231 102
437A02n46Q06P5j279J039N6n30L44m26P43K8j124R64P8o02L24l85O99n8q83P86
$$ 102 -444 362 437 -842 197 253 -277 67 -359 384 412 -712 252 330 -272 52 -333 366 308 -575 211
458B11r2l69M26o45Q51q8r54Q56r2j89K06m96P17m7q73P83j32j23K28n62O84r9
$$ 211 119 -250 176 -469 382 294 -660 196 104 -85 121 -375 342 295 -578 205 73 -50 178 -384 300 201
480B01p43Q36j66j27K12o83P96j99q01J015l62j16K88n53P12j28o86Q36m19K1
$$ 201 -542 294 128 1 213 -470 326 127 -674 341 -21 -137 151 -402 310 182 -504 332 -87 -66
500f6J43m06O87k97n12P55l09l5J82m75P23l18n25P69m39J51Q6m29P48l34m70
$$ -66 77 -329 358 61 -451 304 -5 -40 142 -333 390 72 -453 316 -123 28 114 -315 433 99 -371
521c71N98j83J04o4m55P24l84l57O77m71K56m4m69Q37l85l66P19m02M0j5m10Q72
$$ -371 227 44 148 84 -371 353 -31 -388 289 -182 74 30 -439 398 13 -353 366 -36 4 -11 -421 451
543D51m24k13M09l92L26p4m05O82m29j51N28m82L24j49l91P76m30j24M89o23N91
$$ 451 27 -186 223 -169 157 83 -322 360 -69 -220 308 -174 150 1 -390 386 -44 -168 321 -302 289
564B89k47m39O40m00nL31l46L37j91k18M86m25k8L53k44L59k64l06O63n84J04
$$ 289 42 -397 243 -157 -162 169 -177 160 -31 -249 237 -188 -216 137 -107 252 -12 -318 345 -239 -135
585a35L27m24L99j53l23P43n38M6J26l28L50j79k05N60m95K32J86m73M82k32j85
$$ -135 192 -232 167 14 -309 434 -104 -58 68 -260 90 -89 -294 266 -229 3 189 -284 198 -34 -219
606b19N95n43N6L03m68M88k85j99O85o42J95J71l83N50m63M7M19m98K97J6l25
$$ -219 376 -167 -111 192 -276 212 -73 -272 413 -229 -34 137 -246 304 -159 -112 307 -191 106 122 -203
627b03M83m94P3L72m76K54J52m45M84k12o7K77l76K46N5l48M77l38L4L67n59K38
$$ -203 280 -214 -141 231 -245 9 161 -284 200 -12 -79 198 -178 68 123 -225 252 -86 -52 315 -244 -6
649fkk52M91l88P9L15l34K37j57j92L79k98O7K88l64K77j53k7K34l40J28K30m09
$$ -6 -8 -260 231 -157 -78 237 -97 140 -17 -209 170 -128 -61 227 -137 140 -13 -40 194 -146 -18 212 -197
672a97L60k10q0M40m00L0J88l42L15K4k59L67l79J70Q6k40L02k61M7J85m16L90
$$ -197 163 -47 -127 313 -87 -57 131 -211 104 128 -131 236 -143 27 113 -127 175 -86 -39 146 -270 120
694A20ol00L41j40j36L95n16K83L5k54K50j36kL08l65J95k0k59M81m89J89L00
$$ 120 114 -186 155 15 -121 274 -242 41 76 -178 72 -64 -66 242 -123 72 52 -207 274 -215 -26 274
716B74m79L36r1j94M05l10N3K29m48K55Qj63L25k61l0K13m31M36l2j57J63k33
$$ 274 -205 131 40 -154 251 -59 -6 223 -225 30 38 -125 200 -61 -91 122 -309 127 95 -62 101 -132
738a32Q6O7k29M09j68k32L71l70J12K89l88L73k10q2L64l94P0K01k98K51j90K3
$$ -132 -46 21 -208 201 33 -199 172 -198 -86 203 -185 188 -22 -104 260 -134 -64 137 -161 90 -100 -77
760g7L26l23J36N5k70L70l38oK87m10K72J03l02L31j74q9K93l62K42K5k29J77
$$ -77 249 -74 62 117 -153 217 -121 -127 160 -250 22 125 -177 154 -20 -109 184 -178 64 89 -140 37
782C7j96O3K64l45K84p3j03K80k51q1K04k41K98q6j32K90l44N0J62k59K17Ok09
$$ 37 -159 -96 168 -177 107 34 -69 211 -40 -121 83 -158 140 54 -78 212 -132 -82 80 -179 38 44 -165
805a65L23k33O9J82m12K09K40m13L44j93R2P7l36L59j73p1K72k44M3R1k17K55
$$ -165 158 -75 -6 176 -236 -27 213 -200 144 -49 43 120 -216 143 -30 -101 171 -73 -30 61 -156 99
827I9j74n8L43l45J99K5l26L11q7j46K27j28P5J44k93J93q2j39K80k42K38j7k44
$$ 99 -75 -133 210 -135 64 89 -237 74 -13 -159 68 -60 15 159 -134 59 -23 -162 118 -124 114 97 -147
850a47L35k40L9J14j59P0O4j81K11k26L4L07l48K25L7j57K61k34L8J34l69L58
$$ -147 188 -52 -13 101 -58 12 76 -105 106 -120 -86 221 -127 98 135 -22 239 5 43 177 -192 166
872A66j50j47K28j09MJ94k44J10j48k5K92j89M8J21k51J43j5j97K70j06j6J74
$$ 166 16 -131 97 -12 -8 186 -58 52 -96 -121 171 -18 30 151 -100 43 28 -169 101 -5 -21 153
894A53l34K91p6j71K61k79K26l3j05J57j28NK92l26N3O7j78K99k39N0R7j24J09
$$ 153 -181 110 34 -137 124 -155 71 38 -67 90 -38 -33 259 -67 -14 53 -125 174 -65 -15 82 -42 67
917F7o6j36K28m3J4P3l13K31l5q0J62k13o3K17k38K88Rk70L60k15j8J65k46K03
$$ 67 1 -135 93 50 64 137 -176 55 20 -60 102 -111 -174 43 -195 93 102 -168 192 -23 -41 124 -122 81
941H1j5j33K15l20J06O6j80J45J9J3K4k02J64J40l81K72k1n7K18k12N3Q5j81K03
$$ 81 66 -67 148 -172 -66 0 -180 -35 -16 -3 21 -181 -17 123 -258 14 -7 -64 154 -58 -5 80 -101 102
965A02j24o0J61j43j21K61j77K03j21m9J84j43O7R4l29L07j37o7J73k21K20l1
$$ 102 -22 -82 79 -64 -185 76 -101 102 -19 -68 116 -27 40 134 -195 112 -25 -92 81 -140 80 49
987D9j52K05j82L1J12j48J41q8j17K42p4j65J68j42O4R7j12K96k46r3K11j67J35
$$ 49 -103 102 -80 -49 63 -85 56 -32 -149 93 19 -146 22 -120 -56 41 -71 225 -21 -114 97 -70 65
1010F5q6j56K93j93M5P8j32J50K1j46J45j23J12J79l65K29n9j40J94j48M4J62
$$ 65 -21 -177 116 -77 -32 46 -86 64 85 -61 84 -39 73 252 -113 116 57 -83 111 -37 7 169
1032A69k69J82q9p0K36j60q9J47j36J15p0J7J28k38L0J93k40J94j38n6K53j56
$$ 169 -100 82 -7 -77 159 -1 -90 57 -79 36 -34 -17 111 -127 -97 96 -144 50 -88 -144 109 -47
1054d7L9J0j52J98p2j08J21r9O1R8j19J32r5j65K21n9M7O2k25K81j95n6J92j10
$$ -47 -8 2 -150 48 -24 -132 -11 -110 -49 49 -70 62 -33 -198 23 -36 11 73 -152 129 -66 -122 70 -40
1078d0N6K7p6J86k01P1R7k19O6J1j6J49j55m2Q0j58K66j50m1J0M1K1K6k6j3P6
$$ -40 16 43 -33 153 -48 23 120 -99 -33 -22 -38 111 -44 -86 -6 -164 102 -48 -89 -79 -38 -17 9 -17 -30 46
1104D6j19J40j35J1J09j38J49k9j27J70j52J5J18j11O1J48k46K06j52R6j1p7N6
$$ 46 -73 67 -68 -57 52 -86 63 34 -93 77 -75 -60 58 -53 8 156 -90 116 -36 60 49 -28 28
1127B8L2k08K11k9M5j1r4j0P6q6Q6o5k1J05j08M8n0k0R8j08R0O5j38O8j1p0J34
$$ 28 60 -148 63 34 79 68 -26 -36 40 -46 40 -25 -46 59 -49 -1 -51 -71 27 -81 9 74 -64 4 -7 -77 57
1154E7p0l5L3J3P9j85K4QjO9J0k1N6o2Q1o9k8O5J7k5p6K0j07K57k68J42j21Q7
$$ 57 -13 -48 -15 -2 77 -108 -84 -76 -77 -8 2 -19 37 -25 56 -13 -41 24 41 16 -60 -40 -147 110 -158 -16 -137 -50
1182e0K22j12r0P2p1M3l0p9J75j06o0J04l8K6q7J22j7p3J30nk19J72r8j4P8Rj8
$$ -50 172 60 -30 42 -29 14 -16 -95 80 -26 -86 18 -20 6 -81 41 24 -49 81 76 -143 29 -69 -83 -5 4 -14
1209a4n1q5J93p0n5K79k85J33k2k8J2n6QJ8j16J16R3r5jK2j28J13p5R5p3J7J39
$$ -14 -65 -150 43 -27 -82 197 -88 45 23 -5 7 -49 -41 -23 -139 -23 70 -25 -26 -4 -132 -19 -94 1 -72 -55 84
1236H4q5m9J45r2N3k1r6K04j14L6M9j07Q8j18r3Q7j05J33m2Q8%Jj02K56j99J3
$$ 84 -1 -50 95 3 56 35 -61 143 29 65 114 7 95 -23 -116 -29 -134 -1 -43 45 45 46 -56 200 1 14
1262A4Nj01O3kL6R7k18P6J6k02K82j9j2lj20J49l3r2J15j17J25n8Pl4J06j94J66
$$ 14 19 -82 -19 -21 15 112 -106 -30 -14 -216 66 47 35 32 -88 61 28 -64 51 -66 59 1 8 -26 80 -114 52
1289E2j40M5J29r8J21r3j09K00j06n1J54j48R8K1j2j8j19J5J00p8P8O6j12R9k29
$$ 52 -88 -43 86 -12 109 16 -93 107 1 -50 104 -44 54 75 63 45 -74 -59 41 -37 41 107 -5 94 -135
1314a35J52P1n6m6j3l3Q9L7j42Q7j03P9N1j12J24j53Q5lK3k8O4m4Q4j18J33L1
$$ -135 17 88 32 -14 -27 -60 29 66 -76 11 -92 -13 38 -74 50 -103 -18 -21 2 -26 38 -6 78 -40 93 124
1340A24l24K77J9n6m1M2q8K0lJ07n3k2J84k00R4j43j4J29m7j51J93q8p0J60k35
$$ 124 -200 77 96 40 -1 41 -47 -27 -30 77 24 2 186 -14 80 -63 -77 52 5 -146 47 -41 -111 49 -186
1365a86K86q3l2K7j02P8j1q9K60j52j0J7p9J28r1k9J39o9M4M2j74R1n7jQ5j8q2
$$ -186 100 17 -15 12 -90 -12 -23 -112 148 -4 -14 3 -76 52 -39 -68 71 2 46 88 -86 5 -52 -53 32 14 -68
1392f8O4m4k0N3J8k6K1J1P1j29M4p2j6J51j82rJ52q4J09on2J14j11NQ2o7P6j97
$$ -68 -4 -48 -68 -15 3 -23 -2 9 80 -49 -5 -77 -93 58 -124 -133 19 -65 44 38 -14 100 -11 -6 76 9 85 -112
1420a12J29Nj10R4J3m1J0j7m7J35j40O5J38j41m8M1J26p0L4j85N7J2P3l5m5J7
$$ -112 17 22 -88 6 19 -22 -12 -29 -76 59 -81 -16 122 -19 -67 -26 100 30 64 -121 -64 -52 21 -14 -59 -42
1446d2K5O6q1k7k8K3%R1J7k2L9k8j08O3j5O2r8%PK3j5O3m6P6j13N1N6l4l4O2n3
$$ -42 -17 49 -32 -59 -87 -64 -64 27 44 22 61 33 -75 -12 -27 35 -63 -63 -56 -33 -48 15 -31 45 -68 -17 39 5 -29 33 -20
1477b0R4n3j1k9M2Q1k11L0O5q6K79l90J79O0j07J3L2KP9J27k95J04P4JJ0j88J59
$$ -20 74 21 10 -19 23 104 -107 -77 -12 -98 181 -209 -30 30 -77 -64 -32 -30 49 176 -119 -15 59 60 70 -118 41
1504D1j7l1P4k6r9J03m3o9P6p9J14j19j1K01j83kK15j42K1n8J48q9R3n8r2j14
$$ 41 24 -7 67 41 -58 45 2 -67 9 -70 44 -75 -86 115 -68 -70 145 3 24 -34 114 25 118 60 -32 -146
1530a46J72j20R0J3m6m3Q4q3J49m4o0Q8l3J01j16j38J33N0j7K5K3p3j18R3M6m7
$$ -146 26 -94 -4 9 -37 -80 4 -79 70 26 -34 54 21 122 6 -132 1 51 34 59 82 9 -109 -16 30 -17
1556a7M1M7j27J79p3l7n4Q3mj6L1q3Rm2J77j55J38q1n5J04p8K2N8j24M2J4J8N2
$$ -17 24 71 -56 123 50 13 -41 42 38 22 53 -30 -21 -63 114 -41 97 16 -39 65 -13 9 67 -57 -15 -1 17 69
1584F9j19J08j8j17N1M6j43J69o5L7M3j65J12M4p4P4j00J56j62R0m0J7o1kN6Q8
$$ 69 -50 58 40 -77 -26 20 -123 46 -19 18 61 -104 8 52 -22 52 -48 108 -54 36 -4 13 -48 -50 6 94
1610I4N7k03P3j32n7J09N5R4j07Q3l2r6J18n3j14J19k8r6J61p6k4J22p4k3P9J3
$$ 94 151 -52 21 -111 -168 -59 -4 90 -17 66 34 -62 56 3 -111 8 -20 -116 45 -31 -55 67 -7 -30 49 62
1636F2L1j04j%k1J03j32O8r5LK4R5OK7k7j02M6P0l2M3m1qR2j87P4Jj0K4j17J44
$$ 62 93 -11 -12 -12 -33 70 -62 6 -89 -86 -62 33 39 66 39 -63 -17 53 21 64 23 15 107 -80 -6 -5 -15 9 -108 36
1666C6M7k6Oj25k2J37p2M6p9j77L00j47J8J7O6L6r2j8J03j4o1J84k31J05R4j83
$$ 36 83 57 63 -62 -84 53 -19 27 -52 -229 71 -76 -58 -41 25 61 -31 -49 54 40 -21 163 -68 37 131 -52
1692e2K11j60n4Q1p8J34l3k9M8Jm7j13P1Q7j49L3N9%qP6n5o4k7K2Q7r6Nn6J42
$$ -52 159 -1 -55 26 -52 82 49 20 68 69 22 -91 -20 67 -82 -49 10 10 2 78 23 -41 -68 -46 41 -55 -50 -106 36
1721C6j18qm6J87N4j67J29p9J2nN1jn0n5L2P4j78P4o7J52j28J17L6p5l1nJ10j21
$$ 36 -82 -90 -136 51 105 -62 67 -12 0 -5 46 45 -5 -60 -28 46 -132 -58 -125 27 -101 16 52 -23 -54 -59 51 -70
1749g0qL0R3m6N3q8J1rK6o%K7j6m2O8k9J6P9o2j74J36mq5O3N3m3mJ03n8o7J17
$$ -70 -78 -48 45 -1 52 -36 -25 -34 -8 -14 -14 13 -3 -45 23 -6 10 89 27 -147 -11 -15 -100 -37 16 -27 -31 72 14 -53 64
1780F4q3l5N5J6p1J12l3o6K0Q1m5q0Kk1O5L2R5o9J7o2j07J42q7J06o9n0J18m7
$$ 64 -19 -54 1 17 -54 58 25 -41 -21 60 15 -65 -63 -84 -19 13 108 39 56 -6 -113 29 -58 48 -21 -71 47 0
1808@jL2Oj2N0j44J43OJ8p9O4j51N4J22j18K5m6K4N3j1r8M3M4KN2L7r2j3m7Q3
$$ 0 -1 31 37 25 75 -69 74 80 98 19 83 -68 -14 108 -10 15 -31 -7 46 35 -63 -20 24 26 78 115 23 10 -37 46
1838D6o0K3N3q6J10r9K8j9J8j33J69j00K2P1j04m5J59r6K3q3J61J6m3k7O7j24
$$ 46 -14 9 62 -24 86 -13 15 -4 14 -119 50 -50 -28 43 -61 -106 53 -43 -20 -103 58 74 31 4 71 -53
1864e3N4rK7O0r3N8q2L9r0J40L3j4M1k06K27j78N0K7j15R2j14N3K3PJ26j10n9
$$ -53 1 -8 19 79 -14 44 -38 1 -89 51 84 70 111 -95 132 -46 4 31 -84 8 -106 -53 -30 -23 103 -7 -66
1891f6L2nO8p9K2J40oq7j9k9J42j21r0Q6J07p4R2j73K5pp8J93O3k25Q9k8J5j05
$$ -66 -34 -39 29 -50 -28 112 106 19 0 -29 113 -8 -98 -12 95 21 113 -60 -35 -42 -120 73 136 -89 0 -28 -13 -118
1919a18qJ83L5j38l7J73q2o0J4L4l4p4R4J9K7N4L3j32p3O7n3P4J5K2k2n2j15J32
$$ -118 -126 57 92 -46 -83 90 8 -52 -38 -4 -38 -112 -18 1 28 82 115 -17 -90 -23 -76 -2 13 35 13 -39 -154 -22
1947b2NK0K5N0k4j0k7%m8k4J02q4j4P1JMm6n2N4m5k7R7Q0p2o7J33l7j73O6K8L4
$$ -22 -17 3 28 78 54 44 17 17 -31 -55 47 -37 -51 20 21 25 -21 -73 -19 -64 -91 6 86 14 -53 80 43 -130 -64 -36 -2
1978b%pQN6j54M6rR3p6O0P1m4n2Q9j34P8Qj28L8R7M1j60J72p1j9O3j4j5q4J07
$$ -2 -2 -9 -1 55 -99 -53 -62 31 -45 15 86 42 -10 79 -55 23 31 -97 -59 38 79 -81 91 20 1 64 50 35 -49 58
2008E8k3k9M4q6l5J26o1m3J19m1o3K9J9K3J8o6k8R6j11P4k9L2m7J3M1j19Q2Rn5
$$ 58 35 6 50 -36 -71 55 -6 -49 70 29 -34 -5 14 37 55 -11 -39 57 -54 20 -9 23 -24 -11 30 -89 -7 2 -53
2037e3O1j15P7oLL3j1M7j1j2m4l4k1L7J40j28m2MJ52n3o0lK6N7r6oL8K4jP3j13
$$ -53 8 -107 -30 -36 -33 0 -11 36 25 13 -31 -65 -86 -49 91 -37 -79 -75 77 24 -36 -39 -13 44 -52 -58 -20 4 3 76 -37
2068c7K3o4kJ00m9J6O9mk2o1j4N1m2N2l6M1q8M1m7P8n5O4m2j6Q0m3r0Q4jRL1J4
$$ -37 -14 -78 -80 20 -29 -13 56 52 30 -31 -45 6 -36 16 -20 21 -67 -26 -73 5 -50 14 -28 -44 36 -7 -97 -13 -14 -5 26 40
2100D0M0j73O4M1J1LJ6N9j68J6J01j1o5k5J24Kk3o9L7Q9k9j29J17o5M0L1L4r9
$$ 40 80 -93 -29 12 23 26 42 101 -67 -51 50 39 -26 -51 73 75 52 -17 20 109 80 -49 68 3 43 74 108 9
2128IO0n4J4%j13J18L1K4j12m4K7J09K3l0o3k1N8j02J13p0j26L5Q6%K1m2R2p9
$$ 9 69 15 29 29 -84 34 65 89 -23 -67 -40 69 92 62 -1 -22 36 -66 47 -23 -149 -114 -28 -28 -7 -49 43 -36
2156c6J6J8M3r0P2P6q7O7k7n9k2J41j39P2MJ7L6j40KL0J76k1r8j08rJ63j09N8
$$ -36 -20 -2 41 -49 23 99 12 79 52 -7 -29 112 -27 45 49 66 102 -38 -36 -6 170 149 51 -57 -66 97 -12 46
2184D6k3N8r7n2L4j7O4o7jJ04mq3O1J1p7J4n2mJ33l5O2pj44Q5r6L1mp0J16k0Q7
$$ 46 23 81 -16 -68 -34 -51 13 -54 -55 49 45 -38 23 34 -43 -29 -81 -85 48 13 75 68 -76 9 -87 -56 -60 -130 -14 -34 53
2215E3l1k5j2k3jM9N5j34J05j20JJ43j01j9P4m8O0J17k29K18j74J45o0m7j9J06
$$ 53 22 -3 -15 -38 -39 10 65 -69 36 -84 -83 60 -41 -60 14 -34 26 143 -86 132 -42 103 43 -4 -23 83
2241H3r6p5J43n4k4N7K2k1J9n9lO6j4m4n5P0J8k5o4K9j8Q5o3Q0J2k3n9R9j17P5
$$ 83 -13 -88 55 1 -23 34 56 35 54 -5 -8 58 44 0 -55 15 33 8 -56 -27 -45 40 -23 57 69 46 -13 86 -31 44
2271D4l2p2J32l6n0n6k1L6J13n0JN2J5j60J28j06Q0r9Pk0M1J14j17J07m5j3K7
$$ 44 12 -60 72 36 -14 -70 -91 -55 58 8 9 61 76 -84 44 -62 18 -81 -74 -94 -53 61 -56 51 6 -7 20
2298B0j08l2N8LJ15Ol6l6N9l3O1j5l3o2o4J11m1J6Rm3J16J0j90R9l7J17q5q4J23
$$ 20 -88 -120 -62 -59 56 62 26 -10 49 16 77 62 29 -33 -97 14 -27 -11 -2 -45 71 81 -109 -10 -47 70 -15 -99 24
2327B4r8O4O9r5J16l1p3J17j5j67J85l0n4J5m2J46r3p6M4oO1k3L1p4J00q4M6j08
$$ 24 -74 -10 59 -36 80 49 -24 93 78 -89 96 66 12 27 -15 131 38 -38 6 0 61 38 69 -5 95 11 57 -51
2355e1J34j58j2R1r6J31Kmj16R5l9k0jp4J18M4m5m6OJ0J21%q8R2r3j6N4r4LJ22
$$ -51 83 -75 -87 4 -92 39 41 37 -79 16 -23 -43 -44 -118 0 44 -1 -47 -41 -31 90 90 2 94 1 -15 39 -55 -52 70
2385G0j03j5K8K9p0J47j08k7O8J4K8p1r3K0J36o6J0p3M0J6jnK8M7m9N7r6J04j01
$$ 70 -33 -48 -20 9 -61 86 -22 -49 19 33 61 -10 -103 -83 53 -13 -3 -76 -36 -20 -21 -26 2 49 0 57 -39 65 -36
2414c6K4N9j21O3n8n9R3M2Q3q6o3J14q6J3P0l0k3L9r3P9q7R2j4K1J9q3J26o3j3
$$ -36 -12 47 -74 -11 -69 -128 -35 7 90 4 -59 55 -31 -18 52 22 -1 38 -55 24 -63 29 15 36 55 -28 98 35 22
2443B2nrk5KJ7m4K5O1qj08J03Onr9j1K0L0N6MK5o2rQ7p3L5O4j10J4o9oRN1jQr5
$$ 22 17 8 -17 -15 2 -42 -17 44 36 -72 31 37 32 -67 -78 -58 -28 28 32 57 -5 -14 73 0 35 99 -11 3 -66 -72 -63 -12 -13 -5 -100
2478a00J36K6q2rj6J33o1n6P7J29j44j7l4R9m1J7p9Rj0m1K7J36j92O2pR4J04j73
$$ -100 36 62 -20 -29 -45 88 27 -29 48 177 33 16 -18 81 40 57 -22 -13 -23 -64 -37 99 -93 -31 -38 56 160 -13
2506a3on2J99j46n1J83r9K0K2ql8l7J13k5o2Jj6M5k1M0j82J52l0M4o1M2Oj34R2
$$ -13 -19 -71 128 -18 -69 114 15 35 57 49 11 -26 87 62 0 1 -15 30 9 49 -133 19 -11 33 -28 14 20 -114 -22
2535b2L6K2N1n6K7j35M1N4j43N7J44r3k6R5j35Q8L8k5n0K1qj17N4N0k7k3P3l0
$$ -22 14 36 87 31 58 -77 -36 18 -125 -68 76 -17 -43 52 -83 5 43 18 -32 -11 -19 -136 -82 -32 -59 -82 -9 -39
2563c9l0J23j14Q0K0L2m0QL0n8q7N2O2q5QP1m0L4m2J19j07k3N4O3j17N3M1k4J8
$$ -39 -69 54 -60 20 40 72 32 40 70 12 -75 -23 39 -46 -38 33 -7 27 -15 104 -3 -26 28 91 -26 27 68 44 62
2592F2j7n7PJ4o0P6J49j13m6m6m1O4R7r0J01j26K4k3J7j5KN8o5K8J4o5J36j6n5
$$ 62 45 -12 -5 9 -51 25 174 61 15 -31 -72 -8 89 -1 100 -26 -2 -25 -8 -23 -21 37 -28 0 14 -51 85 69 14
2621A4m7R6n6l5j6j1Q1N9q2q8R0L7L9p7Q4j17P8k9nm7NM1j00P2K1l0L3N1K9r0
$$ 14 -33 63 7 -28 -44 -55 26 85 3 -85 5 42 81 4 88 -29 49 20 15 -32 -27 14 -86 -14 7 -23 10 61 90 0
2651@P6j40J18j06O0K9L5p0m5P1l3m4nO6K1j13M5Q5n3N5l1k6k9m2P8o8J27o2K4
$$ 0 76 -64 54 -52 8 37 72 2 -43 28 -5 -49 -54 12 33 -80 -35 50 -3 52 21 -5 -34 -76 2 -66 61 -1 23
2680B3Q7j13P3l3m4n8N1N3q4J4N9j1L5j02J44r0m4K9qL1kk4K1n5M4J8l0J05l1
$$ 23 110 -3 70 37 -7 -65 -14 39 -45 -31 28 17 52 -50 94 4 -40 -11 -19 12 10 -14 7 -48 -4 14 -16 89 58
2709E8k9q8N8j8j0O8q2J38j66J06M3l7j07L5K2Q9p4M3J4k7m8R7J1j72P0rP8j10
$$ 58 29 -59 -1 -19 -29 39 -43 95 -71 35 78 41 -66 -31 -9 80 6 49 63 36 -12 85 96 -76 -6 -15 63 -47
2737d7P8o0M2M2K7j80J90k51J21O4Ml2M2N2K3l6l2k20J42O3q1J76r3l4o8J02r9
$$ -47 31 -29 13 55 82 -98 92 -159 -38 26 30 -2 40 92 115 79 47 -173 -31 32 -49 127 34 0 -68 34 -65
2764f5K7l1P5m2M7m4M4R7j97J21k7j3LJ9J8N5j00O5M7p3j17J53r3R0L5j55o4J90
$$ -65 -38 -69 6 -36 11 -33 11 108 -89 32 5 -8 -5 14 32 87 -13 52 99 26 -91 62 -31 59 94 -61 -125 65
2792F5p5J4o2N7j1N3p8o8J32Lr5O1K7j0j5Q7l5k3p8l4J50n0l7n9Q7KRj2q0R7j
$$ 65 -10 4 -58 -1 -12 41 -37 -105 27 30 -65 -4 23 13 -2 85 50 27 -51 -85 65 15 -22 -81 6 8 17 5 -75 22 21
2823B1J0n9K4l4n4J45j09Q7p9M8j1N6r0Q2p1K9L1p9k3J03K5K4k1k9o5jl3J06K8
$$ 21 31 -28 -4 -38 -92 53 -56 31 -48 0 -11 45 -45 37 -34 -5 26 -53 -76 27 52 76 55 26 -39 -40 -73 33 61
2852F1l3j5o9qL2Q5j55L9J6M3k6M7r4M4L8K8J5lM4j93J42j07K3O6l0J5r7P2l1
$$ 61 28 13 -56 -64 -32 53 -102 -63 -47 -4 -30 17 -77 -33 5 33 48 45 89 -104 38 -69 -46 20 -10 5 -92 -20 -51
2881e1O3l3l1P6k6J6l1k9O7KJ11j41j08J19L9o0L8q3N4m5j2J38m3l2L0l7nl2J0
$$ -51 12 -21 -52 24 -2 14 -17 -46 21 23 134 -7 -115 4 43 -17 21 -62 -8 -53 -65 73 30 -2 28 -9 -14 -46 -36
2910c6L4l7M6K8o4J67j16q5R6J6n7p1J70p1j16Q2Nk7J35M3n2j38J5N5j5j3n1P3
$$ -36 -2 -39 7 35 -29 138 22 -63 33 49 -8 -79 91 20 -96 -14 -9 -36 99 142 90 -48 -33 22 7 -6 -57 16
2938A6M4o9jj17J95j15J1n2P3Q3m2M8j23J3NN4L6m2m9M0j8o4J65K4l5j01J18q6
$$ 16 60 -9 -10 -127 68 -47 -36 -88 -15 68 26 74 -49 -36 -31 23 59 17 -32 8 -10 -74 91 115 80 -21 97 11
2966A1l7R5k4Nj4l6l2J4J5K1L4q3l3J03l6P4j48R6M2j73P1K3J01o6L7j3j8pj15
$$ 11 -26 69 45 50 36 0 -32 -18 -3 18 52 -31 -64 39 3 77 -71 25 67 -106 -35 -12 89 23 60 47 29 22 -93
2995i3J34j41J54k5o1j5O9p6J49k4n1k0k5l8j7P4P8j03J09j89J37m7N5Mn4J37
$$ -93 41 -100 54 29 -32 -47 22 -54 95 71 20 0 -25 -63 -80 -6 72 -31 78 -111 26 -21 34 38 -16 121
3021A21j17L8N8j75J21p6nR6j11R0o8m9M4p5J82p4m0L7J20j55Q5ro1n4Q3j2o8
$$ 121 4 42 100 -75 46 -30 -35 61 -50 40 -28 -77 -33 -108 74 0 -40 -3 117 -38 47 38 -23 -77 6 -6 -74
3048g4R1l5j7OQ0m8M4j00J56j78J00n4J07k5Lj3k9o8m6J44q5m2O0O2jO6j06K1
$$ -74 17 -18 -35 -29 51 3 47 -53 103 -75 25 -29 78 53 56 43 14 -54 -100 44 -41 -83 -23 39 38 104 -2 19
3076A9o9Q5q0P8n6OJPj1N1j49J36J4o4lJ17j35l0N9O2l0Q7L3p1q1K7j6p3L27k95
$$ 19 -50 35 -45 33 -23 -17 -16 -9 -20 31 -118 18 32 -32 -35 82 -53 -83 -24 38 8 95 128 57 -24 3 -13 -86 241 -54
3106e4K1jkmj1P7j12J38p0k4O4k4O7j21r5J41N6j42K23j26m1J72l1j31N7m9k3
$$ -54 -33 -34 -36 -40 -51 26 -86 52 -18 -42 22 -2 65 -56 -151 -10 46 -96 127 1 -40 132 101 -30 27 -22 -45
3133d5Q4n6O5km7k5K8m8N4M3p7k7J26m0p4L9l6L4J7m9R4q4J65j05k9J3Lq9J68
$$ -45 39 -17 48 46 -1 -26 2 -46 8 51 -26 -53 73 33 -41 -2 -38 -4 13 -36 58 -26 139 34 5 18 21 -68 100
3162A00j23j1m5J38K1j93K15q6j18R9jJ3p3J39q0M5j6J1n2j0J44l3p7n6J73l5
$$ 100 -23 -34 -79 59 80 -113 102 16 -102 -3 -4 9 -64 75 -5 40 24 35 -17 -27 117 84 7 -49 124 89
3188H9j62N6J2K2r0M2JJj1o7O6J6j02J49P8j2j47R4j29J32r0R5j22J6N8J34j12
$$ 89 -73 -17 -5 17 -73 -31 -30 -29 -40 -107 -41 -25 -127 22 100 88 -59 35 -94 38 -52 43 -79 -63 -5 129 17
3215A7Qm2J6l7j00K73n4j73P8J24k34M0k2K04j92Q7J06j94R7j01N6J37r0L1l3
$$ 17 25 -17 -1 -38 -138 135 81 -92 -14 110 -124 -84 -106 98 -94 -7 99 -95 2 -99 -43 94 4 35 2
3240Bj24Q6mL1J3K4o5P7J4o1RO0j16J22q5Q5o6k1J09m1l9o0J32m5p5M6M3j3j4
$$ 2 -122 -36 -40 -9 4 28 -37 40 54 -7 2 62 -54 68 -17 68 2 -19 90 49 10 -50 82 37 -38 8 51 38 24
3269B4q1O3J32r7o0R9j62o4J86j3L6j56P8J19j29m9J76j67Q4r2L1O9NK8r5M0q0
$$ 24 -57 6 138 41 -19 80 -82 -146 40 27 63 -93 -15 104 -25 -74 102 -65 19 -73 -42 27 32 60 -35 5 -75
3296g5J9N3J05j76J62j34J9M8N2j47N0O5j68R7M6J66j51k6J11j05q1l2R7J11j15
$$ -75 -56 -3 102 -74 88 -46 -27 21 73 -74 -24 41 -127 -30 16 182 31 5 116 11 -70 -102 -5 106 -9
3321ij7n3M4Q4J1n0m4J75p2r3k5J46j93J34r5J08N1j66N5q9J13j26J41nl3K5J9
$$ -9 -26 -79 -35 49 60 10 -34 141 69 -24 -49 97 -96 38 -57 51 102 -64 -9 -98 15 -111 30 25 -8 17 36
3348C6k5n9L8J9j2L1j1j4k5P9m2K0j1J1j4k7n7J08Jo0J45j73J13j58J81o5J9p2
$$ 36 11 -48 -10 9 -3 28 17 3 -22 57 15 35 24 35 21 -6 -63 45 46 -14 131 -42 71 -87 94 29 48 -24
3376b4K5J4Nn8mj2J03rm4j76J48K0p7J81j27pO8N4Rj91J12Jq0j5Q0p1QL6O1M6
$$ -24 1 15 20 -38 -42 -54 49 40 -4 -180 -32 -12 -89 92 -35 -42 26 80 89 -102 10 11 -69 -84 -4 -75 -67 -31 30 76
3406G6j2p4k3O5J33j06m5j01J22l8p7P9K2N7m6M0r4ml5j7O1J5q2R8l5j9l9J02
$$ 76 64 -10 -33 32 165 59 14 -87 35 -3 -80 -1 21 78 32 72 -22 -26 -61 -78 -17 -2 -84 14 -21 -40 -79 23
3434B3N6m6j31Q3R2j9p2P1m9m3JP2O6j48n2J11m5m8NR9N0l4j54J08P9p0%j33J92
$$ 23 79 33 -98 -15 77 58 -14 57 8 -35 -34 38 104 -44 -96 15 -30 -78 -73 26 76 42 -112 -4 75 5 5 -128 64
3463F4jj17l3O6n1J23k3M6l2r4Q2l7j57J06J29k5l5J8lO9m4Q3k21L3J04l6K5n8
$$ 64 63 -54 -87 -21 -72 51 28 74 42 -52 30 -7 -164 -58 71 46 11 29 26 95 51 134 -87 -54 50 14 39 -19
3491a9M0Mo3P7n8PJ73j11n3l5oK4J9M5oo9M4j0L7r4J21j58P7n6Q2n5K2J33j09
$$ -19 21 25 -38 39 -19 -12 161 50 -3 -38 -44 -20 -1 44 38 -31 13 3 40 -54 67 -91 -14 -70 12 -43 -21 112 3
3520CK0q1P3P3Oo8m3K5n2O6Q5k05J05N7l4OP1n9m1K3m4p4J26J0K2pl6l2L2m2O9
$$ 3 23 -58 15 88 94 26 -17 8 -44 22 107 -98 7 64 30 36 107 48 7 30 -14 -88 38 48 70 63 27 -5 27 -15 54
3551E4L6n9n0O1j32M5M7o2%J55p7o0R5l3n9o3R4k3RO4K2oqm9k4Q2r4m1O3M8j13
$$ 54 90 31 -19 42 -90 -45 2 -60 -60 95 18 -42 53 20 -39 -102 -8 -31 -22 42 64 58 50 1 -23 59 -35 -76 -13 35 -78
3582g8J35p6k7J35q3j42J82J5j7j24J30l4k2J61k44J19l3j25J40m1M4J7n3k8Q5
$$ -78 57 -19 -46 89 6 -136 46 61 44 -80 50 16 -6 155 -89 30 -3 -128 12 -29 15 32 -21 -49 36
3607C6nj3p5R2j09K6J04P3j81M4m3M7Mk2J40p6O8o3K4j13lJ9NQ8m1N0j0m1p2L7
$$ 36 31 18 -57 35 -74 -48 56 129 -52 -8 -51 -4 0 -22 118 42 110 47 71 -42 -45 -26 -21 67 26 76 66 25 -47 -10
3637a0n6J20m3P5j28J73j72R9k8K3q9k4P1l1J18l0j59N2J09r4NO6m2J7K5rj07
$$ -10 -66 54 11 86 -42 131 -41 58 30 53 -36 -60 11 -20 98 68 -91 -39 70 -24 -19 47 5 22 47 38 -69
3664f9L5onQ9k0m0J36j37Q4q0j3O1Lk8j02Q5K6lp4J60K2j32j6P3j0p2O1M2q7j3
$$ -69 -34 -40 -45 44 24 -16 120 -17 67 -13 -26 35 38 10 -92 -7 19 16 -58 102 124 -8 -24 49 39 -33 28 70 -17 -30
3694c0J11j70J8m2R1P5m9N2o9J9q3Q8Mo9J32j06NL1M3Lj11J19O3m8Qj10J02n4
$$ -30 81 -89 -71 -113 -22 53 4 56 -13 6 -77 11 15 -54 78 -28 -23 8 51 54 -57 62 125 77 85 -25 77 23
3722B3n7J54o8n0L1q6oN6J11%j32p9J81j25Q0J5j61Q5j0O2l4k0P8j1j90J73jp4
$$ 23 -34 120 52 2 33 -53 -59 -3 108 108 -24 -103 78 -47 33 48 -113 -28 -38 24 -10 -30 48 37 -153 20 19 -55
3750e5J60q0k2m3J07p1L3j56Q9k8J43j26J1R5j34R0R2k12J63r7Q5j31J53k7j38
$$ -55 105 25 3 -40 67 -4 29 -127 -38 -66 77 -49 -38 57 -77 13 105 -107 56 -41 44 -87 66 39 -99
3775i9J11r9J40j5j35J36k3L3K2m5j10K9R4l3L8k8O0q2r9P7j9M0K5M1O7j10J1
$$ -99 12 -87 53 38 -97 39 16 49 71 26 -84 -55 39 6 44 16 76 -6 -105 -28 -47 -7 18 59 126 16 27
3802B7k2L5p4P7o8k3n2J09j1j7O6j75J99o8k8J27o6q1J77j15l0l2J45n6j08J21
$$ 27 5 40 -34 43 -25 -48 -100 9 -2 -19 47 -128 71 3 -25 102 36 -45 132 17 -13 -45 100 44 -64 57
3828E7J4l9Q8j80P3J2k6O6l1j16P7q5J69q3l3L6j01R1P8q2n4l5R3J01j04O4j55
$$ 57 71 32 120 -60 13 25 -1 65 34 -82 -5 -90 79 -4 -37 -1 -102 -11 67 -15 -69 -104 -11 90 -14 50 -105
3855a05J29jm1j9R3o2j3n7R7Qo4J23p2m1ML9M0%l3l4L6p1LP8%j27J1J67r7K28
$$ -105 24 23 -18 -37 56 -6 -19 -76 21 29 -35 88 16 -25 -21 18 58 58 25 -9 27 -44 -41 37 37 -90 -79 88 -9 219
3885B19j42j17P6n2J09q2l1N9m4Pl5J00j57J18k7P0j7L4j72P7K5J8jK1j25P3L3
$$ 219 77 -40 36 -16 93 11 -20 39 -5 2 -33 67 -90 28 1 71 54 88 -84 -7 18 36 35 56 -69 4 37
3912C7m8N5m2m3r6J51Pq7J79j36Lm1M1N9r9J03n3K5j01J63o4j15J07l4k1jm3l6
$$ 37 -11 44 2 -41 -137 14 21 -66 113 -23 -20 -61 -20 39 -60 43 -10 15 -86 77 13 -102 5 -29 -50 -51 -94 -130
3940a30J18L8m2j22J21p3L4J28p3LRm4kM4r8J5Q3j6P0j36J38j63L9O8m9J4j4J72
$$ -130 -12 26 -16 -138 -17 -90 -56 72 -1 2 11 -33 -35 9 -89 -74 9 -7 63 -73 65 -98 -59 9 -40 -26 -40 132
3968A32q3j17J37n7m8K6r3J35J4k5K4l5O3q8L8m5n8J74q1M2jq1N0q2R3p0J5L9
$$ 132 49 -68 69 12 -36 -10 -103 32 46 21 45 10 73 -15 23 -22 -80 94 13 55 54 -27 23 -59 34 -36 -21 18
3996A8R8j26%m8P5q3rP7j4j2j07R8k5rM9%j7R3r2R2n3N1q8M6J5K9p8NJ49k09k4
$$ 18 116 -10 -10 -58 17 -66 -75 2 -12 -24 -131 -33 -58 -67 -18 -18 -35 58 -34 58 5 56 -32 14 29 58 -20 -15 134 -75 -99
4027i9J05%M3q7O8PO2n3L9p3L5o2L2o5K4J2O3ll9j10R2ro4R9k2j7m6kN7Q8p3m3
$$ -99 6 6 49 -38 30 37 99 46 85 12 47 -15 17 -48 -24 -12 51 48 9 -101 -9 -18 -82 17 -5 -22 -68 -70 -13 75 2 -41
4059d1J5M0L2k7k8O8m0l6l5J66j11l2k8J35j57J9jKJ34r9p8N4R2L0n1NK0j37J90
$$ -41 -26 14 46 19 -9 59 19 -17 -52 114 3 -29 -57 78 -79 -60 -61 -59 75 -24 -102 -48 44 74 23 28 48 -89 101
4088A01q5KJK8k1j8mQQM9p1Mrj5N8K6p3Q9n7N9r3L0m8NR8j00Q8p2M9r0K18j69
$$ 101 16 18 19 47 26 8 4 12 20 69 -2 2 -7 -22 36 62 -11 78 21 80 -13 17 -31 -26 72 -28 60 -12 37 -53 165 -4
4120dj2%l6L2jN4P6r3l7R5j04n7Q6m1L7l6P4k2jro1N0Q0r9RR0q0M2l9JM7o7P9
$$ -4 -16 -16 -52 -20 -21 33 109 16 -21 74 -30 -87 -1 -42 -5 -41 33 11 10 1 -60 -10 70 -29 -20 70 -10 32 -7 -6 41 -26 53
4153E3L2l6j23J54m5J4n6k2J18p5l4Q4j24M9L9o6QN7p2mj9K6R6p2J0k0r3J00j2
$$ 53 85 49 -74 80 35 49 -7 -29 89 14 -20 64 -60 -11 28 -38 -30 27 -45 -49 -68 -42 54 -18 -8 -28 -121 -21 -33
4182c3j5J8j4J19m2J8j43J40l8j6j0m9N6J16q8rQ5q4J3Rm9K1o4K0P7k7j00Q1J01
$$ -33 -48 -30 -44 75 33 51 -92 48 10 -6 -16 -65 -9 107 19 10 95 11 24 33 -16 5 -59 -39 38 11 -89 -8 93
4211I3j53M6J32j59J6R5Q7r2m5q6J78j47J16j74Q3l8kJ01p9N5K7lm9M6j6l0j70
$$ 93 -60 -14 118 -41 -25 70 157 65 20 -66 112 -35 81 -93 -10 -48 -50 51 -28 27 54 51 2 48 32 2 -168
4238a68K09o9n1M4J3j7K5k2N9j5L2j1J2o1r3N4J61l3j05N8o5J44r4n1M4N5j31
$$ -168 41 -28 -79 -35 -22 -39 -14 -36 23 8 40 29 41 -20 -113 -59 102 69 -36 22 -43 101 7 -44 0 55 -76
4265g6N7N4q5J14j61J17J16j69K2%k5L1p1R5L1ko5p0J95o9m3k3P4K3o2p6J05k3
$$ -76 -19 35 -50 64 -97 20 136 -33 -11 -11 -36 -5 -76 19 50 48 -17 -87 108 39 -4 -27 47 70 8 -68 37 14
4293A4J4n6J24J7j19M1m8j4MO0o3O1n3QM1o7l7M0M4L8N5j09l6qJ50j78J10l9J04
$$ 14 28 -28 96 113 -6 35 -13 -27 -23 37 -26 35 -18 -10 31 -36 -73 -33 11 49 104 -5 -41 -49 101 -77 33 -6 98
4322I8M3k33P5J0l6Mr4J18R9j39J24j41J59kk4q6M5p1N9o8J34o3k1j4j7JJ0l0
$$ 98 141 -92 -17 -7 -43 -39 -133 -15 84 -55 69 -72 87 85 61 -25 20 -51 8 -60 74 11 -10 -24 -41 -40 -30 -60
4350f0J9Q8m2j8R3j44O6o5J01j5j4l0%J07j89J04J20m6j51K9O6p3J02j40J92j03
$$ -60 -41 47 5 -13 80 -64 2 -63 38 23 9 -21 -21 86 -103 1 121 75 -76 -47 19 -54 48 -92 100 -3
4376cjo3L6L9l8N4n1P8n8L9j39Q3l2J27r7j5J30m6m1q0m7K07j06l5L2K5N1Rj27
$$ -3 -4 -67 -31 8 -30 24 -27 51 -7 32 -107 -24 -56 71 -26 -41 89 43 2 -78 -125 82 -24 -59 -27 -2 49 58 -69
4405f9P6M4j06R2J13j33QM9j07M2Jl2P9j1J06j94Pn0O4N7J2j17JP7K2m4r4K18
$$ -69 7 51 -55 37 150 17 25 74 -33 9 10 -22 57 46 152 -42 -35 -85 -21 36 48 -69 -68 9 31 -13 -107 111
4433A11j48L3n0R8p7K4J9j9J82k34O8j09J27l2L0%k2j8J21j34mJ04j05j0J07q6
$$ 111 -37 -4 -54 44 -33 -9 10 -9 173 -61 7 -102 25 -7 23 23 1 -17 104 -30 -34 70 -35 -45 62 -24
4459b4K5p5L9Q3j71J00O1o6J1O1p8L1qJ29j29L8o7m6N9j6J0j7O6L9J1m5j8N1p1
$$ -24 1 -74 -35 48 -123 -23 38 -28 -17 44 -34 -3 -11 118 -11 27 -40 -86 -27 -43 -33 -50 16 55 66 21 3 54 -17
4488a7Pm0R6l1k0J07j34J58j44l8J47Pj22J0K3P3j31Q1J0o2p0J11J33k25J64j37
$$ -17 -10 -50 46 15 -5 102 -32 126 -18 -56 91 98 -24 -14 9 82 -49 32 42 -20 -90 21 154 -71 93 -44
4514d4K5JJ22n4j09J2KJ1m5OM9P4j9l5r7J61j22J12r4N0o1L0N4p1K5m1L7Q4n8
$$ -44 -19 -18 104 50 -59 -47 -45 -34 -79 -73 -24 50 31 -4 -101 60 -62 50 -44 6 -55 -25 29 -42 -17 -58 -21 63 5
4543EJ0p4Q0n7mJ20j03N4J9n0R2j19m5O4P7L0o3O2Oj70J07j96K46q1l7J0J10o3
$$ 5 15 -59 21 -36 -40 80 -23 31 50 0 92 -27 -72 -8 69 99 36 98 104 -66 41 -155 91 10 -27 -17 93 30
4571C0oK0r0k0J55j44j0K6pJ01j1j46R7M1J2J3%j10Q5j14J86j27l9l9N5P4K9N7
$$ 30 24 44 -46 -66 89 -55 -65 -39 -46 55 44 -102 -5 36 48 61 61 -49 36 -78 108 -19 -58 -97 -42 32 61 118
4599A18q2n1R0r7j8K7R1j02j7R0r5Q3L0p0N9Q6j89J0Lk7k8P3k9L7K4j75K35JL1
$$ 118 36 -15 75 -22 -40 -13 78 -24 -41 49 -46 37 67 -3 56 142 -47 -37 -34 -61 -89 -16 -45 -8 16 -159 76 77 108
4628A08j22M0K7j54J26m1N9o9O8o5l5J02J6m1n0N7L3j20L5p6J99n8j56J42O0j04
$$ 108 -14 26 53 -101 25 -16 43 -26 42 -23 -58 44 60 19 -31 26 59 -61 -26 -102 97 39 -117 25 85 -19
4654a9MK6L5l0Q7l9m4R3n5o2q5J87j33Q7j28J27k0q7K1l1J12k7j73R5O3RM3Kj7
$$ -19 -15 11 46 16 103 64 20 113 58 -4 -89 98 -35 52 -76 51 31 -56 -35 -66 46 19 -154 -59 4 13 56 58 41
4683D1p2JR2kj44Q1m0O3qKJ2m1%j9rO5l9J0J7o7J18l9J7mM9j01OM7l7r1O3J5j8
$$ 41 -31 -30 62 60 -84 -3 -43 20 12 14 26 -15 -15 -34 -43 22 -17 -7 10 -57 61 22 39 35 84 -17 -11 36 -1 -92 -29 -14 -32
4716c2M2N4j66P5k5j6J29j24OL8Q3q6N3k6m9J07j64J7P0L1J2o4QO1l0l4r2J80
$$ -32 10 64 -102 -27 -52 -68 61 -63 -57 -19 64 -22 31 5 -44 63 -101 -84 -14 17 29 -35 -27 34 4 -30 -122 58
4744E8K4p8M5j30M3R6oj08q1J26K1J42j81Q5o8M0O4j16j6j72J93q8J25m8m3J44
$$ 58 82 4 49 -81 -38 58 52 -56 -137 -11 10 152 -29 56 -12 28 92 -24 -40 -212 -19 -107 18 -30 -73 71
4770G1J3j25J52n1j00Q4J8J1o6j5l7M8M7m2P9n1P5j09p9J79q5j2J7q7j2P5m6O2
$$ 71 84 -41 111 60 -40 44 62 73 7 -8 -45 3 50 8 87 36 111 2 -77 102 17 5 22 -65 -77 -2 -48 14
4798A4k9L2l3Q0p2n9J41j90N3k8J65k5Rk3j8n9nJ34j92R1l0K3Rl5M8N6j58R1j6
$$ 14 -15 17 -16 64 -8 -67 74 -116 -63 -91 74 49 58 35 17 -42 -47 87 -105 -14 -44 -21 -12 -47 1 57 -101 -10 -26
4827b6M8mqj0j4L9J1l3k1J2p7P7L8p2L6l7Q8o6Q5Ll1j22J03j35J28j19R3L5l1
$$ -26 22 18 10 0 -14 25 36 3 -18 -6 -83 -6 32 -40 -4 -41 47 -19 66 69 38 -84 19 -116 12 -107 -14 21 -10
4856a0O4o6J9j4J3J8K3m1O2l3J00j03n1J52j68J44k04j1R7L4O1n7L6k4l9j47J81
$$ -10 54 -12 7 -7 6 24 47 6 68 35 135 32 -19 133 -35 109 -95 -106 -9 25 86 29 65 41 2 -145 36
4883C6J5Lj24J00j0NpJ9q0P1j06J18Qm0L0n6Nm3N5n8J5J07o7m3OQ9k5nn4R7p0
$$ 36 51 54 -70 30 20 25 18 37 -43 28 -78 40 48 8 38 -18 -13 -56 -1 -59 -44 63 -4 -47 -41 48 23 18 -36 61 -9
4914iM9k01K85r2Ojp0l0Q1j51M8J38L5j92J06np2J30j30P8j3J2onn1J07p8N9L
$$ -9 40 -161 124 32 38 37 -33 -63 18 -133 -85 53 88 -104 2 -3 -75 55 -75 3 -10 2 -4 -9 -60 47 -31 28 31
4943C1p1l6M3j17Q6nl5J92p8n1k6P3j14J71r0Oo9J16q3R3l6L8O4j54R3r2J13r5
$$ 31 -40 -76 -33 -150 -64 -69 -104 88 10 -41 -67 6 -108 63 -27 -21 -90 26 -57 36 0 38 102 -52 41 -51 62 -33
4971c3P9j12P4K5P7j44J20k40J37R5j10M8q8P7Pj3N4j44J25J01j01N2j08K5j38
$$ -33 46 -66 8 33 110 -34 86 -154 -17 78 -32 16 -72 5 12 -1 53 -91 34 135 34 86 -22 3 -135
4996a35K26j12Q9j49oJ65p1Q9k22R8k0M4pl4K6m9R3O6j00K7J8m2l8R5j00J16K5
$$ -135 91 -21 68 -81 -87 78 7 96 -126 -28 -48 -4 -11 -45 -19 -68 25 91 -9 18 36 -6 -44 51 -49 67 92
5023I2j07j00P1J11n6P3j15KJ51k06J66r3k12J44J44q5K5J9J14j37o2N6m0N3j72
$$ 92 -15 -115 -44 67 11 84 -31 -29 122 -84 82 -11 -223 -79 65 -20 5 24 138 1 -61 -5 -45 8 -164
5048a64J72n9rN7J4j5kj8O7J1p7J6J4LR%m5k5P8m5K7JJjjO9n3j28Q1J53j52J3
$$ -164 8 -51 -60 -3 11 -4 -6 -24 43 54 -23 -7 7 10 19 19 -26 -51 27 -18 9 10 11 10 9 78 25 -103 -22 131 -21 -8
5080hnl2LL8OJ5Ql7L2K9Rm1k1n1l0R4j31J97q5j7lnN4o1M3K8k1q7J24m3Jl9M5
$$ -8 -13 -45 -42 -4 2 17 25 -12 20 49 58 17 -4 -55 -85 9 -122 75 -10 -27 -30 -35 19 -42 1 29 8 -79 45 2 3 -36 9
5113Iql1R6j83J47j7K2N2Oj00O3k1ok3n1M5J08j47O2L2K6j00O3n2k7N1q2J63j16
$$ 9 1 -30 66 -117 30 13 35 87 93 -7 56 35 29 6 -45 0 108 -39 23 55 81 -19 44 -8 -35 16 -66 97 -19
5142a9P4o8o1P9J21l9m4q1M0j1l6K5r5J16q9J21l5Kn8J47p0m9K5L9k1k0kJ9L1
$$ -19 55 -13 -74 5 126 87 43 -38 2 -9 -45 -20 -115 1 -88 33 -2 0 -58 89 19 -30 -5 34 13 -7 -9 10 41
5171D1q9j6L7l5J5kO1J23j74R1j24N7J11j70J63K0j12OJ1j0Q2M8j38N9l0J7k5
$$ 41 -48 -64 -27 -62 -47 -49 12 135 -39 52 -72 -15 96 -74 89 109 -3 3 14 4 86 134 -4 55 25 42 17
5198A7l9K29k21J4k5m4L5N2m5J16j15M8qO5n6o1L6q1J18j53J58m3l0j6M9O3k5
$$ 17 -22 207 -14 0 -25 -69 -34 18 -27 89 -26 22 14 79 23 -38 -2 -83 35 -118 40 -3 -33 -49 0 63 38
5225C8j1N7p7j0J9j9J34j00k8Mn4P8Nl6ML7M8o0n9q4J61j5J3j59J06j9J09r9k9
$$ 38 27 84 7 -3 16 -3 131 31 3 7 -47 31 36 0 4 41 89 29 -30 -114 47 32 45 -114 -8 -27 82 -17 -46
5254d6OK5J36j93J2O2N6n0m6P7l6o1J5J25Jo7R8j32M5K1o9P5m8P7k02J31j6Q5
$$ -46 -40 -15 121 -72 -60 2 58 8 -38 39 3 -58 -43 82 83 16 114 -18 27 48 -21 54 6 83 -119 12 -4 81
5282H1j17J50j40l5N6kn7J70j61O5j3j5M0o1J10q2m1KkL3P8q6k3l2J38j26J12
$$ 81 -36 114 -26 -61 -5 -7 -64 106 -55 10 -3 -18 22 -39 71 -11 -52 -50 -52 -19 59 -27 -50 -82 56 -70 42
5309D2r8K04q2rr6L6M7j21J06M4p1l6k2L9J4J0K8l1O1q9p8M8M6M8n1j5O1p1K7
$$ 42 -56 148 66 57 -39 -3 44 -77 29 73 2 -34 -56 -17 -3 7 35 4 65 -24 -102 -54 -8 40 -11 -26 35 -36 -9
5338iLJ4r8J61k21Q0j1RM1j5P9k9N1j57O5j5J28o8p9M9Q9j2Q3j57J17p0Qpr2R7
$$ -9 -6 8 -90 71 -150 -70 -81 -72 -31 -46 33 4 55 -102 -37 -52 76 8 -71 -22 67 55 138 -19 98 28 36 29 -63 34
5368C4n5N7K8o8N4jK0q1M8j04R3J7J2l4l8j1O4l2m9Q9l2M0n7R3q4o8PKR8k6ML9
$$ 34 -21 36 64 -4 50 49 69 -12 36 -68 25 42 54 20 -18 -29 35 3 -46 43 11 51 -6 87 3 -65 -58 -56 42 16 20 59
5400E9p3R7q1rp9P8J00j30J6q7J53Jq4N5j26J58R9k14O0m4k4P5M5K0j29N7J0R
$$ 59 -14 83 2 -7 -86 -8 92 -38 -22 -109 44 45 -39 16 -110 48 147 -67 -7 -51 -75 0 45 65 -64 -7 3 12
5428A2q1R2K7%q0k3J34j22N3N2k17J43JP0j18R4j1J1J9J9j42J26j26M1J2N6r4
$$ 12 -69 23 50 50 -30 -53 81 -41 12 64 -153 -10 -9 61 -57 37 26 37 56 75 -67 59 -67 -26 -14 42 -52
5455e2K14j34o2K8j1N9n5M0o1O4n7Kl6N4k9r5Q0J11q5K8o2O2O9n8k7J07q4m%K7
$$ -52 162 28 -34 -6 -17 42 -13 27 -34 30 -27 -25 -61 -7 -36 -131 -51 60 -25 3 -59 3 72 14 -13 94 10 6 6 33
5485C3p5K7P9m3k4J51j44r7O2O2l5J12j00k1o6J4J49m6K0j43J54j0j61P6P5o7
$$ 33 -42 -15 64 21 -3 148 4 -93 -31 31 -4 108 8 -13 -79 -65 84 38 58 -85 69 59 -102 -26 49 -18
5511a8K0m3K3J0n2O4n1N6L7q8l3J21m1R2j60O0O8j97J45JL1j21O6j2J0P1j19Q6
$$ -18 2 -41 -18 -8 -60 4 -47 9 46 -42 -75 46 5 97 -63 -3 65 -132 13 14 45 -76 -10 -22 -12 59 -60 26
5539B6j47J01J00p1R2j43O7oO4r4P4p2K1k3J08k0j40M4j4J1%Rj2M7K4j03J4P3
$$ 26 -121 -20 80 9 101 -42 25 19 83 -11 63 -9 12 -11 97 77 -63 -19 -33 -22 -22 -13 -25 22 46 -57 -43 30
5567C0m9j4L6qJ37j07j15P5m7J17o0j11J24N7j14k2k5J30K0jj31J19J2j31Q0%
$$ 30 -19 -33 3 -5 132 25 -90 -15 -62 55 -5 -116 8 65 -49 -71 -96 34 54 53 -78 41 53 -78 2 2
5593Bk0j3R2oj6q7R6k5q1O4N6j35L8K2m2R1l8j16K01j81N7N9j0j6M9m3k9J1J4
$$ 2 -18 -31 61 55 39 -48 48 23 -58 6 62 -73 -35 -13 -55 36 -2 -118 83 -98 -41 18 8 -8 41 -2 -31 -20 -6
5622fm9j7P8j3N4p5N8m0l6P5N8m8j00M2k9J7R6m2l9L3N1j21k9O9K4m2K0L0k8o8
$$ -6 -55 -72 6 -7 47 -28 30 -10 -46 29 87 39 -61 -19 -48 -31 65 23 -16 17 68 -53 -82 -13 11 -31 -11 19 -9 -77
5652g7M3J60j10n2N4rR0o5o1J01p2M5k0p9m8P9P6q0O6rr8J37q9p5Q2N9q3K5o5
$$ -77 -34 126 16 -36 18 9 99 34 -27 74 2 47 27 -52 -100 -21 55 -25 41 32 -66 71 -18 -93 -11 48 -35 -10 -75
5681g5J22M8j21M7K6j3p6K8m9N0J04j25rJ34j45J81q9m5L2j31J41j46J03J03j55
$$ -75 47 95 -26 21 47 34 -42 -14 -63 -13 91 -34 -43 91 -54 127 38 -7 25 -106 35 -111 -8 95 -60
5706f0R3%Nm5J3N2j36R7M3j46O9j1J5Mor5J37p9k7Q8N7j02J29q1K0j8o4J17o8
$$ -60 33 33 38 -7 6 58 -78 19 62 -84 -15 -26 -11 -7 -13 -108 29 -50 -77 11 68 -34 95 14 34 16 -48 69 1
5735AK4jM7k9j77J60O7j57qL8J01m4N4j52L5J02m5n2n1J8J33Oj32PJ48j20o2J24
$$ 1 25 24 71 42 -135 25 92 -65 -73 -35 66 22 76 -76 -41 61 16 -36 -87 -69 64 70 -62 -55 93 -27 -89 35
5763C5j0k1m4Q7p4L7K7k7N5j74nJ28K0o3p1J42m6j2M0J2o2N3Mk7ln2m9M4K4kJ
$$ 35 25 4 -40 47 -27 10 37 10 65 -109 -114 14 34 -29 -100 42 -4 -16 24 36 -26 27 31 4 1 -51 -100 -56 -32 -34 -33
5794c3Q8r1P8%J2j6l5R2j68J4J03n5k0M7M6jq7k7N6Q2r3j9K1q3J4K8P8L4l4j2
$$ -33 55 -36 42 42 54 38 3 95 -73 -59 44 -11 -31 16 62 61 -26 -53 3 85 -8 -27 -6 -89 -75 -47 31 65 31 19
5824A9m0k5k5J48j90J26j73K14l1M9j59J26j42J10K0O2J3k04J53n9lP5n6q9k5
$$ 19 -21 -46 -71 77 -113 13 -160 54 23 72 -87 39 -103 7 27 89 102 -102 51 -8 -11 64 8 -81 -106
5849a06M8K5L8q9M3N6n8M6n0J17p0P4n7K5m8P3M7j50l1P4K8P5k8j14J5P4Q8j33
$$ -106 -58 -33 5 -84 -41 15 -43 3 -47 70 0 74 17 42 -6 67 114 -36 -67 7 35 110 82 -32 -17 57 145 12
5877A2M1n0m7J21j2n4K7k5k0O3n5j2K0j46J06L6j9Q7k06J39J47k45J50n6qkJ6
$$ 12 53 3 -44 77 65 11 38 13 -7 56 1 -11 9 -137 -31 5 -14 73 -133 6 153 -92 58 2 -6 -8 8
5904HR8k3l3k0M7k6l3j18R5p8KJ52ok3j8J01j07l9J07o2N7j15J7J41j72J0J09
$$ 8 106 83 50 30 77 51 18 -100 -5 -83 -81 71 65 42 24 125 18 -21 86 24 81 -34 -17 124 -48 -38 71
5931G1q5K0q8J11K7j22L9J07o5k7O5m6JPo1R6j13P8L0NMJ3Qr4%l3P4jm8M9l5J7
$$ 71 -14 6 -82 29 56 -66 -27 80 15 -12 53 7 8 15 -46 50 -63 15 45 50 54 67 75 -19 -19 -52 22 21 -27 22 -13 4
5963Dj5N1M0n7L3j8J05q9j15P0j8K5M2q8O7o4j5q9J29qp4N1P7o1L8K2l2m5l3N3
$$ 4 -11 40 80 23 56 38 143 54 -61 9 -9 16 58 -30 37 -27 -42 -131 -2 -10 -84 -33 44 -17 21 43 11 -34 -67 -14
5993a4rj8K0q0J60o2qk2J31L3j55K2M0j4M2q8k6Q5j54J01N6j10J09n7O7j35J29
$$ -14 -23 -41 -21 -101 59 -3 -11 -33 98 131 -24 -2 38 24 66 -22 -48 37 -117 -16 40 -70 39 -18 49 -86 43
6020D3m9L4L3k4qk6N2j33J66p6L6o7O8q2M8L9N3q0J23q7j0m5n6N7o5J20p0Rr5
$$ 43 -6 28 61 37 29 3 55 -78 88 12 48 -19 49 -33 15 54 107 27 150 63 53 8 -48 9 -56 64 -6 3 -92
6049i2%J8J21np4J4J9m7k3m9J04k4N7Q0j08p6J66q2L6l3J4K8j6j04Q4m1L8K6N8
$$ -92 -92 -74 47 42 -32 -18 1 -46 -69 -118 -14 -38 19 99 -9 -85 81 -1 35 2 16 44 28 -76 8 -33 5 31 89
6078H9m1nK0j00m1O7N9n7n3P2N7j58M9O5j1L8J1k03J27j20J83N7l7l7j12M4%l3
$$ 89 48 43 63 -37 -78 -11 48 -9 -62 10 67 -91 -42 23 12 50 61 -142 -15 -135 48 105 68 31 -81 -37 -37 -70
6106g0J29q2Q7J5p6kj8O6j60J75j0q0J02j23K5J2Lk3N4o5j0j8ll1P9R3q8N3J1
$$ -70 59 -23 64 79 3 1 -17 49 -111 64 54 -26 76 -47 -22 -10 -7 -30 24 -41 -51 -69 -72 -103 -24 69 -19 34 45
6135D5q2P1K7j2kj5O2q9M1j20m4J44K3m0j04P1R1K0r8L9k9j06P7Q7o6l5k4k0N7
$$ 45 -37 34 61 49 47 32 94 5 46 -74 -118 26 49 9 -95 -24 67 87 -11 28 -1 -107 -30 57 -9 -44 -68 -88 -31
6164c1R9j0j49R0l7N5j8k6l1Q7m5J9n8R9lo6k4pQ0m9k9J70j12j4K3J3NpM1n6k2
$$ -31 68 58 -91 -1 -38 17 -1 -27 -58 29 -16 3 -55 44 41 -25 -49 -56 24 -25 -54 116 4 -10 13 26 31 24 65 9 -13
6195a3p0J32n4qML0j4n8Ok8R5m1K6k8q8J00J3K7k2o5L3P4m8L6l2m1l0M8Q6l5o0
$$ -13 -83 49 -5 -13 -9 21 7 -51 -45 -73 22 -19 7 -21 -109 -9 4 31 9 -56 -23 51 3 39 7 -34 -64 -16 70 35 -25
6226b5N2r0J82j62J05m2o2M5L6r6L6N1n4Pm5n3Q6K0L0M1M0l9o3Nr0O0m0K9M7l4
$$ -25 27 -63 119 -43 62 20 -42 3 39 -57 -21 30 -24 -17 -62 -115 -29 -9 21 62 102 63 0 5 -85 -25 -65 -36 11 -23
6256b3j9M8o6J83r0q7J74k14Q8m2J34l3j5r8L7J38r3l0n2K5j3M6J0O4j26J7J51
$$ -23 -42 6 -60 123 33 -54 120 -94 -6 -48 86 53 38 -60 -23 115 22 -8 -60 -35 -48 -2 8 72 -54 -37 114
6283A14n9K5j02K2l1J07j13R7l9j0j8mj1M1j29J35p9Q7M7j5n9r0L8O8j03J16j55
$$ 114 55 80 -22 0 -31 76 -37 60 21 11 -7 -11 -22 19 -110 25 -54 33 80 65 6 -84 -46 22 -81 35 -120
6310a20J34Nl3P9j6o6R5m6K8n5L1k5n7J24o8Kj08N4R4M2j79J13Oq0J48j45L3J
$$ -120 14 19 -14 65 49 -17 78 32 60 5 36 11 -46 78 10 12 -96 -42 52 94 -85 28 34 -46 102 -43 -10 -9
6338iL0m6l2M7J9K1j99J1K35j24MJ31m3l5K2m4R7n0O9j15r7J90p2j1%K0JJ2R9
$$ -9 21 -25 -57 -10 9 30 -169 -158 77 -47 -43 88 45 10 32 -12 85 35 104 -11 -108 82 10 -1 -1 19 20 32 131
6367A31k15N8rK5N2j11J10q3M1o2R6r6N6ml8K2K9O0l9j7j2kK9K2l9l4P1k6m0j7
$$ 131 -84 -26 -35 -10 42 -69 41 -42 -1 -63 33 -63 -7 -11 -49 -27 2 62 23 6 -6 -8 21 43 4 -30 41 15 -25 -42
6397d2J0J0L6j3J3j18KQ7M3j8N6o6r2J97j9k18J69J9j41N1N2R3j55Q2j31J85o4
$$ -42 -32 -22 14 1 14 -104 -102 -15 28 10 66 0 -92 105 86 -132 37 56 -85 -34 18 111 -44 38 -93 92 28
$$ [...]
8191a03
##END NTUPLES=NMR FID
##END=
