##TITLE=1H_5-2021
 CDCl3, 8 sc, 
 1.02.2021
##JCAMPDX= 6.0         $$ Bruker NMR JCAMP-DX V2.0
##DATA TYPE= NMR FID
##DATA CLASS= NTUPLES
##ORIGIN= UXNMR, Bruker Analytische Messtechnik GmbH
##OWNER= root
$$ XWIN-NMR		Version 3.5
$$ Mon Feb  1 10:43:23 2021 Russian Standard Time (UT+4h)  she@DPX200
##.OBSERVE FREQUENCY= 200.1315066352
##.OBSERVE NUCLEUS= ^1H
##.DELAY= (6, 6)
##.ACQUISITION MODE= SIMULTANEOUS
##.ACQUISITION SCHEME= undefined
##.AVERAGES= 8
##.DIGITISER RES= 18
##SPECTROMETER/DATA SYSTEM= spect
##.PULSE SEQUENCE= zg30
##.SOLVENT NAME= CDCl3
##.SHIFT REFERENCE= (INTERNAL, CDCl3, 0, 15.7039)
##AUDIT TRAIL= $$ (NUMBER, WHEN, WHO, WHERE, WHAT)
$$ ##TITLE= Audit trail, XWIN-NMR		Version 3.5
$$ ##JCAMPDX= 5.01
$$ ##ORIGIN= Bruker BioSpin GmbH
$$ ##OWNER= she
$$ F:/spectra/data/she/nmr/H-F/1/audita.txt
$$ ##AUDIT TRAIL=  $$ (NUMBER, WHEN, WHO, WHERE, WHAT)
(   1,<2021-02-01 10:42:07.93 +0400>,<she>,<DPX200>,
      <created by zg, POWCHK disabled, PULCHK disabled
       configuration hash MD5:
       00 E9 B6 7A A2 85 ED C7 34 08 36 98 17 FE 4E 26
       data hash MD5: 16K
       61 AF A5 C5 98 38 0F 00 83 60 F4 A9 9F AD 22 DA>)
$$ ##END=
$$ 
$$ hash MD5
$$ 01 1D AB 90 67 F0 E6 A3 5F E5 6A 3E 35 15 BC 72
##$RELAX= 
##$RELAX= 
##$RELAX= 
##$RELAX= 
##$RELAX= 
##$RELAX= 
$$ Bruker specific parameters
$$ --------------------------
##$DU= <F:/spectra>
##$EXPNO= 1
##$NAME= <H-F>
##$PROCNO= 1
##$TYPE= <nmr>
##$USER= <she>
##$AMP= (0..31)
100 100 100 100 100 100 100 100 100 100 100 100 100 100 100 100 100 100 
100 100 100 100 100 100 100 100 100 100 100 100 100 100 
##$AQSEQ= 0
##$AQ_mod= 1
##$AUNM= <au_zg>
##$AUTOPOS= <>
##$BF1= 200.13
##$BF2= 200.13
##$BF3= 200.13
##$BF4= 200.13
##$BF5= 200.13
##$BF6= 200.13
##$BF7= 200.13
##$BF8= 200.13
##$BYTORDA= 1
##$CFDGTYP= 0
##$CFRGTYP= 5
##$CHEMSTR= <none>
##$CNST= (0..31)
1 1 145 1 1 1 1 1 1 1 1 1 1 1 1 1 1 1 1 1 1 1 1 1 1 1 1 1 1 1 1 1 
##$CPDPRG= <>
##$CPDPRG1= <>
##$CPDPRG2= <>
##$CPDPRG3= <>
##$CPDPRG4= <mlev>
##$CPDPRG5= <mlev>
##$CPDPRG6= <mlev>
##$CPDPRG7= <mlev>
##$CPDPRG8= <mlev>
##$CPDPRGB= <>
##$CPDPRGT= <>
##$D= (0..31)
0 1.2 0 0 0 0 0 0 0 0.06 0 0.03 0 0 0 0 0.0002 0 0 0 0 0 0 0 0 0 0 0 0 
0 0 0 
##$DATE= 1612161727
##$DBL= (0..7)
120 120 120 120 120 120 120 120 
##$DBP= (0..7)
150 150 150 150 150 150 150 150 
##$DBP07= 0
##$DBPNAM0= <>
##$DBPNAM1= <>
##$DBPNAM2= <>
##$DBPNAM3= <>
##$DBPNAM4= <>
##$DBPNAM5= <>
##$DBPNAM6= <>
##$DBPNAM7= <>
##$DBPOAL= (0..7)
0.5 0.5 0.5 0.5 0.5 0.5 0.5 0.5 
##$DBPOFFS= (0..7)
0 0 0 0 0 0 0 0 
##$DE= 6
##$DECBNUC= <off>
##$DECIM= 32
##$DECNUC= <off>
##$DECSTAT= 4
##$DIGMOD= 1
##$DIGTYP= 9
##$DL= (0..7)
0 120 120 120 120 120 120 120 
##$DP= (0..7)
150 150 150 150 150 150 150 150 
##$DP07= 0
##$DPNAME0= <>
##$DPNAME1= <>
##$DPNAME2= <>
##$DPNAME3= <>
##$DPNAME4= <>
##$DPNAME5= <>
##$DPNAME6= <>
##$DPNAME7= <>
##$DPOAL= (0..7)
0.5 0.5 0.5 0.5 0.5 0.5 0.5 0.5 
##$DPOFFS= (0..7)
0 0 0 0 0 0 0 0 
##$DQDMODE= 0
##$DR= 18
##$DS= 0
##$DSLIST= <SSSSSSSSSSSSSSS>
$$ [...]
##$SUBNAM2= <"">
##$SUBNAM3= <"">
##$SUBNAM4= <"">
##$SUBNAM5= <"">
##$SUBNAM6= <"">
##$SUBNAM7= <"">
##$SUBNAM8= <"">
##$SUBNAM9= <"">
##$SW= 16.9725356469052
##$SWIBOX= (0..15)
0 0 2 0 0 0 0 0 0 0 0 0 0 0 0 0 
##$SW_h= 3396.73913043478
##$TD= 16384
##$TD0= 1
##$TE= 0
##$TE2= 300
##$TE3= 300
##$TEG= 300
##$TL= (0..7)
0 120 120 120 120 120 120 120 
##$TP= (0..7)
150 150 150 150 150 150 150 150 
##$TP07= 0
##$TPNAME0= <>
##$TPNAME1= <>
##$TPNAME2= <>
##$TPNAME3= <>
##$TPNAME4= <>
##$TPNAME5= <>
##$TPNAME6= <>
##$TPNAME7= <>
##$TPOAL= (0..7)
0.5 0.5 0.5 0.5 0.5 0.5 0.5 0.5 
##$TPOFFS= (0..7)
0 0 0 0 0 0 0 0 
##$TUNHIN= 0
##$TUNHOUT= 0
##$TUNXOUT= 0
##$USERA1= <user>
##$USERA2= <user>
##$USERA3= <user>
##$USERA4= <user>
##$USERA5= <user>
##$V9= 5
##$VALIST= <valist>
##$VCLIST= <CCCCCCCCCCCCCCC>
##$VD= 0
##$VDLIST= <DDDDDDDDDDDDDDD>
##$VPLIST= <PPPPPPPPPPPPPPP>
##$VTLIST= <TTTTTTTTTTTTTTT>
##$WBST= 1024
##$WBSW= 4
##$XGAIN= (0..3)
0 0 0 0 
##$XL= 0
##$YL= 0
##$YMAX_a= 352981
##$YMIN_a= -292192
##$ZGOPTNS= <>
##$ZL1= 120
##$ZL2= 120
##$ZL3= 120
##$ZL4= 120
##$ABSF1= 10
##$ABSF2= 0
##$ABSG= 5
##$ABSL= 3
##$ALPHA= 0
##$AQORDER= 0
##$ASSFAC= 0
##$ASSFACI= 0
##$ASSFACX= 0
##$ASSWID= 0
##$AUNMP= <proc_1d>
##$AZFE= 0.1
##$AZFW= 0.1
##$BCFW= 1
##$BC_mod= 2
##$BYTORDP= 1
##$COROFFS= 0
##$CY= 11.3945322036743
##$DATMOD= 1
##$DC= 2
##$DFILT= <>
##$DTYPP= 0
##$F1P= 15.9154993809931
##$F2P= -4.1035820241983
##$FCOR= 0.5
##$FTSIZE= 0
##$FT_mod= 4
##$GAMMA= 1
##$GB= 0.15
##$INTBC= 1
##$INTSCL= 1
##$ISEN= 128
##$LB= 0.24
##$LEV0= 0
##$LPBIN= 0
##$MAXI= 10000
##$MC2= 0
##$MEAN= 0
##$ME_mod= 0
##$MI= 1.114404
##$NCOEF= 0
##$NC_proc= 0
##$NLEV= 6
##$NOISF1= 3.799351
##$NOISF2= 2.8
##$NSP= 1
##$NTH_PI= 0
##$NZP= 0
##$OFFSET= 15.70392
##$PC= 1
##$PHC0= -10759.2
##$PHC1= 12.20095
##$PH_mod= 1
##$PKNL= yes
##$PPARMOD= 0
##$PSCAL= 0
##$PSIGN= 0
##$REVERSE= no
##$SF= 200.130013532006
##$SI= 16384
##$SIGF1= 3
##$SIGF2= 2
##$SINO= 400
##$SIOLD= 16384
##$SREGLST= <1H.CDCl3>
##$SSB= 0
##$STSI= 0
##$STSR= 0
##$SW_p= 3612.71676300578
##$SYMM= 0
##$S_DEV= 0
##$TDeff= 0
##$TDoff= 0
##$TI= <>
##$TILT= no
##$TM1= 0
##$TM2= 0
##$TOPLEV= 0
##$USERP1= <user>
##$USERP2= <user>
##$USERP3= <user>
##$USERP4= <user>
##$USERP5= <user>
##$WDW= 1
##$XDIM= 8192
##$YMAX_p= 0
##$YMIN_p= 0
$$ End of Bruker specific parameters
$$ ---------------------------------
##NTUPLES= NMR FID
##VAR_NAME=  TIME,          FID/REAL,        FID/IMAG
##SYMBOL=    X,             R,               I
##VAR_TYPE=  INDEPENDENT,   DEPENDENT,       DEPENDENT
##VAR_FORM=  AFFN,          ASDF,            ASDF
##VAR_DIM=   8192,          8192,            8192
##UNITS=     SECONDS,       ARBITRARY UNITS, ARBITRARY UNITS
##FACTOR=    0.0002944,     1,               1
##FIRST=     0,             0,               0
##LAST=      2.4114304,     0,               0
##MIN=       0,             -292192,         0
##MAX=       2.4114304,     352981,          0
$$ Real data points
##PAGE= N=1
##DATA TABLE= (X++(R..R)), XYDATA
0 0 0 0 0 0 0 0 0 0 0 0 -8 8 -8 16 -16 19 -24 32 -32 40 -51 64 -72 87 -97 115 -133 155 -177 203 -232 262
32 262 -298 338 -378 426 -479 534 -595 662 -735 816 -905 1002 -1105 1218 -1345 1481 -1631
49 -1631 1796 -1976 2178 -2402 2651 -2930 3248 -3610 4029 -4518 5101 -5805 6676 -7783 9244
64 9244 -11262 14227 -18998 27857 -49596 205167 218346 -148644 352981 43243 -44119 267862
76 267862 -77053 32773 349559 -153355 48254 83464 -292192 168469 -13652 -234103
86 -234103 151494 -123171 -150443 124724 -268491 -109217 188466 -192268 131266 67470
96 67470 -223423 207369 35755 -76898 259225 11471 55023 330312 -105677 64493
106 64493 215216 -96500 270215 126451 -116175 206885 9462 -81093 192226 -113659
116 -113659 -15851 238811 -161188 45366 42461 -201865 158983 34349 -130235 150872
126 150872 -39682 -71957 185275 -162660 -13583 175314 -116531 128672 38318 -168831
136 -168831 127739 21526 -97627 154954 -70177 -33018 190794 -150701 12559 85295
146 85295 -107891 151153 59738 -118929 125659 13126 -53665 180275 -85064 15308
156 15308 186958 -85350 73846 52432 -107822 134033 66392 -92784 125309 -35740
166 -35740 -43966 158862 -122713 1093 104383 -82464 81034 30640 -133993 91533 29376
177 29376 -82482 122600 -84000 -26999 130365 -109179 1308 37900 -96102 71570
187 71570 30074 -138731 62055 -30184 -70889 102287 -113629 -28507 82864 -76035 18780
198 18780 24970 -100036 80644 53324 -77004 96790 -32500 -5122 127903 -57249 10668
209 10668 78765 -34129 62786 50613 -98900 76638 22728 -52491 80950 -79682 -25978
220 -25978 73306 -67302 -22299 17393 -88977 40141 22467 -114785 45720 -34460 -33198
231 -33198 70893 -71890 -26598 59893 -35299 14527 33867 -83862 66791 33611 -51987
242 -51987 57846 -39271 -2482 73636 -35171 -20862 42206 -39342 37934 29667 -85857 48567
254 48567 1186 -21510 44016 -50333 -20446 55583 -23081 -14069 23811 -62408 48358 22857
266 22857 -60347 29336 -21449 -3187 44466 -34669 -32689 41892 -22378 14105 17274 -67447
278 -67447 43375 13437 -20123 19628 -26530 -6765 49188 -13394 -24851 27304 -30796 38408
290 38408 14130 -48367 20598 997 2684 16323 -24460 -27183 38151 -10605 -8125 2673 -43443
303 -43443 32235 6762 -22367 -5996 -8722 1977 26129 -11154 -27769 26482 -3978 26512
315 26512 3672 -23232 22720 21001 16205 2038 97 -601 40243 6475 -8035 3993 -7476
328 -7476 29435 -684 -14075 -17940 2754 4503 -6805 -19698 -32510 6097 -7192 -6367 -30584
341 -30584 -20102 -835 -536 -1072 -33759 -3267 367 11574 -2929 -16332 -5807 12955 18838
354 18838 -15002 2548 -15608 17584 17315 -20408 -5841 -7502 6970 7504 -7167 -33379 11166
367 11166 2289 -4779 7580 -37576 11967 17890 -4431 -528 -4211 -6153 32871 12482 -25250
380 -25250 24205 -9528 21618 25250 -31783 4284 13739 -4141 8912 -9435 -41654 28666
392 28666 -8111 -26507 6116 -49608 4137 12461 -39319 -17148 -6005 -29532 21840 -11760
404 -11760 -51503 28658 -19006 1551 19677 -43087 8450 32043 -14580 12789 9308 -28891
416 -28891 59992 7375 -18745 42357 -16243 29182 45038 -25631 11044 38984 -14323 41468
428 41468 4090 -43400 55913 -10604 -11668 22096 -49261 -669 28432 -51605 -13087 -2532
440 -2532 -58732 36443 -25334 -59533 28794 -33597 -3259 30880 -45825 4152 51343 -25969
452 -25969 40330 20666 -29977 86453 14938 -955 58268 -8971 28440 67254 -30375 15895
464 15895 44122 -35277 54798 -7326 -51805 47938 -18191 -14869 30823 -48951 -3644 51788
476 51788 -51170 19503 19099 -40477 77526 3244 -25375 58455 -5903 15800 70644 -36606
488 -36606 17699 61444 -42485 46877 -2907 -54834 60163 -15372 -37946 28636 -55486 -18830
500 -18830 47395 -75069 3334 22493 -56091 59635 -8751 -46394 64727 5876 7582 81858
512 81858 -27509 29111 89870 -30573 63725 39308 -20512 93394 16348 -29333 56839
523 56839 -21307 -3438 70638 -65498 5606 33213 -68481 33281 -19868 -65542 52491
534 52491 -10021 -39331 45498 -59551 -7726 66298 -60679 34144 30680 -41798 65043 -211
546 -211 -48751 64471 -3044 -3875 76393 -61420 8696 52616 -56910 42895 12823 -44188
558 -44188 68640 -115 -50820 53075 -38065 3535 79728 -57988 23526 33686 -50664
569 -50664 46208 2198 -50749 69710 184 -31056 52431 -71476 -4792 54404 -58070
580 -58070 26106 12831 -57958 41364 -12419 -67756 55888 -22048 -7244 64471 -72792 2053
592 2053 36343 -49798 39733 17428 -49171 64348 -5026 -52424 52227 -48794 7263 67593
604 67593 -56153 10670 19026 -58167 37990 5182 -56279 70032 -9509 -24910 50269 -65850
616 -65850 6553 58814 -35919 31087 24149 -54539 50774 -1720 -53548 61772 -24683 -309
628 -309 51722 -67488 -10248 26131 -51505 27385 8759 -65957 48566 -21939 -51634 36987
640 36987 -51664 2698 54757 -48646 159 20030 -55815 45006 11805 -47987 65708
651 65708 -13593 -14209 44681 -51857 2773 55723 -33528 22878 18922 -60964 49406 -5742
663 -5742 -43386 49884 -26206 -1937 45092 -53261 -11046 34310 -43027 36571 12378 -54808
675 -54808 49862 -13258 -28851 37507 -33791 1350 54055 -40497 -312 21270 -51285 46993
687 46993 5327 -41982 45826 -15302 -13167 37529 -41144 -6045 50633 -35259 22856 11767
699 11767 -52343 47650 -2090 -29171 37211 -20310 -6513 45603 -44289 -7839 32191 -41291
711 -41291 37801 3097 -47625 37099 -9132 -21981 32058 -30450 -8053 49318 -39638 6458
723 6458 15240 -41353 44415 4154 -31688 32673 -7993 -10605 41147 -34243 -4731 42525 -32167
736 -32167 24702 4190 -39524 35639 2130 -24832 25370 -20226 -11998 41608 -40761 -3498
748 -3498 18581 -33525 29910 -1619 -36657 24033 -916 -16860 31437 -28567 -5513 41632
760 41632 -29145 14598 8424 -25209 35133 8904 -23717 24483 -4887 -6515 39329 -31431
772 -31431 -413 25031 -22671 19484 -1956 -30270 20647 3946 -22753 18591 -23575 -8279
784 -8279 31080 -30512 1024 5278 -18833 20632 2770 -26798 17040 2456 -9225 26762
796 26762 -25813 162 24406 -15215 8575 -537 -18213 18204 7439 -23103 12459 -12831
808 -12831 -4759 22420 -27461 -3506 6493 -10617 9232 -1014 -22822 13191 6253 -10104 16113
821 16113 -17854 4707 21773 -8443 4295 4647 -3235 17775 11216 -15954 14893 2387 3630
834 3630 18455 -16084 2335 11117 -39 2105 -1320 -14391 9823 5823 -15333 3392 -14776
847 -14776 1209 7037 -13371 -8946 -2635 -2174 1697 115 -18493 6598 3134 679 5430 -10331
861 -10331 6274 11369 7748 -373 4625 2987 14832 12011 -5235 7141 1990 12410 4683 -3773
875 -3773 -4120 1960 6627 -4985 -4741 -13027 1820 -412 -4530 -10329 -10314 3286 -2033 2348 -10729
890 -10729 -1304 7127 6639 4052 -1916 4805 8666 17506 -1065 4988 5111 6740 15735 -4160 -1840
905 -1840 1389 4976 223 -913 -14424 -3089 6643 -11230 179 -13766 -5291 8599 -3222
918 -3222 -6505 441 -110 6723 15577 -11358 8753 10768 4205 18612 -3308 97 14928 7696
932 7696 -683 7461 -12446 5209 12414 -18317 1524 -10400 -8829 8283 -11342 -18111 2058
945 2058 -7422 -3913 8510 -24848 5261 9227 -8250 11732 -6223 -4619 20078 4400 -6752
958 -6752 14856 -9175 10581 19058 -19857 9252 2954 -5479 14773 -7232 -16728 15818 -4782
971 -4782 -6785 12876 -25565 8853 13183 -17675 8457 -3308 -9451 21432 -1640 -16499 20070
984 20070 -11090 5679 18431 -26986 9994 9581 -11570 12358 -5367 -19454 23387 -5102
996 -5102 -13306 17708 -24169 9679 16468 -24116 7355 4320 -12532 21573 -3163 -22232 26354
1009 26354 -10746 -693 18686 -28448 10690 14759 -19681 8391 -2214 -22126 26942 -7631
1021 -7631 -20666 21677 -23219 5824 16956 -29016 7919 13039 -17028 19340 -2772 -24897
1033 -24897 34199 -8927 -5003 23166 -25250 11690 19637 -24762 8605 8012 -20799 29862 -7669
1046 -7669 -25372 26571 -19728 1225 18320 -28977 7760 18065 -24189 12405 -1595 -25197
1058 -25197 36915 -8543 -11892 23678 -22815 7985 22288 -26154 10316 17508 -23087 26798
1070 26798 -8507 -27515 33750 -13944 -2453 20926 -28854 4842 20371 -31262 11549 6530
1082 6530 -25614 36492 -12905 -22967 24348 -20348 3796 24751 -28278 7452 20051 -31315
1094 -31315 20292 -5268 -25087 39193 -11032 -11584 19366 -26664 2169 25698 -30383 12353
1106 12353 14330 -28076 29452 -13980 -25053 30877 -10521 -704 23626 -29764 2147 22846
1118 22846 -32474 19507 4223 -22232 35999 -13814 -21587 20653 -18151 3003 30072 -31128
1130 -31128 8259 15894 -32248 25093 -6971 -19635 36686 -7641 -11253 20479 -27568 3185
1142 3185 30317 -30313 18749 8761 -25680 28250 -13234 -22071 28338 -8149 -2745 25908 -35619
1155 -35619 2079 19300 -30836 22306 -106 -20280 29360 -11466 -23103 20955 -17852 3289
1167 3289 31629 -33065 9422 9795 -27122 23809 -4871 -18923 31427 -5691 -13834 21921 -30632
1180 -30632 4952 27732 -27652 17441 3165 -23169 23241 -8397 -22741 27880 -9810 -2560
1192 -2560 25829 -36550 5778 16387 -22673 21667 997 -19675 27087 -5819 -19639 26024
1204 26024 -18207 8051 29464 -28285 10726 8260 -19498 22721 409 -20129 29451 -6836
1216 -6836 -11669 21380 -29901 6883 21047 -22836 10827 711 -23684 20062 -4952 -23485
1228 -23485 25013 -15024 -985 19929 -31814 5405 12935 -17122 16836 1810 -21830 26048
1240 26048 -5218 -14172 23479 -19631 8985 21814 -22252 6270 7372 -16959 20755 103
1252 103 -21492 25049 -10953 -5427 16717 -25473 5825 16002 -17373 7351 1831 -21841 22060
1265 22060 -4117 -17289 20671 -15331 3139 15466 -22431 2345 12437 -14597 13635 317
1277 317 -21843 22739 -7100 -8458 15020 -17730 4731 15617 -17631 1928 6651 -17036 19471
1290 19471 -2821 -18064 18920 -9770 -141 12585 -17387 2449 15473 -13107 7858 2578
1302 2578 -17015 22661 -3532 -9098 13275 -10589 3519 13419 -15479 -766 10472 -14120
1314 -14120 12302 -4179 -18496 14803 -7665 -5919 5218 -15361 -2683 11068 -16465 -1464
1326 -1464 1482 -15865 15011 -5763 -12280 8864 -5020 612 9949 -11005 -36 15012 -8481
1339 -8481 10382 1144 -8796 17560 650 -2692 7464 -3616 2235 13752 -10317 507 7471
1352 7471 -8414 11740 -4228 -9631 7850 -789 -2529 4095 -9438 -1772 11544 -10039 2035
1365 2035 -1323 -6954 10930 -2368 -6695 2200 -696 -732 7697 -9809 -1867 7320 -5384 5672
1379 5672 -4546 -5384 6407 2656 -3329 1781 -2612 917 10889 -6299 1635 2235 358 8803 -291
1394 -291 -2471 3645 6078 1176 5521 -4669 1646 8434 -1317 2464 -3347 178 4474 2508 -4227
1409 -4227 -1881 683 -121 3774 -6769 -1570 -67 1771 571 -3860 -1727 -1109 4994 -1796 -481
1424 -481 -2813 2992 4594 -20 -346 -2360 6651 2448 2726 -856 -488 6272 3823 2218 -1663 3204
1440 3204 2394 7561 -313 -2327 4855 861 6549 -417 -3083 1587 4926 -69 265 -2254 -4125
1455 -4125 8671 -3654 -2166 -917 -4678 4189 496 -6625 -2674 1812 -4003 5084 -6966 -6112
1469 -6112 6825 -4151 1677 -1457 -6588 3062 5957 -5959 1815 -737 -3734 12513 -5519 -2591
1483 -2591 4994 -3039 5975 3428 -8083 3031 6977 -5611 8443 -5438 -4551 12433 -5225
1496 -5225 -230 2416 -6887 5010 7158 -11500 3492 1026 -6670 12432 -9346 -5448 8644
1509 8644 -5318 1349 3475 -12178 4008 7382 -11810 8063 -5958 -6359 13845 -8535 -4032
1522 -4032 6107 -7193 3735 7686 -15661 6029 4116 -9553 12925 -9128 -5847 13012 -6128
1535 -6128 -1704 7139 -11912 6123 9902 -15797 9156 -2001 -7019 15386 -8793 -6395 10832
1548 10832 -6866 1302 9021 -17586 8450 7454 -12611 12239 -7667 -6833 15591 -6830 -5089
1561 -5089 10609 -11198 5939 10639 -18984 10715 2346 -7821 15878 -8003 -7281 15414 -6473
1574 -6473 -907 12275 -16393 10694 9867 -15941 11785 -3624 -6324 17427 -6615 -7626 14419
1587 14419 -10563 3338 11515 -19610 12403 6410 -10197 13555 -6324 -8573 18300 -5258
1599 -5258 -3394 15603 -14471 9281 10740 -17525 12969 2800 -5707 17484 -6009 -9260 18172
1612 18172 -7843 1382 13906 -18160 12337 7895 -15117 10809 -3716 -9093 19607 -6555
1624 -6555 -9422 15165 -16243 5011 9913 -19615 11901 5433 -11498 12471 -6550 -13017 21226
1637 21226 -7374 -1799 15769 -17585 9820 9363 -16016 11646 5023 -7958 20044 -5545 -12036
1650 -12036 19770 -10542 5479 15289 -16280 11276 9135 -14284 11040 -160 -10312 24596
1662 24596 -6332 -7496 15152 -17068 6735 11333 -16939 9809 6651 -14494 12640 -7690
1674 -7690 -15505 21315 -10481 -1523 10993 -20728 4563 7428 -18379 8346 3025 -13726 19189
1687 19189 -10759 -13787 15720 -13313 5169 13493 -16593 7372 9605 -16313 12918 -221
1699 -221 -10382 25653 -7057 -5104 13093 -14487 7076 14487 -15215 9632 7217 -15895 16060
1712 16060 -8854 -12755 20633 -9207 -783 9395 -19908 2696 8477 -18532 10138 -181
1724 -181 -14838 17749 -12420 -12096 11823 -11951 3190 12631 -18382 4526 7984 -17437 15097
1737 15097 -3036 -9362 22236 -7309 -4227 11929 -12865 6299 16445 -15313 10792 5697
1749 5697 -13393 18193 -7021 -8376 18192 -5832 -159 11690 -17312 4129 11896 -16312 12932
1762 12932 -1429 -11438 16700 -9529 -9468 11198 -10259 1369 12402 -20513 4279 4205 -16198
1775 -16198 12929 -7046 -10452 14539 -7593 -6880 9719 -14579 4258 13530 -16204 10326 1298
1788 1298 -9111 16498 -4112 -5849 16396 -3054 1756 14810 -14369 8886 12204 -9651 13958
1801 13958 -867 -6359 15743 -3140 -6200 12439 -8298 3762 11933 -16661 6454 2646 -9399
1814 -9399 10760 -4876 -9205 11487 -5416 -5570 8996 -14815 4624 8180 -13389 6629 -2132
1827 -2132 -7980 10651 -3610 -8783 11075 -6408 863 9710 -14279 6961 6261 -6307 9064
1840 9064 -746 -5617 13559 -536 -3818 12022 -7671 6839 9884 -9816 6324 2755 -4204
1853 -4204 9003 -1650 -8455 10329 -4857 -2363 6083 -12806 3511 3806 -8584 2137 -1977
1866 -1977 -7496 7931 -3174 -8398 7938 -7064 2732 5023 -9800 3271 3487 -3647 4964 -916
1880 -916 -6976 10478 -1786 -2354 5988 -7251 5151 5058 -5684 1659 2517 -3579 7324 -801 -6156
1895 -6156 8702 -2931 2292 3575 -6361 3030 4599 -2946 1181 343 -5405 7411 -2264 -4782
1909 -4782 2953 -5220 2289 1095 -6318 -2095 1932 -4195 1634 -2805 -6675 5314 -2885 -708 -185
1924 -185 -4151 1694 3336 -2444 -1050 2014 -2297 6212 -1453 -2767 3379 -536 3071 767 -2016
1939 -2016 -153 4420 -500 1133 -202 -2239 5593 -138 427 -359 498 2679 2424 -943 -1098 3811
1955 3811 171 3135 -1262 -856 2450 1384 1568 -1485 310 -381 3618 -1063 -1835 -748 507 3146
1971 3146 -1053 271 -2219 3207 2013 -50 873 -1393 3772 2428 1461 -1353 2475 1811 3028 2241
1987 2241 -3279 3955 1154 2429 1016 -1846 464 3624 852 -1463 1767 -2944 5133 1270 -2793
2002 -2793 2222 -418 2460 3091 -771 -1800 5670 93 3489 2844 -3570 6898 2337 804 2929
2017 2929 -205 1559 6867 -189 -824 5281 -2798 6352 1577 -4379 4180 523 31 3049 -2565
2032 -2565 -2834 6816 -3544 392 2098 -6207 6527 943 -3572 3057 -196 -674 7500 -2748 -1529
2047 -1529 8137 -3425 6701 2666 -4782 7421 3142 -1028 5530 -1167 -2181 10078 -4536 94
2061 94 4415 -6881 6383 610 -6636 3104 107 -4228 6326 -6048 -4061 8334 -7007 3006
2075 3006 1648 -7336 6247 2707 -5565 5017 -1363 -3636 10568 -6568 -1239 6451 -6976 5136
2089 5136 879 -8757 4217 1658 -7040 6811 -5811 -4391 9948 -8138 973 3464 -7086
2102 -7086 6747 3853 -7637 6493 1397 -3821 12799 -5618 -306 10266 -5853 4664 3835
2115 3835 -7407 6442 4288 -8856 7007 -4860 -6002 10063 -10128 -2433 3717 -9734 1945
2128 1945 1089 -13325 4032 94 -9367 8782 -8926 -5049 8620 -8776 438 4340 -8483
2141 -8483 5835 4996 -11444 8178 -1557 -4388 13271 -7425 -976 8710 -6794 3314 5614
2154 5614 -10267 8556 4477 -9398 10122 -6722 -4172 11325 -7697 -1026 6006 -9280 3967
2167 3967 4058 -13844 8112 -312 -7216 10483 -8609 -4389 7456 -7917 249 7108 -11345 6772
2181 6772 3812 -13289 9040 -4530 -3960 12605 -7326 -3377 8284 -9106 2681 7126 -12359
2194 -12359 10376 2885 -8341 10348 -7036 -3413 12619 -5075 60 9880 -10438 6682 5653
2207 5653 -12081 11531 157 -3937 11220 -7725 -5442 9987 -8053 1378 7973 -13565 7637
2220 7637 1011 -12515 7837 -5237 -4840 11259 -7659 -5496 7666 -12174 3814 5656 -12747
2233 -12747 10133 387 -7498 8473 -6264 -4737 13534 -5205 470 9069 -12440 7900 4035
2246 4035 -9767 10686 625 -3600 11195 -6295 -5066 11887 -7476 5264 7877 -11417 8972
2259 8972 1584 -8371 8177 -2699 -4431 12248 -7498 -4384 7205 -12612 5466 3536 -11362
2272 -11362 6876 -1272 -8525 6372 -7024 -6294 12005 -8008 553 5693 -12189 6638 3006
2285 3006 -7771 8315 409 -5162 11274 -6766 -3969 10736 -8091 5985 5002 -10387 6104
2298 6104 1459 -7872 7446 -2826 -5246 12142 -8435 -2037 5992 -10163 6218 3983 -8278
2311 -8278 5844 726 -7067 9017 -5397 -3762 11239 -7342 2295 3608 -9545 5044 3392
2324 3392 -7883 6177 -1533 -6380 10145 -7909 -2754 6941 -6926 4404 3772 -8390 4633
2337 4633 3298 -6426 8934 -2758 -3265 10927 -6124 607 5047 -6264 5205 5064 -7545 5062
2351 5062 629 -6014 9088 -5838 -2328 7317 -5362 1976 2917 -7317 3919 4454 -6875 6476
2365 6476 -2031 -3774 8813 -5576 -901 4547 -4506 2748 4155 -7856 3713 1784 -5534 7346
2379 7346 -4558 -2508 6651 -4270 -19 3720 -5067 3616 5190 -6599 5605 190 -2410 8769
2393 8769 -2947 -65 5987 -1276 1944 4787 -5494 4354 4117 -4511 5744 -3138 -1598 5943
2407 5943 -2954 -1599 3271 -3576 1811 4116 -6992 3977 652 -2384 5720 -3199 -1083 4832
2421 4832 -966 -206 4173 -4147 3835 4003 -4494 4486 -1205 -567 4853 -1547 -2041 3579 -1698 468
2437 468 2990 -5988 2820 695 -2899 2210 -2835 -1963 3006 -1179 -2613 2457 -3611 2145 2482 -4438
2453 -4438 2777 -275 43 2965 -532 -1279 4227 583 551 3429 -2959 3896 2067 -999 1704 -830
2469 -830 397 1893 -479 -2615 1538 -2280 482 12 -4499 231 -907 -554 -786 -1737 -2184 1564
2485 1564 -99 -1407 1203 -1652 2843 1093 -105 722 801 1848 1269 742 -1716 2079 -296 588
2501 588 -857 -2459 165 -1141 -290 -2975 -1720 -1976 -476 -919 -2738 -747 -1128 1473 -1147 212
2517 212 -1073 1175 2292 -431 1243 -503 2075 1047 1078 -1083 531 818 -948 1092 -3613 -487
2533 -487 -881 -2281 -1757 -2562 -2696 -910 -615 -3675 26 -1772 71 1873 -2279 -257 65 1012 1750
2550 1750 1453 -1785 2626 1802 -925 2813 -2537 1945 2119 -1481 113 323 -1506 1595 274 -4281
2566 -4281 2450 -1657 -441 2265 -4422 -31 1096 -1671 163 418 -3960 2910 42 -3295 2487
2581 2487 -3739 331 2137 -3764 -419 1104 -2909 1838 299 -5433 4038 -1578 -1344 3037 -3882
2596 -3882 347 3317 -2317 431 2039 -3846 4575 507 -3893 4539 -2283 673 3785 -3518 -186
2611 -186 3742 -3221 1731 1396 -5654 5108 -1062 -2639 3581 -3687 -57 4358 -3607 -204 3589
2626 3589 -4586 4541 282 -5423 5357 -1715 -846 3994 -3955 -1023 4952 -4566 966 1877 -6325
2641 -6325 5935 -815 -4212 3924 -3058 -875 4927 -4349 -460 5125 -5306 4264 887 -5661
2655 -5661 6170 -663 -2076 4410 -3490 -1085 6342 -5333 685 3481 -6215 5903 -540 -5558
2669 -5558 4779 -2136 -2369 5351 -4795 -1548 5799 -6821 2498 1431 -6519 6083 -784 -4455
2683 -4455 4280 -3278 -2545 6784 -5721 278 4759 -6518 5132 133 -5428 6201 351 -2720
2697 -2720 6518 -3870 -1169 7527 -6205 3310 3330 -5771 6462 78 -5734 5101 -1376 -2678
2711 -2678 7337 -6170 -806 5237 -7633 3447 716 -5940 5919 229 -5306 5170 -4241
2724 -4241 -2579 8291 -6540 1885 4134 -6556 4759 467 -6407 6029 141 -3862 7125
2737 7125 -6633 -1693 6431 -7208 2853 2540 -5988 4873 183 -7217 5753 -2373 -2302 8737
2751 8737 -6845 413 4314 -6490 3620 2345 -5577 6445 829 -6184 6564 -5706 -1193
2764 -1193 7921 -6134 1761 3029 -6523 3477 1443 -6703 6961 -435 -3524 7589 -6943 -335
2778 -335 6065 -5039 3210 3549 -5912 5158 1016 -7183 6925 -3355 -1312 7624 -6840 -190
2792 -190 3475 -5998 3071 3143 -6715 6496 -479 -5502 6679 -5302 -25 7222 -4392 1318 3948
2807 3948 -6454 4452 1966 -6441 7519 -1797 -2621 6034 -6820 -1274 4764 -4768 1834 3111
2821 3111 -7756 4593 -810 -6361 6160 -3835 -743 6202 -5265 -514 4219 -5521 4344 3484
2835 3484 -6318 7170 -1108 -3094 5862 -4075 -108 6324 -4119 552 3730 -7122 4842 909
2849 909 -5809 6044 -2607 -1859 4821 -5190 -1618 5237 -5044 2625 2473 -7150 5537 -681 -3503
2864 -3503 5272 -2809 -836 5860 -4377 -555 4653 -5566 4714 1886 -5105 5369 -1281 -2337
2878 -2337 4613 -3127 -1612 5623 -5069 647 2230 -7096 4420 -458 -4792 3567 -2538 -2724 4130
2893 4130 -4362 -1631 4820 -4975 3289 1339 -5314 4879 320 -2197 4517 -1117 -1157 6283 -3518
2908 -3518 630 3578 -4608 4559 614 -4158 3140 -1091 -2903 3445 -3741 -2498 4218 -5231 868
2923 868 637 -4563 3537 381 -2882 3151 -427 -1405 5672 -2702 877 4613 -2636 3749 1118 -2563
2939 -2563 3135 729 -2258 3176 -2504 -2253 3814 -4770 -59 429 -4226 1773 -391 -3721 1367
2954 1367 -569 -2565 3750 -2827 -213 3607 -2618 2358 1065 -1565 2703 1748 -1949 2953 -722
2969 -722 -1390 3512 -3350 10 785 -2538 928 -401 -3068 640 155 -2728 2592 -2662 -423 2738
2985 2738 -1825 854 900 -585 1936 2050 -1835 2284 263 -700 3095 -2176 201 952 -1079 336
3001 336 56 -2156 311 697 -2192 1604 -1694 -309 1767 -1432 121 366 116 1010 1372 -1535 1560
3018 1560 767 -618 1731 -1831 282 598 -155 -519 -409 -1259 95 679 -2336 430 -1282 -47 578
3035 578 -1141 -9 -65 972 -234 978 -1048 1313 942 161 1013 -918 1057 47 580 -1094 -220
3052 -220 1 -251 117 -1825 -244 -794 589 -815 -699 -44 -870 1287 -1209 139 -218 753 633 711
3070 711 -224 40 1964 -333 1426 -502 82 1440 -275 295 -550 -21 -343 1341 -1635 193 282
3087 282 -1300 1481 -1334 -414 277 -38 -631 838 -1186 19 2009 -2078 1371 -590 -583 1903 -708
3104 -708 -786 406 -262 -455 1887 -2526 303 682 -1933 1791 -1144 -973 1356 -174 -1186 1592 -1542
3121 -1542 68 2456 -2714 1435 -38 -1454 2099 -641 -1463 2054 -391 -750 2811 -2823 968
3136 968 1839 -2150 2065 -284 -1443 2091 49 -1809 2580 -2308 -3 3087 -4119 2001 632
3151 632 -1976 2720 -387 -3427 2719 -129 -1753 3073 -3585 865 2131 -3520 1291 -119 -2115
3166 -2115 2335 250 -3436 2874 -1462 -300 3051 -3951 1285 1331 -2483 1957 188 -2627 2958
3181 2958 -471 -2329 3656 -3580 96 2619 -4155 1157 1050 -2447 2250 -260 -3446 3879 -1584
3196 -1584 -1222 3730 -4530 1534 2178 -3818 1148 494 -3429 3436 -367 -3439 4370 -3335 297 3337
3212 3337 -3896 1306 2151 -2863 2416 1022 -4054 5048 -1180 -1625 4328 -3834 1177 2699 -3405
3227 -3405 1460 1915 -3795 3200 -901 -3974 4694 -2812 -204 3420 -4007 1226 2563 -4041 1766
3242 1766 1441 -4263 5858 -786 -3010 3909 -3028 132 3353 -2669 952 2628 -4256 2842 -129
3257 -129 -3914 5271 -1861 -1011 3489 -3985 -211 2963 -4284 1540 2262 -4931 4240 -1388 -3707 4891
3273 4891 -2180 -355 3896 -3262 478 3475 -4859 3233 1215 -3746 5468 -1377 -1779 3779 -2706
3288 -2706 159 4430 -3813 1462 3127 -4823 3888 -615 -3262 4894 -1529 -1194 3517 -3862 -519
3303 -519 4038 -4628 2935 1788 -4195 4681 -1467 -2583 4084 -1311 -160 4695 -3806 776 3725
3318 3725 -4671 3887 704 -2756 4728 -1215 -2546 3190 -3201 -634 4504 -4814 1642 1422 -5156
3333 -5156 3352 -968 -2979 4156 -1058 -1912 4000 -4013 380 4192 -3954 3832 1378 -2891 4202
3348 4202 -324 -2625 4146 -1314 -753 4579 -4577 829 2263 -4828 3004 -221 -3385 3158 -1300
3363 -1300 -3333 3292 -3311 86 4587 -4493 2550 1126 -3383 3870 644 -1933 4519 -692 -1446
3378 -1446 4516 -4025 1087 3153 -3862 2817 52 -3642 2500 -712 -4089 3708 -2548 -843 3919
3393 3919 -4594 1029 1474 -2802 3135 697 -2274 3837 -501 -2280 4649 -2520 573 3535 -3221
3408 -3221 1867 643 -3351 1993 -118 -3422 3505 -2407 -2127 2829 -4649 134 1868 -2860 1788
3423 1788 1648 -3686 3814 713 -3396 5024 -2873 791 3062 -3354 1326 1484 -2283 2237 722
3438 722 -3034 3318 -1971 -1894 2851 -2957 218 1707 -3134 393 1046 -2879 2573 332 -2544 3375
3454 3375 -1708 859 3001 -2403 841 2419 -2139 1498 1133 -3133 2670 -931 -1664 2323 -2611
3469 -2611 -401 1266 -2676 -271 1221 -2987 1888 75 -2667 3097 -1209 -367 2185 -1350 620
3484 620 2307 -1335 887 1372 -2499 2710 -394 -1673 1842 -1592 -394 1407 -1942 -848 1468
3499 1468 -2761 1135 -37 -2285 2152 -1022 -579 1203 -1028 93 2171 -1236 502 1773 -1706
3514 -1706 2383 -43 -1198 1730 -444 -337 986 -1078 -466 1477 -1882 799 170 -1809 1651 -738
3530 -738 -614 850 -311 -198 1689 -1055 -8 1547 -1394 1476 -116 -689 1324 -109 -69 610 -413
3547 -413 -425 1241 -1404 163 136 -1165 908 -762 -669 3 -237 -480 816 -815 -240 1268 -915 912
3565 912 -341 -233 469 9 -215 -89 -24 -590 1104 -478 146 222 -231 727 -355 -192 -320 748 -359
3584 -359 545 -392 -147 803 -386 513 -485 465 245 158 207 -224 841 -89 642 -339 411 -130 447 70
3604 70 -433 487 -533 802 -120 -69 -159 -200 269 -19 19 -857 1065 -243 253 378 -522 690 -70 -139
3624 -139 -126 223 -694 717 -185 -391 1158 -852 502 2 -627 570 520 -311 236 96 -1196 1423
3642 1423 -910 -249 524 -979 664 229 -952 488 358 -1188 1134 -766 -1081 1609 -984 841
3658 841 696 -621 440 1112 -1092 654 262 -1454 2663 -1162 421 1139 -1011 897 1028 -1038
3674 -1038 295 1280 -1563 1495 -351 -991 2199 -1340 283 1037 -1000 508 1611 -1816 979 601
3690 601 -1831 2230 -1097 -748 1830 -1299 149 1124 -1528 425 1482 -2324 1664 -374 -1758 2394
3706 2394 -1262 -347 1410 -1235 7 1561 -2195 1196 969 -2089 2191 -924 -1004 2050 -1212 -423
3722 -423 1750 -1581 449 1908 -2858 2021 405 -1582 2485 -1112 -723 2208 -1056 -341 2124 -2570
3738 -2570 1302 1548 -2591 2446 -744 -1442 2251 -1077 -1041 2141 -1626 -142 2074 -3236 1925 336
3754 336 -2032 2434 -417 -829 2814 -932 -640 2727 -2396 1521 1687 -2833 2088 -333 -1791 2446
3770 2446 -1230 -1584 2404 -1942 -410 2547 -3571 1572 571 -2301 2361 -1252 -1708 2012 -1116
3785 -1116 -1510 3202 -2424 297 2335 -2844 2273 779 -1598 2201 -888 -2169 3566 -2119 -1194
3800 -1194 3084 -3108 1059 1241 -2441 1574 -131 -2244 2322 -277 -2301 3542 -2013 844 2807
3815 2807 -2677 1637 859 -2108 2212 360 -1899 3379 -1520 -1480 3035 -3266 491 1279 -2719 1873
3831 1873 1028 -2383 2675 -784 -2849 3526 -2299 770 2801 -2876 1554 892 -2603 2526 1331
3846 1331 -1934 3577 -983 -2249 2804 -3227 465 1856 -2950 821 292 -3381 1634 -530 -2983
3861 -2983 3616 -2134 -803 2724 -3079 879 1838 -2078 2407 1634 -2623 2927 -740 -1875 3268
3876 3268 -1928 578 1924 -3211 318 1247 -3302 2055 446 -2825 3011 -2114 -1492 2649 -2226
3891 -2226 639 2335 -2280 1332 1470 -3000 2895 -302 -1465 3783 -1742 -92 1953 -2572 301
3906 301 1787 -2907 1743 548 -3211 2483 -1806 -1668 2586 -1829 66 2033 -2432 401 1752
3921 1752 -2885 2812 297 -1920 3024 -1831 -795 2235 -1703 197 2184 -2829 1197 1023 -3473
3936 -3473 2468 -1300 -1933 2198 -1656 -857 1769 -2428 135 2213 -2990 2355 154 -2141 2684
3951 2684 -969 -726 2443 -1164 -226 2393 -2463 707 1117 -2653 2466 -646 -1448 2060 -1082 -1066
3967 -1066 1850 -1745 196 2189 -2576 1794 374 -2029 2235 -614 -934 2018 -589 -1142 2324
3982 2324 -2156 975 1525 -2260 2089 -270 -1570 1630 -661 -1091 1899 -1613 -347 1906 -2667
3997 -2667 1050 730 -1971 1554 -277 -1342 1419 -568 -1114 2309 -1741 332 1401 -2479 1339
4012 1339 88 -1146 1436 -7 -1451 1695 -1366 -683 1822 -2135 809 525 -1382 994 21 -1207
4028 -1207 930 -75 -1122 2040 -1217 427 1128 -1778 795 495 -832 681 133 -1462 1594 -532
4044 -532 -586 1828 -1563 929 720 -895 795 447 -1031 985 27 -1263 1691 -1103 -116 921 -1190
4061 -1190 483 301 -675 264 486 -1131 913 -381 -811 1299 -1189 387 388 -648 221 248 -946 388
4079 388 366 -991 1077 -742 -30 540 -802 308 149 -497 -254 528 -1066 989 -238 -528 891
4096 891 -954 278 -64 -283 -68 518 -372 27 379 -675 791 -408 27 245 -222 425 129 -130
4114 -130 10 680 -436 660 -91 -108 494 -179 341 -114 152 -256 391 -115 6 330 -502 422 -426 259
4134 259 -332 -133 48 -66 420 -559 462 -215 302 -103 -159 -10 -132 469 -611 165 -459 234 151 -253
4154 -253 82 -234 -68 -372 427 -736 242 91 -337 492 -510 139 -87 114 -54 346 -644 -8 640
4173 640 -862 893 -202 -205 348 -113 19 416 28 -470 999 -1160 253 57 -806 871 -465 -346
4191 -346 426 54 -610 962 -737 114 922 -1222 1105 -302 -581 674 -190 -408 622 -203 -672 1391
4209 1391 -1319 661 128 -894 908 -264 -469 444 -204 -882 1228 -689 -80 1042 -1485 935
4225 935 210 -573 617 -203 -897 1269 -347 -768 1822 -1569 263 402 -1355 913 27 -962 653
4242 653 -72 -1105 1384 -1264 -357 1209 -1733 914 80 -974 735 176 -1140 1430 -198 -957
4258 -957 1826 -1515 211 1122 -1480 854 267 -966 998 153 -1492 1748 -1058 -496 1815 -1920
4274 -1920 674 530 -1467 1173 648 -1332 1355 -234 -1444 2140 -1511 301 1209 -1468 591 504
4290 504 -1475 1172 241 -1653 1787 -1249 -635 1582 -1624 219 899 -1635 499 751 -1968 1664
4306 1664 -149 -1581 2114 -1461 88 1642 -1658 109 1085 -1755 1141 672 -2192 1921 -996
4321 -996 -1111 1909 -1387 270 1415 -1318 181 908 -2294 1503 213 -1750 2271 -1390 -466 1465
4337 1465 -1818 298 1634 -1641 1029 969 -2294 2247 -462 -1037 1992 -1227 -42 1643 -1576 47
4353 47 1523 -2139 1727 514 -1861 2180 -1024 -867 1956 -977 15 1999 -1884 503 1283 -2307
4369 -2307 2074 -225 -1066 1997 -984 -730 1362 -1690 -315 1675 -1975 1250 307 -2433 1691 -924
4385 -924 -878 1799 -1132 -729 1582 -2197 353 1408 -2540 2132 -54 -1731 1700 -827 -925 1767
4401 1767 -1021 -104 2345 -2354 905 803 -1966 1992 -189 -950 1589 -849 -1077 2021 -1693 419
4417 419 1807 -2142 1402 -1 -1666 1621 -464 -1125 2122 -939 -793 2060 -2435 639 976 -1737
4433 -1737 1849 -115 -1627 1215 -568 -1470 1983 -1395 -111 1695 -2401 1007 493 -1583 1467
4448 1467 211 -1451 1794 -1055 -1010 2069 -1965 698 1201 -1939 1440 -36 -1806 1315 -229 -1265
4464 -1265 2225 -1482 -431 1697 -2210 980 678 -1489 1186 186 -1541 1523 -722 -1284 2214
4479 2214 -1676 217 1224 -1888 750 554 -1494 1604 373 -1445 1811 -1243 -682 1875 -1627
4494 -1627 565 990 -1477 584 473 -1593 1495 47 -871 2005 -1564 -2 1278 -1448 470 835
4510 835 -1107 1115 492 -1764 1559 -769 -554 1518 -1373 522 1082 -1593 505 650 -1688 1716
4526 1716 -105 -1362 1627 -1195 -298 1065 -1242 267 984 -1400 378 604 -1802 1435 -611 -604
4542 -604 1324 -1243 -138 985 -1112 89 828 -1338 1235 128 -1198 1533 -797 -181 891 -605
4558 -605 -116 723 -1172 575 611 -1507 1570 -325 -725 1144 -747 173 442 -678 104 897 -1200
4575 -1200 931 462 -1032 1176 -525 -210 798 -344 -259 839 -997 144 552 -1173 1044 -128
4591 -128 -768 601 -483 -163 816 -281 -185 798 -1259 591 57 -939 849 -356 -383 505 -176 -414
4609 -414 804 -821 -190 509 -791 702 -124 -574 531 -11 -249 371 -116 -381 777 -879 519
4626 519 338 -659 623 -137 -156 319 -261 -518 604 -465 56 492 -767 398 -110 -32 242 169 -165
4645 -165 251 50 -494 732 -381 233 238 -237 528 -44 -200 -101 143 -489 494 -435 -153 324 -163 181
4665 181 -420 103 -97 245 -314 -102 -133 -298 642 -471 51 -229 256 285 -281 332 -343 382 -286 -87
4685 -87 -20 -157 58 -8 109 -272 68 -264 112 -154 -334 323 -157 -252 -39 -25 -268 268 -235 -231 502 -455
4707 -455 438 351 51 75 432 30 262 228 -436 665 -198 78 331 -450 -33 92 -247 -101 178 -728 392
4728 392 99 -400 561 -409 235 313 -152 77 421 -194 275 119 -567 703 -383 -118 366 -612 73 294
4748 294 -670 -141 511 -933 569 -420 -663 761 -607 46 219 -279 92 690 -724 470 261 -772
4766 -772 958 -474 -185 865 -668 -140 282 -950 31 402 -1081 614 -317 -711 789 -597 -347
4783 -347 565 -520 171 960 -661 721 558 -623 1163 -214 -165 1150 -387 125 1018 -647 140
4800 140 713 -1132 799 -74 -863 1073 -656 -449 487 -559 -205 1090 -1094 564 735 -1212 1093
4817 1093 -563 -388 1030 -135 -363 981 -1131 49 1124 -1223 829 127 -1091 776 -266 -812
4833 -812 706 -632 -426 1011 -1384 427 497 -1454 884 -126 -958 1296 -78 -760 1132 -594
4849 -594 32 1220 -1619 849 288 -1112 976 -72 -770 1190 -579 -926 1353 -1253 305 1018
4865 1018 -1461 1101 72 -796 1118 116 -969 1447 -702 -175 1448 -1537 782 714 -1158 911
4881 911 114 -956 1256 -271 -1036 1627 -1326 93 1232 -1682 831 330 -1039 820 66 -1207
4897 -1207 1525 -779 -484 1389 -1531 667 977 -1420 728 327 -1346 1098 -215 -1321 1525 -1045
4913 -1045 -199 814 -1473 320 585 -1205 730 418 -1154 1538 -333 -630 1819 -953 687 1076
4929 1076 -1133 233 566 -1065 1156 176 -1001 1643 -962 -498 1025 -1082 479 786 -1232 628
4945 628 173 -1507 1305 -174 -760 1573 -798 59 820 -988 72 746 -1032 1062 368 -1347 1620
4962 1620 -649 -580 1299 -950 57 1036 -1056 251 691 -1506 1377 -56 -903 1492 -908 -338
4978 -338 819 -954 250 945 -1222 582 113 -1371 1599 -487 -467 1317 -499 -250 1211 -900
4994 -900 429 956 -1292 1117 -233 -1289 1058 -866 -637 1075 -1011 -88 1031 -1493 463 417
5010 417 -1172 1419 -131 -1051 940 -359 -68 1074 -872 119 1154 -1522 980 271 -1280 1631
5026 1631 -178 -630 1237 -570 -262 1158 -1453 297 775 -1184 1082 -120 -789 839 -349 -687
5042 -687 961 -853 -75 1148 -1412 505 119 -828 1121 -328 -330 887 -142 -689 1019 -1293 64
5059 64 768 -970 930 -165 -731 745 285 -968 753 -658 19 1051 -1495 498 429 -540 1184
5076 1184 -308 -652 468 -304 -237 978 -1219 92 574 -602 744 -804 -221 413 -137 -372 780
5093 780 -482 -459 1785 -455 1156 2 -205 443 410 -392 674 89 -933 1075 -814 -482 1053
5110 1053 -286 237 -146 -456 453 -110 -615 591 -75 -304 935 -869 276 211 -389 200 58 -530
5128 -530 496 124 -773 625 -755 -174 407 -775 -12 108 -247 -7 54 -920 712 7 -563 578
5146 578 -515 265 352 -316 186 93 -691 303 284 -665 606 -188 -86 291 -576 -344 -168 -285 -107 27
5166 27 -534 511 102 -235 427 -326 160 21 169 -157 297 182 318 367 -636 642 -213 58 231 -512
5186 -512 -180 -121 -18 -232 3 -382 145 130 -292 178 -299 78 221 67 -82 435 -67 186 150 -53 569
5207 569 -1 182 43 -179 -34 -163 -135 -444 -88 -270 -461 -421 -425 -273 -351 -12 -637 57 -113 112 358 -169
5229 -169 133 112 448 50 646 -204 433 443 -37 173 -43 334 69 -116 -154 266 -131 -64 158 -492 241
5250 241 -153 235 90 -351 144 294 214 -19 418 -746 172 291 -11 542 -99 135 157 153 -400 -105 -278
5271 -278 -56 240 -466 -45 -57 -549 361 -368 -157 4 -181 91 366 -697 137 410 -262 120 -94 -267
5291 -267 -58 184 -574 834 356 461 216 -133 1 10 187 345 -9 -344 211 73 5 616 468 7 136
5312 136 -74 240 917 -130 -129 403 -121 836 -52 -457 1619 -1423 -390 -12 -437 -52 -227 -612 382
5331 382 64 -589 1217 -312 194 589 -91 348 600 -241 468 360 -487 909 161 -473 584 -782
5349 -782 303 282 -464 109 105 -702 587 -227 -758 797 -338 -266 633 -921 299 510 -105 143 244
5368 244 -653 874 -464 -316 774 -241 209 569 -562 319 629 -1007 240 -107 -435 1024 -800
5385 -800 -392 645 -469 63 558 -784 226 756 -911 1304 -52 -586 970 -269 258 708 -436
5402 -436 360 498 -882 699 571 -814 1025 -454 -686 919 -565 -111 570 -553 -42 648 -1232
5419 -1232 784 -19 -601 879 -627 -643 496 -428 225 604 -829 218 445 -1084 638 -176 -347
5436 -347 866 -20 -630 567 -652 138 864 -1227 756 284 -484 842 -657 -418 552 -494 -229
5453 -229 808 -840 182 338 -944 585 -78 -781 885 -183 -646 807 -347 86 1186 -900
5469 -900 750 388 -783 828 -34 -573 914 -476 -436 949 -1117 116 491 -828 704 -120 -567
5486 -567 716 -198 -1010 857 -285 -12 793 -1296 589 344 -636 603 199 -469 870 -44 -548 1119
5504 1119 -716 245 1013 -1116 642 130 -612 646 -211 -719 915 -196 -504 812 -1132 306 411
5521 411 -822 62 -161 -755 599 -184 -955 797 -1039 75 652 -1020 232 159 -683 625 37 -691
5539 -691 1256 -163 -417 850 -719 235 692 -336 366 427 -776 914 289 -782 979 -283 -193
5556 -193 758 -527 312 937 -609 662 261 -916 905 -353 -817 732 -796 16 356 -1143 -249
5573 -249 275 -680 -133 -193 -1219 820 -762 -436 444 -685 97 486 -655 108 499 -890 1103 169
5591 169 194 708 -360 -111 520 -958 135 830 -888 342 -128 -1080 645 -219 -88 323 -457 -275
5609 -275 559 -996 200 724 -527 611 651 -466 543 -348 1 516 -608 -176 790 -961 -540 413
5627 413 -1568 631 -415 -480 180 -437 -560 852 -482 154 417 -816 692 106 -444 606 1 291
5645 291 476 286 155 959 -97 605 448 -324 466 321 -522 44 -227 -756 55 -930 -43 395 -1177
5664 -1177 -217 -358 -1133 550 -611 -268 -465 -355 44 1071 -790 572 -18 -224 307 491 564 317
5682 317 -432 -262 944 -147 -13 756 -21 194 -23 50 37 293 -148 -34 684 -613 -393 -801 66 1379
5702 1379 -204 397 390 29 -191 -113 -839 278 -474 -561 262 -73 -308 202 -94 239 549 -285 -262 828
5722 828 -310 172 -287 168 21 -65 148 205 474 291 155 -551 244 135 -662 319 -343 -54 81 -2 -120
5743 -120 -15 -349 317 174 148 199 139 407 299 -81 109 -40 256 170 438 -272 194 -308 5 150 -187
5764 -187 194 -653 -23 -439 -64 21 -189 -94 32 -187 -76 61 112 180 214 373 660 -45 362 139 265 238
5786 238 256 91 214 376 -304 495 -210 -87 109 64 160 -16 -274 -312 -64 -515 -137 61 -81 92 -287
5807 -287 219 86 231 155 102 -83 122 518 -158 186 -99 -113 196 -130 -256 9 -157 -30 245 -458 175
5828 175 204 -270 198 -466 -150 499 10 -100 135 -181 -73 517 -541 261 -25 -69 459 -183 114 230
5848 230 -65 17 548 -294 256 204 -117 416 -22 -143 201 -65 -134 187 -446 43 340 -759 282 -200
5868 -200 -357 360 -534 -286 379 -274 -122 325 -698 269 178 -505 120 64 -286 378 -63 -314 630 -607
5888 -607 116 520 -755 590 84 -358 240 -133 -318 621 46 -116 445 -609 347 393 -424 368 68
5907 68 -228 515 -128 -183 783 -250 49 396 -700 406 238 -542 221 -118 -386 543 -36 -407 738
5926 738 -600 206 509 -652 166 290 -481 280 44 -664 865 -340 -163 541 -687 377 -4 -556
5944 -556 428 232 -530 606 -234 -592 635 -585 332 525 -451 404 307 -558 268 128 -542 978 -164
5963 -164 -195 556 -535 111 391 -540 49 344 -486 454 -267 -448 526 -560 34 185 -777 209 301 -454
5983 -454 155 72 -500 813 -262 -581 616 -319 230 395 -513 313 543 -516 574 73 -143 1141
6001 1141 -436 188 709 -261 96 690 -650 209 531 -602 693 -374 -593 424 -651 -16 163
6018 163 -969 -222 448 -866 537 151 -649 870 -281 -263 532 -89 -1 686 -288 71 315 -646 673
6037 673 -163 -464 679 -236 -224 545 -368 -149 601 -725 280 293 -613 610 -335 -479 640 79 -17
6056 -17 481 -528 110 603 -458 498 218 -473 822 -155 -338 165 -150 -359 575 -945 7 28 -880
6075 -880 429 -390 -667 537 -67 -343 740 -422 108 1012 -662 636 -115 -263 752 -197 -251 407
6093 407 255 2 912 -682 268 121 -423 676 -127 -365 210 -67 -856 417 -307 47 695 -830 235
6112 235 -31 -364 336 62 -1136 393 -434 51 623 -315 473 192 -939 -135 -344 -247 502 -411 -227
6131 -227 612 -294 -198 849 -794 39 255 -317 -32 312 -243 1188 -162 -684 289 -1048 246 132
6149 132 -1031 -546 324 -308 121 -52 -514 705 124 -59 455 -320 61 275 -754 442 523 -363 227
6168 227 -74 -747 454 -111 67 372 -292 290 274 -427 237 35 -926 380 -106 -296 173 -409 257 294
6188 294 -279 -30 478 -350 647 246 -457 416 -66 263 465 -157 2 269 -60 129 198 -225 312 -199
6208 -199 -368 155 -435 217 -169 -399 -381 185 -462 387 225 -293 618 -500 -63 142 -64 160 524 -236
6228 -236 156 322 -126 310 -76 -119 166 -105 147 -162 73 -135 334 -29 167 20 -154 266 -15 -165
6248 -165 -63 -62 -127 189 -300 -147 219 -288 311 -40 -1 149 -27 -237 -88 -119 272 404 -138 143 -262 -65
6270 -65 484 -100 -38 -73 78 -6 337 -19 -86 144 -340 -143 -30 -12 -60 -66 71 -87 45 40 46 30 134 8 78
6295 78 274 39 113 -105 109 -218 76 8 -139 97 -88 220 -170 10 -12 52 -68 -77 313 -34 -1 -171 1
6318 1 54 405 28 -297 230 43 378 -142 134 51 -156 -20 -270 -129 -275 317 -145 -138 -78 -176 261 -92 198
6341 198 -97 130 162 342 -146 -204 325 -151 121 -7 -347 40 57 198 -158 -252 -277 512 -80 -5 227 -166
6363 -166 154 -105 -59 0 261 11 244 2 -25 439 -39 32 -110 -169 126 339 -111 25 241 -189 351 -278
6385 -278 -164 -54 -448 241 4 -248 -163 256 -86 102 -65 -140 496 -201 38 100 195 312 206 -246 56
6406 56 4 -105 576 -208 -94 241 -149 135 364 -379 207 3 -459 249 -293 -343 241 -316 -16 -36 -328
6427 -328 -3 320 -423 -159 427 -458 623 -322 -108 422 34 210 268 -125 337 604 -420 205 136 -71
6447 -71 611 87 -98 479 -99 160 179 -311 63 259 -406 460 -239 -279 392 -237 -133 172 -420 133 176
6468 176 -642 530 -39 -233 593 -140 -313 446 -68 90 447 -407 179 218 -516 379 -141 -251 279 -303
6488 -303 -371 437 -258 20 262 -736 359 114 -282 288 -133 142 284 -265 -181 466 -362 95 284 -436
6508 -436 123 133 -232 383 -158 -292 212 -203 -66 318 -559 252 238 -542 105 -85 -112 462 -142 -256 432
6529 432 -445 54 307 -542 249 204 -350 224 -49 -214 495 -81 -387 580 -264 396 289 -448 277 246 -171
6550 -171 240 -178 -130 606 -384 -119 229 -717 173 103 -421 129 112 -459 454 -269 -286 397 -411 235 157 -426
6572 -426 128 538 -206 532 -111 -485 437 -201 73 412 -334 96 269 -390 179 155 -360 505 -223 -356
6592 -356 353 -212 -80 284 -513 77 118 -378 204 62 -211 889 -304 -167 675 -422 157 484 -438
6611 -438 159 444 -691 545 -211 -416 467 -172 -203 194 -680 194 522 -419 -5 199 -379 548 -455
6630 -455 -264 422 -237 -31 131 -300 282 581 -427 320 21 -508 771 214 -203 197 -181 -73 445
6649 445 -632 -27 -73 -490 345 -358 -280 344 -37 -102 596 -192 -35 487 -460 311 64 -62 611 -346 -163
6670 -163 422 -12 -24 467 -444 78 250 -165 323 208 -345 356 -219 -137 266 -180 48 393 -368 -52 100
6691 100 -265 350 -242 -320 538 -262 35 272 -313 -61 314 -392 541 -1 -31 375 284 -268 298 -66 -147
6712 -147 224 -519 100 386 -279 -153 -330 -222 53 108 -321 387 -459 -37 -57 -173 265 2 265 102 -201
6733 -201 -174 411 -14 207 274 -88 197 159 -274 37 -157 -72 93 -203 55 271 -250 -11 206 -526 231
6754 231 134 -285 277 11 -17 456 45 10 115 -562 271 -19 -209 393 348 -345 159 -108 -375 416 1
6775 1 2 243 -131 -155 158 -27 8 234 -292 117 -284 -466 308 192 205 324 -580 97 234 313 -281 -49 -188
6798 -188 242 361 -119 -166 -71 375 66 -417 -250 315 -478 -48 -133 -341 716 150 -143 -343 96 52 -331
6819 -331 43 272 121 337 407 -304 -91 331 -220 257 52 34 -571 -174 161 -265 -12 24 496 194 33
6840 33 -361 -30 -89 254 -147 84 172 -179 67 83 102 -85 -149 106 -244 -87 -5 197 -124 -282 -138 188
6862 188 106 66 72 -348 -231 31 232 -182 -34 107 335 270 18 -150 -217 158 -40 8 -83 -145 243 -159 -18
6885 -18 -41 133 4 135 298 -185 -23 94 93 -85 37 -104 309 112 -292 312 -360 -11 -46 -309 -95 -231
6907 -231 -14 -100 -112 -74 165 62 -63 188 -439 175 61 -131 356 -57 89 295 -39 -129 417 -333 386
6928 386 252 -134 220 12 -13 -200 41 -188 124 6 -274 166 -179 -26 -160 -264 149 -241 -166 73 -124
6949 -124 -456 513 -92 111 229 -372 98 -44 -119 85 -93 -28 315 -94 -49 149 -341 171 162 -120 -43 -7
6971 -7 -60 -184 165 -317 251 -206 46 57 -312 192 263 -136 -150 255 -225 479 -415 -384 501 -369 82 38 -315
6994 -315 64 -80 -190 39 -256 -287 519 -227 -137 149 -306 -6 159 -496 -94 188 -393 301 -20 -265 425
7015 425 -221 32 353 -138 166 124 -296 100 6 -188 414 -128 -179 281 26 -15 -132 -308 89 144 -563 146
7037 146 -143 -473 294 -386 -353 109 -253 52 326 -485 163 -6 -315 669 -274 9 181 -291 -32 254
7057 254 -335 106 339 -411 213 -80 -136 460 -128 -322 242 7 13 189 -274 63 130 -377 266 -18 -78 264
7079 264 -191 -3 347 -8 4 369 -202 264 221 -373 403 -19 1 292 6 25 235 -449 284 24 -305
7100 -305 444 24 -248 86 -168 84 40 -161 -24 198 -481 278 3 -66 531 -182 234 667 430 -137 170
7121 170 -172 -27 495 -427 409 -8 -77 98 -143 -45 394 -312 -151 222 -519 223 3 -141 136 152 -290
7142 -290 43 -200 -174 391 -117 -16 292 -494 256 180 -303 373 -19 -387 732 -279 -203 331 -527 175
7162 175 83 -503 191 -53 -347 187 -282 -307 283 -268 64 154 -237 167 193 -127 32 71 -78 318 -81 -176
7184 -176 93 -523 251 22 -492 140 205 -423 384 137 -212 394 33 -17 223 -247 115 236 -131 -184 58
7205 58 -385 247 -224 -342 341 -131 192 162 -303 -93 131 -295 82 -90 -536 414 -247 -149 70 15 394
7226 394 216 -196 97 382 -35 138 -63 -157 151 -136 47 172 38 345 239 -152 118 156 -45 384 -99
7247 -99 -266 130 -461 -82 -60 -210 12 247 -199 -4 -241 -465 405 -101 -204 78 -104 -141 307 -96 -7
7268 -7 208 -159 393 -67 -134 266 128 155 164 -108 34 269 -140 186 73 75 189 -152 -24 90 -256 113 303
7291 303 -200 218 82 -419 203 123 -412 245 -18 -205 389 -303 -250 90 -554 112 -174 -35 97 -266 -224
7312 -224 68 279 -191 -40 -13 25 191 257 258 52 95 280 -24 21 -149 4 -136 136 -260 70 185 353
7334 353 140 104 -101 508 465 -380 159 -615 -338 -615 -325 -571 92 -297 -143 749 -304 -27 85 -207
7354 -207 149 -191 -43 371 -407 -261 43 377 139 196 -220 -471 148 -55 389 -361 140 0 353 -14
7374 -14 57 -255 216 -490 306 294 -223 -77 103 225 -98 -320 267 188 79 -19 179 -220 -26 111 -209 50
7396 50 -51 -62 -106 105 -260 -219 34 -178 -38 -123 -48 -191 251 78 -65 106 110 84 -233 -92 -46 -96 -210 120
7420 120 250 -175 228 -118 -93 177 226 153 45 -211 139 136 -24 40 -38 99 169 -60 46 -19 -24 -216 217 -40
7444 -40 -90 192 -336 16 -211 -79 155 60 -44 304 6 -100 344 -253 -164 -267 -177 46 -122 76 249 -197
7466 -197 188 14 -335 125 134 -42 -26 -73 -208 -175 -418 -58 314 82 96 40 -198 97 -129 -108 342 -120 69
7489 69 48 63 -142 -119 -197 98 103 -71 280 -32 -20 223 -9 50 86 -133 121 339 -207 403 -298 -340 180 -105
7513 -105 53 -35 37 251 129 -105 241 23 -90 219 -31 192 29 -43 -89 287 110 244 540 -587 472
7534 472 270 269 286 -44 461 -304 477 -88 109 193 -599 452 -468 -67 -238 -146 110 14 513 -89 -275 -24
7556 -24 503 -209 342 141 -187 -245 42 -560 486 345 -416 223 17 -180 43 -137 296 77 -134 108
7576 108 314 -70 244 -258 -207 109 -303 280 372 -185 135 247 90 626 -183 248 159 -363 20 -45 251
7597 251 -602 401 -233 191 -337 8 -159 -655 -181 578 -85 178 132 -128 -166 50 -365 32 -378 -323 358
7618 358 -263 -236 136 -140 199 268 -237 105 364 -93 357 -71 -46 291 27 211 -120 -260 210 248 -143
7639 -143 325 97 -240 373 -339 4 370 -177 27 28 -141 57 270 -484 -3 40 -262 464 -93 -16 39 -340
7661 -340 88 278 -365 160 -181 -349 560 -326 148 413 -319 45 481 317 20 573 -415 330 74 -104
7681 -104 660 -237 150 217 -191 428 158 -165 131 870 -132 169 -26 -39 466 80 -224 123 127 -249 378
7702 378 -794 26 -38 780 256 -548 -522 126 195 -54 -385 -764 483 230 -376 559 131 -45 190 -52
7722 -52 -152 99 -105 291 -96 -38 652 -261 -217 707 323 299 450 119 -112 368 -65 95 -63 33 -88 -115
7744 -115 -5 488 60 -98 -180 73 -47 104 -677 61 -258 -482 436 -260 5 438 39 -257 182 -218
7764 -218 346 79 -265 170 -150 -69 -404 41 -55 517 -100 -35 189 65 211 451 -421 78 51 -271 102
7785 102 -279 -320 461 -430 282 48 -109 484 327 11 -17 240 -288 -98 -127 -661 767 333 -121 -125 -8
7806 -8 -29 375 -357 189 58 588 263 -74 -147 299 479 215 87 628 274 -491 243 27 130 -54 696
7827 696 184 403 174 279 274 225 -1 186 28 -392 177 -248 -324 -41 178 517 -552 169 -342 131 -17
7848 -17 422 52 155 130 -84 -486 97 -277 351 199 249 -76 -10 -637 -331 13 -203 -280 -65 300 228 343
7870 343 120 111 69 166 -325 277 68 -285 480 -264 -123 343 -202 38 82 -34 97 218 -663 219 -3 293
7892 293 312 163 -125 -351 4 77 165 54 -239 -55 -111 317 -90 -110 65 -38 -146 -125 -138 43 -93 206
7914 206 392 -250 70 128 160 50 -320 79 118 237 -135 60 58 320 -221 -24 143 -92 -417 -4 58 97
7936 97 -66 -116 -11 -207 205 155 7 -43 -67 365 109 -152 24 153 285 -74 -152 -579 154 352 -108 72
7958 72 226 107 -40 272 -128 248 174 -534 172 138 -132 175 -37 200 -75 38 112 -171 -29 -156 158
7979 158 -39 105 -64 106 -14 -111 37 -198 51 114 26 -262 -80 90 -81 172 84 221 -347 -121 -120 375
8001 375 -249 19 293 154 231 -234 180 -161 -93 -403 470 -360 -53 637 -429 -129 -207 305 -299 182 -305
8022 -305 -283 -577 -406 377 63 230 531 -148 367 547 -143 193 314 593 -20 -454 -398 108 -199 396 -205
8043 -205 338 -50 509 -324 10 -298 515 227 221 126 754 -78 -768 52 -412 597 -155 928 -145 -259
8063 -259 320 1377 -250 -7 311 394 -203 369 -533 408 204 -388 673 -196 326 435 14 283 182
8082 182 243 189 115 66 133 -1 338 179 251 -116 69 -140 -17 61 -188 624 253 -117 419 -429 -77 463
8104 463 -175 442 -669 -395 -76 291 -70 352 -340 -148 -23 -466 -269 188 -394 -64 -127 324 36 148
8124 148 32 558 357 463 1113 521 349 249 630 192 424 -263 374 61 -439 -276 19 396 479 74
8144 74 18 684 -285 -21 464 -329 488 18 -530 358 -516 46 -243 -679 -255 -291 -521 32 274 -59 -196
8165 -196 321 -220 -162 -285 -287 186 -44 46 24 -79 430 34 92 322 192 -115 309 -183 -236 -82 -283 -37
8187 -37 3 -273 113 -189
8191a89
$$ Imaginary data points
##PAGE= N=2
##DATA TABLE= (X++(I..I)), XYDATA
0 0 0 0 0 0 0 0 0 0 0 6 -8 8 -8 8 -16 16 -24 32 -33 41 -50 64 -74 89 -105 122 -143 167 -191 221 -256 289
32 289 -329 375 -425 478 -539 606 -678 758 -844 938 -1040 1156 -1280 1417 -1563 1724 -1900
49 -1900 2093 -2308 2541 -2799 3083 -3404 3759 -4163 4623 -5153 5769 -6498 7374 -8455
63 -8455 9825 -11628 14124 -17853 24137 -37780 138909 -61578 146563 134994 -217467 285733
75 285733 83245 -125262 210142 -102032 -131515 224405 -276496 -18507 161707 -192915
85 -192915 151299 12506 -263264 157110 8564 -106233 258279 -101059 -9546 267468
95 267468 -196534 58460 109176 -142442 218547 75496 -197274 135301 -84069 -133458
105 -133458 198244 -204049 -31073 152125 -213301 30189 -16287 -229792 145470 46720
115 46720 -143696 178099 -102960 -50652 224843 -148472 62569 171172 -76366 169463
125 169463 78985 -164004 168989 39951 -62065 218786 -118689 -16006 158060 -161258
135 -161258 12728 42059 -153988 113561 24178 -203688 83272 -104855 -95418 139164 -169597
146 -169597 -33765 82882 -144463 18371 4851 -186934 105182 17906 -126675 112913
156 112913 -124271 -47536 128898 -123708 -759 80084 -99531 87443 43797 -158780
166 -158780 121208 2346 -39788 151640 -96739 -7146 123855 -80018 22244 62163
176 62163 -117424 106530 33081 -139055 81661 -79721 -48511 95406 -120653 -53630 51723
187 51723 -113384 5292 7209 -166468 72739 -8585 -90322 67336 -94247 -33153 95412
198 95412 -68624 -17098 62731 -83564 74505 37318 -112323 83064 -11536 -21981 84477
209 84477 -70471 -34401 83369 -59149 3791 36665 -109805 76802 15388 -81745 52359
220 52359 -43556 -17923 84811 -53662 -33499 71585 -57783 49979 33894 -94808 75597
231 75597 12882 -29792 52448 -45789 -27893 82825 -45777 -21409 35561 -81487 54777
242 54777 7536 -82914 28632 -20058 -25219 43651 -53518 -47421 61449 -47182 12623 13553
254 13553 -76255 55406 15375 -36632 23784 -18569 -15380 71521 -32286 -25493 46808 -39759
266 -39759 49501 13098 -55694 33962 16492 -11171 32047 -25636 -25980 69509 -26135 655
278 655 15306 -42351 48868 15519 -34307 9185 4836 -9337 45811 -30649 -28359 42805 -22446
291 -22446 22985 -4784 -39715 21670 19222 -18236 1562 -13599 -17539 49726 -25240 -14983
303 -14983 7489 -15557 30397 1052 -27039 -1828 20392 -4428 17894 -22738 -17367 36241
315 36241 -8006 4589 -15859 -14049 14398 13713 -19576 -17493 -1557 -7217 22880 -26894 -19055
328 -19055 -851 2758 10407 -16000 -12966 -4571 26217 1049 -786 -7559 7053 31694 7612
341 7612 6429 -9658 25175 20205 14855 100 -11300 20848 12969 5849 -18962 -5511 -6811
354 -6811 13068 -9501 -37280 -3774 -18971 5612 -14028 -34509 -15969 5671 -4737 -8055
366 -8055 -9266 -25252 35856 4314 -3675 11595 -6335 32408 32342 -1009 4547 31619 8116
379 8116 43613 8190 -18039 44112 7527 18046 14851 -19933 10798 35482 -13805 909
391 909 3624 -27210 44797 -10545 -27610 14836 -17564 9495 17365 -36272 -10098 27750 -25663
404 -25663 21928 -11789 -38847 44869 -7541 -9321 14545 -22962 10399 44695 -29478 6822
416 6822 26509 -20775 58764 -2018 -22724 46876 4574 13412 38222 -26451 10737 57626
428 57626 -27510 29391 6974 -30118 63090 -2426 -20780 32140 -12319 10011 53697 -39808
440 -39808 12459 46541 -24833 57120 1309 -26734 63434 10236 -2438 43113 -27568 9537
452 9537 61348 -48428 16009 8747 -44590 45739 -22660 -55381 21780 -27309 -25536 30637
464 30637 -70169 -10454 36667 -54271 30996 -3776 -35201 66621 12220 -15886 60365 -3540
476 -3540 27299 92127 -29082 43012 56560 -16474 69038 10412 -33349 60883 1146 -27693
488 -27693 41619 -67932 -12822 38893 -78420 2937 -15999 -67253 32022 -24994 -70174 35416
500 35416 -30228 -15053 61028 -68208 12614 48644 -39797 51650 15054 -36386 73085 10051
512 10051 -36274 59296 -42492 6944 68002 -65585 12066 12998 -58124 36731 -9870 -67249
524 -67249 53237 -18464 -32687 51358 -73538 5837 56220 -46663 34978 18889 -46726
535 -46726 61784 3853 -52091 67476 -26514 2271 63496 -75924 -319 24242 -58999
546 -58999 29091 -4149 -74794 46557 -31990 -64178 36422 -75062 -3469 49968 -70743
557 -70743 1267 7170 -66486 45029 864 -60840 70341 -23025 -16929 51849 -70987 7915
569 7915 54557 -39999 33150 15168 -66109 57113 -9793 -49827 64611 -34825 7748 55349
581 55349 -67878 -3021 31974 -48035 49452 13375 -65317 61076 -27644 -39525 44490 -58663
593 -58663 4998 53011 -61826 -3671 4987 -77791 46570 -7795 -61241 56289 -39607 -22145
605 -22145 36160 -69169 -1922 54977 -41379 35964 13049 -68661 62503 -7727 -29197 63963
617 63963 -26893 6920 54281 -60163 -4165 35889 -49255 54642 5246 -63361 48327
628 48327 -30220 -31411 38830 -47362 -1200 56016 -55585 3968 9760 -64755 59325 2202
640 2202 -38348 52119 -25246 -14248 45038 -51983 84 57002 -42650 36684 2048 -65230
652 -65230 50003 -9483 -27618 45650 -31046 -9771 50083 -59699 -1725 30913 -45913 55403
664 55403 3334 -48829 42148 -13737 -18946 48423 -34439 785 59778 -46986 16732 9708
676 9708 -47544 54685 6395 -32873 37604 -20829 -17519 48177 -48214 -231 43459 -41198
688 -41198 33148 -2725 -51279 39382 668 -25548 40131 -31016 -11600 49914 -52002 5921
700 5921 19155 -39049 42395 504 -46237 29581 -10494 -22021 45205 -41942 -4046 43502
712 43502 -42935 17480 3470 -39666 41474 9193 -33272 34235 -19954 -11499 50436 -42338
724 -42338 5580 29711 -29840 29347 2917 -40935 32826 5307 -24180 37512 -33738 -6738
736 -6738 41284 -38441 7274 9902 -29952 30377 6592 -40673 27453 -8255 -13633 41335 -37741
749 -37741 557 30595 -24923 16013 6211 -31850 32489 11294 -29039 30711 -22963 -3680
761 -3680 38024 -34184 728 13522 -23592 17495 2588 -41461 22604 -3791 -20772 25384
773 25384 -36548 -4414 24637 -24466 2014 5308 -24322 24372 9885 -29636 26150 -8315
785 -8315 1799 32333 -22857 3842 22736 -7488 13892 9771 -25566 27270 7518 -15990
797 -15990 20103 -21971 1873 20862 -19995 -6613 5298 -17959 12613 1347 -32675 15619
809 15619 -6454 -5084 13772 -22783 -967 17099 -6893 1331 6453 -17170 23385 7654 -14480
822 -14480 16073 -7176 9141 18082 -10036 -3364 14417 -3364 10613 4254 -20578 18044 1279
835 1279 -3338 4805 -13796 895 12204 -6450 -9179 3199 -11579 12688 -330 -16862 5518
848 5518 -3486 5266 3390 -8856 -5197 12699 840 1348 1676 -10417 16458 4113 -1305 -895
862 -895 -2218 6413 7430 -2520 -10742 4645 -2666 5382 -6716 -13192 498 -1110 1968 -9810
876 -9810 -6762 -5291 7183 1111 -6272 -1452 -52 13559 2945 3787 -1412 10799 14956 5866
890 5866 6615 -1223 12300 10807 6252 -4945 736 2732 2130 2466 -18311 -3061 -4666 -4367 -6221
905 -6221 -16727 -11977 -941 -2193 -13479 -2780 -13630 5514 7569 -10186 3253 -235 7513
918 7513 12729 2963 -5619 14470 6151 5708 10513 -14814 10328 7548 -4842 -47 -8544 -8529 8461
933 8461 -5048 -18642 3268 -15783 3202 4002 -21752 1064 1280 -2803 7570 -3277 -12073
946 -12073 20213 1252 -1089 13176 -14703 14624 13548 -9714 3922 1488 -6837 16079 -4583
959 -4583 -19411 14684 -12684 1860 6433 -25405 3925 6906 -11811 4518 -3630 -16972 24035
972 24035 -4533 -10545 15742 -15919 12636 14500 -17772 5288 10095 -10597 18004 -4532 -20910
985 -20910 25432 -10587 -1756 10640 -23839 7105 13856 -19104 3835 2317 -19056 26634 -8219
998 -8219 -18161 20292 -15050 6398 14202 -23591 4222 16139 -18736 14224 -4492 -23608 29988
1011 29988 -11721 -10121 13653 -22321 5471 17572 -25191 4716 10811 -21226 27304 -8848
1023 -8848 -20593 29247 -10387 3210 18504 -23251 7257 23676 -23484 15529 2969 -21656
1035 -21656 34637 -12533 -16409 19103 -18370 3135 20056 -29687 4280 15983 -27497 22743
1047 22743 -8936 -21738 33148 -9817 -6458 18117 -22877 4953 27687 -27399 14099 9544
1059 9544 -22639 31139 -12363 -19625 26356 -10999 -1075 21289 -32577 2882 20486 -31709
1071 -31709 19972 -3964 -23403 32179 -13747 -18686 19245 -19909 3585 29383 -33872 10654
1083 10654 12342 -28421 28244 -9098 -18959 33378 -8571 -10058 21242 -30829 5682 29210
1095 29210 -30850 20079 2477 -24516 29263 -12026 -20293 28411 -10690 -525 27679 -37607
1107 -37607 7260 18610 -27080 26460 -2670 -19993 30773 -10277 -20275 23814 -22423 7339
1119 7339 32006 -35228 12184 4682 -25800 27099 -5074 -19588 32904 -9776 -11552 23796
1131 23796 -35485 10406 27399 -26039 20931 -876 -24785 26596 -8124 -21815 31175 -15325
1143 -15325 1301 25816 -40884 7804 12458 -22798 24462 -1740 -24241 27907 -11832 -20273
1155 -20273 26209 -25596 11510 27830 -31433 10092 2980 -22074 27459 849 -21047 33342
1167 33342 -13014 -8127 23658 -33288 12458 23863 -20334 16335 430 -26555 27061 -5780
1179 -5780 -19958 31309 -19213 3942 21103 -35574 6084 12377 -19081 22746 657 -27411
1191 -27411 28664 -12793 -13360 25869 -24263 11978 23475 -26258 7075 6031 -22013 29154
1203 29154 898 -21348 30675 -16194 -2822 19806 -28202 8514 20762 -19530 12375 350
1215 350 -28769 27605 -7450 -15866 24644 -19939 3536 17492 -28118 2907 13956 -19057
1227 -19057 22149 -1167 -26061 26825 -12117 -6286 20014 -21260 6256 19983 -23353 5171
1239 5171 5202 -23357 27406 -5253 -19069 21109 -16385 -1440 15388 -24115 2474 18356 -19821
1252 -19821 13740 -1257 -23396 26954 -6307 -7572 18632 -14205 4098 20606 -20294 5486
1264 5486 14262 -16438 24276 -2708 -17457 22466 -6790 -2256 15804 -16842 1288 18841
1276 18841 -20859 6748 1189 -19964 22518 -7467 -15210 11652 -12566 -3048 14209 -21771
1288 -21771 -352 13636 -18706 14014 -5047 -17288 19674 -3785 -6302 12604 -11321 1486
1300 1486 20383 -17298 6532 8608 -11961 20956 -2896 -11394 14954 -2210 -1870 14348 -14801
1313 -14801 1142 16693 -15004 9296 -1690 -11784 16802 -1963 -9692 8648 -5978 -1039
1325 -1039 15841 -16686 2418 9038 -9853 12735 -3541 -10205 12226 1379 -5474 9345 -10635
1338 -10635 974 15036 -13581 4537 548 -6795 11852 -1381 -9962 7801 -249 -1576 12337
1351 12337 -12487 3459 11497 -5091 8888 -508 -3615 12729 5690 -4867 9228 -2758 4103
1364 4103 13908 -9643 3653 3669 -1490 6922 -1424 -8844 5302 1761 -5647 4384 -11771 273
1378 273 5884 -7308 -913 -3612 -3437 4575 1245 -9359 3496 -958 1184 6773 -8727 1992
1392 1992 4415 2320 2722 -5 -2676 6884 6150 -2777 4553 -2954 5904 7193 -1724 465 1561
1407 1561 4617 4097 2769 -5137 4546 3694 2555 1347 -5081 2992 2520 3180 -2800 -2017 -398 2035
1423 2035 1944 -5511 -1577 -2116 3266 -2097 -3745 -4116 -1873 4256 -3856 -2403 -4297 826 2171 4
1439 4 -4281 -2127 4115 -788 4268 -5509 -1317 5488 913 1350 -2089 -1300 2813 6425 -5211 1184
1455 1184 -296 -269 8157 -5574 -2023 2019 593 1345 1033 -7606 1442 5457 -5847 4028 -6872
1470 -6872 -2584 7323 -3993 -3429 -117 -4027 2127 4722 -11802 2246 600 -4104 7822 -8107
1484 -8107 -3800 6737 -1369 -951 3395 -8806 5210 8012 -9440 6812 -3101 -1400 11688 -4279
1498 -4279 -3811 7105 -2506 3325 7939 -13039 7733 4859 -5965 9319 -7002 -3646 11271
1511 11271 -3583 -4233 6721 -10537 5925 7542 -15157 7311 -1597 -4860 10826 -7600 -7387
1524 -7387 10617 -5375 -423 8217 -16067 9016 6311 -10956 8777 -4396 -4267 14310 -4581
1537 -4581 -6849 11865 -9188 6426 9648 -16267 10537 4004 -6243 11467 -5181 -7224 16464
1550 16464 -4805 -2508 11800 -14722 10718 8595 -13810 9890 242 -5146 15749 -4986 -8655
1563 -8655 16388 -9018 4553 11312 -16920 12064 6710 -9846 10760 -2929 -7616 19193 -6179
1576 -6179 -6100 13829 -14038 9186 8994 -16266 10156 3426 -9001 13010 -6834 -11521 19023
1589 19023 -9264 -29 10587 -18067 9482 6741 -14483 8926 520 -9429 18157 -8799 -10116
1602 -10116 16451 -12775 6744 9563 -17620 8994 5632 -12579 11207 -3658 -10477 21960
1614 21960 -8743 -3850 12253 -16511 9642 10157 -15315 10056 4877 -12101 16776 -8451 -10844
1627 -10844 21240 -10206 3564 10051 -18581 7213 8595 -15719 10766 198 -12790 19844
1639 19844 -13021 -11087 13221 -14155 5629 9931 -19362 4768 5354 -17990 13372 -6115 -12033
1652 -12033 22083 -11052 -4436 9826 -16589 6930 13560 -15729 10713 4582 -14598 19218
1664 19218 -9560 -8755 20554 -7592 3143 10313 -19373 4896 11300 -17229 14376 -1747 -13553
1677 -13553 19001 -13829 -10320 11473 -13449 3653 12215 -21923 4114 3712 -19397 15185 -8127
1690 -8127 -11193 18601 -10776 -6816 8588 -17943 4720 15321 -17912 11071 846 -15079
1702 -15079 17679 -8914 -8066 18676 -6354 1662 12996 -20088 6757 12565 -14234 17702 -1669
1715 -1669 -9577 18364 -8394 -6987 13999 -10170 6274 15861 -19941 8351 3238 -13918 17180
1728 17180 -6089 -9564 16926 -9376 -7240 10279 -19638 5318 12685 -19121 9387 -4634
1740 -4634 -14884 14058 -8417 -10615 15031 -9894 -1076 11948 -22550 7283 8769 -11846 15659
1753 15659 -2458 -9406 17322 -4535 -5700 17415 -10288 8746 15947 -16685 10616 3832 -8415
1766 -8415 17262 -1832 -8885 16910 -7209 -3448 12720 -18289 8107 9879 -15044 8224 -3997
1779 -3997 -12165 13640 -5823 -10540 13806 -12512 1139 9706 -19889 6482 4733 -10104 10646
1792 10646 -3351 -11543 15039 -5737 -5484 13216 -13373 7832 10351 -13415 7362 2709 -6961
1805 -6961 14891 -1139 -8994 16345 -6575 1734 11305 -13306 8391 8680 -8826 7141 -582
1818 -582 -9847 14177 -4367 -8007 10638 -12421 2946 5722 -15127 2219 2071 -9961 6838
1831 6838 -4747 -13052 11440 -7779 -3859 6831 -12842 4293 5666 -10403 3340 1367 -8251
1844 -8251 12009 -3630 -8120 11529 -6743 3305 6513 -9822 4033 7014 -6322 6432 -26
1857 -26 -7761 13949 -3300 -2549 7918 -6515 5310 6987 -7685 2665 4952 -6002 8766
1870 8766 -3079 -7808 9458 -5461 -803 2320 -9255 642 4387 -9362 49 -1283 -8647 8186
1884 8186 -5730 -6146 3812 -5341 1349 3052 -7413 308 5767 -5146 5911 -1538 -4360 9668
1898 9668 -1443 81 3223 -2532 2741 6339 -5325 1389 3286 -3693 7683 -3236 -3382 4748
1912 4748 -708 896 1970 -4126 569 6218 -4162 2334 -1191 -2649 6647 -1883 -1675 696 -281
1927 -281 743 3463 -5021 -301 3300 -2314 3864 -3371 -1482 3415 1194 -135 25 -528 1388 5663
1943 5663 -2857 1743 983 1469 5400 -730 -159 1077 3409 860 2489 -2394 1355 3667 -684 1557
1959 1557 -3477 1061 926 1796 -1407 -1161 1289 476 2211 -2276 56 398 2782 1079 -1710 824
1975 824 -554 4461 -468 -1048 -343 1297 2149 430 -817 -2299 3975 -857 975 -1536 -3452 3346
1991 3346 147 -747 -1462 13 -793 3772 -2269 -2229 2726 -1980 4315 -989 -2753 2169 2332 59
2007 59 2110 -1125 -1693 6907 -2690 1188 968 -3006 5085 763 -3371 488 1019 -1700 4965 -4839
2023 -4839 -2804 4325 -4349 2484 -1608 -5362 2581 1279 -4354 1300 -2659 -3342 7102 -5995 -1042
2038 -1042 2079 -4441 4112 86 -6395 1849 1610 -4646 4945 -6539 -3191 6035 -6912 34 -1548
2053 -1548 -7119 2381 907 -8885 1642 -3036 -5278 6991 -8837 -2435 3842 -5334 2906 1505
2067 1505 -7175 4839 4070 -5601 7814 -3972 -1215 10168 -5500 1354 3650 -5017 4069 3056
2081 3056 -10052 4464 -916 -6829 6874 -10123 -4163 4447 -8400 -1414 302 -10705 2881
2094 2881 1913 -11523 5508 -5437 -4201 9208 -8072 -1512 5514 -5573 3148 4747 -10263
2107 -10263 7257 2554 -6979 9216 -7157 -2327 9118 -6028 -1014 4740 -8843 4425 3809
2120 3809 -11928 7603 -2052 -4620 9259 -8202 -3317 7296 -6072 1014 5630 -11368 6981
2133 6981 2675 -10378 8088 -5807 -3028 9508 -7343 -3889 6221 -9503 2859 4475 -13656
2146 -13656 8189 -713 -7717 7726 -8108 -4195 10047 -6170 -849 7180 -11487 7216 4462
2159 4462 -10244 10485 -1130 -2479 11284 -5505 -3401 11248 -6243 4844 8816 -11395 10694
2172 10694 2084 -8097 9833 -3855 -2727 12198 -6574 -4239 7737 -12374 5481 4379 -13012
2185 -13012 7922 -2359 -8490 6658 -8139 -7092 11314 -8868 -767 6077 -14987 6988 2132
2198 2132 -10063 9046 -1414 -4666 11645 -7261 -4738 11895 -8635 7325 7315 -11679 9085
2211 9085 1189 -7428 9870 -2557 -4027 14734 -8189 -2104 7923 -11938 8586 4897 -9981
2224 -9981 7965 -204 -7981 9607 -6920 -5620 13364 -9266 1958 4434 -13806 6108 1885
2237 1885 -9700 7846 -2268 -7886 11259 -10039 -4876 9664 -9843 6802 4625 -11510 6210
2250 6210 1643 -8117 10881 -2942 -4502 14312 -9129 59 6074 -10099 8280 5508 -9169
2263 -9169 7095 -477 -8535 11172 -7638 -3146 11550 -8705 3255 3088 -11947 5285 3832
2276 3832 -8471 9258 -2836 -6613 11547 -10009 -1943 7406 -8185 5166 3565 -11779 4104
2289 4104 679 -8957 10192 -6219 -4475 10092 -9329 -11 4063 -8708 5984 5889 -9239 7538
2303 7538 -610 -5598 12437 -5808 274 10327 -5031 4059 5307 -8871 6509 5095 -7500
2316 -7500 10088 -4408 -4854 9781 -7346 -949 5359 -6956 3340 4283 -11515 5091 102
2329 102 -6716 9856 -5963 -2814 7826 -6005 -357 4732 -8043 4932 4953 -9196 6760 -3156
2343 -3156 -4220 8914 -5459 -1967 6145 -4939 1536 5067 -9640 5646 2919 -5636 8152
2356 8152 -4123 -2495 8012 -3334 -759 5868 -5759 4047 4926 -8819 5989 -952 -3418 7141
2370 7141 -4573 -3255 5669 -3944 -684 4498 -8432 4637 2937 -6470 5302 -2935 -2122 6913
2384 6913 -2305 -2507 6037 -4208 2558 4936 -7686 5446 948 -3408 4703 -3158 -3106 5529 -3102
2399 -3102 -2628 4100 -7241 3093 1991 -7020 3435 -1893 -2596 4289 -2634 -3882 5244 -3456 837
2414 837 3524 -6685 4178 1532 -3059 2866 -1532 -2336 4876 -1990 -3260 3920 -5201 2076 1304
2429 1304 -6020 1956 -691 -2429 1436 -2690 -4637 4045 -3234 -1440 1621 -5955 2719 532 -3524
2444 -3524 558 -587 -2071 3171 -1626 -3323 3855 -2739 2001 1065 -3555 2006 1320 -960 651
2459 651 -564 -2786 3562 -2042 -1943 615 -4044 1516 -761 -3575 -1253 -272 -2292 440 -2165 -3908
2475 -3908 2493 -2227 437 -407 -1995 1538 1324 -149 -211 930 -697 3578 -846 -1326 1094 -1084
2491 -1084 1242 -1409 -1920 -1983 90 -2043 -2064 -3078 -3617 183 -3085 -2054 -3164 -1573 -416 -928 -944
2508 -944 -2084 1216 52 1900 -311 487 1498 2276 2401 -742 2064 312 2154 711 -1038 -140
2524 -140 -326 649 -988 -697 -2989 985 -1350 -1622 -713 -3276 628 405 -852 -1728 459 -800 1871
2541 1871 717 -2653 2538 -626 1360 1787 -1122 796 1536 -534 -570 172 -2756 2666 -782 -2481
2557 -2481 822 -2697 423 911 -2473 -1534 1851 -1992 1729 447 -3552 4256 -338 66 1895 -1726
2573 -1726 873 3769 -1350 46 2314 -3167 4158 -356 -3423 2881 -1699 -70 1971 -3035 -1228
2588 -1228 3512 -3532 1377 604 -4748 4789 -954 -2080 2365 -2044 -268 4103 -3709 -952 3569
2603 3569 -4261 3900 -377 -4195 4308 -850 -985 3349 -2784 -876 5480 -3916 1781 2276 -3953
2618 -3953 6246 126 -2778 4239 -524 -612 5222 -4063 -583 5293 -5320 3210 -42 -4966 4437
2633 4437 -737 -3621 2849 -3221 -2388 5522 -6254 273 2367 -5625 4331 -837 -5068 4003 -361
2648 -361 -2714 5092 -4677 -960 6404 -5597 3185 1593 -4931 5096 77 -4502 4603 -1602 -2107
2663 -2107 7268 -5901 217 4300 -5798 4063 568 -4770 5183 695 -4338 5545 -4119 -1487
2677 -1487 7388 -6426 2016 2208 -5429 4477 572 -6018 5334 -589 -3120 7266 -6640 -392
2691 -392 5674 -5680 3470 1883 -5285 4983 538 -6188 6135 -3220 -1717 7760 -7021 683
2705 683 3223 -5803 3756 1098 -6462 5800 -276 -5090 6591 -5988 -346 7070 -5440 2409
2719 2409 2747 -5914 4495 1610 -6713 7554 -1779 -2573 6994 -7320 -500 4765 -5580 2792
2733 2792 2276 -7523 4974 -291 -6712 6990 -4556 -625 7048 -6193 275 3539 -6000 4186
2747 4186 3113 -6893 7771 -1144 -4343 6957 -6095 430 6989 -4866 1400 3018 -7915
2760 -7915 5171 1162 -6624 7777 -2963 -1869 6238 -6331 -623 5607 -4751 3407 3392 -8103
2774 -8103 6404 -803 -5306 6977 -4197 -614 6340 -6172 -1307 3711 -7522 4598 2004
2787 2004 -7346 6504 -3114 -4032 5228 -5179 -633 6878 -5050 1191 3256 -7784 6483 820
2801 820 -5000 6948 -3006 -1960 5522 -5472 -1459 5740 -6076 3750 1664 -8280 5307 -2200
2815 -2200 -4485 5411 -3553 -1322 6200 -5972 -487 4319 -6525 6416 1853 -5277 5881 -1873
2829 -1873 -2375 5776 -3666 -682 7315 -5513 2368 2165 -7521 5845 -89 -4144 4854 -3067 -2825
2844 -2825 5559 -5865 -1031 5026 -6339 4767 586 -6437 4487 -918 -3374 5166 -2845 -1713
2858 -1713 6634 -6131 931 3231 -5445 5666 654 -4521 4142 -1173 -2965 6028 -3973 -996
2872 -996 5718 -6000 2509 718 -5725 3896 108 -4407 3959 -2922 -3437 5726 -5952 33 3290
2887 3290 -4787 3752 707 -4689 3947 534 -2897 6062 -2671 -798 6334 -4178 2642 2318 -3654
2902 -3654 4224 1320 -4202 3276 -1356 -3141 5259 -5247 -927 2759 -4890 1714 -81 -4978 2527
2917 2527 714 -3864 4179 -2476 -1209 5684 -3729 1742 2899 -2073 3574 2236 -3404 3593 747
2932 747 -2350 5026 -3872 -838 2908 -3848 74 119 -4310 1439 669 -4953 2355 -2428 -1952 3886
2948 3886 -3868 218 2349 -1905 2106 1893 -3034 3298 1736 -2018 4376 -2129 79 3414 -2184
2963 -2184 147 984 -2445 824 950 -4541 1867 -1735 -1740 2417 -3445 -465 1568 -1314 452 1786
2979 1786 -2276 2625 1325 -2032 3180 -1066 532 2386 -1055 -129 1544 -884 699 1262 -3429
2994 -3429 1845 -509 -1596 1676 -2469 -299 1161 -939 -780 860 -1749 1479 1123 -2083 1914
3009 1914 -789 505 1353 -809 -560 1056 -475 -319 353 -2591 1343 -389 -1291 -69 -1641 -118
3025 -118 -67 -548 -1507 763 -856 907 484 -1413 1471 108 1447 330 217 -49 1167 595 -223
3042 -223 1010 -935 1198 -594 -468 -465 -529 34 -423 122 -1529 442 -310 221 -203 -367 772 133 1519
3061 1519 -447 746 418 728 1088 -371 330 230 1036 -656 611 -1169 111 773 -1603 363 -1329
3078 -1329 -304 146 -241 -1346 249 53 -548 1427 -2085 750 598 -397 965 -620 -129 886 1080
3095 1080 -1549 1654 -1174 561 1694 -2221 927 -494 -484 728 -273 -1969 1360 -523 -1211 1768
3111 1768 -2848 1283 1187 -1378 970 -233 -950 1670 -51 -2219 2334 -1511 90 1905 -2883 1345
3127 1345 641 -905 1048 179 -1964 2901 -189 -1363 2830 -2634 1372 1847 -1809 970 694 -1496
3143 -1496 2074 -126 -2690 3270 -2473 -708 2571 -3094 1538 1446 -2545 1117 778 -2813 3187 -781
3159 -781 -2540 3426 -2700 885 2237 -2922 586 1637 -2557 2243 558 -3893 3850 -1813 -1026
3174 -1026 2674 -3387 863 2091 -2774 1074 1742 -3465 3824 -295 -1761 3988 -2006 437 2969
3189 2969 -3585 948 2731 -2998 2621 643 -3388 4373 -1821 -1742 3330 -2740 431 3065 -3237
3204 -3237 782 2741 -4114 3271 -517 -3074 4705 -2038 -281 3146 -2904 298 3637 -3703 1855
3219 1855 1800 -4136 4710 -1661 -2796 3445 -2506 -494 3246 -3826 -69 2837 -4233 3163 80
3234 80 -3246 4732 -1619 -1406 3074 -2358 -102 4494 -3924 1980 2233 -4412 5028 -670 -2752 3904
3250 3904 -1662 -1949 3207 -3344 166 3015 -4808 3372 1197 -4232 4304 -1116 -2340 3756 -1724
3265 -1724 -687 4505 -4593 1100 2898 -4336 4752 207 -2570 4571 -1233 -2201 3835 -3343 157
3280 157 5057 -4780 2703 990 -4387 3995 -1078 -2880 4425 -1206 -1583 4300 -5164 376 3438
3295 3438 -4621 3589 194 -3686 3988 -1193 -2990 4654 -2093 -57 4844 -5261 1772 1923 -3640
3310 -3640 4187 282 -3197 4268 -1190 -2778 4351 -4391 476 3663 -5046 1909 -372 -4448 2785
3325 2785 -750 -3747 4125 -2423 -1811 4044 -5464 1102 2672 -3479 3459 954 -3468 3615 -456
3340 -456 -2736 5349 -2725 685 4311 -4795 1286 1159 -3654 2777 264 -4111 3732 -2537 -2933 3906
3356 3906 -4701 811 3029 -3692 1705 646 -3914 3712 433 -2914 5397 -2655 -331 3765 -4054
3371 -4054 1659 2413 -2972 2256 766 -4728 2913 -1625 -3266 4080 -4285 -195 2131 -4397 151
3386 151 955 -3661 2602 663 -3565 4521 -2055 -1150 3894 -2977 1113 3352 -2467 1007 1137 -3951
3402 -3951 3616 -245 -3076 4056 -2917 -1091 1858 -3793 138 2272 -3776 2287 301 -4426 4070
3417 4070 -922 -970 3653 -2822 448 3190 -2799 1422 2708 -3140 3695 -477 -3054 4150 -1652
3432 -1652 -1445 1967 -2460 -653 1845 -3885 272 645 -3790 2597 -969 -1649 3203 -1500 66 2922
3448 2922 -1674 518 2837 -2708 2450 258 -2425 3314 -1378 -1097 1842 -2166 -995 2217 -3612
3463 -3612 363 778 -3508 2346 -1013 -2187 1948 -1362 -847 2422 -1922 -193 2807 -2345 2274
3478 2274 484 -2195 2863 -594 -1019 1873 -1171 -956 2491 -2640 135 1204 -2646 1933 -613
3493 -613 -1859 1363 -534 -940 1833 -1345 -242 2681 -2100 1884 875 -1531 2474 114 -722 1531
3509 1531 -90 -394 2294 -2040 374 1099 -2178 1265 -822 -1454 740 -184 -1137 1097 -1210 -501
3525 -501 1789 -1964 707 554 -1038 1414 149 -888 1024 447 -740 1878 -1229 -90 1331 -1412
3541 -1412 809 -394 -1054 415 291 -1404 559 -679 -597 1281 -1627 268 264 -379 449 -37 -696 393
3559 393 560 -839 903 -1107 154 686 -762 217 -296 -20 64 389 -1039 573 -196 -554 863 -954
3577 -954 446 104 59 85 114 -78 38 651 -728 963 -289 333 336 -173 236 -134 491 -240 374 -263
3597 -263 146 177 -232 235 -702 269 -579 523 -523 -177 292 -437 438 -518 39 -163 365 -320 -45 5
3617 5 -708 722 -688 216 18 -163 316 51 -530 -133 588 -886 776 -679 -313 926 -495 201
3635 201 80 -357 -73 897 -1249 430 -9 -896 1448 -920 242 693 -432 6 325 -792 461
3652 461 1202 -1235 997 -109 -222 1696 -979 76 578 -138 -90 1316 -1330 1110 653 -1227 1951
3669 1951 -1032 -679 906 -515 -344 1168 -1306 437 1364 -2076 1483 -193 -1012 1849 -965 -622
3685 -622 1264 -635 -287 1963 -2384 1090 547 -1920 1818 -895 -820 1361 -816 -1058 1543 -1831
3701 -1831 101 1518 -2522 1518 -28 -1416 1890 -752 -1151 1743 -908 -497 2337 -2379 865
3716 865 1051 -2319 1845 -372 -983 1998 -436 -1204 2294 -1421 287 2138 -2892 1854 366 -1766
3732 -1766 1624 -864 -1639 2248 -1186 -1221 2520 -2875 595 1426 -2547 1828 -69 -1601 1917 -514
3748 -514 -1839 2938 -1766 -113 2509 -3366 1611 738 -2058 1650 -374 -2254 2311 -1307 -1741 2956
3764 2956 -2927 436 1904 -2664 1435 337 -1871 1469 -720 -2746 3001 -1577 -718 2051 -2574
3779 -2574 983 771 -2680 1679 909 -1889 2593 -770 -1983 3265 -2365 -227 2247 -3311 891
3794 891 814 -3190 2338 79 -2589 3587 -1292 -1871 2274 -2761 884 1484 -2674 1666 1064 -2667
3810 -2667 2221 5 -2189 4105 -2382 -335 1967 -3186 229 1895 -2859 1169 551 -3087 3075
3825 3075 -1843 -1582 3183 -2300 885 1930 -2702 854 1292 -3181 2486 -278 -1409 3425 -2107
3840 -2107 -1206 2460 -2368 845 2433 -3112 940 943 -3569 2398 -1205 -2109 2887 -2132 -330 1809
3856 1809 -2572 709 2367 -2814 2627 525 -2724 3565 -1979 -1065 3127 -1457 211 2350 -2937
3871 -2937 458 1572 -3453 2807 -339 -1852 2626 -2197 -1225 2178 -2255 354 2407 -3337 2029
3886 2029 729 -2929 3237 -588 -754 2801 -1370 -346 2310 -2600 812 2143 -3234 2519 -381
3901 -381 -2467 2214 -1574 -1337 2515 -2117 -385 2365 -3762 1094 956 -2893 2919 -587 -1428 2471
3917 2471 -1434 -870 2991 -2188 598 2292 -3319 2011 -254 -2087 2310 -930 -1408 2270 -1906
3932 -1906 -1151 2211 -3355 1329 1321 -2730 2343 -249 -1630 2217 -374 -1095 2984 -1795 470 2348
3948 2348 -2732 1646 459 -1668 1973 -293 -1821 2091 -1225 -1150 2700 -2550 726 1313 -2432 1445
3964 1445 -167 -1760 1966 -318 -1396 2846 -1701 -207 2201 -2550 1381 795 -1889 1666 -47
3979 -47 -2084 2007 -713 -1500 2475 -2308 491 1020 -2504 744 421 -1746 1314 -160 -2007 2158
3995 2158 -1444 -506 2168 -2167 843 696 -1503 1041 498 -1738 1598 -511 -1324 2303 -2065 322
4011 322 1376 -1776 940 580 -1653 917 89 -1627 1975 -897 -276 2096 -1723 662 1168 -1037
4027 -1037 504 753 -1588 1578 -141 -1298 1959 -1327 343 1079 -1337 290 896 -1045 563 403
4043 403 -1526 1626 -827 -524 1286 -1541 249 893 -1072 132 860 -1401 929 146 -1207 1526
4059 1526 -827 -333 699 -848 9 408 -1069 357 612 -1511 1336 -435 -381 837 -752 87 510
4076 510 -458 -147 899 -1061 683 -6 -1178 1203 -587 -137 600 -401 -275 660 -486 98 604
4093 604 -903 1091 -351 -106 636 -297 89 239 -24 -433 933 -749 348 236 -421 822 -461
4110 -461 27 113 -4 -284 221 -346 -317 429 -869 341 -468 37 -27 -66 71 -108 93 -539 319 -788
4130 -788 381 -91 -406 258 -366 161 -543 454 -445 -112 164 -308 289 -291 209 -572 175 -264 -58 -19
4150 -19 -492 293 -715 290 -332 253 -329 115 -177 -558 623 -491 412 -102 -146 288 -127 -261 108
4169 108 232 -476 876 -645 65 313 -700 704 -58 -181 203 350 -745 582 -312 -363 1100 -843
4187 -843 720 1 -542 480 256 -352 615 167 -842 1230 -865 385 633 -1046 390 -1 -363
4204 -363 444 313 -1090 1077 -666 -771 1054 -1378 502 191 -958 368 240 -950 850 -357
4220 -357 -1168 1559 -1241 -158 1032 -1033 473 288 -834 469 449 -1286 1323 -356 -637 1383
4236 1383 -1359 402 658 -1153 416 638 -1183 1008 197 -1513 1747 -594 -133 1204 -845 497
4252 497 701 -994 511 707 -1373 1582 -458 -1053 1766 -1230 221 1194 -1300 165 950 -1280
4268 -1280 896 394 -1791 1913 -935 -712 1572 -1182 176 1052 -1280 554 996 -1711 1767 34
4284 34 -1181 1633 -1278 -165 977 -1314 -108 1239 -1891 951 336 -2267 1793 -994 -677 1407
4300 1407 -1313 -47 1377 -1620 175 1297 -2077 1796 150 -1507 1809 -919 -617 1581 -1151
4315 -1151 -45 1637 -2040 827 623 -2295 2097 -395 -1005 1963 -949 -586 1926 -1370 454 1928
4331 1928 -2258 1814 227 -1736 2025 -806 -649 1908 -1059 -383 1986 -2309 605 1135 -2032 1802
4347 1802 -353 -1336 1579 -960 -1333 1796 -1761 -396 1895 -2516 1079 43 -2040 1930 -300
4362 -300 -1429 1590 -1079 -947 2185 -2125 812 1694 -2311 1592 -554 -1898 1726 -376 -1075 2557
4378 2557 -1356 -341 1858 -2569 1229 578 -1832 1741 -81 -1628 1703 -954 -1093 2447 -1988
4393 -1988 376 1306 -2515 944 393 -1637 1495 -85 -1485 2013 -1310 -756 1989 -2157 853 1186
4409 1186 -1789 1156 115 -1842 1778 -298 -1245 2434 -1609 63 1545 -2249 1181 732 -1585
4424 -1585 1568 147 -2252 1918 -884 -1104 2356 -2258 679 1111 -1992 622 423 -1613 1841 -230
4440 -230 -1873 2234 -1895 -38 1681 -1978 700 1117 -1778 723 191 -2204 1865 -788 -838 2193
4456 2193 -1972 -188 1183 -1575 471 928 -1341 1611 206 -1729 2030 -1306 -236 1996 -1692
4471 -1692 552 1174 -1632 942 983 -1927 1951 -547 -1177 2083 -1609 -31 1283 -1053 302 1098
4487 1098 -1745 976 70 -1854 2028 -651 -698 1581 -1461 112 1080 -1640 420 1024 -1908 1494
4503 1494 -222 -1276 1671 -1077 -102 1341 -1151 -95 1146 -1752 661 337 -1827 1819 -736
4518 -736 -746 1282 -1062 -312 1117 -1304 -9 927 -1967 1045 -172 -1232 1629 -791 -466 1224
4534 1224 -783 -457 1070 -1614 863 620 -1698 1461 -433 -653 1253 -732 -392 1378 -915 -29
4550 -29 1063 -1511 1047 328 -1173 1193 -307 -483 851 -589 -390 1311 -1198 432 740 -1286
4566 -1286 1189 -144 -617 1223 -413 -481 1229 -677 -313 1262 -1470 895 51 -837 873 4 -611
4583 -611 514 -452 -535 1265 -988 157 503 -881 983 31 -668 677 153 -474 800 -509 -152
4600 -152 836 -959 238 -86 -679 779 76 -552 635 -37 -520 807 -918 -28 646 -942 608
4617 608 -12 -215 372 174 -382 674 -247 -310 562 -972 410 26 -248 526 478 -181 295 315 -320 549
4637 549 -286 106 496 -347 551 -56 -196 285 462 -477 269 -29 -163 626 -518 181 -107 -275 28 171
4657 171 -495 144 213 -433 449 -450 26 74 -11 -112 -341 283 -210 257 -321 137 -10 -53 74 -168 116
4678 116 -216 247 69 -160 62 -162 197 -129 230 -462 295 64 -60 -166 -277 534 -459 429 0 -97
4698 -97 42 86 61 -45 504 -315 488 -120 -51 225 -170 106 -87 -359 -297 227 -563 -33 -25 -527 443 -288
4720 -288 157 -122 -195 100 501 -217 76 519 -455 848 -147 -352 589 -337 6 350 -354 -198 372 -673
4740 -673 70 -155 -842 471 -411 -175 296 -221 -283 511 -457 104 706 -770 896 -170 -505 769 -366
4759 -366 24 691 -279 -196 835 -1106 275 218 -801 684 -628 -365 489 -221 -332 574 -967 116
4777 116 819 -1116 938 154 -309 990 12 -250 875 -241 -89 1075 -1036 472 513 -1055 962
4794 962 -590 -601 804 -258 -676 747 -1149 -245 894 -1373 384 -17 -631 574 -185 -616 945
4811 945 -297 -192 1287 -1358 475 745 -976 1080 -75 -788 825 -376 -909 1134 -879 -45
4827 -45 766 -1460 683 403 -932 634 176 -1068 1118 -164 -737 1350 -1233 547 1040 -1009 591
4844 591 248 -765 1185 27 -836 1606 -776 -364 1170 -1403 418 731 -1023 432 349 -1196 1193
4861 1193 -283 -930 1580 -1022 395 1079 -1239 492 713 -988 883 407 -1421 1453 -842 -753
4877 -753 1441 -1405 522 930 -1171 326 338 -1028 1401 -94 -1115 1590 -1096 -145 1317 -1097
4893 -1097 628 801 -1012 471 174 -1494 1230 -632 -622 1423 -1249 117 821 -1276 301 816
4909 816 -1476 878 -2 -1263 1635 -626 -85 1037 -896 382 938 -1274 493 866 -1333 1519
4925 1519 -105 -594 1486 -1231 -146 1033 -994 365 1065 -1300 1057 -17 -1655 1582 -548
4940 -548 -357 1505 -1217 -201 1406 -1375 547 1003 -1357 1216 -169 -1263 991 -418 -165 1187
4956 1187 -874 -17 1181 -1606 626 325 -1141 1560 -695 -802 1055 -1052 -485 962 -1150 253
4972 253 1010 -1841 1066 -439 -860 1369 -413 -599 1243 -775 -94 1171 -1342 756 875 -1122
4988 -1122 1475 -229 -755 1138 -405 -437 1233 -1201 0 1177 -1723 794 184 -1018 1043 -37
5004 -37 -924 884 -842 -373 1316 -1334 609 903 -1142 1027 -62 -602 1274 96 -458 1317 -1404
5021 -1404 -227 990 -1557 679 258 -912 940 -65 -1134 1230 -654 -682 1059 -1307 232 536
5037 536 -1348 727 -204 -806 885 146 -1001 1014 -858 -374 886 -1066 603 449 -862 687
5053 687 103 -804 1019 -143 -1100 1120 -1107 221 856 -1361 686 209 -1035 612 210 -1548 975
5070 975 -1111 45 580 -1146 228 557 -937 48 359 -641 1063 221 -341 613 -733 381 590
5087 590 -829 370 216 -509 -240 360 -353 801 105 -166 857 -958 544 653 -1102 883 493
5104 493 -322 1003 67 -485 1311 -481 411 576 -617 114 531 -504 446 527 -811 909 -133 -187
5122 -187 501 -649 77 361 -650 -26 149 -927 326 -4 -628 673 -395 137 231 -627 -245 513
5140 513 -226 47 514 -517 896 27 -347 659 -158 29 412 -162 -294 588 -565 422 231 -171 867
5159 867 -140 390 53 -317 -88 704 -57 -28 563 -20 703 -125 -142 370 -123 188 198 -259 -244 210 -518
5180 -518 -413 -444 -652 137 -528 -569 -338 -221 -331 292 -374 -76 72 -230 210 -9 177 354 78 420 126
5201 126 193 191 473 -410 79 139 -41 314 -338 -398 -379 46 -370 -54 -273 -51 227 -177 137 -265 111 104 496
5224 496 275 -17 311 -157 442 -103 108 -71 3 -20 -234 12 -268 325 -491 -436 -163 -344 152 -12 -12 -275
5246 -275 361 -16 87 165 -182 484 395 696 36 88 93 547 160 85 473 -184 429 -68 -50 -150 -98 99 -93
5269 -93 290 -469 504 -147 68 235 -352 267 467 255 -186 16 -43 114 313 -420 529 -134 368 210 -333
5290 -333 59 263 -106 770 569 -267 925 -210 174 584 -503 144 617 -385 659 719 -671 1388
5308 1388 -58 -396 586 -259 -343 -61 -250 -44 37 -1959 412 61 -793 699 -727 -564 335 -252 90
5327 90 482 -200 91 726 -539 778 -87 -517 740 35 79 395 -439 64 371 -655 24 324 -693
5346 -693 623 -471 -648 338 -186 -133 281 -618 -31 880 -702 69 283 -559 964 -98 15 574 -257
5365 -257 -183 750 -547 225 846 -489 793 -176 -1114 620 -657 -244 243 -967 -104 422 -921 147
5383 147 -99 -1034 533 -608 -6 990 -209 -869 681 -949 443 456 -674 953 -290 -751 786
5400 786 -281 -103 889 -721 149 824 -932 190 -155 -959 470 -480 -710 1128 -249 -496 733
5417 733 -991 52 747 -1188 690 -52 -932 829 -540 -513 1112 -369 -445 945 -691 317 724
5434 724 -746 323 128 -738 753 -259 -593 945 -876 -348 606 -1401 307 232 -596 687 -32
5451 -32 -795 486 -303 -292 1133 -1191 305 843 -398 620 193 -365 1025 26 -535 1052 -332 65
5469 65 803 -976 523 437 -872 628 253 -948 590 -296 -601 838 -937 279 586 -1123 131
5486 131 78 -529 573 60 -951 1149 -509 -406 751 -1005 166 808 -679 136 354 -827 1189
5503 1189 -242 -681 944 -510 -17 577 -935 236 564 -327 544 -2 -958 1361 -282 -210 966
5520 966 -447 28 827 -582 187 594 -885 1051 77 -1166 1095 -542 -221 407 -672 246 655
5537 655 -855 -50 177 -1089 745 -376 -289 713 -702 -151 526 -781 -40 648 -674 1057 286
5554 286 -822 898 -371 -322 834 -517 32 695 -740 225 409 -888 892 -301 -844 645 -206
5571 -206 -183 610 -694 41 500 -1046 532 292 -1063 1055 -155 -382 248 -583 -543 1127 -1016 -52
5589 -52 637 -1080 407 -191 -622 651 -311 -685 593 -353 116 723 -1087 683 86 -356 1049 -490
5607 -490 -248 754 131 179 972 -249 412 385 -630 775 195 -556 397 203 -576 77 -123 -351 11
5626 11 -1156 106 22 -570 69 -223 -237 483 36 -387 863 -88 84 486 -189 390 505 -349 581 436
5646 436 -25 414 -357 -393 765 -385 192 610 -782 411 -132 -235 356 368 -769 930 -232 -140 122
5665 122 0 101 -33 -123 488 311 -164 597 -134 -591 532 -712 552 752 -518 -204 147 261 110
5684 110 656 -516 402 -694 -473 242 -346 109 84 254 236 -28 -356 351 -443 -671 111 -1064 -218 -215
5704 -215 -750 486 442 134 15 -173 -621 951 -737 -1104 -178 -607 371 -68 76 -449 -238 -1031 397
5723 397 27 -603 55 -550 315 413 -184 -465 -215 -81 -86 38 -643 298 84 -369 17 -63 -302 379 474 268
5745 268 312 237 438 139 -51 233 26 420 -37 -110 -152 186 160 -20 -143 -359 148 -264 15 -181 -261 10
5767 10 -288 -186 -163 212 342 83 77 92 221 -135 359 -252 168 101 120 343 -132 86 -128 -82 -339 -250 -278
5790 -278 -185 38 -332 102 -437 9 -161 -109 -46 -25 145 73 442 -409 318 203 137 237 -72 181 101 -88
5812 -88 -268 75 -252 57 17 -282 -74 -313 90 10 -68 -477 -45 -105 18 220 -509 38 -87 -452 128 -302
5834 -302 118 -5 163 -377 462 -201 235 482 -311 117 -72 -220 109 113 -662 246 -262 -174 257 -581 407
5855 407 -10 -623 32 -91 -351 206 -4 -594 468 -310 59 337 -410 294 187 -243 135 -134 -412 513
5875 513 -126 -287 635 -347 206 16 -446 112 -355 -293 229 -92 -520 600 -547 -173 281 -617 127 145
5895 145 -193 171 16 -183 553 -154 -253 404 -324 480 354 -305 258 490 -447 330 -84 -440 767 -435
5915 -435 -201 177 -511 515 297 -213 -165 374 -467 689 -148 -422 802 -321 52 129 -612 -163 419
5934 419 -814 112 -156 -628 528 -336 -490 247 -351 106 192 -687 192 357 -801 359 -84 -592 690
5953 690 -229 -139 573 -595 101 586 -614 178 185 -358 865 -156 -218 684 -241 90 522 -670 -48 642
5973 642 -832 537 69 -373 607 -546 23 325 -331 170 285 -903 371 354 -763 518 -198 -392
5991 -392 709 -326 -326 406 -633 -32 797 -1019 252 74 -547 745 -342 -435 427 -253 -278 670 -668
6010 -668 344 695 -886 507 109 -117 1027 -5 -180 703 -339 -34 802 -1078 463 208 -441
6027 -441 618 -295 -721 477 -517 -223 321 -928 46 261 -819 354 -334 -891 519 -277 -508 767
6045 767 -512 -235 610 -863 511 383 -151 796 213 -161 782 196 -113 948 -494 446 575 -621
6063 -621 506 80 -696 557 -375 -545 590 -226 -545 200 -956 167 508 -480 488 109 -288 601
6081 601 34 -710 760 -46 101 553 -652 107 218 -602 450 -18 -717 716 -500 -500 544 -703
6099 -703 337 475 -569 156 444 -568 467 281 -583 1004 -54 -95 912 -157 166 631 -197 479
6117 479 89 -954 452 58 -915 508 -713 -45 476 -253 -270 733 41 56 -338 -560 1053 -785
6135 -785 -613 1118 -1179 435 567 -662 -39 -216 -216 -62 -403 -416 480 -639 153 712 124 119 294 -416
6155 -416 337 336 -651 702 77 -343 316 -290 266 527 -467 340 10 -284 -45 -249 -769 -4 -44 116 -80
6176 -80 -235 -35 99 -689 188 32 -466 652 -54 -116 381 -194 -26 432 -147 34 311 -460 191 -27
6196 -27 -348 237 -62 -328 59 -187 -254 171 -410 -6 202 -304 314 -32 -217 190 211 53 39 -392 -241
6217 -241 526 -183 325 95 -258 512 25 -64 186 103 -225 339 -485 -94 -101 -338 -107 -312 -157 40 -160
6238 -160 -115 -207 -211 -33 271 -496 143 -289 2 289 3 -89 -8 198 -97 49 -462 100 269 -201 448 -259
6260 -259 -42 204 -91 -97 172 -153 -213 220 -558 133 -86 89 -2 -305 -230 35 128 -223 117 -46 357 85
6282 85 -189 48 -193 153 149 165 -169 -47 203 92 78 -248 191 -194 107 121 -147 -93 -169 128 -243 119 -178
6305 -178 129 133 -438 -94 -159 309 114 133 -25 79 112 -54 69 -132 -100 20 218 -213 -78 -55 53 134 -119
6328 -119 -119 -320 63 -138 -174 -43 -211 283 -263 37 -94 14 229 -6 -88 -90 286 -116 22 -77 -38 72 -154
6351 -154 73 73 -180 57 170 -384 108 151 103 230 -273 -45 185 181 348 90 -33 148 284 -284 260 -165
6373 -165 -30 518 -78 -93 -189 -226 172 -3 -482 26 -111 -374 190 -258 -164 -52 -171 -133 85 -451 133 314
6395 314 -583 236 -157 -117 410 -82 11 280 69 -66 197 -458 332 260 -183 176 -304 74 442 -118 -34
6416 -34 204 -98 171 84 -260 361 -61 72 530 -129 -57 246 13 172 87 -421 332 151 -503 64 -456
6437 -456 -103 413 -103 -354 174 -505 -147 142 -649 143 125 -113 225 -176 -413 241 -263 -257 281 -532 256
6458 256 248 -337 325 45 -136 248 100 -57 752 -238 60 490 -442 375 177 -436 298 1 -247 306 -241
6479 -241 -604 92 -599 146 239 -568 147 116 -319 274 -87 -420 527 -163 -58 398 -524 395 50 -354 239
6500 239 163 -216 331 -98 -462 591 -321 -129 165 -634 233 -26 -67 44 -6 -360 436 -125 73 680 -406
6521 -406 110 352 -500 194 355 -316 405 -37 -362 547 -155 -38 351 -488 276 119 -239 18 311 -165
6541 -165 605 -426 -416 641 -465 283 29 -527 85 465 -635 194 2 -574 475 -341 -304 231 -767
6560 -767 19 522 -461 151 367 -469 475 -133 -149 558 -84 121 167 -432 179 360 -282 137 189 -422 571
6581 571 -383 -426 220 41 109 473 -543 -89 543 -543 529 -121 -421 377 -4 -92 145 -281 234 559
6601 559 -309 178 274 -326 439 -76 -218 536 -155 -101 176 -508 -93 250 -662 393 -100 -333 419 -246
6621 -246 -235 -111 -181 47 536 -392 258 388 -327 467 -143 15 330 -224 43 417 -169 168 316 -299 105
6642 105 4 -541 382 -177 -158 336 -364 -21 411 -350 149 244 -361 574 23 -265 449 -138 -259 333 16
6663 16 36 329 -441 130 54 -42 317 -15 -250 436 -12 -247 307 -565 54 477 -328 276 -212 79 189
6684 189 -180 -502 239 -246 -145 206 -456 10 272 -159 173 27 -279 241 -128 -247 305 -403 118 425
6704 425 -509 247 71 18 170 -155 -273 260 -428 -132 287 -412 61 274 -170 212 -46 -63 43 -273 -301
6725 -301 306 -268 176 188 -264 -221 238 129 -16 -128 -329 550 6 6 332 -246 -170 218 -37 -267 205 -365
6747 -365 222 -172 -480 196 -328 108 -59 -139 -87 258 -168 -319 -56 -322 6 439 -313 294 -59 30 -30
6768 -30 -384 83 15 -29 178 43 -49 251 -129 43 135 -263 -41 93 -111 -203 0 -305 448 -293 159 70
6790 70 -219 57 -3 -791 -293 102 518 -142 -461 -308 381 -647 136 -266 -126 -26 67 -308 43 505 -265
6811 -265 91 -523 -448 65 394 152 -298 -138 -955 272 -842 176 -254 -105 45 27 31 -267 156 -175
6831 -175 -325 127 -122 178 75 27 -209 281 -51 -132 58 -16 46 -129 130 -222 67 299 202 -10 -77 -24
6853 -24 62 190 2 2 -167 -216 262 -232 -93 -482 253 240 104 184 -168 -106 -84 -49 -205 -26 -327 112 215
6876 215 326 73 95 190 19 -229 153 79 558 -167 168 156 268 -130 -174 58 -159 264 -107 -125 12 26
6898 26 -84 197 -19 -221 124 -21 228 -86 -246 16 25 -76 133 189 -74 241 -216 49 207 -251 -165 4
6920 4 -75 7 80 -311 51 -104 -139 154 -165 -116 13 -141 218 338 1 -244 -33 -255 290 -54 137 254
6942 254 -43 279 134 -17 43 287 -246 273 132 -266 553 -211 -78 91 -29 76 -15 -105 -141 -84 -245 203
6964 203 -226 143 252 -223 213 313 -203 -71 352 -250 263 25 -189 304 -110 93 354 -165 8 111
6984 111 -413 134 403 -271 244 -38 -139 420 -72 11 143 -19 139 -60 -313 106 118 -264 429 -401 34
7005 34 274 -39 105 117 -127 77 -136 -233 423 -115 -87 341 169 171 8 -145 -158 119 -326 303 196 -234
7027 -234 209 -9 -26 288 -102 -235 245 -199 156 476 -356 152 3 -110 473 -326 -35 72 -205 -76
7047 -76 345 -199 399 -72 -92 44 -215 -79 184 -131 -97 352 -321 -127 366 -686 250 106 -326 92 -212
7068 -212 -177 170 -92 -28 512 -407 285 241 -469 322 -330 -173 382 -139 -75 383 -216 39 358 -564 285
7089 285 -112 -217 255 -191 -220 258 55 -357 395 -590 166 109 -363 204 302 -333 334 -98 -65 617 111
7110 111 264 405 -503 832 279 -400 305 -37 808 570 -339 -446 612 -653 146 111 -333 -71 147
7129 147 -351 286 -164 -214 464 -113 -200 237 -394 149 -1 -346 -13 57 -172 16 -318 -507 403 -184 57
7150 57 103 -484 79 70 -142 348 -33 -308 475 -219 -335 401 -416 65 58 -325 74 52 -362 29 -69 -290 497
7173 497 -6 -17 166 -340 143 166 -168 14 217 -384 673 -103 -505 273 -346 119 -62 -272 157 205 -409
7194 -409 210 23 -245 421 -232 111 231 -146 -54 262 -264 -27 354 -63 225 -263 -181 8 -46 -165 96
7215 96 -137 -49 120 -297 91 133 -219 220 -171 -56 57 -164 174 281 -434 12 45 -58 228 -26 -204
7236 -204 450 -330 4 81 -57 -66 555 -235 240 269 -59 230 161 -238 231 162 -187 172 -158 122 186 -73
7258 -73 -57 -230 -204 71 -32 -255 187 -156 -30 267 -528 166 58 -330 89 -277 -114 75 276 -28 180
7279 180 -119 58 212 -294 89 -77 -149 161 -17 -109 179 -6 -41 -45 -208 172 224 -157 77 -149 -19 -88
7301 -88 -29 -250 71 -241 -160 72 -491 79 123 67 95 -346 -720 84 36 -243 49 -352 34 194 -335 -94
7323 -94 -37 -12 193 109 -330 311 183 191 48 -480 -34 64 -270 457 168 -452 -309 214 -29 56 329 -50 359
7346 359 408 -126 -44 -260 -80 -18 -146 -71 -235 -116 56 -224 -70 -431 225 -512 285 -223 74 -217 -81
7367 -81 407 59 -109 -278 -137 -71 56 -283 -458 273 -310 312 69 -177 253 91 198 43 96 -256 -238
7388 -238 17 -315 -30 -205 151 -159 415 -146 99 12 79 -196 -177 312 -62 -137 -106 -48 -176 -31 271 -421
7410 -421 151 -151 85 -136 146 68 -31 71 -247 74 -56 -2 27 -18 336 -125 182 154 86 -195 21 134
7432 134 -51 317 -266 173 39 -118 38 -220 -153 102 243 152 -48 -167 219 143 -247 -19 -5 127 -116
7453 -116 -143 14 133 -195 83 81 -344 83 121 -214 31 68 -17 87 209 98 76 -398 233 243 -366 86 54
7476 54 -68 -175 -145 10 334 -210 -3 28 -524 113 -149 74 -100 6 -380 -117 170 -177 96 97 422 214
7498 214 -303 176 -86 -36 150 -162 -84 346 -276 -163 -41 -128 64 -114 20 -200 1 108 149 -189 -89
7519 -89 286 -152 364 118 -140 -235 -98 -254 311 100 144 194 -99 -146 234 -899 -28 -522 86 -41 -487
7540 -487 187 15 418 233 576 445 -151 54 -190 -185 -75 48 118 202 -50 578 -58 -6 444 -41 385 271
7562 271 -168 255 -88 -267 128 88 -235 191 -38 126 180 -230 -23 61 -306 285 108 -252 36 -127 -70
7583 -70 560 80 -65 64 -14 -93 -196 -111 286 -357 -111 111 -71 -130 546 -84 -167 873 -484 85 411
7604 411 172 591 -2 418 442 -332 55 148 -213 -7 294 8 119 -50 -148 289 -108 -253 292 -29 -41
7625 -41 309 -246 307 61 -320 259 -191 14 264 -134 13 103 -268 174 245 -377 101 -26 -158 456 -111
7646 -111 107 172 184 -164 236 -318 182 216 -451 75 -83 -139 146 46 -72 194 -1 82 7 -336 302 -55
7668 -55 -281 -74 -205 -6 181 215 -102 415 105 221 96 -657 -154 57 -109 954 -341 -256 -267 117 -321
7689 -321 -3 185 -106 284 63 674 104 -580 264 204 -228 -243 180 -309 -35 -222 -537 270 -232 123 -596
7710 -596 -260 773 21 -300 -291 -376 98 -6 -391 -338 46 -239 122 -4 -447 25 -75 203 64 -316 -49
7731 -49 271 -236 217 146 -343 238 -77 -28 332 -576 -80 104 -134 40 194 -106 22 108 -146 242 -18
7752 -18 27 -82 -411 150 -131 -274 136 -84 -195 150 -472 -27 320 -304 23 33 -300 289 122 -590 -86
7773 -86 -62 -596 -3 68 -134 64 -106 182 203 85 198 490 -45 224 13 471 303 -552 -81 533 -324
7794 -324 289 650 -121 -124 261 -487 91 -560 -62 347 212 398 -336 -112 23 444 -560 -259 -216 -261 36
7815 36 -229 -59 -190 122 -144 48 -307 -20 211 -188 68 -588 -261 -199 -231 96 316 -111 216 351 -50
7836 -50 -383 10 -373 420 -78 -240 80 62 113 -115 -509 365 170 -120 -255 -200 106 202 50 80 316 178
7858 178 240 39 -109 37 -130 -200 351 87 222 -425 176 -29 128 -125 150 25 128 66 243 229 -209
7879 -209 195 -304 189 -497 -8 98 74 246 -353 140 -95 11 -186 -224 -26 222 45 -25 -201 225 -287
7900 -287 76 318 -151 86 -440 4 -206 -152 -565 196 -40 -24 -4 35 -68 45 -111 -135 362 -453 -85 53
7922 53 467 666 -69 -3 207 368 -124 686 231 173 -267 -270 217 -241 -260 -250 -42 -366 253 224 3 -86 616
7945 616 -265 -350 -109 -187 -323 -59 -155 -276 -280 86 16 -236 -59 62 0 -267 285 -325 -148 57 -121 -399
7967 -399 -267 -39 -145 237 -55 474 -31 -419 -60 -64 276 -106 45 -591 39 349 122 -67 -11 124 78
7988 78 -190 -544 -800 -22 -97 -53 -413 40 132 -586 98 97 -24 24 102 -491 332 -107 -210 339 -112 -201 163
8011 163 -80 24 -46 182 -134 -153 6 -24 -421 -115 205 2 -695 -38 42 18 2 576 61 -14 206 186 -505
8034 -505 99 -304 98 -258 256 114 158 248 -8 72 -127 -480 98 173 416 456 315 -578 131 -718 -106 332
8056 332 -176 -215 423 -1080 -14 -232 284 -98 -305 -4 826 631 459 -56 52 -20 167 91 -509 62
8076 62 -775 74 -107 -125 318 -673 -755 387 66 -61 164 -203 -472 538 -112 -393 14 245 174 -103 -336
8097 -336 596 -272 1095 -19 -244 325 -57 -4 -171 -759 -175 -192 -246 -287 -318 -378 129 -811 116 -598 351
8118 351 -19 447 -328 2 833 -89 -657 -4 167 61 82 308 153 -194 559 -200 397 -146 368 -168
8138 -168 782 135 -396 -189 101 22 29 -508 38 452 -492 -345 -290 -11 -5 278 -389 36 127 139 27 15 -454
8161 -454 205 -119 51 371 13 280 -101 -45 447 -469 -127 33 -378 118 -99 -269 -107 -77 -98 -68 -73 -327
8183 -327 -19 -221 -105 123 -164 234 -8 -65
8191f5
##END NTUPLES=NMR FID
##END=
