##TITLE=1H_49-2022
 DMSO-d6
 8 sc, 
 25.07.2022
##JCAMPDX= 6.0         $$ Bruker NMR JCAMP-DX V2.0
##DATA TYPE= NMR SPECTRUM
##DATA CLASS= NTUPLES
##ORIGIN= UXNMR, Bruker Analytische Messtechnik GmbH
##OWNER= root
$$ XWIN-NMR		Version 3.5
$$ Mon Jul 25 14:29:56 2022 Russian Standard Time (UT+4h)  she@DPX200
##.OBSERVE FREQUENCY= 200.1313499994
##.OBSERVE NUCLEUS= ^1H
##.ACQUISITION MODE= SIMULTANEOUS
##.ACQUISITION SCHEME= undefined
##.AVERAGES= 8
##.DIGITISER RES= 18
##SPECTROMETER/DATA SYSTEM= spect
##.PULSE SEQUENCE= zg30
##.SOLVENT NAME= DMSO
##.SHIFT REFERENCE= (INTERNAL, DMSO, 0, 15.7524)
##AUDIT TRAIL= $$ (NUMBER, WHEN, WHO, WHERE, WHAT)
$$ ##TITLE= Audit trail, XWIN-NMR		Version 3.5
$$ ##JCAMPDX= 5.01
$$ ##ORIGIN= Bruker BioSpin GmbH
$$ ##OWNER= she
$$ F:/spectra/data/she/nmr/H-F/1/pdata/1/auditp.txt
$$ ##AUDIT TRAIL=  $$ (NUMBER, WHEN, WHO, WHERE, WHAT)
(   1,<2022-07-25 14:28:39.10 +0400>,<she>,<DPX200>,
      <created by zg, POWCHK disabled, PULCHK disabled
       configuration hash MD5:
       00 E9 B6 7A A2 85 ED C7 34 08 36 98 17 FE 4E 26
       data hash MD5: 16K
       03 7F 91 EE 7F 54 51 2E DB 6F F7 D3 ED C5 04 15>)
(   2,<2022-07-25 14:28:47.67 +0400>,<she>,<DPX200>,
      <Start of raw data processing
       efp BC_mod = 2 LB = 0.24 FT_mod = 6 PKNL = 1 PHC0 = -18039.01 PHC1 = 10.40068 SI = 16K 
       data hash MD5: 16K
       C7 09 93 6F 81 A8 60 16 CB 0D 0F 50 5A C2 9B 5C>)
(   3,<2022-07-25 14:29:05.04 +0400>,<she>,<DPX200>,
      <pk PHC0 = -0.99559 PHC1 = -1.2 
       data hash MD5: 16K
       53 48 17 AB 98 DF F0 D5 13 73 41 A1 75 EE 2D 98>)
(   4,<2022-07-25 14:29:08.40 +0400>,<she>,<DPX200>,
      <abs ABSG = 5 
       data hash MD5: 16K
       4A A8 60 50 13 9C 85 F5 7E 80 8C EA E9 86 DC CA>)
$$ ##END=
$$ 
$$ hash MD5
$$ BA 5B 3B DF 9F 40 02 79 DD 65 BD 49 60 13 15 D3
##$RELAX= 
##$RELAX= 
##$RELAX= 
##$RELAX= 
##$RELAX= 
##$RELAX= 
$$ Bruker specific parameters
$$ --------------------------
##$DU= <F:/spectra>
##$EXPNO= 1
##$NAME= <H-F>
##$PROCNO= 1
##$TYPE= <nmr>
##$USER= <she>
##$AMP= (0..31)
100 100 100 100 100 100 100 100 100 100 100 100 100 100 100 100 100 100 
100 100 100 100 100 100 100 100 100 100 100 100 100 100 
##$AQSEQ= 0
##$AQ_mod= 1
##$AUNM= <au_zg>
##$AUTOPOS= <>
##$BF1= 200.13
##$BF2= 200.13
##$BF3= 200.13
##$BF4= 200.13
##$BF5= 200.13
##$BF6= 200.13
##$BF7= 200.13
##$BF8= 200.13
##$BYTORDA= 1
##$CFDGTYP= 0
##$CFRGTYP= 5
##$CHEMSTR= <none>
##$CNST= (0..31)
1 1 145 1 1 1 1 1 1 1 1 1 1 1 1 1 1 1 1 1 1 1 1 1 1 1 1 1 1 1 1 1 
##$CPDPRG= <>
##$CPDPRG1= <>
##$CPDPRG2= <>
##$CPDPRG3= <>
##$CPDPRG4= <mlev>
##$CPDPRG5= <mlev>
##$CPDPRG6= <mlev>
##$CPDPRG7= <mlev>
##$CPDPRG8= <mlev>
##$CPDPRGB= <>
##$CPDPRGT= <>
##$D= (0..31)
0 1.2 0 0 0 0 0 0 0 0.06 0 0.03 0 0 0 0 0.0002 0 0 0 0 0 0 0 0 0 0 0 0 
0 0 0 
##$DATE= 1658744918
##$DBL= (0..7)
120 120 120 120 120 120 120 120 
##$DBP= (0..7)
150 150 150 150 150 150 150 150 
##$DBP07= 0
##$DBPNAM0= <>
##$DBPNAM1= <>
##$DBPNAM2= <>
##$DBPNAM3= <>
##$DBPNAM4= <>
$$ [...]
##$SUBNAM2= <"">
##$SUBNAM3= <"">
##$SUBNAM4= <"">
##$SUBNAM5= <"">
##$SUBNAM6= <"">
##$SUBNAM7= <"">
##$SUBNAM8= <"">
##$SUBNAM9= <"">
##$SW= 18.0517283424941
##$SWIBOX= (0..15)
0 0 2 0 0 0 0 0 0 0 0 0 0 0 0 0 
##$SW_h= 3612.71676300578
##$TD= 16384
##$TD0= 1
##$TE= 0
##$TE2= 300
##$TE3= 300
##$TEG= 300
##$TL= (0..7)
0 120 120 120 120 120 120 120 
##$TP= (0..7)
150 150 150 150 150 150 150 150 
##$TP07= 0
##$TPNAME0= <>
##$TPNAME1= <>
##$TPNAME2= <>
##$TPNAME3= <>
##$TPNAME4= <>
##$TPNAME5= <>
##$TPNAME6= <>
##$TPNAME7= <>
##$TPOAL= (0..7)
0.5 0.5 0.5 0.5 0.5 0.5 0.5 0.5 
##$TPOFFS= (0..7)
0 0 0 0 0 0 0 0 
##$TUNHIN= 0
##$TUNHOUT= 0
##$TUNXOUT= 0
##$USERA1= <user>
##$USERA2= <user>
##$USERA3= <user>
##$USERA4= <user>
##$USERA5= <user>
##$V9= 5
##$VALIST= <valist>
##$VCLIST= <CCCCCCCCCCCCCCC>
##$VD= 0
##$VDLIST= <DDDDDDDDDDDDDDD>
##$VPLIST= <PPPPPPPPPPPPPPP>
##$VTLIST= <TTTTTTTTTTTTTTT>
##$WBST= 1024
##$WBSW= 4
##$XGAIN= (0..3)
0 0 0 0 
##$XL= 0
##$YL= 0
##$YMAX_a= 405016
##$YMIN_a= -409352
##$ZGOPTNS= <>
##$ZL1= 120
##$ZL2= 120
##$ZL3= 120
##$ZL4= 120
##$ABSF1= 15.77003
##$ABSF2= -2.281819
##$ABSG= 5
##$ABSL= 3
##$ALPHA= 0
##$AQORDER= 0
##$ASSFAC= 0
##$ASSFACI= 0
##$ASSFACX= 0
##$ASSWID= 0
##$AUNMP= <proc_1d>
##$AZFE= 0.1
##$AZFW= 0.1
##$BCFW= 0
##$BC_mod= 2
##$BYTORDP= 0
##$COROFFS= 0
##$CY= -3
##$DATMOD= 1
##$DC= 0
##$DFILT= <>
##$DTYPP= 0
##$F1P= 0
##$F2P= 0
##$FCOR= 1
##$FTSIZE= 16384
##$FT_mod= 6
##$GAMMA= 0
##$GB= 0
##$INTBC= 1
##$INTSCL= 0
##$ISEN= 128
##$LB= 0.24
##$LEV0= 0
##$LPBIN= 0
##$MAXI= 10000
##$MC2= 0
##$MEAN= 0
##$ME_mod= 0
##$MI= 1.114404
##$NCOEF= 0
##$NC_proc= -6
##$NLEV= 6
##$NOISF1= 3.799351
##$NOISF2= 2.8
##$NSP= 0
##$NTH_PI= 0
##$NZP= 0
##$OFFSET= 15.7524
##$PC= 1
##$PHC0= -18040.01
##$PHC1= 9.20068
##$PH_mod= 1
##$PKNL= yes
##$PPARMOD= 0
##$PSCAL= 0
##$PSIGN= 0
##$REVERSE= no
##$SF= 200.130003830164
##$SI= 16384
##$SIGF1= 3
##$SIGF2= 2
##$SINO= 5.538805
##$SIOLD= 16384
##$SREGLST= <1H.CDCl3>
##$SSB= 0
##$STSI= 16384
##$STSR= 0
##$SW_p= 3612.71676300578
##$SYMM= 0
##$S_DEV= 0
##$TDeff= 16384
##$TDoff= 0
##$TI= <>
##$TILT= no
##$TM1= 0
##$TM2= 0
##$TOPLEV= 0
##$USERP1= <user>
##$USERP2= <user>
##$USERP3= <user>
##$USERP4= <user>
##$USERP5= <user>
##$WDW= 1
##$XDIM= 16384
##$YMAX_p= 402024807
##$YMIN_p= -1219965
$$ End of Bruker specific parameters
$$ ---------------------------------
##NTUPLES= NMR SPECTRUM
##VAR_NAME=  FREQUENCY,     SPECTRUM/REAL,   SPECTRUM/IMAG
##SYMBOL=    X,             R,               I
##VAR_TYPE=  INDEPENDENT,   DEPENDENT,       DEPENDENT
##VAR_FORM=  AFFN,          ASDF,            ASDF
##VAR_DIM=   16384,         16384,           16384
##UNITS=     HZ,            ARBITRARY UNITS, ARBITRARY UNITS
##FACTOR=    0.220516191357247, 1,           1
##FIRST=     3152.52795203693, 0,            0
##LAST=      -460.188810968852, 0,           0
##MIN=       -460.188810968852, -1219965,    0
##MAX=       3152.52795203693, 402024807,    0
$$ Real data points
##PAGE= N=1
##DATA TABLE= (X++(R..R)), XYDATA
$$ [...]
8660 1067174 946509 782452 747047 983250 1085972 1056730 1029635 1071492 960175 1068833
8650 1068833 966504 1055190 1179595 1225008 1332736 1244112 1374204 1464840 1501356 1443605 1380792
8639 1380792 1322257 1326978 1112498 1137746 1072617 1045709 1075368 1002464 949212 956636 1025640 1028324
8627 1028324 1052778 1046527 1370850 1473531 1569725 1714471 1739475 1663932 1636076 1687335 1770391
8616 1770391 1830828 1727443 1849193 1901143 1735241 1829084 1791652 1778863 1533222 1241713
8606 1241713 1392215 1330234 1434156 1389517 1316301 1274674 1360125 1396826 1326168 1189728 1214334
8595 1214334 1213044 1104821 1071521 1186965 1115097 1019276 1090750 1041801 1159405 1099401 1142179
8584 1142179 1199790 1303613 1153740 1127942 1031015 869775 958745 1209656 1147996 1079005 1116164
8573 1116164 1007633 982606 895934 1010507 1103329 1081830 1147955 1083120 925592 990409 1038824
8562 1038824 979166 794012 730599 753572 703989 723761 754183 681509 568624 658597 725027
8551 725027 799218 809185 689996 597011 521927 639091 888126 799861 682627 663002 653958
8540 653958 659017 536997 579203 646899 745640 751432 746660 707113 706714 583067 601161 726209
8528 726209 713503 680455 763343 651382 554501 641515 633957 638234 739792 679913 674933 624599
8516 624599 467642 628802 521255 504889 482115 476981 452538 345782 441999 618717 641992
8505 641992 509665 421319 407154 453797 386483 573455 505764 419871 300217 253623 367958
8494 367958 276262 410481 642359 474638 373759 411773 386881 303314 204532 71228 18427
8483 18427 87642 160436 165999 180612 173276 154735 -4535 123413 254399 176097 86635 60653
8471 60653 177353 3870 44713 11739 172197 238369 156803 329199 131480 -68361 46918
8460 46918 216069 284100 180829 160647 180817 191909 55234 16115 102083 46250 24931
8449 24931 206254 246030 175650 -2963 -12231 42795 67937 -3468 20546 23165 16121 134587
8437 134587 113292 23595 151303 239523 130303 193523 101264 58135 96541 152715 132539
8426 132539 207045 286522 108262 63992 257319 297493 296860 286335 263065 142163 171924
8415 171924 121754 -5462 160424 91184 19898 17007 167887 231024 150984 74734 52710
8404 52710 -13394 -186041 -195819 26571 -29204 -109033 56511 38362 -47780 -27279 183086
8393 183086 142102 5037 41952 22735 8061 77720 25027 -7353 -140576 -89407 -62613
8382 -62613 -186413 -75106 52735 77032 220230 125784 88 16314 87125 35736 -23361
8371 -23361 -96818 -44335 61177 30427 -12352 -191524 -91742 44397 4960 -112171 -65064
8360 -65064 -177623 -8840 11178 -94499 -57058 -30522 -104126 -107124 -142145 -127719 -117354
8349 -117354 104533 49529 -144040 -31859 118697 114653 29995 11947 -66247 -57611 -178635
8338 -178635 -72647 77260 -70353 -19530 31713 11357 94945 55568 -39260 10737 -24759
8327 -24759 -153392 94074 70852 28864 -110018 -139752 -62219 40012 -46435 -9593 59290
8316 59290 -37367 7982 -115040 -138295 33429 75380 74800 -17357 -16944 2537 65509 135438
8304 135438 188690 71294 99692 223677 102305 -80953 -62879 -19082 66453 202698 -82639
8293 -82639 -147920 -66309 -21368 35769 38185 154811 175952 -44926 46494 -25216 -139306
8282 -139306 -101958 -54359 27541 5777 135911 134895 -45031 -82140 -69860 122377 120750
8271 120750 -5311 -70320 -39746 104416 57320 84591 95479 76698 -43517 -143277 -99575
8260 -99575 -136386 -127174 -25945 -7183 74757 95508 24775 -116217 -72278 113033 26355
8249 26355 202558 282046 4220 -22126 16453 -37823 40105 -29499 -131364 -167910 63200
8238 63200 41234 -46217 -67928 668 -36670 -132867 -35043 25758 -51109 -58509 69598 55386
8226 55386 -27076 38424 157883 150319 151061 -24695 59722 49448 12093 -95249 33536 160443
8214 160443 219500 187211 411251 194217 177373 188115 151236 49259 -20083 108173 25307
8203 25307 -46866 87276 237739 195607 193208 213173 311712 385148 438072 276601 395282
8192 395282 -1143270 -1219965 -491529 -459087 -159946 -198604 -188538 -270571 -98486 -148889 -158983
8181 -158983 -147494 -35652 -31888 -49757 -2703 -100150 55635 -40535 -76938 64350 -116080
8170 -116080 -212434 -102126 -191950 -147233 -149115 -171715 -117929 41753 96486 139103 100737
8159 100737 -8141 -9846 -169612 -101168 26119 146276 42834 -247200 -195344 -82991
8149 -82991 -39772 -55272 -56291 82284 -26382 -24982 -92826 -150916 -69682 22340 78057 164354
8137 164354 77265 4692 -29711 183255 198610 102087 88538 -18030 98084 259996 115485
8126 115485 58204 -4334 106592 122295 23064 -36164 -41549 21485 18801 -42102 -36254 13523
8114 13523 38873 -137133 -131119 -53983 2484 40222 1370 115063 124432 78849 84550 42054
8102 42054 -38513 43643 -48494 -8741 -110306 54892 82651 -80645 -136071 -19702 3510
8091 3510 -48772 19928 -60514 -115015 -41974 -160876 -165770 -61487 28074 -204776 -120834 -94047
8079 -94047 -47086 22516 -33087 -99492 78869 44583 -133603 -37281 -60521 12439 43230
8068 43230 7406 -6315 -20926 -70235 -141632 -83987 71833 50615 -74584 -101952 -113755
8057 -113755 -73118 57275 73535 72188 -7654 -53591 -43734 -65908 -36686 160439 -37931
8046 -37931 -17084 17907 -70522 -126611 -146815 56370 91023 -66466 -93809 -108204 -126848
8035 -126848 -110474 -46617 -35764 -45184 -110312 46997 -47375 -148395 -141554 -107868 -148113 -117548
8023 -117548 -14367 -28919 -105953 -167797 -117792 27117 42185 -49069 -19017 -37676 -90572
8012 -90572 -175997 -250768 -165188 -196844 -202710 -193656 -284281 -48700 -75644 -103275 32254 198878
8000 198878 211688 -23635 -93847 -174935 -36005 -23153 -58221 -77005 -19276 44736 -17156
7989 -17156 -64572 -134893 -137906 -145669 -136309 -136896 -155999 -162333 -50875 -178499 -64550 -103013
7977 -103013 -50412 -36898 -50681 13313 -42643 51595 26255 27871 36278 -48380 54552 9010
7965 9010 -160148 -81631 -20243 -32335 134080 162264 -58849 -14614 -72 -214069 -250785
7954 -250785 -124332 -26314 107250 50562 6707 125207 -45752 -70632 -32058 -105873 -5854
7943 -5854 -66349 -109358 -112240 -14118 -139132 -150944 5646 99752 126498 75998 41522 90624
7931 90624 18919 -70482 -194208 -248765 -141798 -157859 -175471 -185282 24673 91302 54533
7920 54533 -136129 -97062 -43331 -50691 -35690 -108635 -96794 -34621 -58690 -36613 63896 75071
7908 75071 -90623 -190560 -251911 -50908 -85873 -113872 -17386 16512 -33463 53699 -66969
7897 -66969 -212340 -136247 -279646 -208587 -104880 -74967 -118481 -216955 -181386 -222183 -172743
7886 -172743 -210672 -147438 -139727 -178621 49565 -9420 44997 -23736 -134440 -231743 -210093
7875 -210093 -145823 1591 -47040 -98253 -73858 -61773 -117548 -116588 -158339 12142 -14165 -79414
7863 -79414 -108483 -113295 23813 -63272 -109521 51522 73117 -104522 -83260 -241113 -163424
7852 -163424 -51290 -33387 65524 -10830 -100255 -116445 -59698 -44383 -85745 46701 124931
7841 124931 206463 179126 131661 41150 31713 41046 -48954 -57702 84880 -57531 -131939 43186
7829 43186 -105498 -139345 -142503 -59245 -81990 -5749 28297 -58845 4445 -15680 -56714 -62168
7817 -62168 -112682 87776 60334 -46774 -135285 -156593 -10966 3769 -32767 1848 -96300
7806 -96300 -34715 -118352 -188615 -329680 -259490 -90336 -130399 -33044 122542 141671 116095
7795 116095 81962 8595 86872 5962 -12818 1365 64086 -12745 22241 96434 118146 111055
7783 111055 126778 3970 -1398 6640 43996 149757 -33019 -51223 -26147 2409 -133412
7772 -133412 -161861 -112005 -44153 1534 -169549 -419108 -382662 -274252 -203254 -227181 -217701
7761 -217701 -122588 -231124 -194960 -178745 -86042 18556 -97984 -167733 -50798 -122006 64538
7750 64538 -19293 3800 -168576 -88838 -76073 17437 -42020 -143324 -101432 -145859 -169488
7739 -169488 -259221 -19818 1245 -55537 90622 -118732 -75638 56004 29859 -68822 53584
7728 53584 95981 -118924 -42705 -116794 -54677 42587 -34790 -123548 -3972 124772 -4645
7717 -4645 -53582 9423 -54988 64699 74507 33162 -64935 -64927 -58487 -58963 -111461 -10812 43307
7704 43307 156149 86398 130649 103703 -26996 -113421 -113080 -153892 -169910 -82814 43752 -873
7692 -873 111061 50309 -109294 -86602 -218500 1357 132591 98220 125665 172614 143736
7681 143736 46622 62252 94213 57484 89410 113232 82310 224976 139132 84345 72938
7670 72938 -27359 133475 45678 42383 175129 198892 102456 -1514 62876 141358 117719
7659 117719 -17837 28212 39878 -93752 14174 -152385 -84835 -78503 -270527 -142617 -48067
7648 -48067 -141854 -140029 48780 6670 -39290 -42250 72851 49752 -98303 -123383 -209304 -107312
7636 -107312 -142282 -180559 -196979 -185344 -29613 119005 126108 26804 22041 -97329 -10961
7625 -10961 17409 -52533 -83277 -130247 -46461 319 -2356 -45017 -2843 -20086 -24087 18644
7613 18644 -51459 40406 -37004 -128215 -72867 24430 -57840 -45306 -129342 -47141 161087 186547
7601 186547 45915 -85889 -103283 -7790 74052 -52737 -35501 11320 46166 -90699 -102597
7590 -102597 6088 -8170 -34098 -48635 -46805 -79301 -159277 -73395 24672 -12836 -195033
7579 -195033 -104528 -139808 -87457 107841 71783 44585 -9379 -185322 -116180 -29571 -145871
7568 -145871 -71399 19563 -79089 -223535 -169021 -111022 -267484 -123774 -101237 -161664 53874
7557 53874 -43038 -121294 108710 243658 180690 16255 38680 11248 36773 70578 -96678
7546 -96678 -106422 -148665 -166506 -125466 -54199 -102129 -43953 -10536 -110213 3333 28403 110912
7534 110912 -56529 -51359 92866 25556 67843 -26300 -76029 48103 -41094 -77529 -75346
7523 -75346 -14090 119431 148687 99685 59119 -5962 -95809 -46619 1632 -47039 -19484 -120695
7511 -120695 -71849 135014 95296 50625 44488 35218 58843 -3960 -129125 -60171 -47806 118030
7499 118030 94305 87577 72790 117923 -51 -31651 -68224 -182812 -181914 -9017 -150772
7488 -150772 -205349 -232446 -225404 -22334 20754 -149277 -249190 -19756 15578 93079 -47143
7477 -47143 -147524 -175859 51021 -14705 19632 48653 -93819 -110621 -164753 -46852 22418
7466 22418 -7468 106175 95108 -30218 120663 46981 -12250 43795 12444 -45584 -82963
7455 -82963 -41848 80326 -125413 -128077 -47446 128358 106263 1926 80954 123514 -70354
7444 -70354 -107274 -22495 58185 -60516 38737 110806 -72694 -102150 -133151 -37715 -8019
7433 -8019 -62785 707 -5731 -23990 24010 58649 144589 22697 -81647 -94810 13680 -12703
7421 -12703 4128 -46621 -71212 -33208 159279 188062 193383 44430 64761 4131 -29454 4595
7409 4595 41976 79006 -4278 -72088 -4888 -17250 85484 42961 92473 70154 47358 113635
7397 113635 158125 27140 -116654 1426 -245759 -303667 -243858 -201371 -281372 -80048 54618
7386 54618 -70924 -112345 59458 93896 -65701 -34012 13219 -21337 -75812 -204412 -275480
7375 -275480 -144846 17783 138149 7906 -123160 -114427 -47647 56854 21843 -29362 79812
7364 79812 52016 51270 102821 4127 -153623 -55589 106823 122247 64265 40243 -14132 -37360
7352 -37360 -76577 -26721 47662 -27996 52408 -49953 -146798 -135894 -175071 -177441 11462 70770
7340 70770 43076 -30605 -93926 -154959 -76089 -78109 -178213 13405 70686 -84039 -105993
7329 -105993 -35198 -3641 43388 134211 -5848 -98834 -19862 51545 31177 -107048 -173220
7318 -173220 -135421 -195929 -86739 22758 110688 143869 7344 -116943 -53808 -15895 -12936
7307 -12936 30672 -61515 -279089 -38739 44549 -5313 110810 -5743 -32183 12329 48073
7296 48073 144451 137321 -76004 -74223 3900 106520 99040 22565 -104202 -212649 -102004
7285 -102004 14299 92778 -93654 -129260 -108479 -169755 -159951 -236784 -157184 -66474 -109373
7274 -109373 -72283 -107553 -161184 -152180 -86958 -43482 -5993 75493 875 115289 151008 -15481
7262 -15481 -108153 122410 162368 49131 63396 98505 82567 -23149 18127 160060 114958
7251 114958 106955 93945 98650 195037 197223 119583 129211 57775 157370 110269 151557 -49421
7239 -49421 -96403 -160432 -270529 -138435 97977 294799 64177 -106521 -275945 -120425
7229 -120425 -75189 111639 190330 -47291 -129443 -113383 -7590 -135567 -152560 -123963 -2895
7218 -2895 44623 -40968 -78345 -26164 59502 20992 20515 -116340 -67644 -20155 28316 -16000
7206 -16000 14409 -13650 -58050 41122 289081 137208 17989 86646 -50116 -156524 -78723
7195 -78723 -41992 -19583 66138 -110446 -123826 -68999 -169852 -112731 137780 60938 -22988
7184 -22988 -27689 90837 38538 -126956 -137345 -171324 -165058 -37316 57490 -98544 -77294
7173 -77294 -26818 -102227 -99406 -6648 -75090 -85337 -15207 17030 66315 23943 66428 65624
7161 65624 -32228 67214 21782 131740 50097 37893 379 61497 65440 -6183 18923 -97258
7149 -97258 -31959 -62030 -125699 -172428 -75512 -79241 -98546 -41050 -32923 -42863 33680 57056
7137 57056 -94473 -86124 -116870 -261443 -215499 -166190 -173791 -151146 -160445 -207568 -16619 19054
7125 19054 -230162 -345177 -178274 -183114 -200258 -217409 -128633 -134064 -191546 -223307 -178005 -41574
7113 -41574 63627 -113116 34057 12411 46605 55034 -53283 37382 -46782 -197972 -82118
7102 -82118 -129108 -187881 10928 8800 73538 -30881 -11415 6845 -104496 -102268 -206221
7091 -206221 -148505 -182170 -362937 -203105 -124484 -34134 -29266 33408 -26659 -51584 8450
7080 8450 -62090 48210 85749 103856 26688 10710 119365 85151 63025 -20253 15380 40429
7068 40429 213696 112725 15410 146752 105634 91228 52111 14395 72438 4109 3934 -14226
7056 -14226 -112548 -108456 -10333 -59672 28087 106260 30799 -64262 -102975 -86719 53784 56924
7044 56924 68280 -21329 73153 107727 55469 -45807 -140667 -100785 -169005 -223466 -234872 -131590
7032 -131590 -158227 -11744 51411 110180 -26472 33959 75568 -62675 108736 50580 -17640
7021 -17640 28767 11161 59546 -2869 -64033 -126969 -87433 139657 245453 157265 -155874
7010 -155874 -255982 -139985 83354 77068 -58683 32734 117991 113941 -18449 -101011 21782
6999 21782 -42084 -125442 -160757 -128347 -100907 -348083 -283914 -78762 10799 33241 31440 -14269
6987 -14269 -31223 56 122852 119514 87649 113505 89273 16044 114387 -44548 -142995 -162677
6975 -162677 -43966 -44605 -42094 15507 -140597 -36456 -60105 -161610 -60934 59372 45407
6964 45407 46386 67856 17978 -166189 -55132 -2226 -40534 -50689 -35556 92128 -50201
6953 -50201 -2107 -2996 -36164 -33705 -113980 -156162 -130309 -199173 -47128 32186 -20850 -66888
6941 -66888 80009 130775 98034 2886 38971 14894 31220 62712 -81951 -15451 17478
6930 17478 -7891 -152750 -126776 -115798 -24834 -75128 -57682 -66033 -4238 40818 13330 32577
6918 32577 -36509 -146192 -227167 -103250 5095 -103305 -10913 -24252 28048 127162 -1457
6907 -1457 23769 120243 73266 -116237 -78880 -18295 53695 -45934 -138822 -156006 -86212 -134183
6895 -134183 -109524 -17727 12466 141701 161369 170623 -17195 -52138 58829 165206 75998
6884 75998 123968 70370 33235 -27014 -30050 -14832 -6190 -48446 -151507 -118090 -160899 -132124
6872 -132124 78695 12917 -179572 -283728 -150259 -24699 -61344 -14679 100150 43158
6862 43158 33254 1768 -96306 -41337 127100 3583 -125533 -19543 -20570 18536 -29260
6851 -29260 -156919 -134031 -80574 -4372 145151 12007 -97747 -44391 65729 159408 59120
6840 59120 -117860 -117090 -114314 -30121 28293 -58583 17451 -90542 -265385 -112254 -95633 -54150
6828 -54150 -77889 -9991 55199 51867 148090 165872 -55160 -112593 -99275 -21866 35403 -2473
6816 -2473 -40995 -137363 86230 207302 -26575 46447 20138 -115625 -27263 -206153 -152027
6805 -152027 -64234 -63702 -4247 -112229 -187142 49339 168411 -33230 125186 161673 30449
6794 30449 -101763 -145438 -201024 -116965 19648 29617 -116959 -99808 -24314 76313 216602
6783 216602 136312 109242 3414 -133491 -164736 -104469 -34622 49162 -6516 77491 124138
6772 124138 -45186 88746 57424 18533 -5648 81253 9868 46876 30894 7414 109939
6761 109939 148390 18785 4857 35935 -73650 -37062 5798 53688 2959 33172 -106
6750 -106 145238 105990 31957 125102 140803 -125040 -123376 -169676 -74270 -173862 64706 -63674
6738 -63674 -122929 -47030 100978 129985 133620 75479 -76524 103437 88353 220910 -3622
6727 -3622 -89890 -110649 -13062 73039 7787 130458 133273 -76858 -57744 -79648 -304820 -321328
6715 -321328 -188186 -126617 -45187 -73109 -48650 64240 79496 54232 -2604 16007 63226
6704 63226 141193 98678 -72687 -107200 -127177 -355 3590 -46403 -47785 -148473 -175404 -93739
6692 -93739 -33585 -13595 42544 13775 -19049 -14890 -150828 -142831 -69947 -40292 129980 75647
6680 75647 60631 107428 187325 286017 179118 151378 78041 162749 23482 11948 -94578
6669 -94578 -255225 -64407 -19407 -27999 97387 1358 -101776 -80133 -10496 -31055 70350
6658 70350 33185 -55349 -16988 -75646 -120900 -91187 -77232 -108186 75026 -14079 -27845 131489
6646 131489 63968 -122081 -243641 -186811 37962 213939 152880 -7131 -69592 49520
6636 49520 -13606 -295531 -257430 -125509 -82617 -26968 -68419 -34891 144900 86227 -51354
6625 -51354 25175 -84246 22829 109180 61409 -92104 -167814 39652 -9697 -145747 -172036
6614 -172036 -219401 -180892 81390 47067 88140 22599 83463 192609 125952 -84464 -85398
6603 -85398 -77475 -178904 -101028 2806 -11912 -5833 -22446 -155073 -215396 -111499 -63969
6592 -63969 -108833 -94487 10643 65991 24621 34873 -4849 28170 -56482 -43345 -29887 -82645
6580 -82645 54661 24220 -105973 6811 -2999 -12098 -19903 -28974 73106 183752 116972 68549
6568 68549 44848 25173 24714 21399 88456 -16708 30515 -35755 -209191 -168600 -8109 -73781
6556 -73781 24262 -90026 -90616 43537 -49414 -2752 -23181 2217 153859 124131 378
6545 378 69587 171538 76948 -14807 -4495 185894 191136 -12749 -97890 -41558 -141079 -1837
6533 -1837 60631 16311 -73124 -147855 -68544 -89334 133764 -80003 -88417 -16617 -7386 102639
6521 102639 17108 -19446 120407 108991 100940 130545 76595 36337 67393 79940 199534
6510 199534 141671 15401 -108620 30819 96863 23049 11987 29761 142172 198244 186200
6499 186200 104792 414 12985 59525 -47851 -234176 165981 231868 172933 165109 81202
6488 81202 -16529 -37822 139643 20625 -161809 12469 73508 56835 -22777 58241 -21506
6477 -21506 -47750 -19745 -198094 -5764 92694 69460 43370 133106 41831 46248 -39114 -16958
6465 -16958 -77234 -84930 -10347 -3578 12310 95698 29182 30248 -235893 -283073 -236669 -306671
6453 -306671 -145377 -61439 26520 -9306 115927 189660 -82686 -85756 54641 -100049 -142510
6442 -142510 -141082 -64896 32542 103211 23566 -80756 -83094 -139959 -191355 -149644 43838 5299
6430 5299 84695 -51747 -27890 44200 -47401 161738 231974 67332 681 94844 -84248
6419 -84248 -131584 -20404 50863 174858 154037 33512 -47481 -67065 34282 85449 -8031
6408 -8031 104646 105473 16998 193691 184974 75972 143100 14959 51064 -75703 -119493 72992
6396 72992 43190 -3941 177586 192251 256132 267225 100621 91864 65259 -95320 -17956
6385 -17956 117644 129730 101037 -22918 67630 -40283 -172230 -86224 17769 138165 152139
6374 152139 106501 107869 -32389 -16573 -11128 5633 42949 -68221 -6372 -2108 -82048 -65378
6362 -65378 -49788 105283 123242 103085 267579 171795 -796 -42664 37676 -63939 11269
6351 11269 59844 16880 15558 -34465 60066 -41842 14224 -62351 -163909 -116673 -8447
6340 -8447 90783 44777 -125116 31579 6463 -45460 40909 -10072 7859 -42282 -111761 -61208
6328 -61208 -21804 127838 42795 -5987 46044 8732 37218 163761 201871 79505 97957
6317 97957 3618 -85769 -42455 -136800 -82313 -3888 -15755 -48499 -124216 -71135 -17353 -6929
6305 -6929 -117402 -36048 161299 65594 61528 86806 21584 -75452 34082 150439 52286
6294 52286 26355 35597 53628 103407 129773 172399 127826 118750 96725 45474 -15799 113338
6282 113338 154664 113209 175128 185682 67016 98130 176942 -31314 -121849 -44978 -43327
6271 -43327 28553 224225 -16716 -160274 -144166 13177 223022 97041 -22636 -69900
6261 -69900 -144870 -111468 31675 -83252 -100207 79723 -19677 -69873 13384 225673 96797
6250 96797 -119088 -35187 -25287 -6592 182173 255919 143063 5595 34430 -55758 -41778
6239 -41778 -107352 -43102 60766 129887 1101 -106490 20499 100021 109515 129329 -67468
6228 -67468 61280 47899 -46907 129215 31843 -83533 28502 12897 -77968 128997 208370
6217 208370 60626 -67125 122667 59737 33218 -44084 -11092 111299 -42265 17610 15608
6206 15608 12593 28073 -121584 25540 63209 -105791 -187893 -267240 -237877 -109757 -132149
6195 -132149 -238874 -65644 -91117 -207871 -154671 -92506 41680 94557 193741 111698 6812
6184 6812 -61352 32759 60123 11789 116052 48544 -12152 -142834 -192050 -172499 24049
6173 24049 117997 167154 172333 13001 41900 27535 98051 159346 192678 186983 147599 156545
6161 156545 23932 132270 321655 197664 -32781 -84218 -37789 -86102 45497 37943 31296
6150 31296 121804 6103 -1630 126602 34563 148784 136043 197336 266565 54516 -179852
6139 -179852 -133354 23334 101592 136406 122175 -66487 -73572 -165441 -20661 89069 -80945
6128 -80945 -71097 -18036 -62403 -28291 102789 169639 135737 44973 109953 260075 106239
6117 106239 16884 -13672 -144153 11634 -73950 73148 32477 -143337 -162950 -40061 -51876
6106 -51876 -72126 -161819 5066 166569 112915 -43167 -30618 92663 -44090 -7889 104137
6095 104137 97001 204966 86047 -36487 89358 -1309 -44186 -85478 133228 164017 -42721
6084 -42721 8077 102800 34868 113379 166450 152444 63720 138629 124426 -43542 37760 116822
6072 116822 76237 11025 -37145 70990 -28492 -44793 122495 124997 51824 15792 61622
6061 61622 -129308 -39478 -41066 -10757 57199 43942 -59289 64868 22787 -17804 190110
6050 190110 185233 43057 58984 82990 100929 136168 27478 29872 119958 48797 111398 177102
6038 177102 77134 -120531 4987 176400 85500 150265 190614 -26381 -36415 52805 145519
6027 145519 230804 241985 310571 156839 77120 178153 10300 38078 208841 301099 354052
6016 354052 232102 132488 -9529 27832 -14857 17308 43111 204102 308762 306786 266127
6005 266127 190616 86898 47208 78405 77356 65828 51936 98095 112296 111384 150148 50246
5993 50246 90058 84147 296671 231710 267515 204693 188239 215341 190565 130193 12765 64695
5981 64695 147956 133974 44137 193124 268292 298273 84939 -10183 215026 148542 77235
5970 77235 136339 136342 172306 142562 -44737 8539 36882 43930 84797 30153 19214 85130 141885
5957 141885 162184 339729 313046 159341 19255 29911 -68680 19483 -35381 -46425 -66503
5946 -66503 -104219 -131567 -1414 52439 198933 285217 227009 143794 108338 150307 5698
5935 5698 -54783 -2368 -24656 86137 17294 -74809 94180 56433 89346 81555 80940 187203
5923 187203 14225 75873 135852 113190 84435 25061 -71839 24276 45655 -131332 95009
5912 95009 73110 145790 33812 145121 237721 24392 -126295 -51250 125474 344033 258611
5901 258611 145682 304453 187880 97043 -18708 59239 90449 174163 171217 240420 276611
5890 276611 177198 -30391 -102682 91510 229174 290631 318487 189788 140674 193418 193938
5879 193938 231219 152635 96683 87891 40445 95495 239754 113835 42728 187168 177831
5868 177831 172024 185272 313809 210567 130972 207468 159586 48403 -27669 31532 124656
5857 124656 207569 181543 106985 112692 200928 53126 -42252 -117742 -66940 -30511 155042
5846 155042 31766 -20159 79878 204720 -31658 89198 108320 -29894 115274 194795
5836 194795 69251 13991 124966 68823 131508 139276 231694 160804 207941 156627 217316
5825 217316 196328 196522 163321 169919 135923 94129 149655 145003 93701 266668 169741 149780
5813 149780 126595 8208 72784 240755 76980 -29500 -19899 -121835 21433 57234 246240
5802 246240 263951 332969 337470 335431 269176 250976 286010 299162 218846 71926 132567 201900
5790 201900 126557 178882 78167 176623 251379 234765 254097 296982 318329 282398 298446
5779 298446 327173 186943 202190 320209 292640 235966 367481 530613 350094 437358 583490
5768 583490 563696 535276 500860 359306 268320 285718 325899 245150 262033 187003 192401 246840
5756 246840 215847 467779 359713 166916 171280 398654 292738 259983 385542 295956 372884
5745 372884 269042 316357 143434 181902 285482 106223 34283 59687 222078 289203 274606
5734 274606 223589 194767 395089 436768 444234 320836 321667 129282 131586 217672 323444 285242
5722 285242 288195 253194 290048 455843 416206 439150 496120 424618 424550 355565 373524 443323
5710 443323 426557 478787 439443 389934 425800 521703 372756 411996 368850 317857 449317
5699 449317 457250 373464 323316 300812 456069 432690 507562 391044 331658 398396 419423
5688 419423 431271 490698 450544 455389 479319 586147 540022 454412 542390 518212 463359 486320
5676 486320 484815 507494 320971 466793 359616 356955 488604 369761 462835 423781 417590
5665 417590 479596 472413 538905 674094 580779 524556 542400 505581 365955 376629 415768
5654 415768 582099 466282 336430 388879 429595 566551 522274 340363 496974 550661
5644 550661 510262 496088 462856 407592 526485 646435 669741 540571 587102 593962 398503
5633 398503 354157 422627 578669 572222 517854 589476 557745 563066 705503 693844 627443 630294
5621 630294 574098 678270 664760 645624 595094 658465 764479 765463 724703 734241 924301 902569
5609 902569 845663 886734 775484 722720 761400 833769 796837 779316 820990 820015 783211 897553
5597 897553 1105631 1066434 1102237 1109883 982529 958282 971907 837872 969726 1005623 1057957
5586 1057957 1073183 1167895 1230611 1196757 1238440 1225509 1099330 1144444 1276543 1250946 1087873
5575 1087873 1180283 1355676 1375018 1456355 1466589 1406272 1577629 1538758 1473812 1513851 1592978
5564 1592978 1619560 1654437 1641259 1793760 1747254 1864588 1971459 1897401 1944679 2025722 1971613
5553 1971613 1979872 2142205 2106268 2006889 2048527 2282863 2285119 2263235 2449134 2495508 2456292
5542 2456292 2545033 2586751 2662582 2812191 2867541 2874710 3096209 3215758 3312447 3396490 3342946
5531 3342946 3288430 3415880 3461511 3663946 3759744 3844364 4113880 4348913 4482037 4618890
5521 4618890 4786868 4879138 4951155 5106039 5249812 5477909 5756987 5899841 6041645 6181102
5511 6181102 6541737 6944226 7267635 7665283 7967090 8417760 8900634 9320944 9844146 10498036
5501 10498036 11096876 11640204 12362205 13328239 14225851 15304408 16454616 17780269 18992002
5492 18992002 20523299 22231980 24134074 26104590 28144513 30410698 32662837 34938029
5484 34938029 37134872 38979681 40354440 41220585 41062835 40069730 38373048 36263625 33586718
5475 33586718 31040869 28491062 26111194 24047918 22212633 20736361 19366218 18163618
5467 18163618 17088941 16109124 15241331 14449977 13748389 13262150 12740901 12315661 12018556
5458 12018556 11851087 11487368 11261041 11088648 11008872 10980714 10619266 10443798 10555254 10656232
5448 10656232 10626454 10644639 10833626 10885827 10890520 10920578 11149048 11454407 11646632 11972765
5438 11972765 12465805 12938188 13357009 13831317 14475624 15202048 15953036 16935283 17994045
5429 17994045 18914512 20056420 21579240 23116525 24791711 26569645 28530173 30575671
5421 30575671 32604748 34721909 36974838 38951374 40478303 41353942 41469999 40615060 38915902
5412 38915902 36798117 34282546 31491494 28873599 26325733 23938804 22127769 20406160
5404 20406160 18695068 17203340 16156039 15043634 14030971 13042831 12132386 11577904 11068547
5395 11068547 10434475 9857472 9332586 8818090 8630817 8262501 7756561 7336900 7345038 7014791
5385 7014791 6657039 6612843 6443660 6050820 5844502 5735879 5488447 5320798 5238154 5081798
5375 5081798 4997342 4839760 4720783 4468997 4362579 4347855 4174980 4078664 3848446 3728019
5365 3728019 3845941 3810501 3901451 3936886 3705352 3564098 3634939 3634278 3506451 3499363 3472917
5354 3472917 3269861 3260701 3292032 3113644 3044895 3031783 3032483 2959781 2901925 2955633 2821109
5343 2821109 2795987 2814463 2782939 2951710 2852875 2549498 2466717 2589052 2609183 2716899 2627999
5332 2627999 2507497 2453349 2406889 2397097 2502298 2588481 2450615 2403430 2359812 2377623 2410427
5321 2410427 2444979 2431186 2444610 2498072 2349204 2236012 2281485 2290305 2278504 2295467 2194333
5310 2194333 2151257 2178330 2084906 2048588 2257351 2278780 2188160 2189435 2235573 2302377 2245920
5299 2245920 2205319 2183508 2124350 2075237 2191010 2175667 2032107 2165998 2158112 2369858 2444139
5288 2444139 2391671 2393972 2280658 2061953 2169621 2256932 2377953 2473787 2559069 2347313 2257438
5277 2257438 2373983 2357643 2333484 2265710 2291484 2279058 2543532 2589083 2621238 2714391 2697093
5266 2697093 2669436 2779994 2833292 2768542 2896217 2962561 3092716 3127791 3082280 3106564 3085051
5255 3085051 3097553 3397251 3406946 3432139 3524070 3490234 3495757 3464398 3426427 3434528 3672166 3712034
5243 3712034 3720046 3820682 3807972 3955431 4025193 4106952 4002256 4096621 4298773 4475603 4564586
5232 4564586 4826646 4888457 4749937 4796729 4970694 5183702 5288129 5440887 5505526 5587238
5222 5587238 5817234 6022339 6080061 6425492 6639266 6823101 7103182 7228936 7279972 7356595
5212 7356595 7423875 7537465 7756791 7979810 8140381 8400931 8640456 8775150 8965639 9163002
5202 9163002 9384683 9694576 9877536 10095712 10229342 10652331 10952955 11219782 11483473 11856124
5192 11856124 12079725 12508279 12872033 13272345 13598949 13950015 14463548 14968164 15570888
5183 15570888 16132181 16661373 17256097 17728560 18528224 19314902 20111371 21041323 22033791
5174 22033791 23193424 24186661 25200151 26597428 28168631 29626154 30963261 32540596
5166 32540596 34616072 36943296 39371402 42136399 45259631 48831499 53210998 58399807
5158 58399807 64278483 71162906 79120980 88551788 99408488 112167888 126583685 143033970
5150 143033970 161999479 184476858 212626303 248508134 286520871 313434777 306662589
5143 306662589 263813252 214224165 174163873 145150800 123939915 108295612 96539708
5136 96539708 87447374 80244240 74528587 69674063 65568970 62184202 59421837 56954512
5128 56954512 54624985 52812218 51178699 49493659 47835353 46433959 45389455 44297462
5120 44297462 43050189 41900903 41324803 40933933 40332338 39799361 39448374 39038006 38975665
5111 38975665 39008668 39082074 39168579 39150927 39182815 39236902 39649749 39759946 39930363 39834271 40018313
5100 40018313 40126240 39938627 39792192 39662456 39450113 39052507 38732275 38203843 37779219
5091 37779219 37315341 36596790 35995745 35435012 34607259 33807684 33078281 32484941 31638287
5082 31638287 30924828 30416429 29891412 29271436 28586731 28074463 27781039 27437855 26995104
5073 26995104 26748044 26636554 26561463 26428670 26299364 26209443 26034507 25981659 25946526 25885936
5063 25885936 25744041 25751758 25457526 25092248 24643418 24106926 23330870 22391811 21619955 20858483
5053 20858483 19918087 19080793 18356460 17267422 16453976 15678537 15063435 14526748 13815439
5044 13815439 13303239 12732767 12341382 11912991 11526807 11244416 11005626 10825788 10432328
5035 10432328 10000996 9817500 9542887 9396192 9222187 8944995 8704101 8577799 8543985 8208297
5025 8208297 8231356 8228523 8015506 8000748 7830796 7461623 7462600 7241557 7237347 7289512 7298086 7329110
5013 7329110 7420152 7295335 7256540 7359766 7227156 7163321 7091364 7090700 7016307 6928903 7009797
5002 7009797 7093155 7257312 7222408 7256316 7287502 7525112 7543621 7618139 7785527 7744388 7836382
4991 7836382 8004089 8218565 8530700 8707137 8777337 9042261 9248002 9452059 9701253 10113304
4981 10113304 10445578 10716238 11062461 11558706 11824502 12196928 12755371 13317873 13981129
4972 13981129 14465768 15115752 15865985 16616662 17422647 18426214 19282053 19979851 20571350
4963 20571350 21303442 21892237 22598733 22956010 23156032 23401499 23646619 23601061 23546525 23439206
4953 23439206 23312409 23413387 23505402 23677159 23734676 23769478 23925056 24489421 25027416 25527469
4943 25527469 26106239 26991313 27671847 28523294 29414065 30336606 31232393 32068692 32889724
4934 32889724 33708707 34358837 34996853 35323434 35543131 35694758 35635762 35407047 34991358 34739514
4924 34739514 34342101 33712168 33090772 32170496 31248416 30280456 29316545 28382028 27486199
4915 27486199 26547292 25699153 25084152 24605981 24197948 23711305 23363404 22986547 22701656
4906 22701656 22806397 22787126 22781151 23067316 23173296 23388457 23586579 23754266 23931084 23945951
4896 23945951 23763492 23550850 23167792 22565478 21828233 21090177 20192644 19157359 18011041
4887 18011041 17014848 16004845 15024701 14083071 13332636 12643225 11964440 11374444 10985685
4878 10985685 10277863 9656807 9212307 8855232 8514365 7940580 7808536 7535434 7186359
4869 7186359 7063742 6752429 6369528 6315378 6075935 5863058 5578443 5490477 5230845 5032144
4859 5032144 4905060 4673077 4664962 4532552 4317781 4231056 4157393 4224153 4121179 4062053 3901707
4848 3901707 3828822 3706261 3639573 3558328 3512651 3490549 3360265 3382339 3214370 3143981 3060859
4837 3060859 2970128 2906329 2740976 2773318 2667596 2538677 2660248 2619004 2444711 2372511
4827 2372511 2343872 2365852 2460673 2390181 2389351 2406659 2214444 2115674 1920453 1997624 2203085
4816 2203085 2083999 2203983 2162074 1985088 1941655 1965222 2021412 2070038 1888278 1926575 1995076
4805 1995076 1910450 1938240 1710283 1633523 1674776 1681066 1601057 1681176 1678360 1651868 1744243 1699939
4793 1699939 1756675 1650419 1576754 1527267 1401206 1348231 1444999 1479996 1377780 1363891 1412061
4782 1412061 1353563 1249613 1352615 1227839 1236487 1372632 1345115 1467529 1407566 1408521 1423246
4771 1423246 1301124 1198758 1218584 1163033 1296160 1260789 1300128 1178589 1197934 1284847 1350171
4760 1350171 1344433 1172287 1032182 1015773 1032865 1102012 1028208 1050855 1059534 1084305 1172966
4749 1172966 1312211 1116265 1038743 1039732 974721 1027431 1031553 971671 966525 1010959 940666 872770
4737 872770 785263 811247 801207 855052 915149 926620 865578 921382 950137 999209 1056954 1024904
4725 1024904 1079750 984564 956017 924607 859382 882520 836732 923982 993140 946253 1016083
4714 1016083 1080766 987917 810778 790538 1002865 906692 968756 933702 971077 950082 1013474
4703 1013474 987031 838727 920985 1074181 942780 1046480 1062031 908925 1033892 1003347
4693 1003347 1070511 1157976 1131706 1093329 1089276 1177255 1084697 1102820 1163465 1199905 1126256 1112558
4681 1112558 1205348 1175419 1169811 1127548 1122736 1170242 1095520 1277245 1448708 1220867 1132305
4670 1132305 1084662 1009438 999637 1070347 1099640 1031955 1118895 1201099 1280451 1100308 905829
4659 905829 963592 929999 943919 918402 871404 946258 1078511 994037 925572 945331 617367
4648 617367 753427 940214 854874 891942 902088 1015500 978551 843025 897014 907450 942460
4637 942460 1029566 1050556 883082 931171 1007384 942613 859980 838743 718479 787773 892058
4626 892058 957584 976249 854581 927175 905716 883514 884184 857893 873969 890670 817900 842244
4614 842244 836315 846943 732454 765124 856642 895469 944835 967429 990813 986525 928337 1057723
4602 1057723 1058386 1027139 1001881 955346 917339 884529 928848 893395 868299 785397 835810 788199
4590 788199 642709 775468 909021 998763 925352 1002391 922090 779260 766742 731659 577136
4579 577136 665396 760583 811317 705520 735958 783652 885153 944022 805739 731631 672234
4568 672234 697613 641740 789670 983591 907204 996408 1025924 819418 800275 815243 831817
4557 831817 847086 835149 764395 732593 678254 654077 689770 693444 594777 719574 611124
4546 611124 496895 719764 764841 740181 768736 795320 673975 756936 702808 706292 614721
4535 614721 692847 884288 785547 756864 768360 829483 688865 632650 555726 631613 550423
4524 550423 578948 500276 538473 583455 673477 623884 666925 780357 693466 710225 670519
4513 670519 639953 677121 619814 590792 729012 599028 592777 641718 617814 600090 430598
4502 430598 532821 647488 609203 670095 635025 585575 587057 557545 682773 691489 639975
4491 639975 571016 546004 721567 557350 675280 731642 734619 713710 715066 795175 855803
4480 855803 836065 804734 876316 849245 905175 868587 757666 729801 673036 731410 896043
4469 896043 964724 979942 927924 935541 981994 914714 756028 904730 871303 983990 1140215
4458 1140215 1107840 1083322 1052803 1044976 1010664 1096440 1042640 1164667 1220653 1272606 1484638
4447 1484638 1489999 1339611 1446369 1520081 1378496 1472659 1448303 1438949 1444908 1365358 1448441
4436 1448441 1619114 1728669 1710331 1715890 1691246 1485295 1587975 1891506 1965043 1853872
4426 1853872 1877932 1998733 2090014 2304332 2302833 2206566 2365336 2556677 2675736 2605809 2771513
4415 2771513 2796371 2934885 2964291 2985106 3049007 2957189 3166684 3225657 3511389 3782549 3904673
4404 3904673 4116820 4233934 4181090 4398865 4588444 4949282 5064916 5366399 5689259 6005539
4394 6005539 6464444 6992616 7489315 7945763 8726332 9429033 10252653 11140410 12224644
4385 12224644 13285544 14556894 16369749 18262138 20002186 21262529 22195531 23151809
4377 23151809 24335765 25678364 27558812 29757676 31971965 33753107 34316305 34225082 34169520
4368 34169520 34539308 35495229 37079548 38787149 39861005 39695353 38012640 35795379 33839994
4359 33839994 32481516 31872561 31606192 31525163 30681965 28873122 26410240 23986763 22068464
4350 22068464 20662362 19605683 18685978 17626997 16509142 15099837 13307826 11993158
4342 11993158 10679604 9461815 8659525 7885447 7452438 6994394 6636752 6043257 5686258
4333 5686258 5425359 5127262 4978982 4815113 4549331 4360589 4294069 4096697 4056734 3863576
4323 3863576 3717711 3487714 3400462 3381296 3274302 3064815 2953965 3039087 2886740 2611442
4313 2611442 2438885 2426151 2358329 2381915 2283530 2173728 2045932 1988558 2008219 2063185 1949096
4302 1949096 1819435 1846858 1656606 1757084 1758466 1705849 1558356 1568334 1610945 1444142 1419960
4291 1419960 1426499 1447279 1354678 1214707 1248141 1300734 1439066 1468760 1409537 1402525 1168476
4280 1168476 1042960 1038682 1184723 1202902 895310 846903 872276 896702 987918 957854 688691
4269 688691 698429 895681 953671 879117 867418 820903 871827 692113 667643 694046 867400
4258 867400 877329 836177 918001 741162 794823 874643 696355 518906 705694 715973 729382
4247 729382 710245 625483 685659 725563 734453 694302 718246 730649 512291 538154 767388
4236 767388 693713 680492 729902 724230 740391 601248 556013 607200 574082 595856 640005 399591
4224 399591 498221 503956 411833 485232 534967 668063 569486 451295 455805 470172 572641
4213 572641 637453 596754 552362 634130 737709 786717 771902 812331 789439 696679 693307 683614
4201 683614 702475 810366 756572 598263 662153 776982 855972 943812 910981 1027774 1152756
4190 1152756 1148641 1237517 1291058 1444149 1530875 1768914 2024488 2184619 2503996 2701133
4180 2701133 3036640 3420489 3507065 3617777 3562464 3199391 3011815 2760888 2360618 2030432
4170 2030432 1725689 1480562 1343805 1136710 971443 987583 1008943 1027406 903893 838789
4160 838789 839324 698415 590456 481952 641315 660496 764156 745658 665001 711539 661318
4149 661318 676046 635724 661099 660427 572344 520943 619163 530452 661226 550186 420289
4138 420289 411260 393957 483375 353497 393405 463585 545690 479644 485710 509392 435813 345743
4126 345743 335996 416068 459023 530255 454089 487879 425820 454858 612912 495526 482594
4115 482594 396721 288224 366411 495201 427909 416576 381287 526868 438115 277459 324243
4104 324243 366776 301972 296246 340224 372186 466965 447130 509183 490661 585049 538460 467602
4092 467602 398431 378366 336120 408934 508185 459352 523656 553567 565272 352115 270903
4081 270903 484042 462383 404465 337614 330303 433897 531043 502480 489173 299276 325353
4070 325353 378224 454904 443402 320120 400907 438092 501492 499219 555026 592447 609315 545769
4058 545769 508673 586434 635630 632771 487235 542048 544904 445360 403687 376470 278424 236259
4046 236259 262231 466709 530685 490879 460099 500422 480504 419262 388946 506654 350888
4035 350888 197728 210305 442389 448028 284318 331766 374433 353593 317120 282232 125786
4024 125786 133328 300753 369696 351086 290782 224742 255345 237823 302682 189264 321578
4013 321578 262150 198329 92829 102766 151980 199408 156876 227485 293969 270575 296500 181580
4001 181580 205021 239697 91939 137588 195304 140913 160401 245574 336683 343641 313968 400289
3989 400289 253661 177903 305691 279871 306546 342937 265120 259084 320426 178824 241590
3978 241590 281649 239826 143548 53874 199386 322056 415324 308406 273842 339987 189188
3967 189188 178043 317563 368540 339722 239495 290432 272086 300929 335408 299470 409426
3956 409426 415206 146260 212014 255243 262492 268063 211942 187974 163897 312651 246894 406336
3944 406336 464197 383980 338926 265305 265904 371426 531042 436290 354278 320286 355118 311154
3932 311154 150516 186021 282182 397562 452374 334755 464799 460149 330573 500753 512010
3921 512010 331954 273720 347275 275144 247732 172156 239622 197017 258231 445054 503330
3910 503330 304137 360971 290599 229998 333341 421353 405469 183572 145156 274667 387957
3899 387957 292228 219415 275683 329953 183906 252555 306397 304493 349809 410362 285264
3888 285264 266270 218438 266600 429105 461799 198283 187896 397042 434420 330347 305953
3877 305953 378512 372369 195149 168322 406774 457921 434036 377194 473271 540900 471391
3866 471391 415243 504883 240965 194310 297022 380458 474544 350572 323142 282962 260622
3855 260622 178691 272594 246990 58902 210149 202247 210291 166128 47469 72461 293944
3844 293944 403355 427223 309219 426324 531909 430095 387794 480269 497053 513527 479344
3833 479344 254850 212058 153195 353637 112897 31221 128166 157640 194913 264142 431918
3822 431918 451095 384163 371733 414078 466673 217581 280594 296371 178683 357709 309575
3811 309575 271230 363218 540351 433488 460551 365538 289913 434016 325819 299057 269920
3800 269920 284513 330665 185271 292922 317463 365996 364702 426462 373850 379738 402999 352072
3788 352072 263198 241081 411889 411919 257342 309824 431412 338515 352017 414995 428094 335640
3776 335640 383537 482427 608870 412665 387003 571548 613927 623967 440230 576533 520760
3765 520760 493836 456789 332606 359127 449435 551016 466994 390686 557117 630467 553403
3754 553403 654270 652934 506489 511737 481093 458035 438249 546232 567101 419297 414525
3743 414525 409341 527158 651855 567332 497338 568992 627104 647978 663717 775858 792631
3732 792631 749649 673159 669339 625408 620145 677395 737361 773782 829430 645726 646262 675156
3720 675156 713508 793052 880531 731170 556586 680515 777736 729137 770111 735518 650853
3709 650853 580865 688582 671070 652055 665608 652253 596570 791891 890922 696161 621580
3698 621580 789608 757366 821746 895272 768113 703240 543569 625167 723161 741498 781366
3687 781366 790894 846205 801214 603224 644477 812186 942011 971495 777708 699723 670157
3676 670157 747919 816747 829617 940589 720006 660001 692979 690229 719107 652183 702563
3665 702563 705668 719743 837501 865273 866180 782968 870495 932999 968587 816643 758631 928138
3653 928138 1012334 768440 671144 828211 941586 921446 961533 977192 1008027 887750 892469
3642 892469 946462 829438 829363 793431 782707 837740 875153 880656 881614 890692 852994 825320 941239
3629 941239 983793 922870 1073875 1053223 925852 933336 977248 901310 858884 1041096 1115778
3618 1115778 1031826 1062389 1056740 1073835 1022124 1142610 1409635 1317045 1027501 944757 1063902
3607 1063902 1264130 1269056 1298584 1205208 1281613 1186631 1243836 1398368 1364468 1441845 1366321
3596 1366321 1368309 1393140 1451502 1433940 1351868 1327932 1498774 1541756 1562008 1644024 1660525
3585 1660525 1656374 1674171 1604160 1585983 1700886 1719272 1594977 1683607 1853789 1843333 1818267
3574 1818267 1845013 2031852 2118971 2002429 1941218 1961541 2087171 2336537 2377851 2394629 2300829
3563 2300829 2292556 2454803 2464506 2366773 2460679 2533700 2493859 2578663 2570312 2610023 2805542 2790938
3551 2790938 2777757 2943600 2989347 3024866 3202945 3297758 3165181 3230857 3158935 3233166 3431272
3540 3431272 3541342 3601664 3761963 3896551 3890566 3879363 4215450 4437259 4541774 4644783
3530 4644783 4726575 4959632 5099879 5196477 5243315 5403017 5728203 5652915 5753675 6057380
3520 6057380 6357065 6508685 6594810 6842337 7114658 7374727 7551625 7779561 8192066 8515379
3510 8515379 8819744 8992476 9196992 9247949 9563489 9833211 10056215 10307870 10691222 10795306
3500 10795306 10913508 11238064 11504211 11684458 12016298 12339045 12591990 12860941 13215197
3491 13215197 13680724 14196404 14500442 14885140 15277162 15563706 16005868 16432599 16955325
3482 16955325 17268912 17786560 18112409 18709689 19261877 19596862 19917672 20291356 20601730
3473 20601730 20938333 21270703 21532253 21808104 22208976 22279327 22486986 22694233 23074504 23380798
3463 23380798 23467592 23735039 24000162 24172629 24532047 24925132 25245612 25449453 25538617 25822782
3453 25822782 26050016 26337637 26669549 26911612 27151452 27472297 27657744 27635130 28049555 28016664
3443 28016664 28106700 28313805 28438326 28444103 28360207 28433258 28364430 28400044 28317816 28190467 28182762
3432 28182762 28276812 28170262 27976305 27812983 27720933 27542193 27328287 27137597 27078098 26878760
3422 26878760 26693452 26631038 26359370 26067733 25879354 25816748 25593624 25413285 25091603 24875878
3412 24875878 24802111 24493018 24396600 24194832 24001983 23768545 23438639 23111858 22692567 22477014
3402 22477014 22250368 22164185 21788431 21359570 21215728 20857694 20469024 20010032 19746283 19449030
3392 19449030 19244593 19072673 18661721 18339446 18142040 17974289 17635467 17277011 17147067
3383 17147067 16882210 16735980 16488400 16231576 16022011 15552703 15446196 15420516 15193735 14829650
3373 14829650 14665205 14700749 14402035 14202732 14174198 14086064 13870023 13707013 13532414 13568098
3363 13568098 13559658 13313152 13266007 13074871 13022865 12928948 12935819 12936837 12997173 13096594 12946457
3352 12946457 12863214 13078295 13000378 12954626 13179660 13500967 13528698 13691884 13921343 13957912
3342 13957912 14231274 14528371 14592715 14702822 15143816 15420844 15623783 15838019 16187000 16455435
3332 16455435 16785703 17049655 17344062 17604062 17935858 18246569 18395240 18655069 18898261
3323 18898261 19200890 19541191 19831678 20157215 20598120 21106721 21717710 22181595 22606137
3314 22606137 23184747 23931146 24758678 25301293 26045353 26585580 27395452 28063232 28877236
3305 28877236 29729542 30528473 31162722 31878699 32684896 33390506 34179918 34954761 35843044
3296 35843044 36657878 37237275 37940978 38847393 39526190 40357387 41159528 41998710 42730679
3287 42730679 43451649 44014831 44945654 45856567 46706889 47643120 48617967 49662018 50639754
3278 50639754 51509952 52519750 53829609 55056760 56237948 57326241 58567934 59767630
3270 59767630 60973553 62193173 63618659 64903835 66141758 67284141 68625420 69865008
3262 69865008 71061169 72331873 73683406 75015728 76210091 77441938 78625765 80044763
3254 80044763 81509206 82882832 84324614 85554873 86872522 88406936 89715408 91131377
3246 91131377 92621380 94082577 95642689 97419708 98930543 100556213 102544772 104563418
3238 104563418 106645055 108875508 111117578 113663235 116210978 118839451 121383172 124063620
3230 124063620 126761061 129520752 132312877 135166754 138293015 141133503 144372011 147796923
3222 147796923 151441764 155502153 159782296 164636369 169836627 175370183 181535570 188154596
3214 188154596 195404978 202997942 211103530 219910016 228894383 238328203 248171486 258557218
3206 258557218 269172845 280158618 291450503 302911833 314491005 326208273 337661676
3199 337661676 348947629 359802863 370009061 378993272 386840631 393398888 398038477 400951615
3191 400951615 402024807 401066773 398264992 393738805 387685263 380608983 372691680 364348230
3183 364348230 356048104 347766423 339413362 331036964 322584856 314222477 306091872 297863242
3175 297863242 289678802 281594055 273470024 265719013 258163238 251072247 243914656 236815284
3167 236815284 230078015 223505039 217309682 211302831 205521549 199875600 194667030 189732866
3159 189732866 184964403 180383556 176031340 171753974 167495721 163441942 159629951 155655140
3151 155655140 151724848 147904967 144188219 140817227 137461781 134022789 130667025 127420231
3143 127420231 124122675 120895194 117751413 114834946 111782299 108657397 105804827 103009202
3135 103009202 100258946 97681784 95088569 92553971 90001987 87579749 85280920 83103195
3127 83103195 80926622 78918810 77004728 75220898 73437559 71675305 70074907 68664117
3119 68664117 67225839 65820415 64589232 63258452 61921332 60683669 59459335 58375896
3111 58375896 57051287 55993856 54833181 53868100 52799806 51723699 50682573 49758425
3103 49758425 48851502 47837327 46929537 46036773 45290630 44460198 43668116 42774485 41972943
3094 41972943 41191194 40448037 39532981 38671131 37861613 37072484 36256748 35557846 34728885
3085 34728885 33993808 33221236 32523075 31888114 31190241 30550981 29923015 29094945 28625684
3076 28625684 28130805 27328320 26844183 26302084 25743183 25266540 24753725 24386578 23836539
3067 23836539 23313745 22921399 22405780 21821284 21367086 21053310 20613948 20210130 19679957
3058 19679957 19235017 18838560 18406606 17904138 17507429 17115746 16698471 16392769 15962442
3049 15962442 15654435 15342848 14956631 14676835 14422371 14222365 13897105 13625405 13341690
3040 13341690 13122754 12754952 12361739 12165147 11886776 11652659 11406370 11292378 11135159
3031 11135159 10797439 10589544 10290844 10113101 10051871 9836894 9674339 9460403 9206463 9192351
3021 9192351 9040084 8842942 8654316 8690622 8503456 8115195 8168995 8216253 8042107 7850246
3011 7850246 7966077 7845504 7695267 7575559 7547705 7532024 7442455 7266550 7165382 7042284
3001 7042284 6899311 6845555 6904893 6813368 6628697 6589648 6563691 6588463 6565341 6589382 6557392
2990 6557392 6446278 6400432 6445740 6502785 6614134 6606078 6637848 6713846 6593366 6552454 6551635
2979 6551635 6604869 6767367 6733992 6826070 7031557 7081096 7061572 7313651 7269238 7277807 7196633
2968 7196633 7250940 7248541 7269531 7502582 7584014 7771495 7773639 8022894 8083310 8279125 8535066
2957 8535066 8687401 8645415 8728314 8928057 8905910 9192612 9443720 9550725 9687885 9823141
2947 9823141 10225018 10391808 10668690 10770252 10779182 10938911 11169776 11528044 11742058 11925512
2937 11925512 12290320 12734183 13094611 13205337 13323800 13548047 13856131 14163575 14556636
2928 14556636 15142081 15598266 15937666 16431394 16855326 17288601 17617647 18004063 18724547
2919 18724547 19404203 19966156 20803394 21471157 22026015 22912863 23728488 24793061 25825570
2910 25825570 26978265 28360828 29729199 31323045 32883197 34563706 36492256 38660930
2902 38660930 40875514 43463585 46086591 48923057 52127614 55203064 58452025 61612210
2894 61612210 64452907 66793424 68459493 69692847 70905740 71922996 73072388 74588099
2886 74588099 76139622 77656117 79431931 81163977 82857775 84573933 86004322 87359810
2878 87359810 88601990 89811977 91313463 93130354 95316613 97795806 100471134 103565361
2870 103565361 107256572 111561372 116861428 122680570 128806359 133331549 134117404 130733750
2862 130733750 125048298 119435969 114977955 111839397 110186273 109610753 110347038 112253900
2854 112253900 115093421 118034195 119111138 116360238 110022620 102219015 94970388 88840785
2846 88840785 83908269 80232128 77346752 75119527 73463719 72030292 71208887 70625713
2838 70625713 70483398 70473050 70659850 70888531 70610718 69770686 68210697 66498034 64297202
2829 64297202 62045179 60301640 58514265 56849420 55655280 54546212 53438866 52194886
2821 52194886 50746815 48883257 46753017 44362467 41845336 39190802 36717302 34397514
2813 34397514 32334628 30298137 28489563 26991096 25600057 24122344 22929023 21682149
2805 21682149 20589553 19784414 18810286 18055519 17210716 16515942 15890969 15254898 14828990
2796 14828990 14180155 13796533 13365147 13008744 12448618 12075641 11500278 11030021 10734996
2787 10734996 10337594 10146389 9811492 9552131 9289376 9078002 8642246 8356871 8177203
2778 8177203 8098900 7833352 7496572 7341581 7141666 7096963 7025699 6776296 6515421 6330944
2768 6330944 6202523 6099602 6064903 5861482 5705927 5500294 5163806 5144955 5066705 5040357
2758 5040357 4911824 4675523 4627879 4559717 4398634 4390348 4348112 4201998 4068934 4081327 4042852
2747 4042852 3973033 3867806 3693938 3564745 3508545 3556124 3719675 3652024 3387429 3156709
2737 3156709 3170630 3211867 3202330 3005547 2812139 2833388 2820128 2767531 2752867 2741445 2782957
2726 2782957 2676456 2619492 2624715 2520705 2592457 2507558 2357074 2238519 2297584 2227039 2144685
2715 2144685 2134997 2118499 1949427 1925375 1936629 1886202 1893309 1901307 1779598 1864563 1800934 1526346
2703 1526346 1648897 1680263 1566454 1644861 1819975 1774220 1659850 1624311 1519901 1670789
2693 1670789 1624300 1555282 1428042 1387890 1344115 1344269 1226147 1348750 1497580 1312305 1292632
2682 1292632 1292986 1395275 1142402 1115462 1335042 1257027 1187581 1220067 1324594 1278446 1091511
2671 1091511 1137853 1053083 963245 1011751 942798 965404 824221 824121 879399 856456 1057815
2660 1057815 995106 780325 733019 800832 804335 778005 850460 722257 748557 876190 747754
2649 747754 780308 911944 886419 861012 870424 865092 922293 822049 802408 821061 777261 739159
2637 739159 829127 714670 784659 878520 818188 899426 815312 602108 614425 721297 727559
2626 727559 633124 768610 882765 921902 755798 864031 1048339 922550 755221 754555 791641
2615 791641 844254 1011048 957615 1007832 1003125 1089697 1024831 1017846 941907 814278 846216 926455
2603 926455 847356 899297 845355 723293 795136 871199 986196 926322 857999 915042 885174
2592 885174 875702 899788 928351 895079 878787 913223 1016596 827625 858935 995189 1193869
2581 1193869 1233978 999132 886211 905393 781584 768449 822948 912305 876954 887962 1006607
2570 1006607 1081547 992412 942740 1079129 963060 1002556 987825 876719 707594 651295 740436
2559 740436 686529 626157 884874 891656 738150 698034 646600 536170 546555 664782 695361
2548 695361 714785 750058 587802 519738 624362 550896 440847 359750 341774 480538 530984
2537 530984 545349 617166 572896 621815 684995 393590 221048 330314 490226 409804 407526
2526 407526 221878 355037 465915 438533 446314 393043 336875 345324 322530 313361 332839 292979
2514 292979 335513 351490 408232 477745 315164 250017 373782 387464 447026 335516 240842
2503 240842 281678 222005 216311 443156 447185 419610 303879 259710 296206 196276 167770 142592
2491 142592 235817 168811 207700 231278 202400 285622 273744 302167 329194 313460 215108 162324
2479 162324 169758 166633 273085 366263 370814 166699 206013 282621 130947 51174 118709 194944
2467 194944 237317 125233 41337 -18759 29343 45111 25076 -18501 -28803 -23299 -13236 75147
2455 75147 41863 -37299 60681 80079 103905 292516 280358 371038 325787 264146 220751 210450
2443 210450 330001 242132 263641 182872 76191 149062 130897 116357 90754 160068 118633
2432 118633 202682 355247 354029 192383 234144 155845 212703 172149 250561 215857 222043 222353
2420 222353 272285 265297 174458 78131 96273 153519 227071 280309 115166 192355 147411 156477
2408 156477 158020 66882 89689 127878 223479 171205 31669 -64524 19104 -1701 127304
2397 127304 147569 261528 205119 131492 31646 190337 200479 -19578 -26074 114161 30013
2386 30013 33075 163793 72321 29081 30536 -64185 -114967 59639 132616 37399 101009 55868
2374 55868 -62367 -113644 -155743 29581 77658 120985 86464 125585 65191 11048 -6277
2363 -6277 -83138 -23616 -34877 -56523 170151 -16721 -21479 -54040 -21857 -13559 142987 68534
2351 68534 -128350 -172431 94771 -17 89129 259450 113655 -182095 -212942 -96894 -20403
2340 -20403 69229 42657 145061 119960 156852 287552 170844 156558 141989 87831 161534
2329 161534 -22234 9221 -8211 -43374 -43952 -13649 15184 8468 133570 83217 102224 50041
2317 50041 30541 54679 119555 114877 92014 -23000 51662 105977 104894 88081 147941 99633
2305 99633 1362 -34390 -81468 -71402 -180446 -96911 79198 -63615 -112441 -68909 -53770
2294 -53770 -14681 31923 88426 154425 17987 63949 89836 -79897 -6788 61690 81176
2283 81176 136026 32077 33288 178558 252856 306939 158539 233832 203709 176575 164670
2272 164670 124975 -36888 -57363 -18193 4303 26844 28576 -86015 -140024 -122688 56046
2261 56046 -13787 61920 34360 35254 9564 -86270 10694 -24364 -48670 6788 32365 170753
2249 170753 -37817 -208450 -138206 -54870 9405 72481 93199 116989 220151 88761 -81361
2238 -81361 59230 112062 91592 60227 430409 161731 64141 188338 41470 42656 91646
2227 91646 163401 153181 50685 -34790 -3335 71714 253993 213549 92501 147601 173034
2216 173034 154281 163030 308054 301273 223672 145248 -104358 -113540 12924 140631 196202
2205 196202 168672 139180 6333 -57731 104724 156440 286111 197919 197280 70412 148654
2194 148654 132558 -33741 -23298 70197 -9203 31082 171783 214827 100130 146124 147889
2183 147889 5816 47033 77008 19223 148 25368 -98611 -67912 -26491 157359 238990
2172 238990 7568 53083 25323 196517 231668 278519 261009 115102 -29405 67646 238759
2161 238759 86708 180431 271922 247433 281689 309608 275813 367820 361537 191143 346062
2150 346062 379820 386261 282791 371430 435201 394487 384184 323052 275772 199888 334866
2139 334866 424125 447269 520811 444634 471774 557831 528462 489383 451322 586568 738488
2128 738488 721084 668587 494052 640985 699792 767208 814584 917082 921134 741247 915061
2117 915061 1029908 1198864 1202140 1215103 1359403 1555597 1438829 1429452 1545990 1759865 2044841
2106 2044841 2317538 2547401 2775690 2780111 2961633 3394557 3656335 4064728 4660534 5139635
2096 5139635 6017921 6923051 7786913 8960045 10731187 12948373 15506738 16734445 14931233
2087 14931233 11741817 8919503 7016630 5692679 4837903 4093237 3627701 3313161 2930835
2078 2930835 2769295 2383235 2306563 2049847 1863100 1804994 1712244 1617807 1441516 1455562
2068 1455562 1421399 1290624 1234479 1146662 975138 1001061 1015949 934906 846742 767812 801383
2057 801383 722028 681375 662021 561663 515962 541232 551023 607346 592133 548305 588320 506939
2045 506939 576574 564620 486743 528547 454994 321745 377556 392218 373217 330177 166295
2034 166295 351087 293603 161233 288958 244050 250864 58591 -24747 94587 143031 141688
2023 141688 226960 305678 280040 86485 164242 180117 231639 70860 18160 76253 66938
2012 66938 152541 161754 106545 82022 100891 -51936 -2116 23886 56852 121693 259339 115076
2000 115076 55447 96151 158185 121114 21793 -11786 48333 93952 -1744 191045 163050
1989 163050 147823 288497 165323 80787 15390 50300 46621 -22363 242964 171231 2957
1978 2957 61697 82064 22782 -48570 -67363 232589 179255 156998 118117 57420 38062 69187
1966 69187 68276 -26662 -29719 -58232 -11225 76053 69596 243307 244565 193153 18056 -123333
1954 -123333 -131066 -26617 197721 110908 17063 108343 172971 61014 19929 -45682 34746
1943 34746 122360 42812 42259 130217 67734 -99757 -120376 42983 -92 4547 -116314 -179733
1931 -179733 -79391 57683 -6724 -11789 103038 41901 -62645 68896 128405 78920 -13443
1920 -13443 -12389 -38057 11563 938 3643 -124701 -26276 -41493 18178 94840 181 -170138
1908 -170138 -294952 -182965 -169344 -161918 -191412 22236 3641 -64864 -59715 90429 70600
1897 70600 -56573 64325 158918 187138 13933 44339 -15855 33624 106111 -106914 -3873
1886 -3873 68471 -57342 -154618 -49265 79297 94499 72554 85585 3737 -16913 147435
1875 147435 159835 186179 115636 1590 79651 91879 -42971 47025 160264 2282 151498
1864 151498 118592 50291 10154 40317 45848 -26055 -28922 -98337 10599 -33936 13305 126785
1852 126785 31532 -51956 -37393 -37557 9101 -54033 -69249 2053 41904 128598 43832 74273
1840 74273 20954 -68671 -164653 -144880 -115855 -120550 -77647 -52505 -83488 27510 -69305 -216789
1828 -216789 -132089 -136606 -9200 -258 -34470 -28129 30987 270563 398981 234443 156565
1817 156565 109411 81849 111684 98070 166263 108594 52462 -46831 -85490 2838 17119 91117
1805 91117 -11720 122378 37730 -184736 -11305 37438 75274 93824 -31043 16143 -19230
1794 -19230 4152 -25138 -37411 3262 -4868 20597 -5987 -104903 -98171 -78834 -265732 -93807
1782 -93807 -35089 -113329 -83425 -14172 -3496 -38328 -122532 -55037 -51134 -124142 -192419 -108186
1770 -108186 -16790 -18603 19714 102662 31407 -52316 -148160 -132021 -28866 -48167 8860 -30159
1758 -30159 -79090 118523 143290 -69020 -129267 -89733 -116417 -32616 -126644 -101848 -157773
1747 -157773 -86595 -80764 12556 94513 80269 -18471 -142179 -11743 169528 157875 78925
1736 78925 102004 -4847 -45600 -249763 -137175 -113708 75061 39871 -8770 7291 3679
1725 3679 157220 194716 268683 192617 108252 116518 70756 3301 -3694 75857 -45377 -93062
1713 -93062 -141808 -120772 -85912 -53982 -161020 -79018 20062 8704 -111080 -60075 57671
1702 57671 -171513 -78394 -62830 14257 -53160 -199754 61397 13409 49962 -18107 12730
1691 12730 -19404 -56367 28577 -131646 -171006 -80830 40852 19341 46247 -67736 -34889
1680 -34889 88193 -23483 -20681 -124589 106275 23014 -6566 91871 130316 49297 -55988
1669 -55988 -110781 -65395 -132088 -70551 18002 -24926 796 82206 135038 81374 123680 -45047
1657 -45047 -139083 -143375 29880 52579 108360 5519 15241 76869 -104868 -18496 92172
1646 92172 83670 46742 12982 -1587 -15168 32765 -219356 -187350 -117631 -68436 -82752 26682
1634 26682 64323 25108 -144663 -136506 -107615 -47293 70954 244794 113262 30847 17465
1623 17465 -55204 -45241 -105378 -176221 -157918 -52189 -78785 -72687 14908 59060 115184 -80471
1611 -80471 -107321 -113899 -60598 -202340 -272426 -110404 -111731 -110297 -134719 14706 187763 153776
1599 153776 148275 221068 -76902 -245488 -77377 113213 150940 98662 67947 -63984 -215459
1588 -215459 -132082 -207986 -119630 -84250 89218 69407 193982 82147 -89425 -112832 -61202
1577 -61202 -50188 -18619 17000 -54226 -11094 11310 -19404 -55777 6910 -23757 -54486 -3622
1565 -3622 150340 68206 -115319 -29816 -149087 -91755 -41254 -211246 -21944 101679 145104
1554 145104 60187 -4269 -115475 -128439 69832 9048 -8304 115830 14172 -77222 -96665
1543 -96665 -92849 -92036 -3033 -71034 -159075 -3239 -22023 -44581 73860 119556 2188 -100612
1531 -100612 2631 -38820 -50081 -53733 -137428 -82193 152251 36501 -77590 -47072 -6737
1520 -6737 -9712 98757 -38103 -189731 -122084 27534 -1940 -144776 -89223 -101958 -38823
1509 -38823 -43951 -81799 -26180 83522 45538 -12958 -49996 -65903 -54577 26819 -75973 -69131
1497 -69131 -99737 -165503 -77323 6713 -27414 -99081 -30591 -108935 -163541 -104240 14301 3002
1485 3002 -93854 -186999 -245122 -20386 36400 -43437 -153389 -119167 -153098 -91745 -82179 -32364
1473 -32364 -121422 -62909 14332 -29832 -66569 -49529 -37510 113984 -74463 -130151 -145535
1462 -145535 -106579 31327 -11791 -49665 81784 125413 172733 174307 16771 39513 29231
1451 29231 57126 -50464 -105626 -107935 96391 67381 100955 177864 139376 86713 77159 -473
1439 -473 28396 106294 -66822 -115960 -100881 -145167 -116601 -17830 79146 -98375 58385 73538
1427 73538 59762 27915 -94532 -117014 -127880 -93144 -197927 -150949 -12781 69772 30091
1416 30091 -48935 -14319 23421 -72416 -98595 -95728 42833 154348 107997 -19345 57921
1405 57921 324528 200444 62090 -164250 -95448 -54069 -60180 59611 27621 160457 161903
1394 161903 28649 6363 -140063 -197828 -191569 -123963 -38679 -100404 -168334 -260843 -255132 -292036
1382 -292036 -116357 90979 -98759 -90112 -94904 -63973 -112745 -163111 -111656 -19160 -74254
1371 -74254 2069 -92969 -39203 -44090 -42017 9194 -7147 56779 -49781 -118018 -30748 -43156
1359 -43156 -123865 -178653 -53834 95531 -3810 -34133 25825 111654 -101623 -30947 -115600
1348 -115600 -183451 -195891 -235072 -56347 37831 133161 63221 -48440 17386 19006 -80752
1337 -80752 -56094 -123274 -95108 108085 23409 102133 1270 61876 7269 -159727 -122287
1326 -122287 -102749 60088 113747 17268 8318 120145 125720 -45140 -59875 -46636 -37014 -48729
1314 -48729 -55585 21049 188725 22358 -16804 18274 -51932 -36161 -143308 -156837 -94598
1303 -94598 -124392 -205954 -182739 -124349 -107016 100364 84307 8123 107223 114418 121157 -78373
1291 -78373 -56029 180042 -52359 -147740 -106104 -98655 -62418 -98504 -111897 16311 138851
1280 138851 -63898 -130515 -70075 -127887 -247356 -153348 -22306 -60515 30789 78934 -48463
1269 -48463 -27771 55474 -31922 -52968 -82079 -90354 -80077 -178811 -20438 16341 -9707 26585
1257 26585 -6415 161705 151318 74007 34691 1840 -94789 -46873 -29808 -117469 -101136 -206856
1245 -206856 -233897 -126260 -185321 77480 117081 -19282 54533 147627 93704 -159643 -84248
1234 -84248 -25271 209306 181509 61503 159425 69462 -59899 -108681 -22351 -52455 -26151
1223 -26151 192474 208902 164620 24454 -48045 93691 175993 180502 176957 100686 85715 171492
1211 171492 138713 65706 169059 136876 224529 193494 95770 146365 164423 159456 73395 -11049
1199 -11049 124190 184822 169277 43690 -26627 110388 43602 -14068 -59144 -241454 -160650
1188 -160650 -15807 242151 276238 104824 72847 129930 151277 116344 -27658 -126900 -13762
1177 -13762 -14295 -132130 -164151 -114812 -71883 -188580 -186039 28840 151961 43174 222116
1166 222116 143929 -41302 -155942 32818 -11876 -159331 -60576 -57653 -162481 -133894 -103865
1155 -103865 -40230 -26274 -65440 -63001 -119633 -90410 -129147 36219 63191 8500 -134951
1144 -134951 -17604 -11694 -98537 -162475 -120327 -54083 36836 229449 142496 207196 209995 55894
1132 55894 126831 72200 -64338 -231607 -105579 -119174 -73285 18389 5855 93151 91579
1121 91579 -170845 -55559 26034 39176 14415 -114192 -16835 133238 -40081 -41782 -97439
1110 -97439 -40392 -44514 -58080 -64176 468 -25364 -87842 -65914 -130462 54503 91805 45672
1098 45672 -80765 -129210 -73866 -112098 -78557 -143364 143812 98758 3555 -11654 -17297 -23591
1086 -23591 -18780 136524 146559 104355 127973 213130 30366 -37603 -23697 -34592 -1444 -55733
1074 -55733 -54087 -5160 -76468 122551 88883 87434 -2980 26628 23204 -26977 -125924 26299
1062 26299 -93044 -40038 -77023 -75718 44527 35240 139691 48681 57885 10151 -63982 -35479
1050 -35479 75707 173189 191781 182022 90375 77837 30784 99315 -31907 -137648 -148908
1039 -148908 -116572 105630 131067 120931 122539 271545 100575 49846 29462 18816 66942
1028 66942 -29696 -19684 1512 60937 100080 65532 -45016 -33989 -80619 -143820 -86896 -7236
1016 -7236 -73233 -756 26575 20119 52367 31872 21786 -40763 9527 -129518 -67500 99211
1004 99211 106116 59540 -79618 2502 -82259 -42318 17533 -175166 -219911 -46256 68421
993 68421 47457 -7140 -52406 126566 76159 67734 -2376 -46197 14566 -32174 -22308 2884
981 2884 43637 -88320 -82038 -35292 -175973 -153619 76147 66489 -6118 31829 17164 116650
969 116650 50947 168256 -44445 -43011 30227 28714 -43373 38715 -16391 -171 138953 3731
957 3731 -17999 -116174 -90196 39048 -39562 -40789 -39114 -120727 -37233 28409 1798 -3353 31103
944 31103 63111 117290 82529 73093 -6634 -178628 -78945 15652 -164097 -113931 -171161 -158400
932 -158400 -2781 -51103 -83244 2391 -117685 -41681 27475 25270 -22211 -64915 -78612 -10259
920 -10259 -31759 27938 -99355 -104404 -14148 4939 14298 -3452 -207754 -143239 93665 126863
908 126863 27753 100098 49104 80475 119933 139237 133552 129549 34111 -34699 25828 -17591
896 -17591 111913 48335 114501 149268 235078 227404 190198 1497 -18207 -16663 -47805 -147401
884 -147401 -163483 -107044 -63351 -191427 -265970 -146932 -64023 120718 -67001 -43222 58780
873 58780 -102076 4695 121361 84812 -146147 -125874 -75533 1877 -6053 15181 -126235
862 -126235 -82775 73402 86357 -23851 -72284 -68151 40655 41603 -92958 -177024 -111950 -87956
850 -87956 -70652 -121812 -145664 -39149 -37153 22013 5007 91339 119386 96000 -37179 -13562
838 -13562 -1357 44022 114184 196854 101329 -24356 -5057 49097 79229 -30692 5884 -56561
826 -56561 -23393 94061 11349 19264 5761 70166 -11628 -92499 -144013 -118011 -88173 -101214
814 -101214 -80731 67563 54594 -106941 -80194 -130188 -130474 -103537 -101478 -59977 1061 25905
802 25905 70470 57026 30949 27520 -52990 -38746 -10742 -73010 -98361 -152219 37062 56270
790 56270 -108109 -194270 -163661 -119252 -158142 -6229 -103675 69380 37999 -80104 -132577
779 -132577 -81275 70001 114710 210252 186565 165949 46061 93183 123257 110588 124065
768 124065 152291 -99456 -272489 -187890 -65458 1552 26067 100247 165202 77284 -1061
757 -1061 -74877 36717 147862 29668 101939 54487 47771 90739 265940 227249 152269 -34623
745 -34623 -114390 -108298 108390 190663 151903 -7210 -122858 37159 50069 15066 116971
734 116971 79283 -23394 2155 102188 166003 158856 51784 -34897 55459 33222 -28082
723 -28082 -39881 67324 43367 142152 18 34344 43875 165949 49754 -89210 -222379
712 -222379 -9896 106611 56365 127206 118976 -7286 -37698 -39307 79117 100762 -42106
701 -42106 175752 201618 85951 143344 242279 97548 68266 -24356 -40272 73695 -25711
690 -25711 -109070 -18860 -37296 44800 29383 -84414 -120001 -143332 -134771 -61414 -33885 -24734
678 -24734 27479 -30640 -77942 -46 175799 161176 -43336 71342 114542 76919 -46284
667 -46284 -111904 -131780 -35832 -46863 -917 33272 151398 51976 -26638 -13019 14727 163340
655 163340 99858 67527 146128 221309 74787 43794 15524 -26658 -50829 17629 139538
644 139538 252248 2668 -40449 12196 -45060 75060 123699 90302 -10233 -125977 -83113
633 -83113 -192288 -127856 111963 183125 -29079 -122315 -114220 -71220 -87813 -56409 110369
622 110369 -57466 -72049 4952 72202 30266 204772 37722 -94333 -97065 -158790 34456
611 34456 203642 17048 -150127 -59987 94983 2860 -182959 -163647 -139901 34287 11887
600 11887 -47355 -156061 -45283 55605 -29686 -133489 -107797 -166204 -177738 -88983 88570
589 88570 222150 95045 -36647 10192 3564 -159691 -196376 -92607 -109820 -133950 133189
578 133189 258155 87328 74843 73653 169304 86133 -20195 87528 -10464 -60023 18407
567 18407 70307 -13352 -100942 -148180 -178498 -214439 -110460 -157293 89109 95913 15618 43282
555 43282 17024 -46 136051 -149530 -276037 -203222 5803 148803 -2317 -115863 -271448
544 -271448 -109825 -83363 10074 9362 22537 -1737 140308 127895 134430 -5329 4020 -40215
532 -40215 13604 -30659 -238949 -129604 -104767 -218539 -119175 1147 -49578 -136013 5726
521 5726 -58617 -5616 108530 14365 47409 76863 238963 251993 100918 -15164 139547
510 139547 15252 7299 -106255 -177864 -4926 139417 -78468 -95874 -37435 47234 203040
499 203040 55783 -82684 43516 104821 -11992 14892 73495 73272 209952 171756 90873
488 90873 126869 131565 105093 9863 -4412 100426 125804 -49406 -70559 -50607 -140537 6411
476 6411 -16996 -116754 -5820 -4312 157532 9038 7340 -120926 -46400 11944 -34082 91996
464 91996 98280 44419 -52719 82966 151804 4819 104013 36339 -146612 -72497 -12838 -6248
452 -6248 -78383 2560 -140995 -124326 -22687 -100367 -71721 -47229 -108248 -148179 -121934 8044
440 8044 28993 -240 -146111 -134558 98222 20739 20084 24160 174693 181423 68701 -51776
428 -51776 -32643 70215 48855 -27710 -145743 -7185 -41813 -21464 82234 -214 -60336
417 -60336 -67962 130898 194661 45397 -17350 -129067 -126505 11787 150378 197184 221756
406 221756 20758 27572 97760 193335 163883 214074 128318 61914 207942 131624 165477 -16697
394 -16697 -117994 -136226 16690 27437 -8153 -36756 36933 27465 11354 214620 78089
383 78089 103937 211912 128609 29381 18452 103410 72115 24989 60330 -11322 38347 141755
371 141755 99900 -1832 138261 101465 20978 75888 56701 52683 75454 137907 60872 122172
359 122172 148554 51372 137394 147036 103067 35965 7067 173083 286025 151560 -5095
348 -5095 -33762 65372 148273 68127 71886 204849 160614 84349 100195 207851 139111 45834
336 45834 206059 89472 74452 95863 -47533 5269 82786 154691 148062 250162 257481 222469
324 222469 104172 43407 221293 170150 179686 78026 85075 107606 77679 -9575 8000 12296
312 12296 25303 98979 174716 39260 150300 116105 41986 99210 78516 298263 328528
301 328528 134824 56355 51282 112470 122404 94962 49651 -15144 39891 61232 43876 58117
289 58117 30256 -46261 -113501 -131467 -4797 152973 156382 120924 50709 -76905 33264
278 33264 88911 60969 133782 7404 46366 144462 44161 67987 94847 101060 30840 64196
266 64196 173274 303654 209707 23684 -24940 110440 147730 69321 47764 114001 161071
255 161071 158603 124642 124465 94380 89522 173261 118822 112870 138430 66667 60731 54549 -23969
242 -23969 102595 245977 53613 168064 266340 125460 -93802 5142 129728 147654 115184
231 115184 49022 -1588 -66681 120267 115364 60877 33426 6537 -42114 53532 77390 22329
219 22329 147301 135218 147031 106993 31646 21619 21597 -16651 174198 164245 122402 4147
207 4147 104444 190393 175069 51170 -3668 63143 6453 49818 112542 126601 122737 141584
195 141584 261326 200400 -17690 156241 130898 94145 140541 10298 -133559 -113723 -78945
184 -78945 68731 82923 149537 86693 114904 95700 130328 200941 94085 114304 248456
173 248456 272491 132488 13158 50079 46626 41605 -79085 -34744 54377 22027 32566 44153
161 44153 70838 170294 39466 113226 243282 219758 158996 50901 -37413 71661 135597
150 135597 24707 162360 71261 -21907 59072 45165 42834 138684 134691 53825 55326 157649
138 157649 166848 112532 141886 95019 20193 62448 67463 168294 156913 69672 36683 100235
126 100235 -67817 -46825 158182 135534 58021 101224 15536 -33976 61100 164794 123762
115 123762 36040 140704 116244 130193 104072 171128 187153 7542 15278 117041 144928
104 144928 190940 129311 -12400 -50073 116538 46831 5724 99346 43363 121134 78258
93 78258 8350 54539 60539 143871 176269 -5856 86129 120243 62057 170254 150728 64059
81 64059 145933 161989 125038 133481 119085 189371 287839 104451 46034 77288 35436 -33064
69 -33064 -2570 34942 -7805 21084 -46180 86246 134797 185862 76966 32183 -10534 -8888
57 -8888 8672 29885 52161 120351 93664 113887 94095 120720 147000 -1729 -46830 22709
45 22709 113944 100899 157964 100160 18409 99481 46655 61425 86910 46582 167194 158193
33 158193 203375 227495 -15630 -88018 47957 28773 21317 89844 27304 52071 149926 153260
21 153260 57264 66650 176244 123260 117745 -4382 86476 107949 142230 259569 238576 32745
9 32745 -50196 -38737 27577 -2250 49742 107998 111127 161716 41569
0 41569
$$ Imaginary data points
##PAGE= N=2
##DATA TABLE= (X++(I..I)), XYDATA
16383 -1941031 -1947780 -1924251 -1883139 -1758645 -1772933 -1781729 -1804866 -1733362 -1631317 -1563449 -1606027
16372 -1606027 -1627584 -1594070 -1588592 -1471438 -1450651 -1436158 -1336311 -1353526 -1398758 -1396236 -1385532
16361 -1385532 -1248107 -1197982 -1247666 -1267592 -1262363 -1235965 -1170979 -1144696 -1156254 -1183002 -1146024
16350 -1146024 -1033968 -1063400 -1019047 -1014009 -1042074 -950789 -1001327 -945360 -866203 -812125 -837133
16339 -837133 -844639 -795986 -764043 -686280 -468864 -510262 -483751 -437197 -396673 -459526 -509882
16328 -509882 -629482 -591888 -413710 -279306 -368993 -188206 -143460 -178856 -301358 -197791
16318 -197791 -169782 -161139 -123567 -150423 -182303 -299210 -301802 -238483 12224 -39693 -8559
16307 -8559 -38182 41092 85609 135519 139154 256354 282758 270370 294666 429686 353768 194355
16295 194355 329429 331047 429193 456483 373048 410765 412433 398483 389552 503035 539396 456946
16283 456946 327915 360009 464770 558046 690734 729163 717413 575477 503414 581573 682749
16272 682749 673105 590996 733477 814227 870901 961498 793949 862139 866530 774075 833557
16261 833557 835715 936891 1044329 944832 872197 1049612 1052204 1100733 1113177 1160861 1026207
16250 1026207 964085 982654 1082087 1128408 1137294 1200199 1253077 1350010 1308213 1328548 1317132
16239 1317132 1293262 1339013 1284266 1339095 1282620 1289223 1380593 1402982 1330230 1362677 1435412
16228 1435412 1432811 1356642 1338080 1312258 1321659 1502245 1427289 1463668 1545347 1455943 1490944
16217 1490944 1500214 1473113 1474179 1546385 1619086 1628154 1577677 1643587 1743651 1566097 1550930
16206 1550930 1629268 1609562 1614826 1669067 1695393 1654147 1689498 1625124 1556741 1693644 1813461
16195 1813461 1796504 1837910 1913779 1954856 1943764 2026801 2042803 1995892 1918033 1894483 1867214
16184 1867214 1808120 1838480 1886866 2045280 2185982 2096162 2072049 2085427 1934399 1831484
16174 1831484 1978230 2041484 1923231 1939530 2117113 2175563 1980822 2059427 2144312 2090176
16164 2090176 2017957 2163752 2164720 1998743 2018844 2063462 2149647 2255037 2211113 2148927 2156676
16153 2156676 2162864 2170732 2261081 2192412 2188877 2229155 2149773 2018878 2241625 2176918 2181531 2128874
16141 2128874 2231571 2162746 2116156 2214207 2126417 2155052 2178988 2276075 2079821 1907988 2031387
16130 2031387 2063525 2093430 2148212 2203211 2319344 2430371 2385960 2205126 2137618 2165663 2184833
16119 2184833 2286853 2162639 2123350 2147261 2353363 2493251 2391804 2364061 2258839 2336563
16109 2336563 2314395 2309895 2390126 2334719 2356548 2379825 2404833 2256830 2062692 2156116 2279085
16098 2279085 2311340 2204600 2255882 2416865 2388159 2310590 2356607 2342295 2275024 2254642 2460040
16087 2460040 2409623 2272766 2149499 2291870 2478413 2434853 2440034 2342923 2358362 2453981 2444993
16076 2444993 2671191 2534455 2369953 2499676 2484340 2386650 2409460 2293813 2310976 2235861
16066 2235861 2245464 2282303 2323313 2473804 2470993 2374975 2311079 2199470 2303447 2327075 2224194
16055 2224194 2300919 2295633 2318447 2312534 2380524 2390814 2222089 2119987 2270503 2327716 2347558
16044 2347558 2495542 2506378 2378472 2426073 2364682 2465510 2493319 2553170 2545818 2337486 2223093
16033 2223093 2247431 2364499 2381712 2341367 2326538 2448990 2342536 2152078 2008283 2185267
16023 2185267 2175850 2163903 2350350 2375405 2376739 2346446 2310670 2311138 2280817 2297175 2331717 2465713
16011 2465713 2400420 2285849 2292262 2245743 2204910 2273446 2274714 2494735 2487450 2459963 2463703 2478012
15999 2478012 2506953 2402993 2488843 2529282 2468123 2314739 2326853 2456246 2454383 2279361 2419927
15988 2419927 2430360 2357504 2254465 2396370 2494025 2393879 2321725 2379738 2383058 2284212 2281869
15977 2281869 2148136 2321927 2351946 2192753 2341485 2343655 2274465 2260195 2312867 2328082 2365269
15966 2365269 2423978 2334049 2290248 2480338 2358389 2164328 2156526 2209784 2345475 2407726 2322790
15955 2322790 2262633 2263488 2353782 2235660 2235343 2311308 2466768 2359118 2219361 2359607 2483502
15944 2483502 2554137 2468802 2371586 2246053 2258381 2203182 2217748 2275373 2348337 2337290 2315732
15933 2315732 2347210 2269662 2221726 2241019 2352267 2395162 2416892 2385913 2358379 2347036 2409036
15922 2409036 2397475 2347711 2193432 2120583 2360643 2434853 2387319 2390422 2345795 2393310 2504715
15911 2504715 2531207 2429053 2406994 2459102 2424832 2368820 2338303 2399870 2426212 2377446 2474104
15900 2474104 2458455 2341803 2460514 2469998 2477195 2429732 2338813 2332352 2373271 2471038 2386438
15889 2386438 2281619 2242002 2361101 2433512 2530521 2453405 2259723 2114360 2021539 2312693
15879 2312693 2321989 2402525 2441515 2457279 2350202 2358527 2320748 2407536 2577729 2523736 2400678
15868 2400678 2278188 2270208 2323624 2431902 2424048 2522583 2539049 2574908 2688907 2558564 2484409
15857 2484409 2562921 2549088 2480899 2350078 2354155 2329693 2347961 2534958 2453140 2464036 2473510
15846 2473510 2421558 2490016 2469136 2354326 2429990 2344505 2317992 2421066 2349575 2401230 2414271
15835 2414271 2550814 2391794 2275180 2488600 2467179 2476672 2525366 2515115 2495151 2428882 2436304
15824 2436304 2374701 2370786 2440769 2420145 2489406 2458386 2426485 2342195 2105809 2171096 2229165
15813 2229165 2369242 2466191 2477599 2524109 2373073 2331673 2378466 2393355 2387191 2363682 2447862
15802 2447862 2319857 2489025 2530437 2375497 2450520 2442819 2552339 2634039 2629710 2585729 2557012
15791 2557012 2404884 2388181 2490506 2360878 2321429 2357058 2415145 2555745 2397572 2357721
15781 2357721 2187935 2250523 2533770 2496731 2440160 2455368 2439128 2481675 2411717 2326809 2157139
15770 2157139 2266875 2325983 2276184 2260911 2414451 2518937 2480696 2547973 2410403 2301754
15760 2301754 2359905 2445803 2312431 2449714 2459278 2599051 2497033 2549089 2640835 2450195
15750 2450195 2493188 2490429 2416612 2519444 2509422 2415719 2514694 2388552 2512805 2525770 2578851
15739 2578851 2618055 2538859 2522534 2387906 2354055 2424544 2292698 2333073 2332330 2214283 2304321
15728 2304321 2389873 2343991 2285424 2435826 2518728 2543656 2399473 2436551 2511786 2430927 2377909
15717 2377909 2448864 2595082 2535390 2544529 2561118 2323358 2449862 2455435 2383532 2388141 2450868
15706 2450868 2495157 2473484 2479586 2585072 2445109 2460412 2379809 2358998 2318906 2376001 2391060
15695 2391060 2300772 2367684 2362096 2270358 2404779 2472578 2367377 2560928 2392451 2280353
15685 2280353 2448715 2441626 2381835 2494150 2435218 2300966 2322777 2394499 2468898 2611170 2500870
15674 2500870 2378310 2216808 2226305 2392682 2327105 2499253 2566145 2509582 2432042 2486738 2611660
15663 2611660 2523862 2597702 2577443 2572510 2478554 2344445 2264352 2336514 2508634 2551852 2486300
15652 2486300 2501572 2504618 2679777 2561682 2500213 2413235 2450201 2548050 2569467 2441407 2457674
15641 2457674 2393118 2367810 2551089 2500551 2445614 2523209 2607272 2539518 2534719 2368686 2470563
15630 2470563 2596348 2448275 2405774 2431828 2361981 2454891 2289338 2418318 2545970 2517861
15620 2517861 2472561 2393731 2552511 2467322 2551394 2596959 2545064 2733906 2762119 2645742 2495732
15609 2495732 2398617 2506499 2667173 2620487 2497268 2496599 2568631 2628706 2494853 2526866 2490173
15598 2490173 2440462 2490488 2519915 2365797 2455734 2541930 2547142 2703158 2543966 2484930 2423500
15587 2423500 2421837 2487187 2443284 2502018 2531907 2472159 2465922 2418861 2421207 2383835 2329607 2355873
15575 2355873 2465363 2605129 2667153 2611089 2517644 2557449 2477872 2417805 2599299 2596597 2554795
15564 2554795 2478971 2411572 2397937 2393522 2421632 2530254 2411044 2451206 2439271 2466252 2519344
15553 2519344 2435231 2320604 2548637 2410477 2313674 2352129 2287824 2476475 2488699 2544128
15543 2544128 2458316 2443595 2481856 2522573 2442029 2528772 2531410 2490656 2469251 2558853 2677402
15532 2677402 2640247 2526690 2473142 2420500 2486384 2523070 2480455 2420766 2450326 2262580 2242702
15521 2242702 2384630 2465392 2486188 2474357 2577640 2468926 2499081 2604660 2436633 2362044
15511 2362044 2296455 2344212 2415810 2490103 2539639 2533725 2484912 2611122 2763763 2621225 2647177
15500 2647177 2627665 2527066 2514016 2596056 2444811 2502117 2492544 2372314 2523058 2613304 2549063
15489 2549063 2496951 2548703 2478401 2455168 2427491 2483070 2543697 2491749 2616450 2656588 2543686
15478 2543686 2594158 2574314 2664397 2664044 2703537 2604990 2603410 2657053 2433481 2525152 2551403 2484605
15466 2484605 2302463 2491343 2495092 2384304 2466687 2599642 2571814 2676240 2556143 2469365
15456 2469365 2570236 2491453 2413366 2438237 2389502 2391636 2493382 2546156 2403513 2376617 2547215
15445 2547215 2640257 2520448 2469122 2521033 2535324 2585847 2544277 2668817 2716894 2725511 2718387
15434 2718387 2796949 2677271 2571426 2484647 2604613 2630153 2528413 2529135 2538804 2528421 2585972
15423 2585972 2638507 2526204 2435646 2338074 2373948 2412715 2483460 2384249 2315481 2588261 2624408
15412 2624408 2570324 2523111 2501788 2521724 2468782 2527149 2517288 2419530 2395303 2460215 2560690
15401 2560690 2542743 2471842 2526511 2562696 2527038 2477893 2484783 2655382 2764844 2757900 2626744
15390 2626744 2549128 2539104 2513603 2590985 2596571 2498176 2571546 2528520 2491192 2581792 2484251
15379 2484251 2366164 2414069 2436484 2519014 2551280 2465082 2423975 2349208 2454299 2506995 2616744
15368 2616744 2610560 2487458 2473427 2469178 2440291 2368684 2403056 2471263 2532707 2493952 2538862
15357 2538862 2337342 2335915 2468151 2401487 2652546 2646228 2467320 2446440 2337985 2289648 2368191
15346 2368191 2520149 2512744 2505051 2452522 2457812 2490861 2496781 2492445 2436874 2461693 2454755 2608309
15334 2608309 2748889 2748209 2743617 2660388 2595154 2700044 2594384 2571602 2590179 2563424 2499613
15323 2499613 2561512 2566130 2464847 2522631 2535865 2667022 2582249 2480771 2480982 2368770 2491640
15312 2491640 2721399 2694276 2576016 2490721 2597227 2538395 2415324 2413179 2425541 2592002
15302 2592002 2695933 2676310 2700688 2412667 2423303 2510688 2461576 2514967 2655113 2723229 2567496
15291 2567496 2620334 2669011 2647788 2547780 2551428 2609812 2508048 2417488 2465917 2433673 2607852
15280 2607852 2751502 2617738 2692468 2718140 2580222 2559377 2513042 2462500 2499362 2580903 2636232
15269 2636232 2654790 2557212 2800684 2675568 2479763 2525011 2625889 2699909 2654632 2572057
15259 2572057 2388889 2491617 2504941 2497532 2614793 2677408 2566847 2703315 2736008 2745389 2812119
15248 2812119 2765219 2775267 2648821 2724355 2571336 2543382 2483222 2510787 2596047 2634903 2604491
15237 2604491 2628258 2613925 2550795 2569667 2581733 2593123 2476964 2451397 2504540 2617229 2527119
15226 2527119 2456497 2529028 2715992 2637633 2618957 2538004 2528247 2663063 2726727 2700790 2627162
15215 2627162 2533580 2530987 2697062 2770967 2700853 2642844 2607562 2594822 2442199 2445685 2577455
15204 2577455 2559532 2505987 2397468 2329680 2494869 2669208 2713907 2741050 2589664 2573352
15194 2573352 2527609 2569902 2610968 2605683 2618652 2563866 2482435 2561201 2765551 2630210 2420175
15183 2420175 2588623 2704341 2651991 2616551 2460876 2594448 2715271 2676927 2620228 2551261
15173 2551261 2581792 2521501 2530244 2469895 2519669 2617506 2631898 2637045 2708755 2613408 2573303 2566616
15161 2566616 2586432 2625860 2388082 2354089 2505212 2476336 2513685 2561561 2617746 2737883 2752850
15150 2752850 2514070 2461645 2482439 2591457 2574511 2565909 2691710 2615654 2552745 2595229 2632183
15139 2632183 2606370 2695556 2780983 2603736 2497776 2643808 2598720 2496999 2416689 2508223
15129 2508223 2706866 2772960 2704185 2536127 2504613 2645819 2678025 2686580 2663115 2644333 2538354
15118 2538354 2592193 2506724 2606234 2499680 2513089 2488140 2472015 2483681 2540555 2545360 2555192
15107 2555192 2491370 2607892 2473905 2515996 2611412 2750295 2872621 2784094 2719912 2652071
15097 2652071 2402954 2497485 2633122 2440181 2507749 2598070 2716146 2585429 2722324 2544179
15087 2544179 2591873 2786173 2892879 2705910 2586162 2587704 2538919 2625806 2585678 2530038 2459717
15076 2459717 2515434 2595441 2606691 2634230 2653866 2655136 2593293 2679731 2683764 2623319 2696068 2725261
15064 2725261 2676008 2635801 2644623 2604664 2662603 2739652 2601161 2539039 2633281 2710496 2634965
15053 2634965 2730971 2712243 2657989 2595693 2640474 2680775 2670202 2674677 2809379 2659936 2510953
15042 2510953 2461587 2493194 2427206 2447365 2581538 2657427 2731242 2805835 2771482 2630877 2762527
15031 2762527 2775617 2710313 2636695 2562259 2629973 2636474 2652886 2642670 2715939 2734028 2569332
15020 2569332 2535648 2484404 2574492 2599895 2491579 2577876 2514558 2613025 2556289 2504178 2649880
15009 2649880 2686570 2639392 2527491 2576676 2766459 2646388 2564572 2620695 2584426 2705957
14999 2705957 2546456 2651584 2675436 2726162 2710728 2761019 2824558 2609137 2602550 2634689 2675652
14988 2675652 2739842 2517824 2477797 2675505 2739780 2751417 2677732 2672704 2550865 2529515 2494374
14977 2494374 2526106 2633157 2763413 2663567 2720744 2691707 2599999 2687648 2651469 2611899 2577093
14966 2577093 2731812 2777065 2786423 2631005 2734071 2703195 2656267 2655435 2682241 2634396 2601784
14955 2601784 2332066 2470275 2790520 2760065 2631214 2663778 2758161 2727257 2636417 2680481
14945 2680481 2692643 2559335 2559101 2630049 2802910 2833971 2934940 2738754 2551814 2546469 2529640
14934 2529640 2538577 2514657 2476250 2400773 2425022 2524327 2610535 2619789 2607605 2563773 2693055
14923 2693055 2647057 2618461 2623306 2496499 2510122 2748245 2657626 2601767 2698337 2558342 2622398
14912 2622398 2550624 2544336 2634770 2694344 2644282 2731187 2744912 2654214 2500085 2551551 2486012
14901 2486012 2423609 2447919 2618382 2782984 2782204 2623260 2501257 2512986 2602352 2759188 2579212
14890 2579212 2587797 2483658 2455113 2736257 2749605 2634035 2628804 2605276 2558205 2605796 2601546
14879 2601546 2762120 2780462 2617860 2484875 2584391 2541875 2527596 2530416 2600357 2723288 2720972
14868 2720972 2564417 2555831 2664674 2533389 2735132 2729635 2780464 2721815 2670224 2730480 2641076
14857 2641076 2706633 2754578 2599194 2534133 2606967 2747943 2689890 2646815 2570654 2664988 2679529
14846 2679529 2790340 2825281 2777671 2808300 2749205 2778934 2700939 2729761 2778950 2836518 2782951
14835 2782951 2591880 2651657 2676628 2657965 2762585 2767189 2661114 2721092 2692558 2716668 2797985
14824 2797985 2520783 2480868 2585794 2648314 2601135 2592774 2555346 2610393 2680621 2629243 2668221
14813 2668221 2429184 2352509 2559619 2526106 2655312 2817625 2786184 2619755 2801410 2896797
14803 2896797 2740375 2709203 2780450 2757630 2826681 2863616 2827310 2755114 2468466 2627878 2695678
14792 2695678 2486770 2447342 2535358 2678382 2685159 2782844 2757538 2663239 2685865 2554199 2556856
14781 2556856 2667774 2793618 2661442 2668587 2893000 2875550 2865760 2660783 2685685 2656646 2593884
14770 2593884 2574488 2465579 2633181 2693885 2598522 2687276 2765229 2780084 2734070 2732322 2615382
14759 2615382 2578752 2654094 2624556 2559403 2514685 2703305 2820224 2712415 2741672 2766899 2674333
14748 2674333 2653137 2661055 2672258 2684780 2606498 2688598 2767783 2719242 2711807 2658087 2810577
14737 2810577 2863046 2773959 2813420 2714665 2723218 2738393 2610533 2615196 2608623 2632641 2678720 2580221
14725 2580221 2627408 2608242 2599896 2644744 2704897 2564872 2666318 2615880 2717036 2852624 2538906
14714 2538906 2503740 2605414 2703106 2645890 2724589 2614597 2719215 2759679 2739666 2746088 2675802
14703 2675802 2674287 2828193 2725492 2666651 2694145 2645876 2667016 2743340 2835253 2798906 2986343
14692 2986343 3012616 2756451 2750979 2774677 2751016 2789052 2747349 2992586 3001160 2751392 2808584
14681 2808584 2670909 2619945 2675493 2779228 2781841 2576135 2742313 2787110 2645525 2575322
14671 2575322 2580912 2804930 2758033 2831795 2783143 2752962 2640265 2690118 2792610 2829023 2808871
14660 2808871 2920278 2855715 2710627 2652110 2794355 2730285 2712899 2792330 2710519 2767272 2767662
14649 2767662 2687473 2853121 2819238 2783555 2791851 2739395 2746388 2645745 2681294 2614957 2768358
14638 2768358 2921773 2901035 2653019 2749825 2652217 2622907 2729785 2778303 2702044 2640222 2776353
14627 2776353 2899668 2850006 2921022 2870308 2824239 2860748 2834525 2860438 2852898 2818490 2886235
14616 2886235 2860775 2769004 2699837 2619886 2651494 2667953 2670556 2827438 2751597 2809619 2671097
14605 2671097 2794952 2784455 2628914 2727053 2737160 2729536 2853876 2831052 2810577 2821935 2697908
14594 2697908 2812301 2774523 2774212 2678021 2674785 2693560 2770605 2706721 2662327 2751184 2826356 3010241
14582 3010241 3090027 3010008 2889966 2836548 2782679 2831694 2874630 2783008 2830133 2694268 2745416
14571 2745416 2672433 2658226 2714286 2843645 2796119 2758442 2658952 2567150 2645476 2709272 2734546
14560 2734546 2675489 2741102 2591773 2516660 2636320 2682448 2766009 2905018 2830825 2860475 2877251
14549 2877251 2827751 2884685 3000161 2958446 2912105 2757778 2873028 2856778 2662472 2717887
14539 2717887 2805772 2717994 2880396 2937858 2844298 2927383 2954394 2774511 2771800 2740931 2928999
14528 2928999 2742927 2690697 2664748 2617733 2617928 2751363 2850664 2817614 2882424 3009482 3044442
14517 3044442 3036765 3029152 2915308 2847624 2767531 2752811 2846000 2871100 2688172 2715857 2854537
14506 2854537 2804904 2836111 2969056 2888354 2922583 2747926 2977565 2972344 2846439 2731212
14496 2731212 2703732 2668052 2804175 2816941 2833341 2989682 2821490 2778433 2828877 2950288
14486 2950288 2887143 2835043 2923794 2911256 2923376 2672150 2569591 2769746 2973168 3083749
14476 3083749 3062363 2853644 2791617 2791867 2730186 2809191 2882864 2800391 2748813 2813970 2889926
14465 2889926 2736256 2831378 2808695 2835837 2826776 2886930 2726287 2658998 2913574 2793811 2868029
14454 2868029 2957314 2946220 2910695 2773666 2837606 2979257 3120187 3115247 3105834 3013002 2909520
14443 2909520 3020944 3057430 2979314 2885709 2772189 2919506 2927113 2988941 2913138 2910820 3036712
14432 3036712 2950579 2900220 2800841 2785772 2843811 2798618 2914342 2849045 2817409 2694980 2674330
14421 2674330 2799620 2829423 2924411 2966603 2952822 2925613 2801652 2855817 2934542 2884191 2945792
14410 2945792 2894539 2978750 2866492 2854453 2727204 2609088 2600391 2833705 2826690 2723650 2801260
14399 2801260 2803313 2884241 2826648 2895436 2946305 2929222 2846162 2789816 2796734 2652598 2786752
14388 2786752 2919010 2854433 2709572 2901174 2844730 2868391 2848404 2857821 2797424 2826622 2640072
14377 2640072 2570478 2668405 2832693 2881255 2924279 2850671 2774914 2922822 2910954 2920896 2990457
14366 2990457 2875400 2938863 3001187 3030283 2876849 2945494 2889762 2825545 2832702 2730334 2869632
14355 2869632 2893380 2640827 2606448 2627890 2697982 2784658 2747778 2714397 2705731 2763076 2819978
14344 2819978 2812062 2739268 2766503 2770966 2907019 2858466 2742582 2824665 2863562 2849385 2823667
14333 2823667 2737463 2796131 2708185 2721204 2779623 2738767 2788422 2811941 2796765 2973377 2855581
14322 2855581 2750192 2875633 2852641 2871839 2862244 2818600 2792023 2800431 2905968 2967468 2841981
14311 2841981 2756559 2767814 2724197 2778344 2790202 2878797 2893932 2973912 2942855 2896581 2807495
14300 2807495 2916893 2755123 2757383 2891581 2781467 2704814 2759771 2716175 2784276 2922812
14290 2922812 2903133 2793431 2899924 2883059 2713631 2819330 2691313 2744067 2904313 2816418
14280 2816418 2772678 2755131 2832894 2886565 2801190 2775785 2852844 2866127 2957203 2885518 2774944
14269 2774944 2797647 2794621 2828312 2960260 3005251 3018615 3066279 2951621 2873088 2899192 2959893
14258 2959893 2958142 2838308 2869856 2953440 2908097 2972664 2966336 2692544 2566107 2640074 2722119
14247 2722119 2847365 2727338 2723457 2770517 2781096 2751698 2777919 2849446 2679883 2757463 2719681
14236 2719681 2878684 2855913 2672351 2744223 2766793 2751006 2901496 2896411 2831044 2755880 2871432
14225 2871432 2961000 2992690 3087424 3012535 2898417 2915715 3103823 3041356 2927420 2910004 2850223
14214 2850223 2977450 3055325 3074512 3043667 3005507 2996377 2828778 2700388 2744876 2768662 2824540
14203 2824540 2900663 2911165 2902309 2919240 2993907 2843297 2870225 2829476 2839069 3064827 3050629
14192 3050629 2882507 2881137 2830906 2980322 2806997 2755568 2858776 2898817 2775696 2686623
14182 2686623 2785223 2877346 2962099 2884980 2617004 2812660 2983198 2829115 2726912 2841981
14172 2841981 2942991 2693938 2723447 2871324 3096311 2920683 2833965 2964344 2895916 2883207
14162 2883207 2872642 2903475 2871552 2974758 3027429 3042894 3048813 2972108 2966228 3062865 3102753
14151 3102753 2998148 2921292 2911984 2933666 3094458 3043136 3088856 3064956 3011510 2991594 2941339
14140 2941339 2887868 2932900 2839842 2886734 2904019 3025397 3019575 3051781 3023429 2992060 3136855
14129 3136855 3053892 2935192 3086496 2970854 2872799 2934721 3001583 2966753 3012900 2936695 2928283
14118 2928283 2846071 2886085 2792913 2783784 2973155 2905159 2913268 2750675 2987764 3081729 3057497
14107 3057497 2994857 3114508 3128534 2954873 2750223 2705370 2712352 2907917 2891701 2758725
14097 2758725 2981726 2976848 2903386 3084171 3109376 3079416 2913762 2866063 3060536 3089258 2903345
$$ [...]
##END NTUPLES=NMR SPECTRUM
##END=
