##TITLE=1H_49-2021
 CDCl3, 8 sc, 
 5.07.2021
##JCAMPDX= 6.0         $$ Bruker NMR JCAMP-DX V2.0
##DATA TYPE= NMR FID
##DATA CLASS= NTUPLES
##ORIGIN= UXNMR, Bruker Analytische Messtechnik GmbH
##OWNER= root
$$ XWIN-NMR		Version 3.5
$$ Mon Jul  5 10:33:47 2021 Russian Standard Time (UT+4h)  she@DPX200
##.OBSERVE FREQUENCY= 200.131506
##.OBSERVE NUCLEUS= ^1H
##.DELAY= (6, 6)
##.ACQUISITION MODE= SIMULTANEOUS
##.ACQUISITION SCHEME= undefined
##.AVERAGES= 8
##.DIGITISER RES= 18
##SPECTROMETER/DATA SYSTEM= spect
##.PULSE SEQUENCE= zg30
##.SOLVENT NAME= CDCl3
##.SHIFT REFERENCE= (INTERNAL, CDCl3, 0, 15.7039)
##AUDIT TRAIL= $$ (NUMBER, WHEN, WHO, WHERE, WHAT)
$$ ##TITLE= Audit trail, XWIN-NMR		Version 3.5
$$ ##JCAMPDX= 5.01
$$ ##ORIGIN= Bruker BioSpin GmbH
$$ ##OWNER= she
$$ F:/spectra/data/she/nmr/H-F/1/audita.txt
$$ ##AUDIT TRAIL=  $$ (NUMBER, WHEN, WHO, WHERE, WHAT)
(   1,<2021-07-05 10:32:23.18 +0400>,<she>,<DPX200>,
      <created by zg, POWCHK disabled, PULCHK disabled
       configuration hash MD5:
       00 E9 B6 7A A2 85 ED C7 34 08 36 98 17 FE 4E 26
       data hash MD5: 16K
       F6 C9 FF 92 3F 77 94 28 3F E0 94 65 9A D5 E7 B9>)
$$ ##END=
$$ 
$$ hash MD5
$$ F6 39 8F A8 B7 87 15 90 C4 AC 20 47 F4 28 E7 7B
##$RELAX= 
##$RELAX= 
##$RELAX= 
##$RELAX= 
##$RELAX= 
##$RELAX= 
$$ Bruker specific parameters
$$ --------------------------
##$DU= <F:/spectra>
##$EXPNO= 1
##$NAME= <H-F>
##$PROCNO= 1
##$TYPE= <nmr>
##$USER= <she>
##$AMP= (0..31)
100 100 100 100 100 100 100 100 100 100 100 100 100 100 100 100 100 100 
100 100 100 100 100 100 100 100 100 100 100 100 100 100 
##$AQSEQ= 0
##$AQ_mod= 1
##$AUNM= <au_zg>
##$AUTOPOS= <>
##$BF1= 200.13
##$BF2= 200.13
##$BF3= 200.13
##$BF4= 200.13
##$BF5= 200.13
##$BF6= 200.13
##$BF7= 200.13
##$BF8= 200.13
##$BYTORDA= 1
##$CFDGTYP= 0
##$CFRGTYP= 5
##$CHEMSTR= <none>
##$CNST= (0..31)
1 1 145 1 1 1 1 1 1 1 1 1 1 1 1 1 1 1 1 1 1 1 1 1 1 1 1 1 1 1 1 1 
##$CPDPRG= <>
##$CPDPRG1= <>
##$CPDPRG2= <>
##$CPDPRG3= <>
##$CPDPRG4= <mlev>
##$CPDPRG5= <mlev>
##$CPDPRG6= <mlev>
##$CPDPRG7= <mlev>
##$CPDPRG8= <mlev>
##$CPDPRGB= <>
##$CPDPRGT= <>
##$D= (0..31)
0 1.2 0 0 0 0 0 0 0 0.06 0 0.03 0 0 0 0 0.0002 0 0 0 0 0 0 0 0 0 0 0 0 
0 0 0 
##$DATE= 1625466742
##$DBL= (0..7)
120 120 120 120 120 120 120 120 
##$DBP= (0..7)
150 150 150 150 150 150 150 150 
##$DBP07= 0
##$DBPNAM0= <>
##$DBPNAM1= <>
##$DBPNAM2= <>
##$DBPNAM3= <>
##$DBPNAM4= <>
##$DBPNAM5= <>
##$DBPNAM6= <>
##$DBPNAM7= <>
##$DBPOAL= (0..7)
0.5 0.5 0.5 0.5 0.5 0.5 0.5 0.5 
##$DBPOFFS= (0..7)
0 0 0 0 0 0 0 0 
##$DE= 6
##$DECBNUC= <off>
##$DECIM= 32
##$DECNUC= <off>
##$DECSTAT= 4
##$DIGMOD= 1
##$DIGTYP= 9
##$DL= (0..7)
0 120 120 120 120 120 120 120 
##$DP= (0..7)
150 150 150 150 150 150 150 150 
##$DP07= 0
##$DPNAME0= <>
##$DPNAME1= <>
##$DPNAME2= <>
##$DPNAME3= <>
##$DPNAME4= <>
##$DPNAME5= <>
##$DPNAME6= <>
##$DPNAME7= <>
##$DPOAL= (0..7)
0.5 0.5 0.5 0.5 0.5 0.5 0.5 0.5 
##$DPOFFS= (0..7)
0 0 0 0 0 0 0 0 
##$DQDMODE= 0
##$DR= 18
##$DS= 0
##$DSLIST= <SSSSSSSSSSSSSSS>
$$ [...]
##$SUBNAM2= <"">
##$SUBNAM3= <"">
##$SUBNAM4= <"">
##$SUBNAM5= <"">
##$SUBNAM6= <"">
##$SUBNAM7= <"">
##$SUBNAM8= <"">
##$SUBNAM9= <"">
##$SW= 20.0188882624521
##$SWIBOX= (0..15)
0 0 2 0 0 0 0 0 0 0 0 0 0 0 0 0 
##$SW_h= 4006.41025641026
##$TD= 16384
##$TD0= 1
##$TE= 0
##$TE2= 300
##$TE3= 300
##$TEG= 300
##$TL= (0..7)
0 120 120 120 120 120 120 120 
##$TP= (0..7)
150 150 150 150 150 150 150 150 
##$TP07= 0
##$TPNAME0= <>
##$TPNAME1= <>
##$TPNAME2= <>
##$TPNAME3= <>
##$TPNAME4= <>
##$TPNAME5= <>
##$TPNAME6= <>
##$TPNAME7= <>
##$TPOAL= (0..7)
0.5 0.5 0.5 0.5 0.5 0.5 0.5 0.5 
##$TPOFFS= (0..7)
0 0 0 0 0 0 0 0 
##$TUNHIN= 0
##$TUNHOUT= 0
##$TUNXOUT= 0
##$USERA1= <user>
##$USERA2= <user>
##$USERA3= <user>
##$USERA4= <user>
##$USERA5= <user>
##$V9= 5
##$VALIST= <valist>
##$VCLIST= <CCCCCCCCCCCCCCC>
##$VD= 0
##$VDLIST= <DDDDDDDDDDDDDDD>
##$VPLIST= <PPPPPPPPPPPPPPP>
##$VTLIST= <TTTTTTTTTTTTTTT>
##$WBST= 1024
##$WBSW= 4
##$XGAIN= (0..3)
0 0 0 0 
##$XL= 0
##$YL= 0
##$YMAX_a= 194843
##$YMIN_a= -279210
##$ZGOPTNS= <>
##$ZL1= 120
##$ZL2= 120
##$ZL3= 120
##$ZL4= 120
##$ABSF1= 10
##$ABSF2= 0
##$ABSG= 5
##$ABSL= 3
##$ALPHA= 0
##$AQORDER= 0
##$ASSFAC= 0
##$ASSFACI= 0
##$ASSFACX= 0
##$ASSWID= 0
##$AUNMP= <proc_1d>
##$AZFE= 0.1
##$AZFW= 0.1
##$BCFW= 1
##$BC_mod= 2
##$BYTORDP= 1
##$COROFFS= 0
##$CY= 11.3945322036743
##$DATMOD= 1
##$DC= 2
##$DFILT= <>
##$DTYPP= 0
##$F1P= 15.9154993809931
##$F2P= -4.1035820241983
##$FCOR= 0.5
##$FTSIZE= 0
##$FT_mod= 4
##$GAMMA= 1
##$GB= 0.15
##$INTBC= 1
##$INTSCL= 1
##$ISEN= 128
##$LB= 0.24
##$LEV0= 0
##$LPBIN= 0
##$MAXI= 10000
##$MC2= 0
##$MEAN= 0
##$ME_mod= 0
##$MI= 1.114404
##$NCOEF= 0
##$NC_proc= 0
##$NLEV= 6
##$NOISF1= 3.799351
##$NOISF2= 2.8
##$NSP= 1
##$NTH_PI= 0
##$NZP= 0
##$OFFSET= 15.70392
##$PC= 1
##$PHC0= -11913.22
##$PHC1= 9.000992
##$PH_mod= 1
##$PKNL= yes
##$PPARMOD= 0
##$PSCAL= 0
##$PSIGN= 0
##$REVERSE= no
##$SF= 200.130013532006
##$SI= 16384
##$SIGF1= 3
##$SIGF2= 2
##$SINO= 400
##$SIOLD= 16384
##$SREGLST= <1H.CDCl3>
##$SSB= 0
##$STSI= 0
##$STSR= 0
##$SW_p= 3612.71676300578
##$SYMM= 0
##$S_DEV= 0
##$TDeff= 0
##$TDoff= 0
##$TI= <>
##$TILT= no
##$TM1= 0
##$TM2= 0
##$TOPLEV= 0
##$USERP1= <user>
##$USERP2= <user>
##$USERP3= <user>
##$USERP4= <user>
##$USERP5= <user>
##$WDW= 1
##$XDIM= 8192
##$YMAX_p= 0
##$YMIN_p= 0
$$ End of Bruker specific parameters
$$ ---------------------------------
##NTUPLES= NMR FID
##VAR_NAME=  TIME,          FID/REAL,        FID/IMAG
##SYMBOL=    X,             R,               I
##VAR_TYPE=  INDEPENDENT,   DEPENDENT,       DEPENDENT
##VAR_FORM=  AFFN,          ASDF,            ASDF
##VAR_DIM=   8192,          8192,            8192
##UNITS=     SECONDS,       ARBITRARY UNITS, ARBITRARY UNITS
##FACTOR=    0.0002496,     1,               1
##FIRST=     0,             0,               0
##LAST=      2.0444736,     0,               0
##MIN=       0,             -279210,         0
##MAX=       2.0444736,     194843,          0
$$ Real data points
##PAGE= N=1
##DATA TABLE= (X++(R..R)), XYDATA
0 0 0 0 0 0 0 0 0 0 0 0 0 8 -8 8 -9 16 -16 24 -29 32 -40 48 -57 69 -81 96 -110 128 -145 168 -192 221 -250
33 -250 284 -320 360 -405 454 -508 565 -630 701 -780 863 -954 1054 -1164 1283 -1415 1560
50 1560 -1715 1890 -2085 2298 -2539 2809 -3115 3465 -3873 4349 -4919 5610 -6477 7594 -9094
65 -9094 11224 -14517 20303 -33479 128568 -77183 -142848 194843 -75166 -73933 180244 24756
77 24756 -163641 26969 25874 -92586 14063 26670 -159511 -57949 66247 7883 6868
88 6868 -35676 -76468 5316 -38629 19177 131819 -39133 -99799 49978 8792 -18827 57976
100 57976 -5718 -72103 28064 61810 -12402 28015 17202 -103568 -2905 88139 6953
111 6953 39298 -12191 -102553 42045 38717 -53627 64880 25431 -106636 20293 100737 -18290
123 -18290 -29498 31127 -38695 -16903 107978 15282 -60633 15877 -47297 -50823 51894 -1051
135 -1051 -28143 -34952 -80892 20916 30789 -78949 -724 32847 -73322 5222 115685 -12936
147 -12936 -65382 66350 1938 -49842 136360 56413 -109315 58367 56297 -80117 59162
158 59162 79065 -66406 -16809 49732 1561 72 16941 -36323 -41599 22504 4482 -9813
170 -9813 13676 -52720 -47874 13384 -22644 8666 22616 -58858 -5297 41008 -18400 6193
182 6193 23913 -17962 -4187 29216 27065 5439 -3621 -19431 -21339 22369 7402 -12371 19188
195 19188 -28647 -29355 35811 -14581 -10131 37433 -29173 -9905 55305 1615 -19232 14091 -1986
208 -1986 -18514 19483 31089 -19574 -11897 4692 -32519 8055 23139 -31765 3253 6420 -27743
221 -27743 17559 223 -32475 5168 -8235 -18015 16731 6839 -25928 -16862 10174 -9012 -5708
234 -5708 37538 -921 -13254 37248 634 -2118 40456 -1971 -1449 29959 4510 4320 6599
247 6599 -8870 -8413 -6283 3609 -945 -3604 833 -20558 -5014 7394 -16703 8414 7323 -16219
261 -16219 13875 760 -14663 8083 -9926 -8193 9347 -1062 2863 -2926 -5929 634 -6388
274 -6388 8609 7289 -1168 15173 -2470 -3382 11385 -12733 -148 7867 -11841 6563 -417
287 -417 -14552 628 -10296 -6664 4410 -1744 8038 1079 -483 6544 -8752 4444 6704 -7595
301 -7595 11400 325 -10154 4853 -12916 -8839 2918 -8835 4783 2622 -4254 6181 -5925
314 -5925 486 6371 -3423 11855 5005 -2200 8537 -8977 -4165 3519 -9460 6524 2974 -5251
328 -5251 7723 -5308 -1641 6547 -4382 10387 7169 -32 11656 -4505 -2976 3529 -10081
341 -10081 3454 1235 -6767 5041 -8421 -6273 1541 -9487 5640 4255 -1621 12801 -1655
354 -1655 -390 7539 -6764 5593 5919 -2800 8755 -2911 -3756 1515 -9058 3310 1800 -2584
368 -2584 11081 -3384 -1919 6145 -10655 1471 3156 -8482 4441 -4884 -10266 -4174 -14054 -6707
382 -6707 -6062 -7150 5123 -6322 -1175 6052 -9480 6690 8187 -2461 16618 6938 -515 10912
396 10912 -2909 -570 3557 -2100 6324 -73 218 2184 -9013 1952 -1454 -6675 11626 -1656
410 -1656 -3267 8329 -9906 -2533 1454 -11487 3967 1169 -5992 4077 -4909 -4119 -834 -2852
424 -2852 7421 3889 5417 6866 -3642 8484 907 -8054 12756 -2653 -6689 12977 -8466
437 -8466 -6843 5013 -14048 -2095 11107 -492 1405 7360 4915 -3755 6077 15057 -3940 7884
451 7884 14029 -12887 9314 8984 -24772 2750 4314 -19867 5548 3622 -17503 -5654 -4575
464 -4575 -13688 -2794 9311 -10325 -14798 13092 -8196 -18776 18162 -7503 -18607 20400 -810
477 -810 -4713 22193 -5269 -9515 17547 12190 4873 12097 12034 -2704 -1309 10897 -1062 1135
491 1135 1317 -16835 4515 4958 -18894 1460 -7613 -20862 10434 979 -6207 14060 -9172 -16961
505 -16961 11486 10280 -4484 2022 5779 -9592 -287 12758 -11568 -2047 7269 -23995 9521
518 9521 28302 -20698 -2851 11132 -20972 9038 23929 -10021 228 10735 -13781 -3125
530 -3125 26575 -1403 -21104 15755 7658 -6438 25825 -739 -16921 19096 -6545 -2389 37534
543 37534 -10329 -26063 13257 -10371 -16253 17176 -10180 -36223 5774 4607 -34281 10489
555 10489 17634 -52293 -5554 42020 -17879 -690 26861 -24748 -8841 28241 4278 2342
567 2342 12793 -5983 -10631 13697 17457 -4519 -6786 -3094 3119 14390 -1418 1704 7162 -28867
581 -28867 -5281 29894 -8639 -6008 6057 -28160 -3545 20612 -12316 -6675 9438 -14492
593 -14492 -7873 25907 6495 -16315 6732 -5741 -8849 37339 2206 -30312 19990 -8375
605 -8375 -32405 33495 13438 -34934 2263 6637 -15002 15051 17566 -21664 -6284 23153 -796
618 -796 7900 26797 -14898 -13128 13643 -1005 19399 12098 -31472 4649 13944 -24342 11879
631 11879 20229 -33208 -12955 24749 -9342 -11346 20638 -22782 -37013 30396 8003 -31804
643 -31804 18692 315 -39564 10984 19554 -8154 3026 -859 -4464 12119 12277 4122 924
656 924 -2275 -1620 11011 13125 -2054 -142 -9838 -19981 17161 12404 -21128 4531 85 -20371
670 -20371 12872 9615 -11549 3443 -4068 -7405 17757 9838 -14852 -4174 4008 -12265 6531
683 6531 20505 -17870 -8069 14276 -20899 2695 30201 -21028 -12146 23408 -7280 -5645 18595
696 18595 -6088 -16703 6952 5614 -3938 12115 734 -20745 7502 10714 -6875 16085 3931
709 3931 -13721 15524 4572 -7061 16818 -3540 -17389 11042 8483 -10127 -2108 -269 -16597
722 -16597 -6270 12068 -6725 -6094 7736 -13951 -4520 14301 -7163 -1710 6256 -7018 5092
735 5092 6102 -6074 1804 -1355 -7091 3442 8028 297 -3904 2902 -2689 -4568 11606 413
749 413 -5545 10904 -5206 -5902 11700 -7719 -8244 5448 -6191 -1200 6224 -5183 -5431 559
763 559 -754 -2520 6151 6614 -6154 3735 6408 -8264 4995 3544 -9606 7832 2299 -9252
777 -9252 5869 -1855 -8863 4105 1919 -2311 3446 5508 -1639 -1645 7359 -2763 -3745 12060 -1688
792 -1688 -4727 8729 -5809 -5521 5250 -3948 -99 3169 -1640 2020 -259 -50 1149 -1426 2019
807 2019 316 2076 2785 -5249 584 -2152 -8609 5180 386 -6307 4309 -3235 -4642 3722 -799
822 -799 560 1119 79 4457 498 1334 395 -5374 197 -172 627 3623 -5923 -1823 376 -6980 4232
839 4232 3131 -5372 3541 1548 -1144 2734 -1019 -1022 -3051 -811 4961 -2653 -1317 330 -7648 -264
855 -264 2151 -28 4776 -1161 882 4435 -1818 4904 3631 -3393 4250 2727 817 2490 -2959
870 -2959 -1922 -3513 -2004 5759 -1506 -1777 2050 -5670 243 2676 -1610 2452 -1665 63 4009
885 4009 -3239 923 -742 -6054 2222 1526 520 2891 -2685 -34 -110 -362 6825 667 433 4918
901 4918 -2431 1471 1975 -3787 627 -2436 -1643 3005 -4164 -1469 -1319 -6359 1161 1417 172 2712
917 2712 -1267 1272 -252 -1882 4326 -2376 -1978 4141 -4266 -674 1243 -7300 -1703 -791 -2351 2157
933 2157 -561 -192 -1090 -2654 2436 -734 1239 4266 -3259 2728 2811 -4795 3368 744 -2627 5724
949 5724 1474 1249 4217 -602 1218 1447 2302 3970 -390 2971 644 -5030 1045 -3145 -4289 1467
965 1467 -4910 -1724 1045 -6121 -630 -987 -3504 3489 389 1301 4787 -664 721 1119 1173 2503
981 2503 -366 3448 1313 -2698 3131 -2903 -2319 5607 -4303 285 7446 -4580 -628 3618 -4259
996 -4259 -151 2731 -1267 -663 1590 -1217 -6767 1709 2587 -8828 4123 5854 -8461 4653 3691
1011 3691 -8831 4529 2420 -6669 3812 3532 -6160 -3693 1639 -4136 -6761 3494 -1230 -6083
1025 -6083 5820 -2776 -5202 8771 -2400 -3013 10464 1394 616 5964 -774 940 2908 -107
1039 -107 1336 2988 1260 -3897 497 2851 -5697 121 2385 -4518 3946 -162 -6341 4376 -3034
1054 -3034 -6530 4795 -798 -2560 1507 -3853 -1247 2077 -1593 -1227 3886 3623 -2733 4311 6999
1069 6999 -5447 2604 5694 -6037 7714 4705 -11633 4796 2932 -12440 3402 6043 -8304
1082 -8304 -638 5482 -4876 -1629 8440 -6182 -5853 14701 -2726 -8812 14754 -3828 -13621
1095 -13621 9921 -838 -7958 7551 -2571 -8860 4581 1482 -7924 1060 5009 -6665 -788
1108 -788 7635 -4657 -1715 1965 -8421 4284 6186 -7593 4162 2980 -7917 4270 4743 -2117
1122 -2117 4310 2369 -1819 4421 6761 -3279 -3105 5956 -2361 -2975 7704 -3825 -5460 1792 -8295
1137 -8295 303 7002 -8315 -858 4811 -5545 1608 4726 -3539 -251 3568 -1620 1053 8237
1151 8237 -3431 -8569 7439 -142 -5567 10762 -1703 -7843 9084 -3435 -4229 12862 -4013
1164 -4013 -8467 10089 1709 -7139 5409 1249 -11872 2728 8051 -10060 2614 8591 -15819
1177 -15819 -376 14150 -9442 -1152 10282 -6976 -1837 7601 -3008 -3143 2346 -2766 -3789
1190 -3789 5091 627 -7389 901 -1728 -5139 6325 -369 -3324 6785 -4612 -3320 9552 -2442
1204 -2442 -3818 5032 -1475 -538 3874 -1071 -3545 -112 -226 -2070 4654 3168 -5861 2415 1599 -4836
1220 -4836 6943 671 -6696 7742 -139 -7259 7118 -632 -8700 3279 2759 -3756 1836 3582
1234 3582 -5110 -972 6322 -3623 430 9082 -4715 -747 7623 -5932 87 5258 -6721 1207
1248 1207 5363 -5497 -340 3962 -4381 -3343 4994 534 -4280 5276 458 -7211 5273 -125
1262 -125 -7700 6147 -14 -6527 5078 -1765 -5459 3035 -689 -1968 3255 1151 -2144 1907 4004
1277 4004 -3751 -190 5608 -3837 465 6116 -5548 -1746 2287 -5552 946 1992 -3395 457 -965
1292 -965 -1317 1547 -1057 -624 459 546 225 567 2532 -3642 -3223 4304 -2891 -589 6511 -4632 -2391
1309 -2391 4898 -2881 681 4829 -1787 -261 2589 1381 -154 342 -554 -4100 1565 3369 -2997
1324 -2997 2068 -330 -7024 3843 3184 -2592 4447 528 -2969 3841 2694 68 -687 -585 -181 -592
1340 -592 2849 114 -5008 -1688 -2855 -818 3204 -2527 -810 -171 -5295 2846 3263 -3889 1078 764
1356 764 -1966 2495 3214 -144 -3594 -345 2480 -242 4170 3263 -4530 306 1764 167 3905 -589
1372 -589 -1975 26 -2437 1887 1238 -5419 -3015 -1895 -1496 1133 63 -1673 -5112 -2005 4096 -18
1388 -18 1835 3036 -4136 825 4101 458 1933 -1065 -1960 1334 313 2735 744 -4125 -1272 178
1404 178 1847 2889 168 407 -2436 -816 5439 362 -697 2428 -2928 222 4341 4 -379 -1920
1420 -1920 -931 2288 1349 3165 -135 -4204 6 385 1153 1694 -2751 -1734 -2318 -2489 2398 -2436 -4645
1437 -4645 -171 -2617 211 3221 -1039 -1082 -1721 935 4269 1833 3330 1414 -2198 2377 2277 1074
1453 1074 1597 -2081 170 287 -958 2720 -2452 -4561 665 -1554 -117 2644 -2000 -2987 -2014 -456
1469 -456 1006 -1381 485 -1378 -2969 2308 125 -1037 1456 -2552 714 3915 190 2631 342
1484 342 -2821 1512 1488 426 1047 -489 -971 -2234 787 1570 -3332 351 1201 -2477 3460 2328 -2109
1501 -2109 1901 356 83 3565 1920 1444 -478 -1005 1252 -962 190 442 -2381 162 -1221 -1538
1517 -1538 923 -3014 -1615 687 -1658 1861 481 -2831 797 -1471 -953 2301 -186 397 645 -698
1533 -698 1519 953 929 549 574 3553 -1 527 3637 -3107 -1053 2834 -3111 197 1761 -4556 -1510
1550 -1510 535 -3153 -2055 596 -364 -2593 1026 1644 -3101 1656 1326 -3755 3809 2249 -3860 3245
1566 3245 925 -4427 1896 968 -1855 1400 1050 -1622 -135 2464 -1766 -1802 4362 -771 -2266 4844
1582 4844 -1216 -2695 3340 -1931 -862 3545 -1063 -151 1668 -47 -522 314 1898 311 -76 1822
1598 1822 -246 258 153 -2500 1011 -332 -2549 1573 -1586 -2052 1504 -3752 -758 3142 -2452 45
1614 45 3270 -926 -490 1661 407 -1006 1909 1585 -2607 2452 1513 -5615 2399 2350 -5229 2812 2243
1631 2243 -4477 2355 798 -3882 1984 1734 -3201 -83 3182 -2935 -3052 3286 -2965 -3503 4837 -2419
1647 -2419 -2527 5644 -3135 -2922 5992 -1589 -2517 4651 334 -2368 2187 737 -3079 1132 1875 -4096
1663 -4096 1273 3675 -4935 -133 3348 -3966 896 2864 -1644 1865 707 -1584 1181 210 -279
1678 -279 341 94 656 -243 -347 -609 -232 865 -1589 1638 3264 -3069 1235 2623 -3867 1984 2364
1695 2364 -3566 2268 1995 -3860 434 1790 -3194 -1233 2767 -803 -1687 3243 -1269 -2812 4448
1710 4448 -1501 -2851 5715 -1314 -3463 4651 -1621 -3349 2859 -1221 -2622 2814 235 -3517 1291
1725 1291 1764 -4095 979 3790 -3990 758 3512 -4649 659 2597 -4770 1071 2656 -3272 293
1740 293 1926 -1886 -435 2057 -208 -625 3130 229 -1696 3196 -440 -2771 3318 -690 -1947
1755 -1947 2393 -1816 -1553 1030 -2343 -296 1257 -1145 7 854 -401 -420 827 471 -1101 2033
1771 2033 1053 -1980 2949 111 -3466 3029 610 -1770 3529 -161 -1831 2733 -131 -911 1937
1786 1937 193 -1438 913 1428 -2399 -511 717 -4027 235 3326 -3942 292 2676 -4829 595
1801 595 3842 -2226 207 2780 -1340 -594 2352 -406 -2816 1268 256 -2839 2377 872 -4264
1816 -4264 662 -395 -2216 2653 -24 -1674 1136 -888 -1 1637 -253 -706 121 515 586 1049 853
1833 853 -2420 -283 1932 -1090 2145 1676 -3412 620 1204 -1929 1965 -40 -2823 166 277 -822
1849 -822 -438 -819 -1966 -1497 1719 866 -769 1658 -1497 -1182 4001 890 803 2560 -1436 381 2679
1866 2679 49 547 -331 -1594 308 1414 1011 -973 -1207 -1036 -1323 2070 1675 -2079 264 -1086 -2064
1883 -2064 3214 293 -2260 775 -1152 -475 2408 485 -1502 -1572 116 705 887 2332 -1366 -2662
1899 -2662 969 -555 326 1744 -2456 -1773 -13 -1191 1418 -210 -2524 -655 -316 1437 2498 497
1915 497 -805 -1287 975 2204 1117 2025 -985 -2632 2074 640 -479 765 -2555 -2000 1105 291
1931 291 606 -1174 -2791 -853 47 1624 1216 -1275 -1065 -1676 856 2347 -529 381 -311 -1750 2895
1948 2895 2237 -551 822 -809 -90 2792 2119 1010 -1167 -1392 9 195 1710 1 -2720 -500
1964 -500 -963 70 2090 -1649 -1543 -140 -757 2370 1934 -1295 -683 -827 502 1981 1080 121 -1975
1981 -1975 -1184 1211 -222 288 -234 -2873 -58 710 71 843 -1694 -1661 229 39 2039 750 -1882
1998 -1882 -453 -639 639 1733 70 -196 -864 77 2086 385 556 27 -1857 1367 1662 -281 540
2015 540 -2124 -2200 632 -215 -22 -305 -2200 -1181 -143 799 118 -1006 443 -690 636 3389 -422
2032 -422 -739 1224 -1287 1027 2851 -446 -344 -200 -375 312 823 877 -966 -702 942 -355 737
2049 737 962 -2356 109 715 -614 1689 -48 -1912 -209 -397 456 1109 -136 -92 -634 637 1256
2066 1256 -328 684 -181 -1205 1181 361 -368 -298 -2007 -768 128 -696 850 -1208 -1418 809 -753
2083 -753 91 1447 -608 -258 808 827 527 -10 450 -706 -401 2118 -834 -389 1304 -2456 -377
2100 -377 1833 -1574 146 873 -1344 -203 786 -567 -969 296 2 -1464 1357 1041 -2834 854
2116 854 1066 -2276 1856 1495 -1611 1427 1040 -967 1078 1226 -389 -384 915 491 -1054 951 -283
2133 -283 -1961 1082 -182 -1016 1500 -777 -997 1058 -385 369 660 -90 667 -44 -15 319 -645 71
2151 71 -230 -368 834 -345 -154 -206 -983 941 -639 -292 1644 -1177 -311 1473 -1868 -222 1075
2168 1075 -1464 88 1000 -1001 -495 584 121 -1390 860 1211 -1529 1351 1124 -2310 1494 1001
2184 1001 -2385 1634 1013 -2249 513 609 -1668 -336 865 -601 -596 1617 -363 -1439 2015 -521
2200 -521 -1685 2659 -528 -1194 2146 -737 -944 1299 -715 -630 929 304 -488 258 998 -1040 -210
2217 -210 1565 -859 413 1661 -1460 407 845 -1647 686 213 -609 584 -300 -260 195 -610 235
2234 235 350 252 472 -54 481 -350 -323 886 -1067 401 1087 -1775 713 670 -2368 835 613 -1769
2252 -1769 1121 900 -1154 269 518 -907 -536 1299 -445 -1475 1805 -663 -2046 1918 -759 -1973
2268 -1973 2360 -483 -1219 1993 -488 -1196 1087 412 -629 638 1040 -888 -355 1067 -1612 -387
2284 -387 1535 -1654 371 1575 -1919 226 830 -1487 932 877 -639 436 468 -199 -454 506 255
2301 255 -1050 913 543 -1114 1116 -93 -1093 1405 -440 98 1489 -783 107 501 -789 373
2317 373 89 -744 225 92 -66 -534 146 23 -954 1121 956 -914 1446 172 -1444 2030 147 -1006
2335 -1006 1598 -206 -837 811 -154 -884 -339 154 -691 -412 1366 -1016 -1012 1102 -1590 -275 1842
2352 1842 -1402 -251 866 -1272 371 506 -732 106 133 -94 478 597 43 -909 718 513 -512
2369 -512 1676 -170 -1920 1113 -533 -1025 1432 -850 -1217 635 -336 -32 306 -205 -424 -95 1309
2386 1309 441 87 927 -910 -76 1220 -583 646 246 -1264 874 402 -822 674 -770 -753 820
2403 820 297 180 -117 -403 -298 -381 1377 275 -941 762 -905 -258 1832 -733 -16 559 -899 939
2421 939 1325 -214 -75 -142 -98 285 696 547 -1423 -713 246 -1047 808 502 -2169 -28 65 -759 1238
2440 1238 -502 -1034 260 60 1177 767 -363 -245 -705 285 561 143 591 -1245 -813 1055 -567
2457 -567 120 417 -1622 72 998 -242 579 -480 -1242 -66 258 897 85 -627 -265 -555 758 1061
2475 1061 -667 286 -520 -330 1886 28 -537 307 -1177 170 1320 -214 -118 -1023 -841 -43 143 662
2493 662 -566 -708 321 -546 720 1080 -843 176 543 58 1992 147 -965 60 -558 436 1245
2510 1245 274 -257 -940 -43 421 -79 809 -723 -1498 1037 -20 -44 827 -1486 -661 388 -154 745
2528 745 -99 -1107 -281 -328 770 513 -454 241 -559 249 1309 -487 -48 -214 -1185 860 143 -350 -97
2547 -97 -1543 -566 588 -50 566 -430 -855 318 -170 681 726 -472 101 -107 514 984 -614 -106 -243
2566 -243 -975 1314 330 -787 619 -871 -548 1137 -45 -213 -222 -211 240 242 905 -586 -1115 859 -150
2585 -150 -132 1447 -1041 -623 1025 -321 653 1163 -190 -108 229 488 121 -94 274 -939 -73 1104
2603 1104 -841 -227 170 -1643 102 536 -402 550 -247 -547 186 -115 576 -229 -453 441 -487 104 495
2622 495 -1028 -189 -184 -350 764 -120 -135 -85 -678 448 119 -700 962 -689 -385 904 -777 -218 134
2641 134 -686 -163 271 431 -178 -461 840 -415 -138 1669 -775 -333 1283 -1059 -258 1027 -752
2658 -752 -236 475 -228 -282 130 195 -779 56 983 -821 659 945 -1225 633 871 -1202 599 418 -1016
2677 -1016 395 298 -459 -111 203 -16 -623 636 642 -774 696 199 -1139 949 -77 -519 846 -343
2695 -343 -276 54 -593 124 -281 -166 550 -675 16 403 -798 478 -93 -157 256 -213 363 -268 -554 463
2715 463 -625 -247 890 -1072 155 828 -1196 106 679 -503 132 426 -240 -660 273 371 -1152 200
2733 200 801 -1459 658 828 -1643 458 692 -1153 710 589 -661 360 569 -216 -210 722 23 -932
2751 -932 1067 240 -1162 1066 -491 -1150 1332 -155 -634 1114 -227 -424 293 197 148 42 674 36
2769 36 -449 825 -292 -504 946 -522 -11 743 -427 443 141 -385 606 -175 27 791 -615 77
2787 77 343 -671 165 -316 -202 -22 -152 196 -342 -231 636 -816 387 859 -1002 653 458 -1349
2805 -1349 670 365 -636 348 145 -460 -239 170 -212 -924 531 143 -886 1050 -67 -1273 1027
2822 1027 -347 -930 856 -478 -589 793 -142 -339 183 429 -163 -146 905 -418 -254 1121 -892
2839 -892 -36 1104 -818 345 899 -693 190 93 -558 131 -275 -34 53 -24 571 -325 118 420 -380 751
2859 751 161 -245 1007 -383 -228 723 -533 309 630 -785 102 119 -589 182 35 -25 -86 149 354 -437
2879 -437 36 165 -851 340 154 -905 936 -188 -867 881 -169 -512 1005 -170 -92 317 118
2896 118 -185 -319 395 -461 -391 943 -778 -640 856 -1193 -178 878 -953 40 476 -464 254 149
2914 149 14 -5 26 720 -54 128 420 -904 360 434 -534 665 -90 -732 839 -261 -254 791 -542
2933 -542 152 741 -174 308 21 -267 -187 -178 741 -196 -181 865 -674 146 747 -691 796 420 -651 955
2953 955 266 -391 400 -382 -231 352 15 -149 -667 -111 -11 -481 745 -86 -437 930 -480 -78 978
2972 978 -615 -16 510 -199 468 236 -497 -209 -486 -3 127 -49 326 -672 -55 344 -798 488 104
2991 104 -1029 819 64 -505 452 -444 -508 112 49 174 -128 -40 77 -553 496 129 -168 728 -489 -105
3011 -105 920 -364 176 344 -826 583 384 -535 355 -447 -192 153 176 589 -272 -23 415 -253 525
3030 525 165 -375 349 -203 -126 881 -586 -150 213 -708 525 705 -210 184 3 -154 187 135 566 -630
3050 -630 -216 644 -600 232 417 -1158 282 202 -369 609 -286 -381 328 -153 341 226 41 -211 -425 521
3070 521 112 -666 446 -585 -670 1204 -329 -417 492 -759 -179 375 -19 168 -199 -60 304 -477 378
3089 378 -177 -460 252 -495 80 328 -713 207 -171 -261 816 -235 50 385 -267 504 283 -218 449
3108 449 -283 -315 398 -347 103 -153 -258 350 -220 451 478 -988 566 131 -410 1064 21 -515 813
3127 813 -259 -63 248 -90 216 -132 592 228 -533 516 -375 -540 1005 -402 -370 622 -509 -342 538
3146 538 -467 -256 129 -427 -27 -315 305 -239 -309 881 -558 184 1042 -420 53 530 -646 145 73
3165 73 -90 162 -392 197 -199 -513 221 -333 -224 518 -319 -68 -40 -448 296 -30 -148 229 -469 43 125
3186 125 -295 511 -382 -326 751 -250 -30 701 -440 27 427 -88 -176 -74 218 -153 -312 692 -855
3205 -855 -404 868 -566 41 926 -735 -115 536 -73 224 507 417 -415 130 628 -599 23 792 -936
3224 -936 -18 836 -849 15 94 -854 75 48 -89 -238 -200 176 -350 84 745 -777 158 250 -540 594
3244 594 225 -567 67 -148 -3 447 -75 149 -192 -427 483 -520 152 248 -729 -44 195 -565 153 -306
3264 -306 -341 -81 -72 573 -338 -191 615 -503 262 899 -686 50 528 -697 266 315 -312 -308 29 277 -306
3285 -306 105 247 -924 81 612 -825 571 571 -1124 525 493 -468 314 207 -72 -179 551 526 -559
3304 -559 265 476 -733 1000 593 -784 626 -223 -394 724 -300 -104 -34 -398 60 -50 -219 46
3322 46 -462 371 198 -181 667 -476 -298 417 -288 398 399 -475 228 -139 -304 356 -635 22 155 -590 294
3343 294 -71 -183 124 -390 -14 -9 -292 405 -408 -18 349 -662 457 402 -969 578 280 -504 664
3362 664 87 -364 272 31 108 22 315 -4 -647 672 -73 -911 836 -252 -897 679 -294 -390 438 -238
3382 -238 17 205 222 25 -166 507 44 -170 913 16 -137 664 -612 -117 565 -653 247 251 -365 555
3402 555 -232 -106 64 -70 292 64 -136 175 -728 -82 188 -415 584 -171 -419 533 -295 26 550 -538
3422 -538 385 373 -495 318 -54 -261 18 -362 5 -182 -51 140 -726 -28 282 -764 325 24 -685 675
3442 675 -130 -168 747 -274 116 354 -264 187 -48 -85 -68 -412 437 -194 -289 707 -597 -73 562 -660
3462 -660 177 415 -531 560 61 -259 313 -180 -17 -11 65 320 -154 285 505 -614 432 176 -443 689
3482 689 -197 -149 669 -352 -22 262 -547 357 228 -230 399 -505 270 29 -230 457 -531 79 409 -642
3502 -642 300 265 -783 560 -75 -402 571 -287 -231 140 -235 25 -48 32 241 -310 265 -46 -484 557
3522 557 -382 -341 447 -500 46 382 -625 195 127 -280 473 -113 -120 -71 -199 438 -328 65 385 -711 391
3543 391 362 -669 360 -46 -467 620 -273 -137 263 -407 205 -120 -39 466 -373 80 87 -465 447 -154
3563 -154 -380 621 -335 302 324 -476 347 64 -147 680 -156 81 366 -264 221 208 -91 357 -373 238
3583 238 204 -406 404 -362 -383 643 -466 -27 636 -552 321 292 -327 264 -20 -201 142 -175 165 -182
3603 -182 -181 310 -424 167 185 -869 485 181 -892 529 -46 -438 460 -405 -204 4 -7 107 -427 145
3623 145 88 -567 362 118 -434 649 -202 -155 544 -395 130 219 -459 290 -316 -118 173 -482 132 -84 -598
3644 -598 611 -319 -99 559 -440 199 288 -490 267 -92 196 347 -505 716 212 -484 682 -135 -245
3663 -245 691 -201 -4 73 -166 352 -275 264 363 -738 348 74 -789 765 -234 -389 633 -392 -68
3682 -68 440 -199 -86 128 178 286 -127 669 -215 -612 861 -314 -577 652 -661 -472 525 -425 -261
3701 -261 -135 -44 -79 -289 348 -93 -459 607 -355 -343 785 -395 -194 488 -415 197 158 -225 177 -369
3721 -369 209 37 -196 514 -346 -588 709 -442 -41 349 -655 -57 49 -135 135 -310 -37 180 -153
3740 -153 728 -22 -320 716 -360 33 875 -334 -15 239 -90 314 -292 312 -44 -562 694 -200 -328
3759 -328 453 -610 -322 658 -269 158 210 -436 188 231 117 45 -328 302 -258 -108 743 -755 -100 519
3779 519 -705 255 566 -619 -87 -97 -579 232 -139 -99 -475 -183 520 -612 195 269 -1025 275 616
3798 616 -466 588 -196 -370 125 -51 342 -99 -232 326 -622 91 534 -827 20 167 -484 381 51
3817 51 -383 -5 -370 330 -14 -111 387 -746 -169 621 -396 188 460 -688 260 250 7 350 -16 215
3837 215 -198 -44 642 -298 -123 330 -754 283 615 -649 337 -11 -484 347 -19 -116 -84 -159 504 10
3857 10 298 514 -776 254 288 -604 785 -118 -705 299 -176 -118 171 -330 -50 -421 15 360 -216 53
3877 53 23 -725 581 110 -286 397 -493 45 335 -276 390 -333 -260 425 -323 313 285 -670 242 103 -321
3898 -321 332 -190 -272 -170 -282 358 -225 1 349 -633 118 445 -494 394 224 -393 591 141 10 230
3918 230 -256 177 -9 147 410 -547 97 175 -443 523 124 -413 608 -151 -135 478 -294 -111 146 -41
3938 -41 440 -59 8 56 -406 477 -166 -299 491 -377 -76 406 -419 360 118 -284 420 -169 -105 252 -356
3959 -356 4 -29 -300 379 -403 -65 160 -479 302 -29 -383 431 -190 -44 213 -531 259 -31 -466 426
3979 426 -41 -426 207 -233 -20 170 -80 140 -425 152 177 -654 443 59 -588 522 -329 -222 557 -304
3999 -304 -126 291 -209 207 -11 248 214 -280 282 154 -370 485 -287 -162 404 -279 90 278 -402 357
4019 357 -83 -139 571 -277 285 319 -242 217 -170 67 415 -358 147 300 -470 340 -260 -347 427 -278 51
4040 51 340 -384 130 156 -50 313 -262 128 233 -356 400 -170 -170 236 -360 53 121 -399 375 -309 -315 491
4062 491 -244 -117 372 -458 78 -160 -161 119 -156 262 -61 -368 308 -328 -261 438 -380 -30 576 -391 202
4083 202 159 -477 187 -106 58 -79 -282 88 22 -86 380 -416 116 185 -376 315 127 -306 462 -291 151
4104 151 403 -167 267 29 -206 190 -246 -5 194 -484 388 44 -189 276 -410 122 240 -299 258 93
4124 93 -242 502 -216 58 104 -462 312 188 -402 448 -249 88 273 -276 249 -179 -292 189 -315 -126 330
4145 330 -657 269 -45 -777 398 -75 -274 325 -251 210 52 -28 273 -451 107 181 -443 400 156 -570
4165 -570 433 -138 -439 354 -342 -118 138 -159 217 -351 143 154 -365 293 -61 -455 420 -8 -221 548
4185 548 -90 -153 323 111 256 -188 -84 281 -379 257 318 -460 402 -244 -288 284 -144 -8 63 -255 211
4206 211 -258 86 297 -262 124 194 -350 547 -26 -306 284 -292 131 482 -187 184 -63 -61 180 -401 333
4227 333 2 -501 473 143 -372 425 -318 -184 273 -134 67 0 -43 -69 -446 374 -33 -643 429 -332 -318
4248 -318 740 -202 -361 343 -151 -61 212 -145 -60 -464 84 11 -171 389 -256 -234 599 -323 -22 650 -506
4269 -506 294 357 55 267 -58 71 -69 -360 519 -39 -221 513 -216 8 452 -492 47 185 -234 314
4289 314 44 34 177 -89 371 -60 -81 585 -240 -100 541 -420 237 359 -315 205 49 24 102 -307 226
4310 226 -300 -207 740 -314 -217 461 -600 66 437 -357 27 40 -68 56 -106 434 -472 -220 590 -356
4330 -356 73 502 -579 -13 238 -427 198 211 -173 -132 -235 154 -175 -171 388 -359 71 541 -392 250 206
4351 206 -532 262 -42 -153 237 -177 165 249 -99 448 -220 -3 412 -318 247 114 -513 211 -111 49
4371 49 346 -201 107 -163 -159 488 -237 -83 387 -439 76 345 -294 227 245 -324 271 1 -58 -148 -258 317
4393 317 -252 60 417 -619 22 340 -557 422 253 -540 274 -35 69 -32 -180 192 -424 50 408 -402
4413 -402 199 81 -670 383 16 -224 369 -98 -170 205 -260 203 -149 -352 72 -202 185 140 -450 134
4433 134 37 -338 417 -331 -245 120 -125 340 126 -221 209 -301 35 361 -396 44 -56 -495 239 -152 -18
4454 -18 252 -276 153 -162 26 242 -352 150 263 -350 366 208 -570 487 2 -25 377 76 51 109 -105
4475 -105 100 -206 258 96 -516 377 136 -305 484 -264 -340 279 -268 121 182 -295 255 -123 112 161 -335
4496 -335 158 -168 -283 184 -184 -38 325 -455 128 41 -414 249 -113 -158 300 -199 172 250 -358 371 -58
4517 -58 -104 311 -214 95 -75 -289 262 -390 -77 266 -550 186 508 -567 268 -34 -193 286 -77 101
4537 101 44 -100 542 -120 -87 207 -357 201 211 -194 305 -233 -231 394 -400 9 155 -311 67 163 -73 338
4559 338 -174 156 67 -146 339 -126 -131 367 -366 156 269 -252 196 -89 -188 305 -301 13 173 -263 43
4580 43 27 -152 253 -353 -164 76 -406 210 -129 -180 157 -361 75 121 -328 217 -84 -267 184 -133 79
4601 79 70 -318 189 -99 -303 142 -270 107 40 -538 242 -98 -300 276 -355 -70 344 -283 89 -36 -138
4622 -138 401 -169 42 122 -232 209 -8 -75 288 -210 93 435 -374 235 -9 -169 403 -42 117 167 -276
4643 -276 65 -9 -220 346 -113 57 321 -232 189 325 -224 168 -243 -54 302 -126 229 -42 -127 417 -282
4664 -282 -49 196 -440 2 214 -332 273 -120 -174 163 -58 -13 -143 -189 122 -462 -57 122 -543 220 140
4685 140 -161 359 -91 -277 143 -289 36 -89 -407 177 -348 -139 200 -450 18 49 -479 155 -2 -157
4705 -157 187 -144 61 3 -101 300 -135 -46 418 -348 193 233 -494 89 123 -332 426 -35 -28 99 -91 284
4727 284 -85 204 269 -419 364 64 -436 380 -48 -171 352 50 -97 159 41 99 222 99 58 -226 300
4748 300 79 -507 475 -169 -277 289 -262 -101 343 -286 29 88 -88 203 -261 338 137 -273 329 110
4768 110 -223 311 -206 -115 346 -244 185 -54 -264 123 -327 50 160 -511 186 -129 -304 102 -298 -225 141
4789 141 -343 38 -40 -61 162 -343 107 -6 -280 439 -105 -435 446 -109 -185 452 -439 -172 -17 -81 151
4810 151 -110 62 -116 -165 378 -275 -342 406 -404 -40 684 -195 172 298 -218 35 190 293 -150 -329 173
4831 173 166 -61 376 -338 -31 455 -376 54 291 -215 193 82 -57 45 -250 211 -14 -431 85 -270 -98
4852 -98 360 -414 -12 -43 -241 236 -179 16 198 -356 189 -65 -359 232 -237 -59 290 -177 -109 120 -254
4873 -254 -20 100 -76 3 -324 135 16 -119 236 -211 97 240 -451 121 174 -495 44 126 -160 275 21
4894 21 44 127 22 232 -237 -249 332 -302 201 252 -271 417 47 -248 378 -61 129 80 -77 36 -52 -17 389
4917 389 -259 71 399 -246 334 -155 -29 316 27 94 171 -217 337 -301 -202 459 -296 170 230 -418 162
4938 162 20 -379 122 -17 1 108 -300 192 -121 -25 404 -446 47 121 -422 162 31 -363 331 -40 -87
4959 -87 111 -73 96 8 -149 61 -235 257 161 -424 195 -4 -224 65 -133 -88 304 -202 65 -16 -120 183
4981 183 48 -52 174 -193 121 -126 -119 427 -236 -151 33 -322 194 -158 -278 255 -187 8 93 -169 315
5002 315 -69 -149 247 -146 -79 -6 50 90 46 20 376 -34 159 405 -316 219 198 -276 385 -172 -352 203 -355
5025 -355 82 114 -255 76 -146 87 67 -452 219 19 -279 290 -343 -165 314 -349 114 254 -193 237 -230
5046 -230 3 201 -151 -24 31 -256 295 -200 -90 343 -439 76 59 -241 206 63 -162 231 -348 91 178
5067 178 -135 104 -59 -156 112 -217 72 108 -277 198 -54 63 229 -151 67 58 -292 203 -82 -283 306
5088 306 -122 181 80 -100 200 125 142 181 -95 164 200 -330 316 225 -130 326 -210 93 297 -134 262 65
5110 65 -242 233 -116 -108 -40 -283 82 -61 -211 199 -188 -28 124 -390 153 12 -272 155 -217 132 207 -252
5132 -252 28 -55 -22 99 -69 -117 352 -229 158 120 -121 148 -374 -225 29 -167 -38 11 -301 148 -216 224
5154 224 273 -404 150 124 -323 180 3 -279 64 -139 210 -41 -189 236 -207 83 146 -474 281 98 -318
5175 -318 222 -185 125 140 -111 119 100 -7 117 -157 78 236 -260 -131 29 -191 241 -78 31 -11 -188
5196 -188 136 25 -269 143 -166 -80 207 -175 80 48 -316 139 -72 -132 -51 3 186 -37 -198 219 -151 -42
5218 -42 145 -379 276 141 -253 25 7 -201 72 -63 -160 -140 -408 197 -102 -32 319 -282 342 87 -380 381
5240 381 -70 -203 321 -98 52 134 -94 220 -120 -27 356 -294 131 -39 -332 140 -279 32 274 -153 139
5261 139 50 -136 162 -133 -68 373 -167 119 274 -198 130 305 -199 158 -168 -8 206 -157 127 -163 0
5282 0 18 -288 96 135 -354 343 121 -420 394 -77 -70 222 -46 250 -52 101 160 -113 187 -10 -339 270
5304 270 14 -315 457 -91 -82 204 -90 -171 -45 -22 -53 -48 -26 52 -148 252 8 -224 160 -289 -281 128 -294 -67
5328 -67 -33 -104 178 -152 -70 117 -304 55 0 -421 219 -100 8 290 -113 32 -180 4 384 -158 -5 170
5350 170 -255 188 -113 -161 415 -361 -96 183 -6 -64 178 -113 -66 97 -62 53 -100 94 23 -199 407
5371 407 -194 -39 184 -309 63 155 -70 123 130 -56 71 -198 52 -228 -136 330 -172 -41 274 -343 67
5392 67 342 -238 93 -52 -137 24 -201 194 111 -142 310 -335 -173 150 -71 -140 -55 -137 168 -15 6 199
5414 199 -116 112 -36 -206 399 24 -161 286 -353 -49 109 -251 4 59 132 -55 -33 60 88 10 176 -254
5436 -254 19 163 -115 54 336 -278 167 104 -100 155 -12 89 -63 -55 130 -233 -65 135 -286 73 115
5457 115 -254 191 21 -72 164 -113 244 276 -16 187 -33 -41 119 -130 86 234 -79 52 133 -15 123 -178
5479 -178 -117 34 -91 262 -74 -168 131 -303 -83 197 -108 31 113 -363 93 -143 -64 -4 -239 22 -198 -72
5501 -72 137 -381 109 -41 -256 113 188 -263 223 -11 4 115 -154 -53 -43 -197 234 -129 89 274 -199
5522 -199 182 97 -253 158 -136 -122 221 -282 326 36 -37 169 -43 -30 278 -149 93 -181 -190 116 -146 10
5544 10 343 -91 150 -65 -239 458 -176 -16 196 -171 93 215 -114 215 -135 -116 309 121 53 156 -119
5565 -119 169 -172 -101 131 -293 98 3 -179 219 -18 -406 328 7 -111 -58 -160 112 -207 36 143 -199
5586 -199 8 88 -183 142 57 -137 193 -74 84 149 -123 53 -68 72 85 -150 -35 16 -255 -31 -60 -16
5608 -16 33 -191 27 -36 -66 110 -66 -128 219 -201 -100 68 -219 10 156 -76 -154 -31 -55 182 -233 17
5630 17 -109 -25 244 -185 148 91 -309 3 2 -93 354 -168 -47 259 -90 120 92 -116 128 -164 250 32
5652 32 -123 278 9 -158 121 -222 110 128 -313 26 -53 -246 97 -275 -19 -54 -440 30 -118 -72 185 -188
5674 -188 -108 213 -131 44 99 -215 331 42 30 53 -171 119 160 -191 248 14 -114 69 -32 60 9 -379
5696 -379 172 -1 -160 133 10 109 1 -170 111 40 -236 24 -109 31 151 -160 103 -11 -15 90 -210
5717 -210 -103 176 -126 30 0 -113 354 -53 218 137 -100 134 41 -66 246 51 276 19 -94 192 99
5738 99 -35 315 -201 -118 131 -241 148 -102 -91 -130 -210 -44 45 -73 136 -114 56 141 -290 -139 227 -117
5760 -117 20 145 -142 2 -113 40 -12 -8 -40 -91 110 86 -228 103 271 -282 81 70 -268 231 -70 72
5782 72 137 -94 132 -57 -142 65 -142 97 117 -367 188 14 -86 214 -276 -11 7 -91 -55 -7 5 218 -236
5805 -236 98 148 -94 234 175 -118 186 69 -16 -1 2 283 -30 -1 274 -75 1 59 -131 -16 -2 -71 24 24 -47
5830 -47 120 -231 112 68 66 188 -260 -36 181 -236 42 43 -296 37 24 -186 137 -27 -134 -134 -9 88 -228
5853 -228 43 211 -287 268 -72 -286 284 74 -164 159 -154 -13 -82 -101 97 -267 -54 10 -21 32 63 -91
5875 -91 224 -63 -9 17 -275 -24 -104 -189 117 -167 -15 84 -29 178 59 -59 204 -7 -109 172 -46 -31
5897 -31 63 -38 27 -55 -39 48 -233 147 -21 -301 217 -78 -252 162 -85 -199 56 -151 21 -157 91 80
5919 80 -97 197 -237 -72 158 -91 -151 179 -30 40 159 -79 202 79 -171 74 15 69 163 -162 146 -125
5941 -125 -274 210 -337 -12 -10 -158 76 71 -183 143 -282 3 -1 -105 96 -183 -309 82 -137 -114 13 -54 78
5964 78 -28 22 179 -197 116 96 -335 72 65 -131 287 28 -75 107 -149 -11 7 -149 185 146 6 -11 -212
5987 -212 156 109 -75 215 -234 -126 138 -186 202 -3 -189 88 -27 -64 -5 -146 180 -5 -44 78 -10 -114
6009 -114 -14 42 210 -84 -150 25 -79 22 142 -255 121 134 -39 12 14 -116 174 -107 -43 84 -257 39
6031 39 -181 -40 56 24 228 -110 -202 279 -55 -45 172 -185 -16 346 -63 80 -48 -248 77 -37 93 -123
6053 -123 -94 89 -151 26 290 27 149 25 -423 245 18 -143 268 -169 38 61 -85 98 -72 -200 50
6074 50 -117 21 213 -105 140 2 -149 120 -172 141 194 -174 195 68 -65 189 58 124 3 -4 99 -41
6096 -41 -54 144 -138 109 163 -281 200 -114 62 1 -166 -50 -36 -117 10 186 -191 180 -91 -100 39 -100 146
6119 146 -182 38 241 -14 -50 -43 -148 182 -31 -214 93 22 -203 123 -184 213 48 -127 86 -146 29
6140 29 103 -184 180 -91 -207 280 -120 84 40 -81 80 64 -12 59 -33 -44 293 47 158 101 -128 149 -209
6163 -209 98 107 -59 62 -49 -84 97 16 -111 74 -124 -50 -75 -41 113 97 100 158 -24 174 -93 112 212 16
6187 16 171 212 -310 67 173 -185 37 28 -130 -55 -184 141 -124 -72 -34 -65 2 73 -180 102 -82 -55 177 -119
6211 -119 -156 -38 -25 -31 94 25 72 -91 122 172 24 121 -46 -104 116 43 -58 212 -132 -39 1 17 -2 81 -156
6236 -156 125 11 20 49 -29 178 -40 81 228 -12 -126 258 -232 50 -26 14 73 -3 46 -26 -122 83 79 -33
6260 -33 137 -109 -185 51 -201 185 -22 -11 194 -116 82 80 -38 205 53 104 -58 -35 -23 1 -136 304 125
6283 125 -210 188 68 102 -12 -105 99 -50 -165 256 -113 -125 215 -227 -51 -27 -148 35 -71 28 38 13
6305 13 202 -49 -78 90 -242 -74 190 -130 6 95 -43 -78 -89 31 6 -47 36 81 -120 328 -56 39 84 -208
6329 -208 233 -11 -261 199 86 41 100 -151 -23 -88 -55 123 -33 57 -23 -33 90 -7 -171 347 -114 105 174
6352 174 -87 221 -11 -212 -4 -42 33 -23 63 138 91 23 280 10 12 19 -124 45 82 -228 -77 -203 78 122
6376 122 -138 68 67 -184 113 -16 -181 41 97 -45 -76 -45 130 -147 -56 17 -234 51 110 -257 44 -80 -222
6399 -222 88 150 39 161 -49 -140 14 66 209 -97 -71 -140 -36 -19 -66 -118 -11 39 -50 -89 -269 33 -84 -157
6423 -157 172 -60 -63 97 -79 136 98 -129 192 16 -143 -136 -39 186 -10 -67 100 47 -67 269 -272 234 170
6446 170 -117 180 -79 20 68 -86 88 54 184 107 -227 79 27 -281 -25 42 -228 102 19 -137 96 -67
6468 -67 -44 134 -104 11 -147 30 -4 -161 61 66 -85 283 -37 4 194 169 77 40 87 37 -58 -66 -9 -122 197
6493 197 -54 12 82 -91 -74 204 -119 -105 79 -110 50 39 -130 66 -325 -44 32 -107 124 82 -67 261
6515 261 -17 -7 239 -256 94 97 -10 -14 52 82 16 -91 158 -120 83 456 -24 -1 18 5 -67 74 -22 -10 17
6540 17 70 32 -179 149 52 85 143 -152 177 -35 72 40 94 -146 90 50 10 54 -82 179 6 -59 71 -92
6564 -92 -56 -15 12 26 -214 -142 144 -81 84 -28 -16 -72 19 -92 46 -93 -96 107 -125 -81 -47 -255 143 56 37
6589 37 22 -203 153 32 -116 97 32 -79 142 -155 148 85 -7 -135 176 96 -103 57 205 -35 -122 173
6611 173 -100 -156 205 -241 205 81 -249 104 105 -29 -35 -83 163 29 -70 76 -158 -21 32 -143 162 129 -58
6634 -58 183 -42 -106 211 -261 43 103 -223 19 -35 -18 130 0 43 20 -25 63 -17 43 123 -50 109 25 -124
6658 -124 118 -116 32 -73 -169 15 -61 -222 39 -50 -44 84 33 67 -103 36 106 -20 28 124 -178 -104 114 -201
6682 -201 3 -13 -188 37 10 -41 108 -112 -1 -310 57 77 -67 -56 25 -233 71 -37 -149 157 -151 107
6704 107 186 -39 29 40 -123 37 -168 -44 -37 -121 8 -11 6 69 -219 -17 51 -129 103 -69 -55 2 -31 -34 18
6729 18 -16 40 -118 131 129 -177 -126 206 50 113 -119 -162 295 -3 89 286 -38 38 128 -127 120 52 -150 148
6753 148 -3 3 33 -135 48 -200 -7 39 -143 10 6 -146 114 33 -75 89 -59 65 38 -57 164 -60 187
6776 187 32 -89 305 -156 -29 14 -49 25 133 -38 -35 160 2 111 -211 86 73 -70 136 -74 -177 136
6798 136 -182 -168 91 -90 -5 61 -96 145 -50 -10 -111 31 135 -47 -80 316 -58 -182 96 -133 -54 10
6820 10 15 47 -61 -28 32 -96 16 53 -39 215 -2 -195 263 -41 58 61 99 69 -53 6 51 -106 52 -135 -113
6845 -113 171 -53 -218 57 -73 -156 -172 5 -37 -116 6 14 -147 53 109 -88 230 -132 -161 191 -284 -160 112
6868 112 -188 186 180 -261 166 99 -20 87 7 -35 20 -68 164 -112 -92 -40 -101 -44 71 -6 66 -117 -97 117 119
6893 119 97 -60 -47 163 0 -44 72 21 141 230 46 28 -2 128 119 33 -24 -88 -71 64 -8 3 141 -112 -45
6918 -45 49 -128 -76 106 -21 -37 -157 50 -66 -149 2 -121 22 22 -14 67 -25 -180 26 9 41 10 32 -20 73
6943 73 -31 -49 -138 146 142 -75 -47 -69 24 41 -32 -103 94 27 131 -252 -169 3 58 -46 115 -98 21 6 -45
6968 -45 42 115 -95 -49 -136 -54 -56 -147 238 -20 -83 333 -185 14 250 -11 19 -57 -33 115 -195 136 0 -102
6992 -102 202 84 -45 89 -69 3 18 -214 170 32 31 28 -138 -47 -102 -191 -50 -68 46 -14 -178 89 151 -135
7016 -135 41 -152 116 60 9 -121 122 -68 6 -105 -7 16 -121 176 171 -11 226 -15 27 123 -6 -113 23
7039 23 -251 -29 95 31 119 -92 -40 92 -208 69 -4 112 -28 -217 -102 -48 -40 19 -53 -101 -47 42 56 143 -155
7064 -155 113 39 -215 179 -80 -49 51 -127 -42 57 -41 15 118 -28 99 -152 130 115 -200 91 -50 -57 249
7087 249 -201 -127 151 -95 54 -88 26 67 -117 -48 -28 -115 82 -119 -47 54 -228 88 34 -45 144 -40 -70
7110 -70 20 38 135 85 -11 60 -56 -51 63 -58 118 47 -147 47 -126 -181 246 -194 37 -123 -86 144 -102 -101 206
7135 206 -67 -127 75 -200 37 41 115 8 -32 14 21 -131 101 68 -20 19 -89 144 207 -25 -66 53 -101 43
7159 43 78 27 24 -116 165 213 37 132 -197 21 -9 -130 77 -143 -104 -118 -64 45 -93 80 -87 -42 -100 116
7183 116 -146 -54 76 -76 -19 -15 -129 -12 57 22 13 -78 119 27 -228 -56 -58 -124 118 -79 27 9 -209 111 -68
7208 -68 213 -62 -121 202 -17 -48 -37 -191 -81 199 -290 -7 -101 85 19 -233 -163 -186 97 78 -69 -46 77
7231 77 -182 -218 70 -61 29 128 64 154 131 5 10 1 2 -11 -23 252 -76 12 135 -177 138 125 -65 43 103 138
7257 138 -25 -6 67 64 47 252 -36 73 81 -164 -30 81 -103 119 40 -148 111 -206 226 18 -174 166 -17
7280 -17 -134 303 -31 -155 173 -55 102 -207 -9 278 -14 205 75 -53 144 103 -130 167 -105 48 -122
7301 -122 -165 50 34 65 82 -153 -42 -50 -50 28 -25 179 60 -162 -61 134 -133 12 -18 14 144 -162 223 79
7325 79 5 146 4 82 72 -144 10 32 140 94 164 -36 94 -26 175 175 -187 120 1 -35 -18 -128 142 42
7349 42 0 69 -151 -2 105 -149 167 186 -28 12 -135 -44 -44 -79 49 130 -68 5 -49 -91 -10 -129 -145 -43 -178
7374 -178 -18 8 -250 118 85 -17 23 -81 140 -84 -54 164 174 27 -49 27 -124 71 -76 80 -87 106
7396 106 36 -12 67 135 -235 161 9 -105 255 9 -15 47 -48 40 -88 -29 24 -151 2 -40 -99 62 -3 -84 -17
7421 -17 -134 48 -17 -21 -33 -4 113 -20 -98 91 18 22 79 77 -82 51 -149 176 184 -32 311 -104 -117 18 54 18
7447 18 -54 -41 89 -76 -103 10 -68 22 38 115 93 -32 17 67 12 -64 -169 17 1 -120 -90 29 -114 -28 -13 -233
7473 -233 -32 136 89 103 -51 -7 -65 -41 155 -27 72 204 -161 -147 36 -13 85 37 -37 180 -69 -25 -126 -131 161
7498 161 -88 46 -50 -144 -47 -14 58 191 -56 58 208 142 -84 8 16 -76 -5 -232 37 -123 40 -31 124 85
7522 85 49 -98 128 124 213 49 37 19 -27 -23 147 147 -2 125 -110 -147 -19 -77 105 109 84 -46 -136 133 -5 -66
7548 -66 130 -135 -94 -71 -253 -38 217 -59 -162 -33 -241 -53 -41 -54 43 28 105 42 -67 75 -86 -19 -15 -51
7572 -51 179 92 -1 103 17 -51 -47 -198 245 -4 -45 131 -174 75 -108 -102 120 -62 -112 70 -59 115 20 -38
7596 -38 191 -88 -112 53 -128 -88 135 -45 237 97 11 164 33 23 -22 -73 73 50 126 134 -24 36 -26 -137
7620 -137 61 145 -176 73 109 -106 -86 -43 177 -168 224 73 -190 -54 118 -72 137 27 -165 71 -158
7641 -158 114 -67 -68 5 -91 -196 90 -12 58 148 -44 149 130 26 -59 -174 191 -15 -150 144 -52 -83 186
7664 186 -90 107 87 -72 37 68 -51 118 7 -62 172 -245 141 1 -178 186 -215 -62 69 -199 125
7685 125 -145 -24 27 -33 -36 58 -22 33 -60 -72 -73 -157 27 -46 -203 64 -104 -27 108 126 -211 -21 -32 -105 60 58
7711 58 152 -119 -85 -45 108 159 -111 -80 148 -33 114 14 42 122 -44 -132 220 55 -98 63 -138 216 -26
7734 -26 -163 148 -200 -84 -69 -139 47 50 -67 110 -82 90 67 -139 -127 81 -77 164 106 -27 149 -29 -7
7757 -7 -91 -127 88 -98 23 77 -65 124 -22 -38 33 -5 -13 141 45 27 238 -67 160 97 -87 -84 31 76 -65
7782 -65 -15 187 -20 -4 93 -163 24 23 -78 20 163 -103 202 -57 -67 97 -31 45 -43 210 0 -123 164
7805 164 80 -145 124 -64 32 161 0 70 20 60 186 12 27 232 -131 -106 -118 -89 109 27 9 22 -92 -46
7829 -46 -80 -179 -127 165 -44 133 -176 -5 26 88 -207 -71 -131 23 6 35 134 -41 41 125 -28 141 -72 -34
7853 -34 -66 -250 108 -13 -89 54 78 -44 114 173 109 -152 125 190 -121 75 -53 -62 153 32 50 38 -170 21
7877 21 -14 -179 93 -43 -29 82 148 -3 155 -165 141 -81 111 174 -69 114 97 -115 42 -63 -65 82 -220
7900 -220 75 65 -162 126 -88 -236 64 -60 -157 -72 -294 59 -134 -185 56 -64 -75 66 -121 28 160 -178
7922 -178 58 -133 -41 113 -81 -16 -121 -80 -76 90 -174 231 -41 124 51 -119 150 -75 37 2 56 55 136 84
7946 84 -77 -108 22 151 -190 -4 -31 -82 180 -127 -150 14 -131 45 -125 -11 86 -34 81 106 84 -169 -5
7969 -5 -38 242 -72 -97 161 -38 13 5 -27 68 -134 -6 -116 -130 -162 51 65 104 -54 84 -55 1 79 210 -64
7994 -64 -24 -128 20 124 -62 10 34 -81 31 35 -220 4 -225 151 151 -55 78 28 39 -1 -81 86 -7 33 146
8019 146 -111 -54 68 65 96 45 120 -66 17 -48 6 99 44 95 14 7 -101 17 151 -9 -37 -20 -5 82 -27 -87 132
8046 132 -57 -43 -107 -239 18 -52 -30 -27 -66 112 5 -57 3 -115 4 62 83 24 116 7 117 -16 11 79 0
8071 0 -29 105 -141 -190 -151 -168 161 -4 -5 234 -44 -9 122 -166 45 -86 88 83 -42 22 116 -30 140 213 -181
8096 -181 61 58 66 -1 47 98 -144 -108 166 -37 24 -32 -49 58 -110 -80 -241 107 4 145 -53 17 104 24 11
8121 11 -30 22 6 -11 81 -76 20 -66 40 -29 82 -35 98 60 -175 29 -59 10 -15 -232 -65 -75 23 62 -41
8146 -41 -132 -9 14 16 -269 33 76 -36 61 123 41 -36 4 -63 76 67 -29 -4 -247 99 -76 -50 -92 -166 78 -58
8172 -58 -84 78 -16 -196 149 38 -2 99 63 55 -52 -17 -11 -19 -26 -320 -148 105 -92
8191i2
$$ Imaginary data points
##PAGE= N=2
##DATA TABLE= (X++(I..I)), XYDATA
0 0 0 0 0 0 0 0 0 0 0 0 0 0 8 -8 8 -8 8 -16 16 -16 24 -24 32 -36 41 -48 56 -65 74 -86 98 -111 125 -142 159
35 159 -180 201 -225 250 -279 309 -343 380 -419 464 -512 564 -622 685 -753 831 -914 1010
53 1010 -1115 1233 -1369 1524 -1704 1917 -2170 2481 -2869 3367 -4039 4990 -6425 8834 -13572
68 -13572 26189 -124274 -279210 144525 -1666 -151327 125172 34025 -206924 -13120 74540
79 74540 -83196 -27950 46671 -113513 -53714 117723 25291 -34909 -19680 -54837 34606 45607
91 45607 25449 117220 -8796 -111429 66844 69901 -24909 38509 9651 -69278 16405 67014
103 67014 -29413 -32672 6396 -79416 -13905 112480 6688 -23445 647 -77955 36054 93002
115 93002 -44740 22199 46938 -95416 -3957 102377 -32742 -81864 11220 -17005 -37310
126 -37310 70217 8481 -106019 -7231 1415 -40504 62756 28195 -45431 -9369 -30090 28557
138 28557 69488 -50078 -12694 68463 -28892 -1415 113007 4477 -83702 55996 57967
149 57967 -44370 88938 74099 -128780 3285 89392 -83908 -3500 72835 -89278 -66147
160 -66147 41682 -14265 -44213 -10344 -35404 -42198 27422 25181 -19587 7488 -20876 -33559
172 -33559 45315 20293 638 33104 -36071 -16134 56862 -9842 -17286 24610 -14222 -9340
184 -9340 30116 20075 -8185 -14626 -9032 -6495 26387 22339 -19927 5071 -10527 -34885 31937
197 31937 4402 -32294 28127 -12674 -27724 48584 5690 -37477 11035 11750 -10737 16258
209 16258 29103 -20845 -28727 8820 -19080 -7912 24858 -32477 -20203 15523 -26489 3260
221 3260 16033 -27699 10341 22184 -2758 27053 23230 -12010 -3067 26238 14016 -2859 29549
234 29549 6403 -29590 20965 6698 -24701 24001 -491 -23142 20685 1242 -13976 1259
246 1259 -11995 -10100 -2309 1215 -1548 -13213 -7202 -18035 -13710 10469 -11727 -2708 14482 -14425
260 -14425 6845 14295 -12800 11922 9089 -3529 18309 6220 -1638 -603 -9429 -691 -4657
273 -4657 -384 5339 -10744 1604 -2326 -13484 9364 -3613 -4155 17700 -3969 2814 9650 -13086
287 -13086 1137 380 -7385 7206 -1860 -1431 -1380 -10417 1835 -5426 -1122 13293 -3578 7800
301 7800 10100 -9984 7106 814 -7119 11232 -1680 -431 4590 -10434 -728 -4265 -6250 8492
315 8492 -1355 6186 9777 -5088 7827 944 -3821 12763 -742 3775 8666 -9644 414 -4171
329 -4171 -11211 4014 -5887 -327 6334 -7943 3507 -1638 -7748 8794 -1579 3227 10235 -6095
343 -6095 2951 -2038 -10077 4041 -6133 -992 6201 -7903 3732 -793 -8473 7900 -1441 2517
357 2517 12700 -2054 5640 1740 -8314 2840 -6181 -3214 2927 -10250 -617 -6952 -15409 941
371 941 -9730 -5316 8510 -5529 3494 4852 -6657 4869 382 1190 8510 531 8302 1464
385 1464 -4983 7648 -5072 939 13505 -2980 9440 10083 -6544 7676 1992 -3720 7778
398 7778 -576 2179 116 -8387 -2781 -11925 -6844 -126 -10837 4007 781 -10979 6608 -3164
412 -3164 -4312 11744 -1279 6644 12653 -3116 5012 1333 -5356 2818 -1657 3387 2203 -4410
426 -4410 831 -7390 -744 4312 -8718 9510 7017 -8732 13009 1084 -10553 9634 -4477
439 -4477 -4017 13677 -1846 -6800 843 -2141 -7406 -2028 9867 -5054 -4998 11527 -11942 -4356
453 -4356 12393 -22219 -6345 13302 -18528 -3854 6815 -20713 -10608 1283 -7658 38 12186
466 12186 -509 -9606 17595 11808 -10558 23278 15832 -13243 23979 15762 -11148 16285 -543
479 -543 -17936 12574 8959 -7830 -2055 -303 -10486 -9832 5793 -1033 -7312 1790 -11482 -1030
493 -1030 11435 -16932 -5505 4166 -16687 8811 10759 -12278 6712 -2225 -16412 14480 17843
506 17843 -3673 382 9485 -1725 -677 15421 -4162 -9284 11512 -12466 -1807 27635 -20021
519 -20021 -20279 16957 -11834 558 28126 -8097 -8483 15200 -3476 -2490 24838 4359 -24095
532 -24095 8923 15037 -16481 5791 -1941 -32657 5481 977 -19001 20155 -8992 -40268 10499
545 10499 5664 -17514 14875 2467 -29257 7362 22354 -21350 1411 28888 -33011 -11026
557 -11026 55730 -3805 -18988 30357 -9730 -12533 37244 12063 -7462 9306 -2763 -10461
569 -10461 10742 13456 -12790 -17098 -3412 -927 5086 -6245 -13954 1112 -18341 -9138 33978
582 33978 -545 -18688 11347 -11053 -3073 30181 -3523 -13654 11913 -4943 -9641 20160
594 20160 6166 -25021 -1582 6905 -8857 24932 9647 -37035 11053 15272 -26761 26321
606 26321 26856 -37318 -4286 21974 -10465 4967 16553 -20524 -13190 25071 4625 -7534 16886
619 16886 -11723 -21424 19028 6937 1960 8186 -31852 -9549 20951 -21941 -7289 18106 -31137
632 -31137 -22773 26632 -1249 -21511 14507 -4741 -29258 32245 30184 -29745 10302 21207
644 21207 -29185 11269 34958 -9831 -5342 4323 -5159 8161 8769 -4693 -5925 -3311 -91 8159
658 8159 9701 -6953 -8735 -3625 -11598 13123 17929 -23497 -7315 9143 -17866 5561 15234
671 15234 -16006 -2787 5097 -4817 14775 11690 -15250 -5464 12637 -896 2685 19358 -12834
684 -12834 -18280 16556 -9003 -9355 27448 -14655 -24537 25028 2073 -14058 16920 1253 -15456
697 -15456 11064 15643 -2810 4904 4016 -18279 2605 17184 -10176 1091 4342 -20795 4167
710 4167 8530 -15495 5840 1031 -19707 8296 13294 -12112 -6722 3243 -9171 -5149 14240
723 14240 -1601 -12735 6485 -5972 -8121 16660 -1008 -6973 11329 -886 2607 11395 -4245
736 -4245 687 4861 -3464 4350 7600 -2592 -8323 -1440 -1313 -7018 5886 2090 -11085 6110
750 6110 579 -9538 11360 437 -9495 10161 1867 -2619 7948 -3273 -6978 1796 1283 -2023
764 -2023 2230 4692 -6761 -2199 8007 -5909 903 9620 -6785 4506 8856 -9156 2666
777 2666 3587 -9412 2989 4250 -4869 108 2027 -3484 -4786 4338 828 -5244 10018 3396 -8355
792 -8355 7572 -231 -8150 6664 -600 -3925 2876 -4003 -2793 -1786 -4364 -549 -2306 153 1734
807 1734 -24 2683 -3172 -856 3445 -4468 5133 6039 -7189 1977 391 -7201 2826 210 -2921
822 -2921 1177 -1284 2536 632 -1395 1869 -2418 1862 5059 853 3353 -3570 -4508 2760 -4720
837 -4720 520 4791 -7565 -638 3147 -3669 1511 448 -584 1738 1867 7268 1324 -2098 3181
852 3181 -3244 -8 6201 -907 1496 -1201 -3883 3088 -2205 -52 4264 -3899 1744 4694 -1351
867 -1351 1261 -2300 -2634 205 -1510 4115 -1048 -6575 118 -4921 -2922 4059 -2214 400 951 -1068
883 -1068 5166 -250 -161 3935 -2545 3551 5702 -1017 1027 -3257 -3407 378 -2418 2570 -329 -5170
899 -5170 2047 -2098 -2419 3055 -3158 168 1868 -1252 3780 -1767 -3752 829 -4351 115 3372
914 3372 -2188 229 -2265 -1818 1107 -1943 3633 1535 -2387 5612 -263 -2124 4021 -4137 -1835
929 -1835 3450 -1721 1217 7 -2414 -181 -1798 2940 2958 749 5829 263 1369 6387 -2361 2334
945 2334 4874 -2944 3659 1654 -4193 225 -3973 -3670 -470 -1749 236 -2902 -2080 386 -5369 193
961 193 1516 -3275 3448 -272 -2144 3576 -3443 -1455 2703 -2137 3007 2468 -802 3837 -338 -734
977 -734 3169 1542 3202 924 1525 2207 -4020 444 -939 -5219 3113 -2814 -5567 4792 -5082 -6136
993 -6136 3814 -3095 -1453 4811 152 -508 2266 692 -3761 1012 5617 -6172 -410 7297 -8922
1008 -8922 -2388 5504 -9649 -367 6117 -6411 1900 6074 -4818 -2408 5059 1437 -3072 5362
1022 5362 4661 -4928 4537 2651 -6532 6985 2378 -6012 9000 3269 -4343 4672 -97 -1544 3284
1037 3284 -126 -323 1097 -1190 -4995 -3066 1505 -5817 -4215 2971 -4933 -706 1790 -6921 2707
1052 2707 2711 -5141 6765 5057 -2269 3724 451 -493 4205 293 -1217 2442 2245 -4144 -1115 4790
1068 4790 -5941 -3197 6909 -4783 1211 7084 -11112 -11 8042 -10315 178 9141 -7816
1081 -7816 -4657 5960 -3736 -5266 5958 -2385 -8520 11512 2891 -12597 10236 3564 -15373
1094 -15373 8592 7154 -10221 4886 1524 -10583 2828 3745 -7801 -1194 6190 -3778 -2790 9014
1108 9014 -956 -3785 6562 -1666 3537 11345 -5126 196 7093 -6885 1243 6914 -4381 -574
1122 -574 1325 -4169 302 3455 -4552 -6049 4622 1069 -4948 5922 -469 -8385 3317 -2045
1136 -2045 -2079 8320 -5824 -5228 6916 -3415 -1830 6138 -2569 -1410 5249 1120 370 6324 -693
1151 -693 -8605 6294 5416 -7516 5665 1485 -12610 4841 1065 -9478 8290 -687 -12364
1164 -12364 8009 5239 -8881 2365 4846 -8310 1121 11537 -6591 -3722 9790 -11227 -6335
1177 -6335 15968 -6593 -8990 10708 -4543 -6467 8467 -1078 -4976 3737 717 -2231 4938 2842
1191 2842 -6882 -201 3197 -4231 4375 2763 -6460 4139 -350 -5723 8885 1108 -6238 6097
1205 6097 2231 -1647 4189 -69 -3446 511 1667 -1210 1612 2147 -6927 -1842 3616 -5013 2780
1220 2780 3787 -7721 4790 4659 -7863 5399 4407 -8002 3216 6029 -3540 -356 3072 -4167
1234 -4167 -3662 5788 -1603 -3910 7430 -2683 -5624 7890 -2552 -3877 7467 -3766 -2152 6705
1248 6705 -4762 -3774 3875 -3862 -4854 3720 1171 -5948 1622 2377 -7070 2742 4911 -6756 4669
1263 4669 5546 -6897 3745 2848 -5891 3049 2180 -3076 2091 1008 -3121 -421 2691 -2658 -2578 5603
1279 5603 -1197 -2606 6468 -3171 -4382 5056 -2760 -857 4151 -3559 -1409 529 -2138 1123 -323
1294 -323 -1188 1496 1323 1252 1080 2456 -499 -2296 5708 1340 -2397 5820 -2490 -5776 5019 -1471
1310 -1471 -3195 4082 -2170 -2699 2270 996 -940 -137 533 -1355 1752 4973 -2051 -865 1546 -5895
1326 -5895 1720 5347 -4614 206 809 -5142 1546 2414 -2463 -1647 -895 748 260 1321 319 -5181
1342 -5181 -1797 413 -478 3230 -1416 -3498 1285 -2844 1567 5575 -3220 63 3970 -436 2998
1357 2998 3941 -442 -2344 -114 3764 256 103 1138 -6544 -3237 2404 -1755 245 -1341 -4332
1372 -4332 472 -609 647 2337 -3979 -1637 2359 1090 2689 641 -1727 -2427 -583 5376 1642
1387 1642 -801 2841 -2579 -477 5788 558 335 364 -1748 2709 1447 618 190 -4746 -1579 1885
1403 1885 774 1324 -1610 -2022 -1280 -1025 5081 1614 -2735 2495 -697 -555 4803 -524 -2779 -1422
1419 -1422 -1642 1580 30 -1252 -2244 -5794 -1302 1437 -516 739 -2474 -2083 891 -416 3199 907
1435 907 -3508 2260 1864 750 3849 -654 -1904 1 1100 4096 1236 -86 608 -3019 920 2873
1451 2873 -838 -80 -2090 -1663 503 -1989 -201 -2356 -5950 453 605 -1585 2035 -1631 -2899 753
1467 753 2022 3127 1078 1024 1631 -872 3165 2507 -1763 1346 -1048 -823 3683 -710 -1171 -61 -3624
1484 -3624 887 2686 -119 724 -366 -631 -173 1109 2724 -2119 -688 2829 -2033 1073 2570 -3989
1500 -3989 -193 1285 -1224 2120 1001 -1204 -1221 -1645 982 -274 -1251 256 -2695 -1164 -125 -2357
1516 -2357 278 -1742 -2347 1959 -439 913 1963 -1979 1483 2229 423 3757 1473 55 1502
1531 1502 -239 587 793 -775 -628 -1255 825 -841 -2930 1408 -2536 -3505 3397 -1310 -1738 3004
1547 3004 -3204 -2292 2625 -1414 -1359 1815 667 -1751 372 2544 -2192 164 3560 -2047 2415 4753
1563 4753 -3479 1484 3238 -3929 1374 2809 -2247 410 953 -2061 -1119 1446 -836 -2500 3380
1578 3380 1338 -3379 3825 1252 -3850 3537 838 -1911 3726 -147 -1876 1243 -912 -1787 -790
1593 -790 226 -541 -1965 278 -753 -1667 230 -1651 272 1733 -2020 1393 665 -2623 1783 -1264
1609 -1264 -1555 3813 -1176 -1620 3284 -630 -1613 1746 866 -564 1170 1972 -1833 445 2581 -4758
1625 -4758 -233 4026 -4985 -590 3360 -5462 -661 2092 -4222 559 3064 -2579 -606 3872 -963
1640 -963 -2684 3658 812 -3726 4587 919 -4510 4607 -663 -5217 5263 655 -4457 3983 1625
1655 1625 -3214 1526 2026 -2073 586 3217 -2229 -646 4198 -3713 -2533 4260 -2741 -1341 3749
1670 3749 -1939 -300 1470 -1939 899 1303 -398 971 766 824 159 -861 -140 -361 516 -1026 -554
1687 -554 2282 -2893 -1846 3156 -3075 -325 3866 -2987 244 3636 -3429 -455 3050 -2240 -1604
1702 -1604 2553 -108 -3063 1368 -79 -4073 2905 1039 -4263 4347 1131 -5139 3999 1135 -4315
1717 -4315 2932 1013 -3241 1935 1158 -3754 -236 2364 -3183 -868 4553 -2440 -1606 4618 -2581
1732 -2581 -1021 4778 -2587 145 4796 -2309 -789 2941 -1552 -1273 1844 49 -1551 1362 669
1747 669 -2788 1599 890 -3456 2536 1405 -2895 2173 -106 -2520 1632 -868 -983 1888 -925 -806
1763 -806 751 -200 -394 708 977 -356 1398 2467 -1536 1477 1911 -3524 1741 2214 -3233 1430
1779 1430 110 -3909 781 94 -2614 783 189 -1926 413 1486 -1467 -1372 1943 -1607 -496 4469
1795 4469 -2317 -2012 3551 -3541 -1471 4704 -2158 -1868 2807 -1066 -1565 2066 352 -2511 832 2003
1811 2003 -1985 853 2113 -4099 -248 1862 -2224 1872 1259 -2608 1211 472 -120 2114 134 -373
1827 -373 1090 1186 963 334 124 -1644 -813 1882 -1050 -743 990 -3917 -1324 2183 -2098 343 1156
1844 1156 -2664 609 2019 -203 357 378 -442 91 2433 1959 -1288 582 -37 -1547 3375 1548 -1509
1861 -1509 1565 -920 -923 2738 -429 -1127 -173 -1872 -131 890 -541 -1866 -2379 -749 -678 1127 1748
1878 1748 -2586 -979 722 -1238 2814 2121 -2816 720 1017 -609 2145 159 -2469 -1604 327 989
1894 989 -12 407 -1542 -3432 1061 1246 -229 1710 -1259 -1479 1962 647 1152 740 -2129 307
1910 307 1418 1094 1604 -589 -1742 -863 1050 2234 108 -161 -835 -2676 1381 1642 -1618 -163 -1823
1927 -1823 -2227 1679 412 -819 -1293 -2386 197 1704 1651 1208 -1161 -290 1033 1792 3356 86 -498
1944 -498 834 -801 2097 2292 -2315 -904 -513 -926 1699 711 -1315 -2149 -1821 638 745 888 121
1961 121 -2707 -603 847 72 1651 -1295 -2336 625 187 1172 1523 -2133 -1347 441 638 2120 437
1978 437 -922 -1658 -984 1917 327 -828 -72 -2367 -387 1636 -481 -89 -1104 -1503 1810 1349 1462
1995 1462 1130 -1722 72 1373 1068 1936 -64 -937 -417 -354 1353 -295 -1542 -586 -1748 196 1806
2012 1806 -1280 -672 -1127 -1873 1812 1053 -88 115 -1398 -376 1305 1126 489 -926 577 571 114 2524
2030 2524 -71 -1859 1588 25 418 2931 -787 -1576 171 -699 179 303 -428 -1389 -1660 796 -297
2047 -297 -613 599 -1887 -447 2037 -257 894 716 -1803 119 873 232 1008 -786 -932 -607 -259
2064 -259 825 -962 -803 190 -1236 746 830 -1143 -229 -858 -59 1251 -278 604 -293 -1464 1077
2081 1077 255 -469 1346 -524 -539 1210 694 256 -319 131 45 -481 1830 67 -1609 979 -1665 -1502
2099 -1502 2050 -1176 -1432 1083 -1179 -534 1168 36 -579 718 1050 -386 1013 2150 -1763 -162
2115 -162 2315 -1529 555 2235 -2202 -144 1462 -1607 251 967 -657 -415 634 536 -1085 240
2131 240 590 -1573 608 953 -1722 1084 -99 -2042 1021 -127 -549 755 -347 164 145 -418 600
2148 600 -259 74 284 -524 479 -216 -1000 -26 -1057 -21 -175 -1065 1189 -531 -1366 1682 -742 -664
2166 -664 1919 -663 -236 1569 -583 -792 597 150 -979 309 1393 -1661 -430 1526 -2174 62
2182 62 2294 -2241 616 2286 -1988 86 1468 -1392 -512 1164 -311 -869 1165 121 -1696 1290
2198 1290 922 -2096 2046 1081 -1930 1962 525 -1529 1560 236 -846 1029 257 -799 -61 431
2214 431 -740 -815 1349 -341 -698 1630 -1024 -382 1501 -1223 97 1357 -1062 315 98 -892 183
2231 183 -470 -248 347 -331 69 -207 -34 178 -328 636 23 -178 1309 -1037 -396 1520 -2082 -285
2249 -285 1595 -1710 -11 1019 -1629 -223 652 -660 -568 1066 350 -1296 1244 749 -2202 1272
2265 1272 851 -2229 1748 695 -2156 1314 275 -1703 942 752 -700 310 1043 -425 -616 1640
2281 1640 -573 -940 1805 -914 -881 1843 -1550 -930 1617 -1184 -79 1492 -577 -67 625 38 -140
2298 -140 620 773 -505 462 1104 -1386 262 376 -1811 777 1 -1004 1173 -743 -878 830 -768
2315 -768 348 861 -526 324 583 48 -122 59 306 -846 434 1195 -1555 178 748 -1975 1041
2332 1041 1003 -1629 912 354 -1478 680 227 -1092 -393 52 -550 -684 832 -531 -1678 1093 -186
2349 -186 -843 2022 -394 -933 1524 -601 401 1435 -589 52 423 -16 158 -2 -281 -814 -78 780
2367 780 -882 642 321 -2069 832 865 -1223 1419 158 -1295 1292 506 -405 210 -118 -164 -83 908
2385 908 624 -917 378 -150 -403 1514 -124 -446 500 -1234 319 935 -1346 112 -252 -1184 863
2402 863 499 -382 -260 -398 399 223 1266 743 -1067 579 314 -774 1834 -67 -1307 808 -680
2419 -680 -317 936 -1138 -1106 -219 -251 168 228 -125 -1204 -1056 1113 -109 243 846 -1488 -277 1186
2437 1186 -676 875 30 -1479 634 629 715 718 -634 -497 96 661 1066 -218 100 -530 -915 1297 -11
2456 -11 -802 672 -1294 -420 1657 -469 -40 -16 -804 601 1059 947 253 -843 111 135 598 1253 -737
2475 -737 -383 20 -766 1241 31 -1527 187 -640 63 1626 -347 -694 -346 -662 646 490 227 -414
2493 -414 -1179 427 189 245 1095 -1084 -484 971 -116 1011 618 -1585 144 155 101 893 -451 -1079
2511 -1079 -1005 -346 415 -513 -171 -510 -1421 857 729 -861 590 -818 -835 1428 489 402 130 -983 28
2530 28 241 412 595 -792 -166 -336 -338 1153 -508 -685 277 -754 925 1141 -908 59 -482 -202 1149
2549 1149 23 60 -66 -801 495 470 41 406 -433 43 700 317 849 -762 -581 474 -635 917
2567 917 472 -1571 -56 -99 -933 1152 -27 -652 -20 92 420 283 441 -74 -895 1090 741 -435
2585 -435 1162 -325 -1394 1103 124 -134 759 -754 -430 225 159 -2 -367 116 -463 -620 1144 -514
2603 -514 -812 558 -922 -164 1173 -719 -102 -43 -691 443 217 385 182 -530 609 159 -207 638
2621 638 -729 -443 640 -268 521 -12 -868 -116 -434 245 594 -707 634 219 -565 1081 -154 -427
2639 -427 896 -108 28 615 111 -186 -558 474 -129 -614 1374 -173 -1060 1428 -305 -581 1529
2656 1529 -517 -594 924 -159 -111 154 19 -541 -475 1094 -696 -570 1127 -1076 -166 1360 -996 201
2674 201 1229 -972 314 715 -537 -85 118 86 -369 219 518 -1039 -58 736 -1321 520 548 -924
2692 -924 508 142 -496 378 -330 159 49 -402 674 -631 -461 407 -792 13 411 -443 241 58 -107
2711 -107 327 -389 618 -94 -407 1166 -521 -859 1079 -981 -502 969 -543 -522 649 -59 -401 51
2729 51 656 -659 -87 1339 -841 136 1361 -1302 -138 1275 -1115 307 1015 -727 54 527 -227
2746 -227 -67 527 625 -597 758 751 -1342 585 636 -1600 880 680 -1209 698 107 -865 341 180
2764 180 -145 -55 377 373 -593 532 161 -863 883 115 -548 644 -753 -564 151 -875 188 -114 -619
2783 -619 422 -412 -342 476 -421 -11 277 -243 262 -12 113 -98 -337 512 -351 -324 1277 -862 -310 1064
2803 1064 -1123 105 1015 -758 231 516 -456 -153 122 -122 -742 321 623 -981 428 523 -1443 847
2821 847 701 -1043 1170 611 -585 919 148 -409 376 418 -156 -20 373 -80 -815 915 -448 -969
2839 -969 1086 -465 -514 1154 -650 -144 711 -381 130 330 -90 143 -141 1 -6 -176 313 -354 180
2858 180 668 -641 473 196 -931 812 -270 -489 832 -633 -441 209 -629 -4 -28 -424 148 -216
2876 -216 206 -112 -322 529 -329 236 822 -864 383 593 -1255 690 267 -1114 456 23 -671 235
2894 235 -186 -374 -307 214 147 -412 597 13 -941 883 -325 -568 1274 -494 -273 852 -565 -74
2912 -74 542 -313 169 230 390 270 -195 450 -438 -187 802 -579 210 355 -964 278 200 -730 508 -313
2932 -313 -488 704 -126 -125 306 -107 176 184 442 215 -604 542 -346 -310 810 -571 -360 631 -964 231
2952 231 292 -794 187 28 -302 565 -68 -139 -357 -302 211 -462 602 254 -922 502 41 -759 879
2971 879 -378 -626 779 -83 131 330 -629 -270 62 5 135 -327 142 -490 -462 388 -692 -157 605 -821
2991 -821 387 751 -763 695 214 -486 744 327 236 -10 -286 93 -105 282 473 -540 313 41 -435
3010 -435 851 -243 -323 654 -400 337 787 -419 180 -131 -396 418 118 76 -106 -376 549 -163 209
3029 209 559 -531 455 304 -188 706 -350 -621 576 -437 -129 632 -704 -537 -145 -18 15 -119 283
3048 283 -376 -259 738 -412 -212 694 -778 -49 696 -538 336 -50 -836 358 -119 -129 409 -313 -155
3067 -155 -168 360 447 -460 351 133 -674 978 -104 -897 488 -490 -346 648 -284 -163 -244 -99 470 -153
3087 -153 271 309 -618 344 215 -83 432 -568 -126 470 -248 627 38 -445 446 -231 88 638 -498 233
3107 233 179 -245 478 64 -293 21 -283 257 -147 103 391 -775 176 697 -610 706 496 -1021 612
3126 612 379 -544 476 -128 -155 -66 162 29 -704 84 -55 -901 519 174 -838 683 -348 -637 608
3145 608 -290 -148 398 63 45 -91 257 -147 -551 586 -110 -519 993 -324 -465 463 -510 19 543
3164 543 -264 146 -231 -214 27 -626 221 92 -539 624 -157 -391 433 -328 233 319 68 500 -55 153
3184 153 415 -356 505 273 -547 733 -120 -612 653 -435 -402 433 -13 -214 -84 308 96 -435 735
3203 735 -51 -622 1042 -121 -274 1057 -514 -536 677 -219 -112 461 153 -316 -307 553 -339 -658 861
3222 861 -531 -468 1176 -641 -422 439 -616 -196 483 -383 -58 -205 221 -152 -111 590 -293 -54 886
3241 886 -483 -39 414 -833 -9 92 -321 224 -374 -213 -165 -530 256 -74 -538 533 -446 -112 546
3260 546 -408 232 306 -63 456 -53 254 20 -585 699 -93 -148 982 -644 -297 891 -350 -25 458
3279 458 -331 -212 69 53 35 -290 306 -832 -182 1135 -476 181 980 -977 144 839 -352 164 413
3298 413 -103 -33 232 181 -518 -333 538 -776 167 558 -1029 -3 251 -952 477 108 -547 262 -359
3317 -359 -34 60 -51 144 -286 27 448 -279 218 -26 -730 528 102 48 477 -620 96 181 -263 414
3337 414 -225 -407 234 -665 133 155 -710 15 -52 -43 308 -128 254 -127 -179 849 -332 -75 877 -601 212
3358 212 750 -673 56 208 -506 62 8 -33 -165 39 282 -621 426 603 -696 609 500 -917 669
3377 669 388 -798 585 117 -222 365 51 -25 -210 209 429 -383 548 198 -812 454 -146 -578 486
3396 486 -549 -111 287 -662 152 21 -473 231 -267 -50 137 -344 227 -126 -59 339 -366 106 200 -627
3416 -627 612 -196 -603 625 -463 -85 361 -377 54 159 -396 100 23 178 44 -157 437 -270 -268 597
3436 597 -434 62 580 -736 475 264 -586 353 -71 -371 533 -278 197 141 -35 165 -330 114 99 -518
3456 -518 588 -150 -468 788 -418 -283 730 -426 192 405 -350 364 103 -57 -5 -128 397 -176 -313
3475 -313 562 -341 -117 508 -736 186 99 -558 536 -115 -417 309 -295 81 390 -561 133 -53 -227 163
3495 163 -236 302 -96 -463 449 -355 32 617 -619 156 422 -756 539 81 -474 162 -239 25 103
3514 103 -326 107 -479 -117 373 -390 434 237 -616 692 -154 -428 710 -419 138 250 -434 148 213
3533 213 -323 118 -102 374 97 -103 508 -249 72 678 -571 247 497 -535 305 142 -486 229 -190
3552 -190 -16 328 -275 445 29 -195 355 -236 393 213 -591 541 -107 -256 500 -615 -127 354 -399
3571 -399 481 23 -392 397 -334 -79 397 -305 142 -140 -241 257 -297 204 54 -625 465 -98 -491 749
3591 749 -290 -221 479 -315 143 264 -353 220 -286 -52 66 -223 351 -257 -134 554 -698 142 453 -808
3611 -808 357 452 -622 452 -43 -290 209 -48 189 -79 -29 384 -358 131 336 -657 295 412 -415 588
3631 588 -116 -221 414 -225 144 56 -369 450 -185 -64 379 -444 286 -15 -311 772 -1 -250 476 -195
3651 -195 324 79 -82 550 -380 -3 467 -589 246 168 -682 228 108 -358 139 -112 -15 -163 -144 526 -422
3672 -422 -227 490 -734 352 375 -777 682 37 -420 329 -57 -538 50 58 328 -360 89 103 -639 477
3692 477 79 -740 842 -166 -582 674 -283 -329 187 -265 82 10 315 148 -384 488 199 -386 806
3711 806 -2 -427 624 -103 -8 366 -362 -46 -114 -18 228 -366 172 -50 -544 721 150 -459 539 -353
3731 -353 -83 715 -119 53 119 24 459 -329 477 197 -746 532 28 -437 607 -218 -527 330 -148 -36
3751 -36 -115 -234 -74 -429 283 146 -650 485 -171 -542 906 -203 -157 535 -553 133 197 25 102 -328
3771 -328 59 -24 -417 542 -360 -526 579 -505 -140 749 -838 -72 368 -372 126 19 -48 -192 -193 482
3791 482 -119 -30 702 -783 -15 796 -331 4 321 -537 377 195 201 -40 -468 330 -64 -347 601 -492
3811 -492 -437 408 -417 101 533 -480 91 -199 115 545 24 422 -161 -488 691 14 -288 778 -626
3830 -626 -97 409 -279 -108 -61 -266 -53 -115 571 -226 -490 562 -412 -133 984 -368 -203 449 -387 351
3850 351 127 -414 -102 -189 126 98 -59 279 -580 -14 505 -848 262 318 -860 331 189 -507 284 -225
3870 -225 -282 -108 -53 355 -248 -72 335 -324 419 370 -580 272 -210 -305 429 -53 119 120 -597 224 -167 -376
3892 -376 368 -603 -80 513 -336 68 -53 -254 105 -88 352 11 -432 461 -271 -160 793 -445 63 569
3912 569 -382 461 452 -393 201 -144 -175 261 -114 230 -294 -102 497 -310 283 321 -709 580 150 -390 531
3933 531 -170 -249 378 -162 175 121 -58 167 -306 51 241 -423 395 -213 -614 550 -364 -227 382 -518
3953 -518 64 150 -415 261 -156 -94 167 -219 151 -124 -298 268 -90 -41 400 -357 402 188 -101 535 -264
3974 -264 -247 162 -525 155 92 -477 422 -274 -337 191 -87 114 -138 80 210 -479 103 448 -673 277 504
3995 504 -475 550 70 -354 432 -51 142 102 16 80 -235 30 464 -466 257 53 -511 563 -138 2
4015 2 363 -547 105 202 -296 195 -122 -291 178 -309 135 28 -202 474 -343 -31 293 -533 47 -10 -628
4036 -628 480 -98 -277 472 -327 -118 174 -287 137 8 -229 288 -492 259 122 -262 476 -36 -208 222
4056 222 -437 114 187 -506 202 9 -139 438 -362 -163 267 -247 308 1 -106 338 -323 182 75 -506
4076 -506 557 -171 -440 508 -196 -127 562 -191 310 200 -58 405 -134 181 239 -351 377 106 -308 526
4096 526 -284 103 385 -283 84 61 -438 259 -199 -43 167 -276 39 56 -65 353 -440 8 277 -455 411
4117 411 77 -236 497 -139 -16 393 -327 343 58 -103 373 -235 -62 213 -501 37 -58 -431 263 -246
4137 -246 -226 130 -352 179 19 -211 447 -309 -32 318 -580 144 425 -285 377 -54 -135 335 -225 78 -61
4158 -61 95 435 -309 -93 431 -556 209 306 -231 357 -155 -284 61 -4 243 -216 -151 287 -422 173 450
4179 450 -551 362 410 -509 657 168 -92 368 -72 -56 -98 -333 118 -270 33 292 -523 85 287 -480
4199 -480 422 59 -392 350 -161 254 226 -158 393 -206 46 321 -409 240 60 -534 232 -134 -80 286 -257
4220 -257 -76 41 -182 84 -209 -184 147 -474 262 255 -715 328 -96 -423 554 5 -132 -49 -207 42 -114
4241 -114 69 324 -646 130 153 -657 396 65 -759 233 -5 -196 382 -121 -134 -223 319 375 -148 337 31
4262 31 -450 575 78 -302 637 -190 15 393 -35 24 133 118 179 -164 313 110 -608 301 -110 -157 415
4283 415 -292 -344 131 -118 153 278 -294 127 -207 213 168 -222 332 -126 -467 395 134 -327 357 -571 -39
4304 -39 169 -103 42 -456 17 160 -342 664 -278 -723 343 -317 -162 504 -49 -298 194 -84 166 -23
4324 -23 101 -116 -258 364 -167 -438 595 -341 -430 562 -109 -10 380 -332 -11 84 -69 11 -335 401 -89
4345 -89 -37 744 -299 -250 458 -301 188 429 -274 138 -214 -126 202 -50 126 -52 -411 417 -66 -127 291
4366 291 -487 -35 359 -277 37 -32 -49 270 -37 238 56 -275 365 -137 -162 533 -305 -212 45 -136 137
4387 137 152 -102 98 -465 267 35 -71 497 -424 -343 320 -463 -85 188 -570 46 200 -196 201 -66 44
4408 44 -75 4 243 -177 -126 284 -268 109 467 -589 298 11 -431 359 82 37 205 -262 100 -178 -195
4429 -195 150 -550 156 452 -130 439 31 -390 301 -184 267 211 -254 287 -75 -111 442 -179 -95 411 -279
4450 -279 275 92 -84 144 -137 47 196 -104 56 -202 -411 360 -163 65 510 -359 206 143 -297 392
4470 392 -28 -139 93 -215 8 -79 -181 237 -402 142 268 -573 280 275 -501 261 -186 -478 304 -400 12
4491 12 302 -150 198 -256 47 132 -124 327 -51 -252 384 -102 -158 405 -245 56 92 -291 419 -28 -380
4512 -380 279 -284 -34 177 -160 256 18 85 286 -432 251 -62 -293 368 -293 -50 412 -398 -120 407
4532 407 -184 234 114 -191 352 -54 186 103 -134 370 -107 44 299 -438 160 106 -427 437 -81 -193 253
4553 253 -347 -145 352 -38 185 3 -133 348 -19 89 44 -382 478 -225 -152 346 -418 -144 305 -336 77
4574 77 -88 -175 83 -241 127 193 -378 146 -167 -158 505 -277 -54 122 -297 199 -116 -123 300 -218 -2 197
4596 197 -287 52 -58 -285 210 -268 -56 173 -424 213 -359 -144 285 -118 70 115 -269 391 106 -250
4616 -250 422 -187 100 389 -46 208 -265 -269 183 -168 -44 248 -318 376 81 -265 413 -222 -41 333 -441
4637 -441 17 200 -328 111 -73 -34 305 -97 153 151 -108 396 -272 -125 359 -349 158 150 -244 250 -73 -40
4659 -40 88 -183 251 -116 -453 384 -312 -137 507 -325 45 19 -215 234 -124 -91 133 -77 302 -48 -160
4680 -160 61 -310 -156 234 -326 91 77 -488 191 -75 -236 114 -217 82 -1 -439 438 -234 -59 429 -305
4701 -305 126 311 -298 202 -49 -61 267 13 257 18 -227 508 -74 -32 475 -375 93 286 -433 258 71
4722 71 -7 241 -147 -35 90 -164 385 -328 165 183 -438 71 254 -391 125 77 -290 49 -163 -150 75 -46
4744 -46 67 -69 -45 114 -465 250 181 -438 248 -14 -456 365 -292 -140 306 -57 202 -217 163 251 -350
4765 -350 25 152 -368 211 -126 -307 237 -37 -111 102 -275 47 -232 -64 158 -377 128 297 -370 167
4785 167 -61 -300 409 -66 21 196 -83 203 -262 -36 426 -422 94 270 -385 351 -14 -416 490 -28
4805 -28 -174 159 -30 -71 60 -58 179 -261 250 258 -645 283 -65 -414 542 -152 -288 338 -210 -54 163
4826 163 -69 2 -361 148 55 -327 238 -19 -293 419 -43 -169 277 -287 -6 -43 -10 254 -180 68 221
4847 221 -357 234 -165 -184 293 -320 -183 364 -223 -126 21 -53 274 -150 5 266 -349 208 199 -357 515 -139
4869 -139 -488 357 -237 102 135 -120 226 28 70 321 -215 349 -141 -163 400 -271 -327 372 -217 0 372
4890 372 -206 205 -67 -150 112 -75 2 -159 -110 242 -289 72 360 -347 93 235 -334 324 143 -58 333
4911 333 6 207 31 -87 378 -52 -315 256 -389 18 79 -421 180 48 -102 47 -153 -25 7 -290 240
4932 240 -66 -261 349 -228 -236 222 -203 -177 50 -87 61 -98 142 -169 -355 316 -116 40 401 -281 -112
4953 -112 257 -446 212 162 -177 54 36 103 -117 -214 115 -156 -27 333 -382 154 262 -441 354 121 -228
4974 -228 317 4 -98 145 -290 91 71 -239 219 -206 -16 115 -276 205 -43 -25 306 -237 -6 119 -356
4995 -356 143 -124 -17 252 -55 174 302 -289 4 163 -318 114 -179 -16 271 -159 -63 -240 -239 268 -310
5016 -310 29 387 -633 201 -30 -442 128 -109 -240 -16 -73 101 -53 -218 226 -291 -9 174 -236 287
5036 287 254 -287 349 45 -94 261 -111 65 73 -380 185 -84 32 151 -173 246 -94 -210 340 -17 -224
5057 -224 371 -104 47 3 -348 141 -72 -123 293 -262 66 100 -233 21 -41 -8 50 -27 150 120 -97 142 -43
5080 -43 -30 393 -139 179 272 -248 382 64 -145 495 62 68 -41 -38 134 -211 -165 116 -192 215 146 -342 343
5103 343 -39 -289 117 -394 -96 127 -232 200 -83 -52 341 -107 36 150 -342 248 -118 -34 261 -285 -142
5124 -142 104 -358 286 199 -91 274 -246 -15 261 -441 -81 12 -281 356 -116 -87 133 -258 115 86 -91
5145 -91 301 -113 -104 90 -381 80 -230 -224 320 2 -39 313 -128 245 184 -153 208 20 -36 231 -153 175 -6
5168 -6 -376 256 -47 -31 299 -9 105 337 -103 265 -94 150 62 -252 153 174 -208 249 -104 -45 181 -309
5190 -309 -45 -129 -221 15 3 101 79 -156 -49 -80 -272 388 -120 -157 200 -226 -2 326 -193 -46 60 -16 160
5213 160 -213 124 -14 -116 247 -180 -181 317 -116 148 -1 -335 127 -12 -173 86 -125 124 -28 -211 230
5234 230 -173 -40 133 -339 228 218 -213 122 -91 -219 72 -20 -39 90 -95 159 8 14 316 -218 96 63
5256 63 -234 203 64 -47 226 201 -56 62 -419 312 -230 -120 254 -377 -59 -69 -427 199 40 -77 -133
5277 -133 77 -104 -37 -193 158 -183 -78 322 -308 207 278 -180 53 150 -330 260 91 -114 39 32 166 -182
5299 -182 96 224 -368 62 181 -420 241 14 -238 200 -66 -152 211 -148 75 115 39 75 -231 115 159 -393
5321 -393 67 -161 -229 258 -236 -23 164 -130 -27 29 -209 145 -131 84 14 -101 258 85 -315 390 -116
5342 -116 -85 164 -83 19 140 -8 248 -226 190 155 -385 362 -31 -319 115 96 -138 70 -4 -119 -39 135
5364 135 150 -74 91 43 -169 248 -53 -305 237 -95 -171 186 -152 -41 53 -132 38 -53 74 19 -191 249
5386 249 -50 -359 137 -138 -170 440 -229 -65 176 -265 123 -71 27 -138 -302 119 174 35 275 7 -230
5407 -230 230 -175 113 235 -48 308 -17 3 186 -137 196 106 -232 133 -62 -285 247 -62 -37 196 -115
5428 -115 169 -35 131 241 -31 158 -94 -275 277 -103 -48 538 -154 -87 330 -167 187 36 -114 333 -59
5449 -59 156 54 -210 156 -89 -44 214 -278 19 189 -292 -71 126 -46 187 -190 20 118 -146 129 -78
5470 -78 -236 132 -70 17 49 -224 -4 -131 -113 -97 -219 -71 155 -169 13 -54 -258 290 -41 -274 75 -326
5492 -326 31 135 -64 37 -15 42 144 -111 362 -3 -129 315 -89 152 341 -160 -13 193 -304 148 33
5513 33 -101 -90 -159 117 37 57 155 -32 7 60 -391 112 4 -33 30 -212 -108 190 -307 -47 105 -44 200
5536 200 -12 70 82 -152 -110 76 23 243 -35 90 293 -121 158 23 -378 119 -94 20 158 -118 -38 18
5558 18 -92 24 -124 -60 229 -97 -87 -85 -264 185 -137 -19 144 -218 -84 61 -348 -88 -78 -55 286 -107
5580 -107 -69 -153 -180 213 -157 6 298 -66 258 104 -205 116 82 -125 278 -36 -27 48 93 129 79 -103 217
5603 217 -86 -92 99 -177 165 -130 -61 87 -188 131 96 -274 90 -158 -310 343 -251 15 188 -196 247
5624 247 -89 -16 186 -25 46 116 -129 264 -11 -46 323 -115 219 223 -258 273 63 -170 145 -148 -85 248
5646 248 -45 100 -5 -86 136 -356 -49 81 -273 108 -84 -364 -78 -129 -145 74 -308 63 -15 -244 74
5667 74 -137 -39 49 -75 118 172 -309 341 -68 -52 301 -41 178 72 -9 176 58 -84 133 -86 82 68
5689 68 -169 280 -77 -117 154 -216 39 137 -230 102 -158 117 51 -44 179 -100 -95 274 -111 77 292 -108
5711 -108 75 -29 -24 93 23 -25 81 -236 290 117 -57 251 108 -64 100 40 -46 122 -46 158 93 -70
5733 -70 -3 -218 64 12 -49 104 -202 -194 41 -208 185 -42 -174 -139 -64 -136 45 -174 -77 133 -171 16 -104
5756 -104 -94 302 -186 180 143 -4 126 20 -92 120 -173 -37 69 -64 124 -187 -167 232 -272 42 129
5777 129 -175 149 -4 -205 69 -2 -28 83 118 241 -112 -135 245 -83 35 113 -89 40 -49 64 128 45 26
5800 26 24 -128 106 4 -38 150 -43 114 165 63 57 -76 -130 273 -30 263 220 -181 82 -75 -11 256 -118
5823 -118 -63 236 -102 176 134 -104 87 -116 -100 19 44 193 9 -43 233 -189 -64 242 -243 -125 168 -266
5845 -266 56 101 -263 -62 139 -34 -41 13 -59 -83 21 217 -178 71 -45 -189 209 64 -145 220 -47 55
5867 55 187 -157 71 -115 -40 -4 -86 230 -41 -173 263 -102 -20 156 -123 128 -67 -157 31 116 -84 141
5889 141 -89 102 125 -52 -3 -3 -97 15 -135 -77 -47 -164 271 4 251 166 -212 17 123 -380 179 -102 -147
5912 -147 66 -192 -29 207 -115 -11 -117 70 101 21 127 -90 -82 318 -185 -177 71 -20 -138 107 -10 186
5934 186 111 -49 4 -187 47 -93 -269 131 4 -206 86 -114 82 -7 -60 -1 -24 -93 154 -215 8 90 -275
5957 -275 225 153 -169 310 -182 -166 126 -12 191 -331 33 185 -114 254 152 -277 142 -17 -42 152 -8
5978 -8 -65 15 -58 -5 129 -78 80 22 32 163 -308 161 -169 -200 347 -138 -118 106 -75 40 -6 -56 142 101
6002 101 141 102 -112 38 167 -177 143 -115 28 209 -100 232 -27 -126 99 -78 34 186 -196 22 -13
6023 -13 -189 142 74 -107 169 -56 97 -17 -155 205 -215 -1 72 -129 75 36 -183 191 -80 -158 192 -98
6045 -98 20 93 -183 73 231 76 19 -63 96 93 -107 127 -167 2 128 -23 37 180 -267 362 32 -117
6067 -117 160 -106 126 186 -191 24 -14 -149 104 -201 3 32 -121 -21 -74 -75 127 -106 37 225 -143 -70
6089 -70 99 -12 122 94 -47 -56 -97 -3 -96 -69 180 -231 33 71 -175 35 -211 -138 143 -151 -146 121 -103 -208
6113 -208 -82 -180 -2 -14 19 -98 -10 125 41 -86 383 -138 -210 157 -141 205 82 -110 218 19 97 78 -15
6136 -15 71 37 55 333 -15 19 193 -179 147 -100 -195 152 -29 -92 121 -67 97 -9 -73 62 -210 148 56
6159 56 -63 192 -62 -45 133 -69 -175 180 -87 83 -65 -209 160 -252 9 156 -196 178 131 50 -1 -54
6181 -54 62 223 -75 -40 31 -220 218 -172 -132 311 -178 159 -61 -60 112 156 -44 82 -58 57 -17 -66 -21
6204 -21 -124 -123 -42 9 -102 -35 10 261 -89 -107 244 -96 31 318 -123 -164 -101 5 18 -252 61 18 -150 259
6228 259 33 61 270 -100 -15 106 129 166 83 -15 70 -128 51 141 -242 113 109 -42 154 -139 93 127 -255 145
6252 145 113 -40 123 -257 75 72 -66 251 104 -4 163 109 87 15 -11 -19 79 107 -32 83 -89 237 65 62
6276 62 63 -127 159 -4 146 -101 -52 -82 -3 -34 81 -83 156 44 -101 221 -91 -248 179 -311 -65 59
6298 59 -233 116 57 -44 43 -104 21 45 -51 168 131 -84 164 -6 -159 65 -34 43 131 -26 67 -27 31 -39
6322 -39 -76 195 117 -153 285 -13 -37 201 -46 30 43 39 -19 70 115 186 -45 167 -96 -131 174 -13 -152 57
6346 57 -108 128 41 -64 227 -9 -108 -50 -68 32 99 -109 208 -143 -47 109 -135 -107 119 -207 62 -115 -204
6369 -204 87 -211 170 48 -190 44 -77 -94 104 -194 -161 149 -135 -92 4 -113 152 -6 -3 -161 13 128
6391 128 -214 46 155 -164 30 38 -140 125 75 -21 96 0 -88 13 1 52 -174 146 36 -87 92 105 -166
6414 -166 85 -3 12 306 -42 -78 248 -77 127 -109 -27 259 -135 93 80 -18 87 114 86 204 84 -95 163
6437 163 -33 -119 -62 -59 85 -132 34 8 -106 -164 58 -107 119 -68 -33 82 -139 26 -67 79 280 82 5
6460 5 41 -226 -10 30 -164 28 -29 -108 130 -247 90 -93 -71 9 -160 18 98 -147 225 -184 -50 4 -61 -38
6484 -38 184 -24 121 -73 -116 -13 -84 97 156 -92 -36 87 -175 81 -25 0 41 -99 -54 43 14 4 -26 -132
6508 -132 84 -141 30 131 -5 151 77 -115 98 -108 29 -83 -55 21 -82 72 94 -25 179 123 -56 13
6530 13 -40 -5 165 -187 20 23 -123 -18 -85 -107 -33 35 -16 34 -97 125 12 -51 154 -29 127 182 -201 -25
6554 -25 -53 -104 -5 -73 -4 67 -140 -39 27 -58 24 -149 -55 322 -132 68 -207 -151 364 -102 6 99 -92 199
6578 199 40 -253 36 -105 16 48 73 190 -213 -38 112 -25 162 146 -152 167 -25 -182 303 -218 -125
6599 -125 211 -63 -5 84 3 190 -20 10 -6 -219 -48 -32 4 103 -165 -78 51 -235 92 4 -101 106 78 4
6623 4 77 -59 27 146 -87 64 -24 -73 70 -84 67 -25 -97 194 -32 -183 224 -156 40 119 -187 147 21
6646 21 -37 40 64 -34 65 -62 154 -72 75 153 -154 -97 -8 -200 -12 -65 -140 63 -65 -56 -54 -46 126 -105 -126 -70
6672 -70 -105 -2 208 -148 274 -9 128 263 -61 -56 123 -154 100 73 -63 178 -170 -40 24 11 1 -70 44
6695 44 104 10 119 -3 -138 109 -172 -82 -31 -120 71 101 -31 323 -201 -222 36 -151 -23 -19 67 -84 27 50
6719 50 98 17 14 10 -77 19 -7 -159 232 17 -74 53 -64 30 -15 -136 193 -209 73 -169 4 59 -88 -143 9
6744 9 -99 -68 35 1 36 -60 -21 47 84 -78 -35 -106 -15 -29 72 130 -196 -35 56 -175 387 124 -155 86 12
6769 12 -98 -64 -161 1 -190 -155 165 -56 64 76 -193 139 -105 -243 55 -105 -108 340 -150 197 160 12 120
6792 120 -4 -112 155 -99 131 83 -111 89 -69 -195 33 -288 116 -81 -74 30 5 -93 -19 -22 -215 197 147
6815 147 11 -173 -144 -10 60 -27 17 -169 35 -172 -163 166 -101 114 -79 -277 5 -52 -145 58 -132 140 185
6838 185 23 0 -129 -142 185 50 -12 212 27 12 -56 -111 85 -29 137 -57 74 168 -119 1 -110 -92 -12
6861 -12 111 -83 147 -87 -10 227 14 22 44 -65 63 -60 25 91 -139 -82 -3 25 116 -26 -6 183 -31 49
6885 49 99 -54 78 160 -134 40 25 -87 12 116 127 -31 -23 81 -13 87 51 -41 78 -6 -108 206 -46 76
6909 76 192 -266 0 -122 -170 48 -192 13 -40 -148 -88 -71 74 -82 -18 106 -77 -215 154 -19 -164 233
6931 233 1 -88 220 -25 -89 115 -35 258 29 -77 100 -91 11 -76 -56 179 -156 -121 108 20 112 76 -45
6954 -45 -37 -18 -22 -14 -37 10 -43 -25 199 -62 41 -67 -113 -18 107 -8 60 65 109 52 62 54 140 -182 136 161 -56 40
6982 40 -28 133 1 -61 115 -71 -50 92 -90 18 1 150 24 -183 -166 199 -47 -85 157 -152 104 19 -59
7005 -59 21 -188 -3 74 30 70 -34 -180 102 -157 -3 65 -6 -41 14 -85 -67 78 -75 -68 -249 -26 31 -93 50
7030 50 9 -41 56 -96 137 14 -100 83 39 8 -26 -217 74 33 66 73 -50 -64 -21 -75 29 52 -187 60 13
7055 13 8 23 43 19 58 8 -8 -62 125 177 -154 -36 -81 -73 119 39 -84 39 -183 -50 43 20 56 6 -15 -88 -200
7082 -200 110 120 -281 139 76 110 263 -70 157 -78 -153 179 -162 98 20 -81 116 59 -152 145 -151 -137
7104 -137 -6 71 75 279 -185 -22 -7 47 161 -222 128 11 -59 176 28 100 -7 -108 -47 35 54 174 99 -117
7128 -117 197 108 126 270 -77 83 79 0 125 -104 -37 65 70 0 -78 134 208 -211 -10 21 -131 -16 5 77 248
7153 248 -311 48 -80 -107 149 -32 -244 -69 -142 115 53 -40 289 91 -103 -123 -149 12 61 -173 85 -6 16
7176 16 166 -75 -117 72 -53 112 -130 -63 2 -25 -25 -31 -186 216 28 -157 150 -142 -8 141 -123 76 20
7199 20 -177 -84 -76 18 6 108 -143 -124 110 79 -105 21 -269 -14 198 26 64 225 -14 -173 114 32 0 57
7223 57 174 8 -51 80 90 -17 118 -14 50 130 -14 44 130 1 41 62 70 66 -13 128 154 140 65 -171 14 123
7249 123 -14 69 106 -18 110 -103 32 85 16 -9 180 -68 -35 -73 -173 56 -201 -146 -13 -125 -76 -147 -60 154
7273 154 -167 -38 20 -48 94 -48 -164 212 -14 23 121 1 110 15 -126 -126 90 2 23 -86 15 17 -81 163
7297 163 -85 -160 192 -231 -20 27 -103 129 -29 -93 -32 -11 79 -165 -29 67 -128 16 133 -161 17 -8 -167
7320 -167 94 24 -44 -96 161 -5 -150 2 138 33 56 67 -116 -39 78 -141 54 85 99 -77 -129 -142 -49 -154
7344 -154 -80 43 -96 67 -155 236 54 49 -113 -100 -41 103 -31 -176 103 -123 68 -216 -177 -45 -25 0 -30
7367 -30 -176 36 -2 -21 99 -24 -105 64 -75 68 -308 -252 91 -60 -60 128 -346 8 49 -168 -40 25 49
7390 49 -36 -80 125 -34 -59 157 -33 6 67 -118 145 247 -25 145 24 92 170 -29 22 96 68 26 -27 -59 -35
7415 -35 78 96 155 56 229 -81 83 76 -77 -68 -9 9 40 -96 -71 108 50 169 -3 -77 -3 -161 22 118 -109
7440 -109 -35 -91 -107 26 -52 97 21 -73 86 -81 -27 147 -60 -36 -53 96 118 120 -40 159 -177 21 167 -150
7464 -150 72 -128 -100 190 -67 -155 143 -110 18 -6 -8 73 1 163 42 105 -108 141 -102 90 -128 -97 52
7487 52 -24 -31 197 -58 93 119 -33 213 35 -17 171 -73 109 114 -167 175 -69 30 149 -112 171 95 -42
7510 -42 -28 -14 -100 29 77 45 67 -149 0 -70 -2 171 24 173 -1 112 140 -88 28 79 -84 82 90 -168
7534 -168 156 -116 -22 52 -230 65 65 -3 8 -146 -57 57 -103 -43 -58 -139 131 -138 -143 83 -126 31 -1 -96 157
7559 157 6 23 71 85 77 -16 121 95 -101 -73 24 70 15 -12 -55 194 -32 -124 108 156 41 114 -12 10 12 70 25
7586 25 -177 2 -65 -162 -67 45 43 7 113 204 161 67 -65 16 -66 -87 -3 32 -34 -34 167 -52 -229 45 -60 -11
7612 -11 52 29 229 -149 97 92 -43 59 47 -156 49 -29 -83 31 -33 22 57 -46 98 39 -6 95 -189 -2
7636 -2 130 -139 28 97 -66 183 -124 229 -24 -167 -4 100 -19 190 -136 -84 -118 -113 -134 -208 -127 49 -42 91
7660 91 59 -69 187 87 -21 136 -129 102 -33 31 -51 56 7 93 -3 -107 -21 -111 38 -60 -95 -13 3 100 153
7685 153 -96 40 30 -24 154 -57 103 -55 -59 70 -10 -122 40 -18 232 -11 -127 183 -39 -105 112 76 146
7708 146 79 19 -116 192 -54 37 -89 -57 84 105 212 -53 -21 123 2 -26 -37 -111 306 88 41 109 -195 -9
7732 -9 -47 -176 -4 -120 -147 156 142 34 22 -119 84 -15 70 -87 -67 -97 288 175 132 -34 -45 -36 63 -143 55
7757 55 -20 -36 -28 6 290 -115 156 -16 -102 118 -209 -268 166 52 -83 87 -71 -33 89 -141 -141 55 42 -200
7781 -200 -57 46 74 -154 97 -91 -166 221 -279 94 12 -49 78 -80 28 191 -110 69 -49 93 94 -199
7803 -199 48 51 -77 99 201 10 -37 17 -149 -2 146 -103 6 -109 198 -123 -113 -58 -158 -68 -17 49 64
7826 64 -21 -33 31 -95 -27 -160 0 30 -201 -61 47 -23 145 41 -194 117 55 100 -20 57 -81 86 -49
7849 -49 -82 112 -70 191 62 121 35 -56 91 89 -56 99 11 210 -75 230 38 -36 4 91 -25 0 69 -312
7873 -312 188 38 -98 103 6 107 23 -10 -7 -158 -117 29 -129 -7 151 -107 -53 60 -308 -103 78 23 16
7896 16 21 133 -139 -118 129 49 -111 252 7 59 127 -139 -108 -14 -115 6 -305 81 5 49 135 -14 16 73 6
7921 6 40 39 -139 153 127 91 -63 -83 207 -229 -34 2 -177 -30 51 -304 200 131 -241 104 -24 150 66 33
7945 33 89 -38 45 34 50 72 37 -199 -41 -138 -165 169 -98 -42 242 58 36 77 38 66 -27 -9 59 -47 105 -83
7971 -83 -133 131 -72 -87 101 -164 104 92 -112 74 -180 -50 -16 -112 -41 28 -3 -25 -70 -146 13 -261 -42 73
7995 73 -98 12 -146 8 -22 -37 106 95 120 124 52 -46 -63 -62 -54 1 -209 -57 -34 -26 7 -114 15 -24 -159 -94 -6
8022 -6 -132 -50 -24 -25 9 -137 -116 53 -45 163 37 82 -121 91 226 64 -44 161 -151 3 71 -65 -14 128
8046 128 34 17 45 106 13 -45 81 62 29 37 68 66 157 -106 -82 -167 -110 137 -71 53 199 -3 -77 52 -125 -13
8072 -13 9 -66 207 -134 30 172 96 96 49 60 -2 -95 86 51 112 84 -28 116 173 51 122 34 35 83 87 39 3 0
8100 0 132 59 -99 123 -203 -107 91 -134 273 -89 -31 94 130 -137 -115 171 -115 11 138 51 -89 -28 117
8123 117 -55 67 68 21 80 -69 27 110 -7 108 -2 30 -80 17 21 86 53 -164 70 -208 133 -61 -78 12 2
8148 2 -35 78 40 -67 97 -110 141 -132 20 69 -114 -14 30 93 -2 -183 23 -47 -105 134 -197 74 7 -209
8172 -209 42 -23 -130 64 -40 33 -35 -132 115 56 24 118 39 -126 42 -28 -33 -70 -150
8191a50
##END NTUPLES=NMR FID
##END=
