##TITLE=1H_48-2025Bay
 200.13MHz,CDCl3,
 8 sc
 
 23.4.2025
##JCAMPDX= 6.0         $$ Bruker NMR JCAMP-DX V2.0
##DATA TYPE= NMR FID
##DATA CLASS= NTUPLES
##ORIGIN= UXNMR, Bruker Analytische Messtechnik GmbH
##OWNER= pz
$$ XWIN-NMR		Version 3.5
$$ Wed Apr 23 13:50:11 2025 Russian Standard Time (UT+4h)  she@DPX200
##.OBSERVE FREQUENCY= 200.1313
##.OBSERVE NUCLEUS= ^1H
##.DELAY= (6, 6)
##.ACQUISITION MODE= SIMULTANEOUS
##.ACQUISITION SCHEME= undefined
##.AVERAGES= 8
##.DIGITISER RES= 18
##SPECTROMETER/DATA SYSTEM= spect
##.PULSE SEQUENCE= zg30
##.SOLVENT NAME= CDCl3
##.SHIFT REFERENCE= (INTERNAL, CDCl3, 0, 14.3821)
##AUDIT TRAIL= $$ (NUMBER, WHEN, WHO, WHERE, WHAT)
$$ ##TITLE= Audit trail, XWIN-NMR		Version 3.5
$$ ##JCAMPDX= 5.01
$$ ##ORIGIN= Bruker BioSpin GmbH
$$ ##OWNER= she
$$ F:/spectra/data/she/nmr/H-C/1/audita.txt
$$ ##AUDIT TRAIL=  $$ (NUMBER, WHEN, WHO, WHERE, WHAT)
(   1,<2025-04-23 13:48:34.67 +0400>,<she>,<DPX200>,
      <created by zg, POWCHK disabled, PULCHK disabled
       configuration hash MD5:
       00 E9 B6 7A A2 85 ED C7 34 08 36 98 17 FE 4E 26
       data hash MD5: 16K
       7C D0 25 28 54 E2 73 47 01 E5 15 32 4C CC 0F 2A>)
$$ ##END=
$$ 
$$ hash MD5
$$ 56 83 31 53 28 E3 CF E0 61 AD 2F 24 BC 22 BF A2
##$RELAX= 
##$RELAX= 
##$RELAX= 
##$RELAX= 
##$RELAX= 
##$RELAX= 
$$ Bruker specific parameters
$$ --------------------------
##$DU= <F:/spectra>
##$EXPNO= 1
##$NAME= <H-C>
##$PROCNO= 1
##$TYPE= <nmr>
##$USER= <she>
##$AMP= (0..31)
100 100 100 100 100 100 100 100 100 100 100 100 100 100 100 100 100 100 
100 100 100 100 100 100 100 100 100 100 100 100 100 100 
##$AQSEQ= 0
##$AQ_mod= 1
##$AUNM= <au_zg>
##$AUTOPOS= <>
##$BF1= 200.13
##$BF2= 200.13
##$BF3= 200.13
##$BF4= 200.13
##$BF5= 200.13
##$BF6= 200.13
##$BF7= 200.13
##$BF8= 200.13
##$BYTORDA= 1
##$CFDGTYP= 0
##$CFRGTYP= 5
##$CHEMSTR= <none>
##$CNST= (0..31)
1 1 145 1 1 1 1 1 1 1 1 1 1 1 1 1 1 1 1 1 1 1 1 1 1 1 1 1 1 1 1 1 
##$CPDPRG= <>
##$CPDPRG1= <>
##$CPDPRG2= <>
##$CPDPRG3= <>
##$CPDPRG4= <mlev>
##$CPDPRG5= <mlev>
##$CPDPRG6= <mlev>
##$CPDPRG7= <mlev>
##$CPDPRG8= <mlev>
##$CPDPRGB= <>
##$CPDPRGT= <>
##$D= (0..31)
0 0.7 0 0 0 0 0 0 0 0 0 0.03 0 0 0 0 0 0 0 0 0 0 0 0 0 0 0 0 0 0 0 0 
##$DATE= 1745401714
##$DBL= (0..7)
120 120 120 120 120 120 120 120 
##$DBP= (0..7)
150 150 150 150 150 150 150 150 
##$DBP07= 0
##$DBPNAM0= <>
##$DBPNAM1= <>
##$DBPNAM2= <>
##$DBPNAM3= <>
##$DBPNAM4= <>
##$DBPNAM5= <>
##$DBPNAM6= <>
##$DBPNAM7= <>
##$DBPOAL= (0..7)
0.5 0.5 0.5 0.5 0.5 0.5 0.5 0.5 
##$DBPOFFS= (0..7)
0 0 0 0 0 0 0 0 
##$DE= 6
##$DECBNUC= <off>
##$DECIM= 32
##$DECNUC= <off>
##$DECSTAT= 4
##$DIGMOD= 1
##$DIGTYP= 9
##$DL= (0..7)
0 120 120 120 120 120 120 120 
##$DP= (0..7)
150 150 150 150 150 150 150 150 
##$DP07= 0
##$DPNAME0= <>
##$DPNAME1= <>
##$DPNAME2= <>
##$DPNAME3= <>
##$DPNAME4= <>
##$DPNAME5= <>
##$DPNAME6= <>
##$DPNAME7= <>
##$DPOAL= (0..7)
0.5 0.5 0.5 0.5 0.5 0.5 0.5 0.5 
##$DPOFFS= (0..7)
0 0 0 0 0 0 0 0 
##$DQDMODE= 0
##$DR= 18
##$DS= 0
##$DSLIST= <SSSSSSSSSSSSSSS>
$$ [...]
##$SUBNAM0= <"">
##$SUBNAM1= <"">
##$SUBNAM2= <"">
##$SUBNAM3= <"">
##$SUBNAM4= <"">
##$SUBNAM5= <"">
##$SUBNAM6= <"">
##$SUBNAM7= <"">
##$SUBNAM8= <"">
##$SUBNAM9= <"">
##$SW= 18.0517328524113
##$SWIBOX= (0..15)
0 0 2 0 0 0 0 0 0 0 0 0 0 0 0 0 
##$SW_h= 3612.71676300578
##$TD= 16384
##$TD0= 1
##$TE= 0
##$TE2= 300
##$TE3= 300
##$TEG= 300
##$TL= (0..7)
0 120 120 120 120 120 120 120 
##$TP= (0..7)
150 150 150 150 150 150 150 150 
##$TP07= 0
##$TPNAME0= <>
##$TPNAME1= <>
##$TPNAME2= <>
##$TPNAME3= <>
##$TPNAME4= <>
##$TPNAME5= <>
##$TPNAME6= <>
##$TPNAME7= <>
##$TPOAL= (0..7)
0.5 0.5 0.5 0.5 0.5 0.5 0.5 0.5 
##$TPOFFS= (0..7)
0 0 0 0 0 0 0 0 
##$TUNHIN= 0
##$TUNHOUT= 0
##$TUNXOUT= 0
##$USERA1= <user>
##$USERA2= <user>
##$USERA3= <user>
##$USERA4= <user>
##$USERA5= <user>
##$V9= 5
##$VALIST= <valist>
##$VCLIST= <CCCCCCCCCCCCCCC>
##$VD= 0
##$VDLIST= <DDDDDDDDDDDDDDD>
##$VPLIST= <PPPPPPPPPPPPPPP>
##$VTLIST= <TTTTTTTTTTTTTTT>
##$WBST= 1024
##$WBSW= 4
##$XGAIN= (0..3)
0 0 0 0 
##$XL= 0
##$YL= 0
##$YMAX_a= 760355
##$YMIN_a= -773671
##$ZGOPTNS= <>
##$ZL1= 120
##$ZL2= 120
##$ZL3= 120
##$ZL4= 120
##$ABSF1= 10
##$ABSF2= 0
##$ABSG= 5
##$ABSL= 3
##$ALPHA= 0
##$AQORDER= 0
##$ASSFAC= 0
##$ASSFACI= 0
##$ASSFACX= 0
##$ASSWID= 0
##$AUNMP= <proc_1d>
##$AZFE= 0.1
##$AZFW= 0.1
##$BCFW= 1
##$BC_mod= 2
##$BYTORDP= 1
##$COROFFS= 0
##$CY= -3
##$DATMOD= 1
##$DC= 2
##$DFILT= <>
##$DTYPP= 0
##$F1P= 0
##$F2P= 0
##$FCOR= 0.5
##$FTSIZE= 0
##$FT_mod= 4
##$GAMMA= 1
##$GB= 0.15
##$INTBC= 1
##$INTSCL= 1
##$ISEN= 128
##$LB= 0.25
##$LEV0= 0
##$LPBIN= 0
##$MAXI= 10000
##$MC2= 0
##$MEAN= 0
##$ME_mod= 0
##$MI= 1.114404
##$NCOEF= 0
##$NC_proc= 0
##$NLEV= 6
##$NOISF1= 3.799351
##$NOISF2= 2.8
##$NSP= 1
##$NTH_PI= 0
##$NZP= 0
##$OFFSET= 14.38212
##$PC= 1
##$PHC0= -985.9114
##$PHC1= 4.792199
##$PH_mod= 1
##$PKNL= yes
##$PPARMOD= 0
##$PSCAL= 0
##$PSIGN= 0
##$REVERSE= no
##$SF= 200.129724274929
##$SI= 16384
##$SIGF1= 3
##$SIGF2= 2
##$SINO= 400
##$SIOLD= 16384
##$SREGLST= <1H.CDCl3>
##$SSB= 0
##$STSI= 0
##$STSR= 0
##$SW_p= 3205.1282051282
##$SYMM= 0
##$S_DEV= 0
##$TDeff= 0
##$TDoff= 0
##$TI= <>
##$TILT= no
##$TM1= 0
##$TM2= 0
##$TOPLEV= 0
##$USERP1= <user>
##$USERP2= <user>
##$USERP3= <user>
##$USERP4= <user>
##$USERP5= <user>
##$WDW= 1
##$XDIM= 8192
##$YMAX_p= 0
##$YMIN_p= 0
$$ End of Bruker specific parameters
$$ ---------------------------------
##NTUPLES= NMR FID
##VAR_NAME=  TIME,          FID/REAL,        FID/IMAG
##SYMBOL=    X,             R,               I
##VAR_TYPE=  INDEPENDENT,   DEPENDENT,       DEPENDENT
##VAR_FORM=  AFFN,          ASDF,            ASDF
##VAR_DIM=   8192,          8192,            8192
##UNITS=     SECONDS,       ARBITRARY UNITS, ARBITRARY UNITS
##FACTOR=    0.0002768,     1,               1
##FIRST=     0,             0,               0
##LAST=      2.2672688,     0,               0
##MIN=       0,             -773671,         0
##MAX=       2.2672688,     760355,          0
$$ Real data points
##PAGE= N=1
##DATA TABLE= (X++(R..R)), XYDATA
$$ [...]
$$ plain form
1222 2103 2011 2605 2564 -4352 -5480 2260 3877 1583 1237 -3550 -5073 2209 4696 671 -685 -1744
1238 -1744 -3871 -312 5508 2716 -3422 -2670 -747 -157 3749 2967 -3131 -2736 -336 -160 3405 3312 -3516
1255 -3516 -4162 1179 1937 725 1784 -464 -4348 -1251 4003 1819 -624 -509 -2915 -1189 3856 1662
1271 1662 -1484 -138 -1782 -2043 3068 3209 -1749 -2541 -47 67 493 2527 21 -3298 -619 1201
1287 1201 151 2077 493 -3677 -547 2524 -97 239 1185 -1902 -2142 1649 2141 -543 -881 -281
1303 -281 -1198 422 2382 -420 -1287 373 -1284 -157 2960 -199 -2461 537 551 -834 1158 1245 -1638
1320 -1638 -1343 1195 477 -555 1073 -272 -2191 981 1538 -1324 324 825 -1793 -56 1887 -375
1336 -375 -748 381 -254 -511 804 646 -917 -164 584 -778 171 1397 -1219 -815 1621 -636 -997
$$ packed form
1222B103r2N94m1o916j128P740J617k294l46m787j523P282K487m025j356j059
1238a744k127L559N820k792o138P52J923N90L906p82o098L95K400J76L565r3o828
1255c516o46N341P58j212J059k248l884L097N254k184k443J15k406J726N045k194
1271A662l146J346j644k61N111J41m958p92K494J14M26K034k506l319K679J820
1287A201j050J926j584m170L130L071k621L36R46l087k40L791M92k684l38O00
1303b81r17J620J960k802q67J660j657J127L117l159k262K998J4j385J992Q7k883
1320a638K95K538p18j032J628j345j919L172N57k862J648N01k618J737J943k262
1336c75l73J129o35k57J315j58j563P53P48j362R49J226k616M04K436k257l61
$$ plain form
1353 -997 1668 -141 -1559 974 797 -975 92 1073 -716 -764 1307 159 -1332 890 565 -1558
1369 -1558 667 968 -1381 218 949 -946 -151 901 -532 -396 633 31 -688 436 625 -919 75
1386 75 1073 -998 -298 1416 -875 -806 1390 -523 -945 1161 64 -1126 574 598 -813 -6 938 -554
1404 -554 -750 1296 81 -1334 1055 404 -1539 866 1060 -1422 7 888 -805 -176 954 -429
1420 -429 -809 561 479 -618 347 681 -1264 -170 1463 -590 -359 913 -1038 -559 1508 -36 -746
1437 -746 525 -424 -819 1029 900 -1007 -604 799 -405 -380 1877 -239 -2192 790 1020 -933 951
1454 951 519 -1996 -343 1341 182 -20 163 -1114 -961 1246 1281 -802 -404 -33 -1277 757 2208
1471 2208 -805 -1257 154 -728 554 2109 -433 -1856 -213 154 213 1531 578 -2341 -1421 1730 809
$$ packed form
1353i97K665j809j418K533j77j772J067R81j789m8K071j148j491K222l25k123
1369a558K225L01k349J599P31j895P95J052j433J36J029o02p19J124J89j544R94
1386G5R98k071P00J714k291O9K196j913m22K106j097j190J700K4j411Q07R44j492
1404e54j96K046j215j415K389o51j943K405J94k482J429Q81j693O29J130j383
1420d29l80J370q2j097R65L34j945J094J633k053K31J272j951M79K067j544p10
1437g46J271r49l95J848j29j907M03J403j204K5K257k116j953K982K30j953J884
1454I51m32k515J653J684j159k02J83j277J53K207L5k083L98L71j244K034J451
1471B208l013m52J411q82J282J555k542j423J643L67N9J318r53k919R20L151r21
$$ plain form
1488 809 -141 1043 -1316 -2537 1563 2243 -283 -237 -1025 -1846 1034 2449 160 -1201 -968 -1091 286
1505 286 2785 1062 -2674 -1593 541 74 1830 1791 -2465 -2410 817 1155 1571 1222 -2199 -2750 807
1522 807 2308 854 187 -993 -3026 -416 3724 1665 -1644 -1185 -1724 -568 3303 2040 -1740 -1831
1538 -1831 -1496 -49 3274 2430 -2238 -3115 -116 1082 1447 2512 -778 -4635 -938 3124 1665 875
1554 875 -770 -3870 -1176 3184 2309 179 -1191 -3025 -1579 3256 3748 -846 -2848 -1639 -689 1983
1570 1983 3913 -236 -3776 -1930 -6 2411 3795 -880 -4314 -1267 1124 1769 2926 401 -4476
1585 -4476 -3152 2761 3606 527 -594 -2671 -3353 2016 4535 502 -1857 -2520 -2684 1901 4949 741
1601 741 -3294 -2498 -720 1461 3833 1844 -3544 -3936 423 2528 2919 1275 -3579 -3800 1001 2613
$$ packed form
1488H09r50J184k359j221M100O80k526M6p88q21K880J415k289j361K33j23J377
1505B86K499j723l736J081K134m67J756l9m256N5L227L38M16l49l421n51L557
1522H07J501j454o67j180k033K610M140k059l309M59n39J156L871j263l780r1
1538a831L35J447L323q44m668q77K999J198L65J065l290l857L697M062j459p90
1554H75j645l100K694M360q75k130j370j834J446M835M92m594k002J209R50K672
1570A983J930m149l540J846J924K417J384m675l434L047K391O45J157k525m877
1585d476J324N913Q45l079j121k077o82N369K519m033k359o63j64M585L048m208
1601G41m035P96J778K181K372j989n388l92M359K105L91j644m854k21M801J612
$$ plain form
1617 2613 2401 1227 -3397 -4492 1261 4287 1742 -644 -2307 -3385 -31 4774 2766 -2290 -2811
1632 -2811 -2045 -119 4516 3199 -3028 -3558 -765 620 3288 3100 -2413 -4810 -720 2741 2706 1572
1648 1572 -1507 -4466 -1388 3722 2993 377 -1688 -3938 -1277 3981 3146 -396 -2166 -3260 -1049
1663 -1049 3696 3743 -1037 -3343 -2040 -240 2588 4056 -591 -4520 -1670 1243 2032 3147 -226 -4720
1679 -4720 -2011 2272 2315 1754 -101 -3828 -2956 2489 3911 338 -1703 -2118 -2354 1404 4423 846
1695 846 -2673 -2375 -1285 1840 3925 350 -3032 -2108 -441 1488 3377 1047 -3263 -3176 892 2403
1711 2403 1828 722 -2561 -3258 1082 2745 1241 577 -2204 -3579 1102 3920 829 -1357 -1295 -1721
1727 -1721 -465 3212 2622 -2064 -2842 -452 676 2276 1990 -1887 -2645 -113 793 1867 1988 -1661
$$ packed form
1617B613k12j174m624j095N753L026k545k386j663j078L354M805k008n056n21
1632b811P66J926M635j317o227n30K793J385K668j88n513k397M090L461l5j134
1648A572l079k959L078N110p29k616k065k250K661N258q35l542j770j094K211
1663a049M745M7m780k306J303J800K828J468m647l929K850K913P89J115l373m494
1679d720K709M283M3n61j855l727Q72N445J422l573k041m15k36L758L019l577
1695H46l519K98J090L125K085l575l382R24J667J929J889k330m310Q7M068J511
1711B403n75j106l283o97M340J663j504o64k781j375M681K818l091k186O2m26
1727a721J256L677n90m686p78K390J128J600k86l877p58K532R06J074J21l649
$$ plain form
1743 -1661 -3295 -179 2165 1542 333 -948 -2347 -787 2178 1872 -131 -1054 -2274 -736 2978 1686
1759 1686 -1402 -797 -876 -1170 1724 2777 -773 -2668 -661 779 922 1494 73 -2438 -1036 1198
1775 1198 869 1057 225 -2487 -1232 1882 1219 -43 -123 -1175 -1299 956 1916 247 -1116 -930 -643
1792 -643 728 1919 -126 -1482 -222 -386 -25 2022 486 -2057 -762 716 340 691 521 -970
1808 -970 -1199 475 1030 210 290 -581 -1514 610 1525 -468 -281 127 -1225 -213 1613 303 -947 -277
1826 -277 -96 -143 769 798 -771 -824 455 8 144 1028 -548 -1289 519 527 -252 462 -113 -979 -13 649
1846 649 78 -52 -60 -463 -255 769 342 -675 133 69 -810 611 847 -911 -325 623 -492 -167 847
1865 847 -178 -678 248 363 -326 104 518 -647 -356 816 -107 -435 626 -170 -613 615 144 -508
$$ packed form
1743a661j634L116K344o23j209j281j399J560K965l06k003r23j220J538L714j292
1759A686l088O05p9k94K894J053l550j895K007J440J43N72j421k511J402K234
1775A198l29J88q32k712J255L114o63j262q0j052j24K255R60j669j363J86K87
1792f43J371J191k045j356J260j64L61K047j536k543J295J478l76L51j70j491
1808i70k29J674N55q20Q0q71r33K124R15j993J87M08j352J012J826j310j250O70
1826b77J81m7R12K9j569n3J279m47J36Q84j576p41J808Qp79P14n75q66R66O62
1846F49n71j30qm03K08J024m27j017Q08o4q79J421K36j758N86R48j115L25J014
1865H47j025n00R26J15o89M30M14j165K91J172r23l28J061p96m43J228m71o52
$$ plain form
1883 -508 255 134 -427 185 342 -254 -228 275 -36 -376 493 159 -619 381 311 -673 300 530 -610 -49
1903 -49 535 -431 -289 532 -41 -432 215 253 -448 30 568 -416 -260 695 -282 -461 651 -107 -529 535
1923 535 101 -449 238 195 -334 15 333 -145 -275 321 -8 -452 409 152 -607 261 317 -489 287 315 -549
1944 -549 -27 483 -299 -223 327 -136 -357 346 467 -451 -84 410 -430 -71 846 -304 -515 433 -52 -227
1964 -227 598 110 -605 -20 284 -20 93 295 -376 -555 461 322 -283 216 -124 -647 487 589 -396
1983 -396 24 -24 -514 328 799 -130 -524 -91 -53 -42 634 443 -888 -451 501 6 246 574 -757 -710 524
2004 524 380 121 258 -465 -759 191 820 163 -261 -265 -565 -52 1070 403 -754 -359 -290 -142 1030 538
2024 538 -844 -547 -75 136 772 627 -648 -1051 92 645 330 363 -230 -1314 -173 1135 439 -43
$$ packed form
1883e08P63j21n61O12J57n96K6N03l11l40Q69l34p78J000p0r84R73K30j140N61
1903d9N84r66J42Q21n73l91O47L8p01M78N38r84J56R55r77j79J112p58m22J064
1923E35m34n50O87m3n29L49L18m78j30N96l29m44Q61k57p59Q68N6q06P76K8q64
1944e49N22N10p82P6N50m63k21P03J21r18L67M94q40L59R17j150k11R48m85j75
1964b27Q25m88p15N85L04l04J13K02o71j79J016j39o05M99l40n23J134J02r85
1983c96M20m8m90Q42M71r29l94M33L8J1O76j91j331M37R52m95K40L28j331M7J234
2004E24j44k59J37p23k94R50O29o57m24ml00N13J122o67j157L95O9J48J172m92
2024E38j382K97M72K11O36j45j275m03J143N53l15L3n93j084J141J308o96m82
$$ plain form
2042 -43 -317 -1103 -200 1167 638 -263 -521 -795 -192 1023 1046 -490 -1110 -259 80 590 1194 -262 -1472
2061 -1472 -324 508 715 898 -361 -1474 -445 774 806 429 -333 -1171 -791 981 1387 -10 -688 -830
2079 -830 -698 998 1437 -157 -931 -830 -530 969 1499 -144 -1368 -777 125 740 1150 252 -1492 -1208
2097 -1208 691 1154 703 99 -1374 -1330 703 1364 548 -251 -1219 -1184 716 1617 590 -876 -1148 -638
2115 -638 518 1620 739 -1143 -1209 -300 632 1472 604 -1366 -1275 42 798 1260 582 -1262 -1613 144
2133 144 1360 913 -50 -896 -1455 -92 1699 1047 -465 -940 -1200 -17 1760 950 -705 -1123 -829 165
2151 165 1463 1225 -701 -1618 -542 752 1144 915 -621 -1763 -520 942 1106 762 -670 -1761 -255
2168 -255 1238 1040 233 -729 -1363 -538 1292 1567 -196 -1230 -949 -217 1026 1471 -218 -1358 -802 -62
$$ packed form
2042d3k74p86R03J367n29r01k58k74O03J215K3j536o20Q51L39N10O04j456j210
2061a472J148Q32K07J83j259j113J029J219L2l77p62q38L80J772M06j397o78j42
2079h30J32J696M39j594p74J01L00J499N30j643j224N91R02O15M10q98j744K84
2097a208J899M63m51o04j473M4K033O61q16p99r68L5J900R01j027j466k72N10
2115f38J156J102q81j882o6R09R32Q40q68j970R1J317P56M62o78j844l51J757
2133A44J216m47r63q46n59J363J791o52j512m75k60J183J777q10j655m18K94R94
2151A65J298k38j926r17J076J294L92k29j536j142J243J462J64l44j432j091J506
2168b55J493j98q07r62o34Q25J830K75j763j034K81P32J243M45j689j140N56P40
$$ plain form
2186 -62 1080 1448 -229 -1608 -743 494 1028 847 -137 -1353 -1090 623 1330 588 -462 -1228 -921 846
2204 846 1324 327 -439 -1085 -933 764 1589 225 -1007 -976 -257 612 1226 524 -1032 -1195 -18 800 1110
2223 1110 336 -1294 -1043 302 785 715 239 -956 -1169 226 1242 736 -376 -877 -814 184 1167 694
2241 694 -450 -808 -778 137 1295 690 -861 -855 -196 287 910 647 -594 -1120 -285 666 750 387 -527 -1035
2261 -1035 -136 828 551 133 -305 -1105 -276 1030 708 -245 -501 -604 -163 665 815 -105 -791 -493 45
2280 45 693 791 -281 -906 -243 161 395 670 -57 -927 -346 422 579 340 -175 -626 -392 386 600 108
2300 108 -208 -472 -465 509 821 -155 -355 -258 -264 260 669 55 -590 -410 -24 301 367 99 -519 -478 178 296
2322 296 180 151 -409 -544 272 373 105 48 -269 -376 106 406 158 -194 -256 -211 29 410 206 -358 -176
$$ packed form
2186f2J142L68j677j379Q65J237N34j81r84j216K63J713P07p42j050p66L07J767
2204H46M78r97p66o46J52J697Q25j364j232L1P19Q69O14p02j556j63J177Q18L10
2223A110p74j630K51J345M83p0m76j195k13J395J016n06j112n01O3R98R83m73
2241F94j144l58L0R15J158o05j551OO59M83O23k63j241n26Q35R51Q4l63r14n08
2261a035Q99R64k77m18m38q00Q29J306l22r53k56j03M41Q28J50r20o86K98N38
2280D5O48R8j072o25O63M04K34K75p27q70N81P68J57k39n15m51K34P78K14m92
2300A08l16k64PR74L12r76k00R7oN24M09o14o45J80L86L25O6k68o18M1O56J18
2322B96j16k9n60j35Q16J01k68n7l17j07M82L00k48l52o2M5K40L81k04n64J82
$$ plain form
2343 -176 -20 -63 392 337 -377 -250 127 58 118 159 -203 -283 11 240 86 -41 -23 -287 -98 307 106 -111
2365 -111 10 -142 -148 259 152 -167 -58 -112 -53 236 170 -49 -88 8 -20 60 148 -37 -246 117 164 -95 92 91
2389 91 -246 -43 177 -13 -61 26 -43 -115 123 82 -113 -34 90 -133 -25 176 -57 -184 175 -14 -89 85 55
2412 55 -85 72 60 23 15 -11 -43 -43 23 5 -115 85 25 -130 102 118 -221 -31 112 -143 -54 129 -62 -45 61
2437 61 -19 -148 -27 87 -118 -48 88 -52 -73 179 -81 -91 91 8 -82 85 -12 -31 32 39 -77 -16 17 -8 -78
2462 -78 47 18 -79 26 16 -124 106 71 -42 34 60 -106 -48 128 12 -75 1 86 -85 20 83 -137 -63 74
2486 74 -15 -55 104 -145 -145 59 50 -53 36 0 -71 -44 132 16 -29 -5 -40 -5 197 32 -147 -48 41 15 141 4
2512 4 -169 -79 20 43 45 79 -137 -150 41 178 40 8 -18 -181 -19 231 89 -92 -44 -74 -65 191 96 -118 -147 -81
$$ packed form
2343a76J56m3M55n5p14J27L77o9O0M1l62q0K94K29j54j27J8k64J89M05k01k17
2365a11J21j52oM07j07l19J09n4N9K89o6k19l9R6k8Q0Q8j85k09L63M7k59J87j
2389I1l37K03K20j90m8Q7o9p2K38m1j95P9J24k23J08K01k33j27L59j89p5J74l0
2412E5j40J57j2l7qk6l2%O6j8j20K00o0j55K32J6l39J90J43k55Q9J83j91J7J06
2437F1q0j29J21J14k05P0J36j40k1K52k60j0J82q3r0J67r7j9O3Pj16O1L3k5p0
2462g8J25k9r7J05j0j40K30l5j13P6K6j66N8J76j16q7P6Q5j71J05O3k20P4J37
2486G4q9m0J59k49%K04rj03Q9l6p1K7J76j16m5K4l5L5K02j65j79R9Q9k6J26j37
2512Dj73R0R9K3KL4k16j3J91J37j38l2k6j63J62K50j42j81M8l0RK56r5k14k9O6
$$ plain form
2538 -81 29 142 174 -114 -228 -53 139 106 154 -70 -260 -6 108 198 52 -131 -309 -9 198 143 33 -153
2560 -153 -224 -51 224 225 -75 -232 -123 -69 139 315 -50 -327 -146 0 228 226 -9 -309 -233 124 272 112
2582 112 -17 -304 -272 162 349 121 -75 -288 -209 144 385 126 -172 -235 -182 146 375 95 -247 -312 -68 176
2604 176 235 120 -316 -370 24 211 272 125 -330 -422 72 334 197 -8 -251 -386 11 393 278 -112 -256
2625 -256 -241 -34 371 349 -140 -318 -219 95 369 297 -168 -409 -133 166 342 197 -118 -453 -227 320 386 155
2647 155 -156 -418 -151 343 420 89 -185 -430 -156 357 381 -54 -293 -339 -63 302 398 85 -372 -296 84 325
2669 325 360 112 -416 -292 84 291 337 45 -435 -332 138 404 200 -85 -384 -289 84 452 237 -187 -314
2690 -314 -264 110 431 220 -310 -298 -176 97 411 239 -262 -436 -67 222 296 99 -270 -427 -64 326 226
$$ packed form
2538h1J10J13L2k88j14J75J92l3M8k24j90K54J14R0j46j83j78L00K07n5j10j86
2560a53p1J73K75Jl00j57J09N4K08J76l65k77J81J46K28kk35l00P6L57J48j60
2582A12j29k87L2M34J87k28j96k13P9L53K41k59k98o3N3L28K29k80l42o5K44K44
2604A76N9j15m36n4L94J87O1j47m55r2M94K62j37k05k43j35L97L82j15l90j44
2625b56J5K07M05k2m89j78R9L14K74p2m65k41K76K99J76j45l15l35K26N47O6k31
2647A55l11k62K67M94P7l31k74k45K74N13K4m35k39m6K76L65R6l13m57P6L80K41
2669C25L5k48n28J24L76K07M6k92m80J03M70K66k04k85k99R5L73L68k15m24j27
2690c14N0L74L21k11n30J2J22K73L14j72n01j74L69K89P4j97l69j57L63L90j00
$$ plain form
2711 226 91 -181 -493 -17 416 249 1 -201 -368 -105 409 430 -72 -352 -216 14 311 304 -130 -380 -195
2732 -195 39 256 356 -124 -490 -121 158 321 195 -94 -366 -222 227 226 125 -160 -380 -221 270 373 -60
2753 -60 -155 -166 -189 208 384 28 -327 -200 -70 214 334 111 -255 -264 52 157 240 155 -319 -316 103 215 151 21
2777 21 -214 -289 119 296 141 -30 -198 -185 30 294 194 -182 -130 -92 -83 336 211 -244 -208 49 -16 222 186
2800 186 -146 -329 -46 190 159 78 -37 -274 -76 274 220 42 36 -208 -175 202 188 -34 -30 -101 -111 214 213 -51
2824 -51 -154 -114 37 88 245 33 -244 -74 85 8 196 60 -277 -19 167 72 91 51 -200 -187 120 121 31 -51
2848 -51 -26 -178 52 319 -9 -151 6 -158 -92 274 112 -172 -93 0 -3 90 70 -155 -109 78 82 -12 102 -23
2872 -23 -238 63 123 -61 38 26 -220 2 106 -14 -10 29 -85 -60 88 111 -68 -50 75 -143 12 204 -145
$$ packed form
2711B26j35k72l12M76M33j67k48k02j67K63N14K1n02k80J36K30K97pm34k50J85
2732a95K34K17J00m80l66L69K79J63j26k89k72J44M49jj01k85k20J59M91J03m33
2753f0r5j1k3L97J76l56l55J27J30K84J20k23l66rL16J05Q3q5m74LM19J12o4j30
2777B1k35p5M08J77j55j71j68J3K15K64j00l76N2L8RM19j25m55L6K57o5K38l6
2800A86l32j83K83K36l1q1j15k37J98L50n4j78ok44L3L77j4k22Mp1j0L25jk64
2824e1j03M0J51N1J57k12k77J70J59p7J88j36l37K58J86r5J9m0k51J3L07Jr0q2
2848e1K5j52K30K67l28j42J57j64O6L66j62k84P9R3lR3k0k25M6J87Mr4J14j25
2872b3k15L01O0j84R9j2k46K22J04j20ML9j14K5J48K3j79J8J25k18J55J92l49
$$ plain form
2895 -145 -157 91 -68 -50 138 -30 -135 51 40 4 19 35 -73 -70 151 15 -80 85 -5 -139 119 125 -61 12
2919 12 83 -143 28 92 -18 -30 53 -34 -90 55 49 -137 -18 117 -116 -34 181 -149 -60 129 -82 -61 105 -39
2943 -39 -135 80 96 -139 -62 149 -61 -87 163 -26 -209 132 21 -147 129 49 -150 38 91 -74 -61 104 -67
2966 -67 -17 39 65 -61 9 95 -104 17 55 -111 -10 129 -164 -72 109 -36 -75 123 2 -112 62 92 -125
2989 -125 -94 121 -109 -114 155 -5 -212 146 38 -170 47 59 -174 50 90 -20 -5 59 -40 -61 -6 122 -91
3012 -91 52 101 -108 71 129 -76 42 172 -195 13 109 -88 -97 11 -64 -75 111 163 -139 -72 145 -31 -71 186
3036 186 -43 -201 82 63 -133 79 14 -141 28 116 2 -74 47 1 -149 117 146 -82 -6 24 -136 77 191
3059 191 -139 -61 19 -77 104 125 -46 -157 32 100 -21 69 36 -192 -121 224 91 -36 153 -184 -185 260 143
$$ packed form
2895a45j2K48j59J8J88j68j05J86j1l6J5J6j08LK21j36r5J65r0j34K58Oj86P3
2919A2P1k26J71O4j10j2Q3q7n6J45oj86J19J35k33Q2K15l30Q9J89k11K1J66j44
2943c9r6K15J6k35P7K11k10k6K50j89j83L41j11j68K76q0j99J88N3j65J3J65j71
2966f7N0N6K6j26P0Q6j99J21L8j66J01J39k93R2J81j45l9J98j21j14J74L0k17
2989a25L1K15k30nK69j60k07L58j08k08K17J2k33K24M0j10J5O4r9k1N5J28k13
3012i1J43M9k09J79N8k05J18J30l67K08R6j97rJ08p5j1J86N2l02O7K17j76m0K57
3036A86k29j58K83j9j96K12o5j55J69Q8j14p6J21m6j50K66K9k28P6L0j60K13J14
3059A91l30P8Q0r6J81K1j71j11J89O8j21R0l3k28P1L45j33j27J89l37jM45j17
$$ plain form
3082 143 -126 17 -66 -113 90 274 18 -164 -54 16 -34 153 135 -359 -27 117 -7 184 90 -210 -38 149
3104 149 49 102 39 -205 -257 87 163 41 -88 -42 -219 4 333 32 -185 74 -146 -54 400 87 -304 -123
3126 -123 -98 12 138 209 -165 -388 -9 128 49 160 -123 -399 7 287 5 123 -30 -267 6 308 139
3147 139 -56 -158 -152 -83 221 281 -219 -275 -89 -85 161 325 -203 -328 10 27 113 302 -117 -404 -74 206 194
3170 194 84 -20 -290 -259 259 238 -122 -53 -161 -325 200 408 -114 -134 -171 -182 174 306 51 -285 -240 -32
3192 -32 171 250 119 -392 -240 174 75 202 176 -363 -319 180 246 80 -1 -283 -222 119 306 95 -35 -221 -234
3215 -234 11 487 99 -358 -123 -39 -37 436 286 -367 -247 39 76 223 165 -218 -373 23 287 107 83 -101
3237 -101 -419 -89 470 171 -62 -123 -356 -36 329 164 -120 -190 -272 -20 248 318 -120 -330 -47 -17 135 434
$$ packed form
3082A43k69J43q3m7K03J84k56j82J10P0n0J87j8m94L32J44j24J91r4l00J72J87
3104A49j00N3o3k44n2L44P6j22j29M6j77K23L29l01k17K59k20R2M54l13l91J81
3126a23K5J10J26P1l74k23L79J37p9J11k83k76M06K80k82J18j53k37K73L02j69
3147A39j95j02OO9L04O0n00n6J86MK46J64n28j25L38J7Q6J89m19k87L30K80j2
3170A94j10j04k70L1N18k1l60O9j08j64N25K08n22k0l7j1L56J32k55l36M5K08
3192c2K03P9j31n11J52M14r9J27k6n39M4M99O6j66q1k82O1L41J87k11j30j86j3
3215b34K45M76l88m57K35Q4KM73j50o53J20K86L7J47n8l83j55L96K64j80k4j84
3237a01l18L30N59k99k33o1k33L20L65j65k84p0q2K52K68P0m38k10K83L0J52K99
$$ plain form
3259 434 -110 -409 46 140 118 285 -58 -441 -78 197 203 75 -104 -254 -184 241 421 -48 -170 -82 -245 186
3281 186 436 -36 -267 -94 -146 163 352 -6 -230 -172 7 179 220 53 -202 -268 152 229 40 152 -291 -387
3303 -387 207 242 21 116 -195 -293 86 260 147 -165 -161 -109 -45 284 206 -290 -204 57 -36 261 206 -256 -200 19
3327 19 51 192 204 -156 -231 -40 180 63 34 -81 -308 -40 351 66 -70 50 -143 -110 310 104 -67 -86
3349 -86 -38 -82 172 217 -40 -243 -18 59 -44 263 37 -339 13 187 -70 78 45 -206 -95 168 45 17
3371 17 -33 -101 -79 63 164 -64 -172 8 -115 -30 302 -117 -199 45 -78 -35 175 -6 -105 -12 26 87 61 153
3395 153 -59 -119 108 99 -105 69 8 -269 98 236 -105 12 46 -124 42 204 20 -86 53 -37 -76 100
3417 100 168 -155 -103 155 -16 -27 218 -134 -139 123 -36 -2 166 -65 -73 42 89 55 -2 123 -9 -89 151 109
$$ packed form
3259D34n44k99M55R4k2J67l43l83L63K75Oj28j79j50P0M25J80m69j22Q8j63M31
3281A86K50m72k31J73n2L09J89l58k24N8J79J72M1j67k55o6M20P7j89J12m43r6
3303c87N94L5k21R5l11r8L79J74j13l12MN2O4L29p8m96Q6K61r3K97n5m62N6K19
3327A9L2J41J2l60p5J91K20j17k9j15k27K68L91k85j36J20j93L3M20k06j71j9
3349h6M8m4K54M5k57k03K25P7j03L07k26l76L52J74k57J48l3k51J11K63j23k8
3371A7n0o8K2J42J01k28j08J80j23Q5L32m19q2K44j23M3K10j81r9R3L8O1k6R2
3395A53k12o0K27rk04J74o1k77L67J38l41J17L4j70J66J62j84j06J39r0l9J76
3417A00O8l23N2K58j71j1K45l52nK62j59L4J68k31qJ15M7l4n7J25j32q0K40m2
$$ plain form
3441 109 -198 72 21 -179 175 143 -157 36 125 -94 40 93 -20 -108 63 128 -73 22 129 -156 -68 112 -127
3464 -127 7 166 -26 -48 79 -63 -27 32 4 -57 36 37 -31 -4 127 -20 -137 125 53 -120 91 47 -151 123
3488 123 36 -130 55 45 -47 8 28 4 -80 -17 76 -135 47 135 -173 -22 164 -92 -22 156 -129 -78 114 14
3512 14 -64 56 8 0 -12 96 -12 -130 116 36 -71 177 -11 -147 119 51 -134 135 24 -76 -18 59 -8 30
3536 30 2 33 -129 -4 56 -189 21 94 -156 43 196 -90 -27 128 -108 5 162 -19 -102 -25 32 -2 -30 67
3560 67 -80 -61 160 9 -117 58 -41 -161 140 29 -43 94 -21 -40 19 106 47 -63 -64 15 -61 118 98 -162
3584 -162 -33 64 -133 96 124 -171 -49 80 8 32 95 -13 -77 20 184 40 -43 36 -63 -98 202 30 -176 21
3608 21 -48 -91 189 42 -91 -56 -40 48 116 112 8 -190 10 21 35 93 43 -227 20 173 27 62 10 -246 -80
$$ packed form
3441A09l07K70n1k00L54l2l00J93Q9k19J34N3j13q8J71O5k01R5J07k85Q8J80k39
3464a27J34J59j92k2J27j42L6N9k8o1R3Jo8K7J31j47j17K62p2j73K11m4j98K74
3488A23q7j66J85j0r2N5K0k4q4O3R3k11J82Q8l08J51J86k56P0J78k85N1J92j00
3512A4p8J20m8qj2J08j08j18K46q0j07K48j88j36K66o8j85K69j11j00N8P7o7L8
3536C0k8L1j62J25O0k45K10P3k50J99J53k86O3J55k36J13J57j81q3P7N7l4k8R7
3560F7j47J9K21j51j26J75r9j20L01j11p2J37j15j9N9Q7n9j10jP9p6J79k0k60
3584a62J29R7j97K29K8k95J22J29p2K4O3j08o4R7J64j44q3P9r9l5L00j72k06J97
3608B1o9m3K80j47j33L5J6Q8O8mj04j98K00J1J4N8n0k70K47J53j46L5n2k56J66
$$ plain form
3633 -80 194 39 -24 -54 -93 -18 87 205 -71 -199 84 -29 -31 250 -37 -131 -53 -17 49 145 -28 -158 -83 6 161
3658 161 103 -30 -156 -169 127 198 -54 6 -80 -204 131 262 -72 -56 -98 -140 69 207 51 -188 -135 24 22 165
3682 165 128 -211 -225 185 98 77 150 -196 -273 73 195 59 30 -181 -169 -35 208 136 -40 -87 -103 -80 278 170
3706 170 -157 -132 -86 -22 194 151 -157 -150 -38 44 185 107 -122 -222 -117 204 167 93 31 -270 -193 281 188 39
3730 39 -36 -193 -94 222 134 -14 -158 -127 -24 78 158 -77 -334 -87 90 119 224 21 -231 -102 51 117 155
3753 155 -6 -215 -185 135 146 88 -1 -128 -143 126 337 -18 -101 -54 -104 131 308 -6 -109 -86 -120 82 231
3776 231 85 -189 -190 20 125 141 72 -180 -239 37 226 116 130 -149 -257 136 196 87 8 -137 -241 17 205
3799 205 128 -33 -141 -90 31 176 204 -178 -118 -14 -19 177 227 -159 -222 4 136 133 48 -108 -167 -57 112 181
$$ packed form
3633h0K74j55o3l0l9P5J05J18k76j28K83j13kK81k87r4P8L6O6R6j73j30P5Q9J55
3658A61n8j33j26j3K96P1k52O0q6j24L35J31l34J6m2m2K09J38j56k39N3J59kJ43
3682A65l7l39j4M10q7k1P3l46p7L46J22j36k9k11J2J34K43p2j76m7j6K3L58j08
3706A70l27K5M6O4K16m3l08PJ12Q2J41p8k29j00J05L21l7p4o2l01P7M74r3j49
3730C9p5j57R9L16q8j48j44L1J03J02Q0k35k57K47J77K9J05k03k52J29J53O6L8
3753A55j61k09L0L20J1n8q9j27j5K69K11l55q3M7n0K35J77l14j03K3l4K02J49
3776B31j46k74jK10J05J6o9k52n9K76J89j10J4k79j08L93O0j09p9j45j04K58J88
3799B05p7j61j08N1J21J45K8l82O0J04nJ96N0l86o3K26J32lq5j56n9J10J69O9
$$ plain form
3823 181 7 -5 -262 -88 246 102 -90 7 -130 -114 140 186 -36 -148 -132 -6 155 189 -2 -267 -96 94
3845 94 68 109 59 -220 -146 143 50 1 2 -185 -151 90 81 76 -37 -166 -112 84 151 -7 -59 -9 -77 40 226 -1
3871 -1 -184 -43 -38 26 202 91 -130 -75 14 82 58 97 -32 -180 -2 159 -21 -19 22 -120 -12 146 43 -9 -3
3896 -3 -118 -12 121 64 -27 -80 -46 -23 82 127 -2 -132 56 6 6 140 -59 -107 23 49 25 72 -30 -83 -17 79
3922 79 99 8 38 2 -43 16 162 -80 27 60 -156 95 117 -62 1 28 -124 -13 37 -32 -101 -31 19 -3 7 155
3948 155 -106 -37 48 -3 -10 100 -41 -104 66 28 -38 -49 -6 -104 16 93 0 -69 -2 4 -46 22 85 -63 -7 123 -33
3975 -33 -11 91 -107 -61 19 -35 -35 47 32 -31 -23 136 18 -39 54 -47 -105 127 -51 -39 15 -45 -50 54 -31 9 -5 40
4003 40 -52 -66 74 7 -66 -13 44 -44 85 81 -149 86 44 -101 6 87 -37 -40 46 -9 -53 -47 49 -19 -45 107 -87
$$ packed form
3823A81j74j2k57J74L34j44j92R7j37J6K54M6k22j12J6J26J61L4j91k65J71J90
3845I4k6M1n0k79P4K89r3m9Jj87L4K41rnj13j29N4J96O7j58n2N0o8J17J86k27
3871aj83J41NO4J76j11k21N5Q9O8k4L9j29j48J78J61j80KM1j42J08J58j03n2O
3896cj15J06J33n7r1n3L4K3J05M5j29j30J88n0%J34j99m8J30K6k4M7j02n3O6R6
3922G9K0r1L0l6m5N9J46k42J07L3k16K51K2j79O3K7j52J11N0o9o9P0N0k2J0J48
3948A55k61O9Q5n1pJ10j41o3J70l8o6j1M3r8J20P7r3o9O7On0O8O3j48N6J30j56
3975c3K2J02j98M6Q0n4%Q2j5o3QJ59j18n7R3j01n8K32j78J2N4o0nJ04q5M0j4M5
4003D0r2j4J40o7p3N3N7q8J29mk30K35m2j45J07Q1j24lQ6n5m4OR6o8k6J52j94
$$ plain form
4030 -87 -54 97 -57 -108 52 -18 -77 24 12 -38 39 -36 -25 -23 47 32 -14 46 15 -107 5 52 -62 61 31 -110
4056 -110 22 88 -47 -40 0 -36 -25 30 15 -64 -6 3 -35 8 135 -65 -80 36 -31 -20 143 -1 -28 -14 27 -60 10
4083 10 11 -5 -31 56 46 -96 -7 -35 -74 16 30 -15 13 -1 -40 65 45 -26 -5 -7 31 49 55 25 -86 12 67 -4 24 93
4113 93 -109 -83 92 -5 -9 20 -75 -17 55 108 23 11 -60 -6 -60 119 -10 -108 -59 5 -26 140 34 -108 -9 1 -28
4140 -28 41 40 -129 -56 -61 83 44 18 -58 -139 15 163 6 22 -45 -100 34 178 39 -28 -25 -89 42 114 81 -27 -159
4167 -159 -38 47 101 61 -19 -182 -11 93 39 118 -2 -161 -25 32 71 74 -93 -47 -106 116 111 -27 -67 -42 -79 127
4193 127 131 -2 -73 -63 -93 90 133 -31 -137 -46 9 104 96 19 -126 -100 118 134 38 11 -95 -164 125 138 43 -25 -114
4220 -114 -153 87 157 34 -75 -106 -65 -27 103 97 -148 -72 -4 48 137 42 -145 -136 29 86 191 64 -97 -166 23
$$ packed form
4030h7L3J51j54n1J60p0n9J01j2n0P7p5J1KP0j5m6O0l1j22J12M7j14J23l0j41
4056a10J32O6j35PM0l6J1N5j5p9N8Rl8M3J27k00j5J16o7J1J63j44k7J4M1q7P0
4083A0Jj6k6Q7j0j42Q9k8l9R0J4m5K8j4l9J05k0p1K1kL8J8Ol0j11R8N5p1K8O9
4113I3k02K6J75r7mK9r5N8P2N3q5j2p1N4n4J79j29r8M9O4l1J66j06j42R9J0k9
4140b8O9jj69P3nJ44l9k6p6q1J54J48j57J6o7n5J34J44j39o7Lo4J31P2l3j08j32
4167a59J21Q5N4m0q0j63J71J04n4P9j20j59J36N7L9Lj67M6n9K22nj38m0K5l7K06
4193A27Mj33p1J0l0J83M3j64j06R1N5R5qp7j45K6K18J6r6k7j06o9K89J3r5o8q9
4220a14l9K40P0j23j09l1M1L8J30ok45P6O8N2Q9r5j87RJ65N7J05j27j61o9J89
$$ plain form
4245 23 176 66 -63 -111 -132 -31 179 118 -42 -43 -89 -25 178 58 -72 -96 -86 35 201 109 -61 -153 -51 90
4269 90 100 135 -16 -188 -91 81 119 97 4 -178 -47 143 93 -4 -92 -162 3 88 175 53 -136 -77 -64 128 233
4294 233 -64 -200 -56 -35 38 202 -9 -231 -149 24 132 120 -12 -123 -165 58 135 64 -12 -91 -162 102 261
4317 261 -34 -81 -113 -133 79 174 85 -48 -103 34 59 143 53 -96 -141 15 69 74 192 -109 -190 40 66 54 45 -136
4343 -136 -146 31 127 35 -35 -61 -97 -31 132 90 -104 -45 -49 -38 178 190 -174 -68 -9 2 86 28 -70 -90 -62 112 35
4370 35 60 -30 -181 -98 137 40 26 18 -116 -163 125 92 -27 -62 -124 -53 117 152 -57 -92 -26 -51 15 191 78 -91
4396 -91 -70 48 13 164 -8 -135 -36 45 17 63 47 -142 -101 50 70 37 -13 8 -126 19 142 -29 -49 -6 -69
4421 -69 -37 125 31 -88 -11 -23 10 42 38 -80 -147 40 71 45 95 -46 -82 49 64 -9 5 -53 -122 69 90 -14 -17
$$ packed form
4245B3J53j10j29m8k1J01K10o1j60jm6O4K03j20j30k4J0J21J66r2j70r2J02J41
4269I0J0L5j51j72R7J72L8k2r3j82J31J90n0r7q8p0J65Q5Q7j22j89N9J3J92J05
4294B33k97j36J44K1P3J64k11k22Q2J73J08j2j32j11m2K23P7p1p6p9p1K64J59
4317B61k95m7l2k0K12R5q9j33n5J37K5Q4r0j49m5J56N4NJ18l01q1K30K6j2rj81
4343a36j0J77R6r2p0k6l6O6J63m2j94N9mJ1K16J2l64J06N9J1Q4n8r8k0K8J74p7
4370C5K5r0j51Q3K35r7j4qj34m7K88l3j19l5o2P1J70L5k09l5O6k5O6J76j13j69
4396i1K1J18l5J51j72j27R9Q1k8M6j6j89M1J51K0l3n0K1j34J45J23j71k0M3o3
4421f9L2J62r4j19P7j2L3L2mj18o7J87L1k6N0j41l6J31J5p3J4n8o9J91K1j04l
$$ plain form
4448 -17 19 -32 -13 20 115 -42 -67 53 -107 49 83 -111 -77 -10 13 -30 77 -3 -44 33 78 48 -21 -6 -65 -60 40
4475 40 -15 -34 11 -77 -78 64 48 -67 16 31 -48 55 24 2 -71 21 21 -74 -6 25 -65 -86 65 13 -14 70 -57 -105 30
4504 30 -67 56 19 -82 -60 19 6 -20 -37 33 -38 -74 59 28 -142 110 -17 -58 78 -48 -83 2 27 11 15 69 46
4531 46 -16 -15 22 -43 39 83 -63 6 74 -70 -7 84 -81 -41 43 -15 54 48 -31 -7 0 1 -31 -79 -2 -20 1 65 42 -75
4561 -75 -2 32 -53 -6 -32 -13 11 10 -51 -20 9 15 -34 10 43 -1 35 24 -107 35 112 -19 9 34 -34 51 70 -27 44 -41
4591 -41 -3 0 18 70 17 -77 16 -3 -53 53 -33 -57 -2 -25 -11 57 -40 -56 -9 60 11 -11 -10 -29 -99 47 104 -65 -11 32
4621 32 -82 27 85 -48 -39 77 -32 47 45 -39 -16 -14 19 44 1 -14 -88 -36 60 -4 -32 10 -14 -22 73 28 -21 -40 -85 51
4651 51 54 78 21 -132 32 28 22 32 57 -99 -37 52 58 136 8 -143 -10 13 31 79 9 -23 -44 61 53 -30 -36 -17 -44 5
$$ packed form
4448a7L6n1J9L3R5j57k5J20j60J56L4j94L4O7K3m3J07q0m1P7M5l0o9J5n9NJ00
4475D0n5j9M5q8jJ42j6j15Q3J5p9J03l1k2p3R2%r5O8L1r0k1J51n2k7Q4j27m8J35
4504C0r7J23l7j01K2P9j3k6j7P0p1l6J33l1j70K52j27m1J36j26l5Q5K5j6MN4k3
4531D6o2JL7o5Q2M4j46O9O8j44O3R1j65M0Q4n8O9op9K4PJl2m8P7j8K1O4k3j17
4561g5P3L4q5M7k6J9K4jo1L1K9Om9M4L3m4L6j1j31J42P7j31K8K5o8Q5J9r7P1q5
4591d1L8LJ8N2n3r4R3j9n0J06q6k4N5k3J4O8r7j6M7O9m9k2Jj9p0J46N7j69N4M3
4621C2j14J09N8j33RJ16j09P9kq4K3KL3K5m3j5p4N2R6o4k8M2k4qR5m5m9j9m5J36
4651E1LK4n7j53J64moJ0K5j56O2Q9OP8j28j51J33K3J8M8p0l2k1J05qq3oJ9k7M9
$$ plain form
4681 5 90 -35 -70 -32 -55 -8 143 18 -109 -80 40 40 32 63 -75 -86 35 118 17 -27 -50 -108 72 153 21 1 -36
4708 -36 -72 29 80 84 -21 -68 -74 3 133 151 -17 -112 25 -2 43 88 -76 -114 12 50 52 77 -119 -137 -35 72 134
4735 134 -22 -23 -72 -33 85 83 -29 -81 -45 7 146 114 -43 -34 -64 9 127 105 -74 -71 -80 30 23 83 22 -131 -11 102
4763 102 22 44 32 -196 -75 96 104 30 -47 -98 -35 54 121 40 -38 -104 -23 39 124 30 -144 -75 4 52 127 -42 -85 -80
4791 -80 25 105 96 33 -43 -77 57 106 39 14 -103 -177 25 154 75 -81 -69 -74 32 144 40 -96 -96 -68 28 111 39
4818 39 -92 -105 12 28 63 76 -21 -154 56 79 113 30 -53 -116 -5 100 87 48 -69 -129 -11 104 76 -21 -91 -25
4844 -25 -10 121 89 -75 -124 -51 24 138 93 -67 -202 -79 21 91 22 -35 -123 -76 94 105 42 -56 -90 -52 97 88
4870 88 -14 -31 -81 -54 106 123 -38 -23 -48 9 28 91 6 -103 -32 -16 23 93 1 -98 -83 30 72 104 -8 -82 -38
$$ packed form
4681EQ5j25l5L8k3M7J51j25j27K9J20%qL1j38j1J21Q3j01m4k3n8J80Q1j32k0l7
4708c6l6J01N1Mj05m7oP7J30J8j68r5J37k7M5M5j64l8J26L8KK5j96j8J02J07O2
4735A34j56jm9L9J18kj12n2L6N2J39l2j57Rl0P3J18k2j79LrJ10pO0o1j53J20J13
4763A02q0K2j2k28J21J71Qp4p7n1O3Q9O7q1p8o6Q1O2Q5r4j74O9P9M8P5j69m3N
4791h0J05Q0ro3p6l4J34M9o7k5j17p4K02J29p9j56J2nJ06J12j04j36%K8R6Q3p2
4818C9j31j3J17J6L5J3r7j33K10K3L4q3q3o3J11J05j3l9j17o0J18J15k8r7p0O6
4844b5J5J31l2j64m9P3P5J14m5j60j35J23J00P0o9n7q8M7J70J1o3r8l4L8J49r
4870H8j02j7n0K7J60J7j61J5k5N7J9O3q5j09P1J6L9P0r2r9J5J13M2L2j12p4M4
$$ plain form
4897 -38 -11 110 62 -30 -45 -94 15 114 19 -3 13 -68 55 142 15 -54 -46 -51 11 87 15 -96 -65 -21 66 2 8 -50 -126
4926 -126 38 104 27 34 -74 -39 43 78 92 4 -76 -25 -22 39 37 -75 -83 -57 -2 56 53 -31 -47 -30 -1 64 62 -113 14 -37
4956 -37 84 24 46 -36 -117 10 13 79 -6 -14 48 -36 87 54 -34 -22 -30 4 29 63 26 -7 -1 3 30 16 30 -15 -21 33 19 53
4988 53 23 -40 10 30 39 45 -29 -28 19 18 13 -20 -27 13 0 -39 35 53 4 45 51 10 49 39 -20 -50 26 26 41 -16 -23 -22 -41 -6 22
5023 22 -34 31 -106 -1 43 -20 34 50 9 -28 7 -9 34 -42 -52 9 55 14 -28 -1 15 8 -27 80 5 -49 -57 24 13 57
5053 57 24 -35 34 48 8 -50 27 9 7 -12 -6 0 15 -23 -5 14 0 -45 -47 -39 42 -14 -38 48 -9 -60 -39 12 49 -36 -23 17 -20
5086 -20 -2 28 52 -12 11 -35 -18 46 -38 -44 28 -20 15 9 24 -46 6 -35 -61 29 15 -18 -19 -38 -12 25 -46 27 11 1 38 34
5118 34 43 7 -36 80 26 -15 -9 14 0 24 15 50 -17 -21 68 27 11 10 -85 31 -57 -12 -10 30 1 22 -37 29 16 -11 -57 8
$$ packed form
4897c8K7J21m8r2j5m9J09R9r5k2J6q1J23Q7j27o9QnO2P6p2j11L1M4Q7o4On8p6
4926a26J64O6p7Pj08L5Q2L5J4q8q0N1LO1kj12qK6N5N8lq4j6J7K9O5kj75J27n1
4956c7J21o0K2q2q1J27LO6q5qO2q4J23l3q8J2qL4K5L4l7l3OMK7j4J4m5oN4j4L4
4988E3l0o3N0K0ROp4JM7jnl3pM0j3l9P4J8m9M1Om1L9j0n9l0P6%J5n7pJj9L5K8
5023B2n6O5j37J05M4o3N4J6m1l7L5j6M3p6j0O1M6m1m2K7J6pl5J07p5n4qQ1j1M4
5053E7l3n9O9J4m0n8P7j8kj9OOJ5l8J8J9j4m5kQQ1n6k4Q6n7n1K1N1L7q5J3M0l7
5086b0J8L0K4o4K3m6J7O4q4oP2m8L5oJ5p0N2m1k6R0j4l3jj9K6L7p1P3j6j0L7m
5118C4Rl6m3J16n4m1OK3j4K4rL5o7mQ9m1j6jr5J16q8M5KM0k9K1n9O6j3k7m6O5
$$ plain form
5150 8 9 14 0 -9 2 -28 -57 38 24 -16 -25 -33 -16 96 47 -3 -33 -11 18 -4 19 -49 13 -52 0 12 -14 44 -27 -12 -33 -3 -80
5183 -80 -42 -8 -4 35 41 40 -68 -9 17 -43 52 32 -84 -44 20 -26 43 -55 -52 -2 27 30 45 -19 -14 34 41 31 9 -34 -30 44 21
5216 21 21 33 -8 -91 -22 -13 49 -5 -55 -17 10 39 -7 -32 -16 -36 43 43 20 -10 -47 -39 -10 37 48 -14 -22 -45 18 15 19 12 18 31 37
5251 37 67 36 -5 -54 -21 49 15 45 -5 -95 45 49 47 -1 31 -75 -15 72 66 -11 -11 -7 -12 62 70 -51 -36 -42 15 118 82 5
5283 5 -26 -51 34 46 -8 -16 -41 1 40 74 4 -16 -64 -25 31 50 17 -23 -73 -42 63 94 -40 -29 1 -13 33 53 4 -84
5313 -84 -43 -21 1 77 14 -67 -56 -41 92 31 -6 -62 3 35 40 27 20 -31 -73 25 21 -25 -14 -59 -18 24 42 7 -47 -44 -97 -20
5345 -20 30 89 -48 -1 -89 31 89 58 -72 -72 8 37 4 29 -35 -39 43 28 20 31 -28 -30 -2 24 60 28 -42 -39 -16 51 41
5376 41 -45 -19 -26 3 41 24 42 -17 -17 -16 -9 58 -37 -46 15 60 8 -10 -20 -46 -15 50 9 32 -18 -51 15 7 34 0 -15 14 -13
$$ packed form
5150HJNj4rJ1l0k9R5j4m0rqJ7J12m9n0l0K2K9k2K3o8O2o5N2J2k6N8p1J5k1L0p7
5183h0L8L4ML9Ojj08N9K6o0R5k0j16M0O4m6O9r8LN0K9LJ5o4NM8Pj0k2m3MP4k3
5216B1%J2m1q3O9RO2n4n0L8K7K9m6k5J6k0P9%k3l0l7QK9M7J1o2qk3O3lMpOJ3O
5251C7L0l1m1m9L3P0l4L0n0r0J40Mkm8L2j06O0Q7op7%MnP4Qj21J5oN7J03l6p7
5283El1k5Q5J2n4qk5M2L9L4p0k0m8L9N6J9l3m0n0L1J05L1j34J1L0j4M6K0m9q8
5313h4M1K2K2P6o3q1J1J5J33o1l7n6O5L2Nj3pn1m2R8mm6J1m5M1M2J8l5n4Ln3P7
5345b0N0N9j37M7q8J20N8l1j30%Q0K9l3K5o4mQ2j5qJ1n9kK8K6L6l2p0LK3O7j0
5376D1q6K6pK9L8j7J8n9%JPO7r5rO1M5n2j8j0k6L1O5m1K3n0l3O6qK7l4j5K9k7
$$ plain form
5409 -13 -49 27 3 -16 68 33 47 14 8 -24 5 17 -2 -3 -20 -41 1 32 11 30 -54 -42 -20 49 61 1 13 12 -50 20 98 -23
5441 -23 -44 1 -15 -21 23 -19 -14 -62 62 37 -39 16 -96 -56 37 -13 -41 29 -70 -94 -5 -22 20 2 21 -14 -17 0 31 21 4
5472 4 43 -42 -7 25 -23 -42 -13 -9 -32 61 -37 -33 -4 3 -50 1 -18 -4 -36 7 31 26 48 -18 -31 60 -59 2 24 5 43 36 39
5505 39 -13 28 -44 33 -16 6 -2 -52 22 54 -54 -27 16 -68 22 23 11 50 57 -18 -19 -30 -6 20 -8 42 29 -12 58 -81 -52
5536 -52 -25 -50 -38 60 2 -20 32 -66 -18 6 43 70 -55 23 -9 -14 -6 -18 -95 16 67 -68 -5 86 -5 -10 -14 5 7 -3 -3 36
5568 36 -27 -34 8 -13 54 -1 -57 49 11 8 90 -46 -66 38 38 1 0 24 -18 10 -39 -12 28 3 9 -18 44 47 -8 13 -2 -79
5600 -79 21 -54 -62 -7 17 9 15 9 11 3 -57 19 2 -28 13 -11 13 -17 17 -48 -33 -82 -45 10 3 -16 5 9 -24 -3 9 -1 17 5
5634 5 48 -19 20 12 -52 -21 7 -64 12 37 -10 15 -56 2 -42 3 6 -44 22 15 -52 12 56 -22 -27 66 -7 -17 44 -9 -10 35 -47
$$ packed form
5409a3l6P6k4j9Q4l5J4l3ol2K9J2j9jj7k1M2L1k1J9q4J2K2O9J2o0J2jo2P0P8j21
5441b3k1M5j6oM4m2Nm8J24k5p6N5j12M0R3n0k8P0r9k4Q9j7M2j8J9l5lJ7L1j0j7
5472DL9q5L5L2m8j9K9Mk3R3r8MK9Pn3N1j9J4l2M3K4nK2o6j3R1j19O1K2j9L8pL
5505C9n2M1p2P7m9K2qn0P4L2j08K7M3q4R0Jj2L9Pp5jj1K4K6k8N0j3m1P0j39K9
5536e2K7k5J2R8n8k2N2r8M8K4L7K7j25P8l2nQj2p7J11N1j35O3R1r1nmJ9Kj0%L9
5568C6o3pM2k1O7n5n6J06l8lQ2j36k0J04%l7jK4m2K8m9K7M0k5Ok7O2Ln5K1j5p7
5600g9J00p5qN5K4qOoKqo0P6j7l0M1k4K4l0L4o5J5m9L7N5pj9K1Ml3K1J2j0J8j2
5634EM3o7L9qo4L1K8p1P6K5m7K5p1N8m4M5Ln0O6po7O4M4p8nR3p3j0O1n3jM5q2
$$ plain form
5667 -47 -24 15 21 30 -46 -8 18 5 47 -2 -19 53 4 -48 28 29 -64 17 -53 -6 -42 -24 -32 -92 63 42 -52 34 64 -6 -5 70
5699 70 -5 18 66 4 0 13 -46 28 5 -32 22 -12 -28 -29 1 45 17 3 48 29 -57 41 -30 -8 3 21 -3 -37 3 12 7 -28
5731 -28 23 -19 27 60 -37 -29 28 -130 8 25 -68 -2 22 -12 7 21 -52 -39 15 -34 9 -107 55 -35 -39 15 -59 -39 -4
5760 -4 -8 -41 47 11 -2 -4 9 -16 3 2 0 -28 -30 24 -34 37 40 -31 -14 25 -17 20 1 -32 -7 20 -7 -8 -78 -5 -24 -47 -6 -71
5794 -71 -15 45 -85 -25 45 16 -28 10 -4 -59 60 -16 -53 64 -1 50 44 -27 10 -31 -25 6 -57 37 24 -30 36 -3 -41 53
5824 53 -6 -48 91 22 -40 -20 1 8 -32 -6 -19 14 6 58 -42 -52 69 -32 10 40 -9 -26 50 35 -2 14 -8 -38 -29 -10
5854 -10 43 -50 -2 -31 -73 17 16 -20 42 19 -61 17 5 -29 9 -43 -31 1 -27 3 -46 -10 76 24 -39 14 -41 22 123 -37
5884 -37 -12 1 -39 -21 61 74 -3 33 29 -39 -41 36 -5 -42 11 -26 -83 29 -62 -38 62 -1 -51 67 -15 -10 28 -2 27 -17
$$ packed form
5667d7K3L9ORp6L8K6j3M2m9j7P2m9n2P6Jr3Q1p0M7l6J8qo0J55k1r4Q6L0p0JP5
5699G0p5K3M8o2mJ3n9P4k3l7N4l4j6jL0M4k8j4M5j9q6R8p1K2J1J8k4l4M0Rnl5
5731b8N1m2M6L3r7QN7j58J38J7r3O6K4l4J9J4p3J3N4m9M3j16J62r0mN4p4K0L5
5760dml3Q8l6j3kJ3k5J9jkk8kN4n8P1Lp1J7L9m2L7j9l3K5K7k7jp0P3j9k3M1o5
5794g1N6O0j30O0P0k9m4L8j4n5J19p6l7J17o5N1op1L7m1OL1o3R4j3n4O6l9l8R4
5824E3n9m2J39o9o2K0K1Pm0K6j3L3qN2j00j0J21j01M2L0m9j7P6j5l7J6k2l0RJ9
5854a0N3r3M8k9m2R0jl6O2k3q0P8j2l4L8n2J2L2k8L0m9L6Q6n2o3N3n5O3J01j60
5884c7K5J3m0J8Q2J3p7L6mo8kP7m1l7N3l7n7J12r1K4J00o3n0J18q2NL8l0K9m4
$$ plain form
5914 -17 29 -1 -31 -41 59 -35 -13 48 -45 26 44 -17 -11 -22 -5 -24 31 17 17 15 89 25 -55 -16 -45 23 71 -9 -8 44 -33 -53
5946 -53 22 1 36 -30 15 -34 7 -3 -14 -24 -8 62 -35 31 46 -19 19 45 -41 19 27 -34 32 18 6 -3 60 19 -20 32 36 -14
5978 -14 -4 12 -48 -12 24 -50 -15 48 -5 -49 93 18 -73 4 -10 -7 -21 -29 17 -21 23 31 -79 39 8 -111 31 37 -37 52
6008 52 18 -23 -23 7 4 -3 -31 -34 13 -3 -27 8 2 62 -21 26 38 -43 -34 42 -25 9 -12 -33 -15 -5 17 35 -48 -14 4 -36 6
6041 6 43 -33 38 -9 -59 45 -47 -71 -5 1 -50 20 101 4 68 -12 44 -4 -34 64 14 -13 16 -19 52 89 -29 28 30 -5 26
6072 26 -61 18 13 -30 19 20 -49 11 -20 -42 -10 -39 -17 -2 40 -19 9 20 -35 -4 51 17 -16 -23 -20 21 54 24 -22 45 12 1
6104 1 -26 40 -16 -23 46 36 -34 -10 -21 -65 31 -49 -30 -5 28 22 -62 -9 -3 -40 44 34 8 1 -48 -76 5 9 5 -29 -14 44 54 -10
6138 -10 -13 21 -8 2 -56 8 50 -52 8 12 -15 -1 -71 -41 -14 41 10 -36 -6 -18 62 1 41 -23 -5 29 38 -60 21 -52 -57 24
$$ packed form
5914a7M6l0l0j0J00r4K2O1r3P1J8o1Oj1J7j9N5j4%kP4o4q0L9k9O8M8q0JN2p7k0
5946e3P5k1L5o6M5m9M1j0j1j0J6P0r7O6J5o5L8K6q6O0Qo1O6j4j2rO3m1l9N2Mn0
5978a4J0J6o0L6L6p4L5O3n3m4J42p5r1P7j4Lj4qM6l8M4Qj10J18l1j19J42Op4Q9
6008E2l4m1%L0lpk8lM7j6k4L5oO0q3M7J2q1RP6o7L4k1k1J8J0K2J8q3L4J8m0M2
6041FL7p6P1m7n0J04r2k4O6On1P0Q1r7O4q0N6m8l0R8n0k7K9l5P1L7j18N7Kl5L1
6072B6q7P9nm3M9Jo9O0l1k2L2k9K2J5M2n9K8J1n5L1N5l4l3pLM1L3l0m6O7l3j1
6104Ak7O6n6pO9j0p0K4j1m4R6q0J9K5L3oq4N3Ol7Q4j0k6pm9k8Q1Mml4J5N8J0o4
6138a0lL4k9J0n8O4M2j02O0Mk7J4p0L0K7N5l1m6L0j2Q0o1M0o4J8L4Rr8Q1p3nQ1
$$ plain form
6170 24 -57 -40 -2 53 -58 -4 15 30 -42 -23 40 14 -32 20 -21 -11 -26 -50 18 16 8 -5 48 -56 23 12 21 -11 -7 44 -23
6201 -23 -13 -10 6 -12 44 27 38 34 -45 -16 16 -13 8 5 -53 -21 82 -9 3 13 -21 -37 1 46 0 -8 4 35 -33 -9 27 -31
6233 -31 -38 12 7 -19 12 6 -65 -31 12 8 -19 46 -19 -30 99 -25 -27 22 4 44 8 20 -46 28 6 37 -11 -51 -2 -35 8 44
6265 44 -6 5 28 -48 38 37 -33 52 -35 -34 -8 -1 -17 23 18 -4 -4 53 34 -46 -64 -6 14 -27 28 -39 -60 -24 -3 54 32 -38 -42
6298 -42 -17 -10 -5 -12 -5 14 -32 51 63 6 10 -11 -38 8 -1 -29 21 -10 -34 27 34 -1 -25 -78 -12 49 8 -27 2 -42 100 -68 -24
6331 -24 24 -8 -12 10 26 -27 21 -66 84 -42 17 6 -8 -23 -37 -2 50 58 -54 20 58 -64 58 -5 -68 -27 -32 27 12
6360 12 -15 -3 -14 4 92 47 -31 44 -28 -21 132 -33 -67 14 -18 30 16 -10 -4 7 8 21 -48 19 8 14 41 3 -60 -1 8 -55
6392 -55 -26 26 11 10 9 -49 -24 26 36 13 13 2 -59 41 5 4 2 31 -54 28 49 -26 1 -42 -9 -29 60 -37 22 -75 12 79
$$ packed form
6170B4q1J7L8N5j11N4J9J5p2J9O3k6m6N2m1J0j5k4O8kqj3N3j04P9j1Rl2MN1o7
6201b3J0LJ6j8N6j7J1mp9K9L2k9K1ln8L2J03r1J2J0l4j6L8M5m6qJ2L1o8K4L6n8
6233c1pN0nk6L1op1L4M3mk7O5o5j1J29j24kM9j8M0l6J2o6P4k2L1m8m0M9l3M3L6
6265D4n0J1K3p6Q6jp0Q5q7JK6Pj6M0nk2%N7j9q0j8N8K0m1N5o7k1L6K1N7k2p0m
6298d2K5PNpPJ9m6Q3J2n7Mk1k7M6rk8N0l1k4O1Pl5k4n3O6O1m1l5K9m4J42j68M4
6331b4M8l2mK2J6n3M8q7J50j26N9j1j4j5j4L5N2Qj12P4L8j22J22o3o3M1nN9j5
6360A2k7J2j1J8Q8m5p8P5p2PJ53j65l4Q1l2M8j4k6OJ1JJ3o9O7j1OK7l8o3N9Ro3
6392e5K9N2j5jjn8K5N0J0k3%j1o1J00l6jkK9q5Q2K1p5K7m3L3k0Q9r7N9r7Q7O7
$$ plain form
6424 79 -22 50 -36 -27 -31 40 -12 44 -8 -48 66 33 26 37 -23 -23 18 59 11 -68 -23 8 -10 28 55 -23 10 -3 -40 18 59
6455 59 -68 -57 -30 -35 -18 27 1 -29 13 -13 -13 -56 11 -11 -40 15 -27 -66 18 -44 -35 87 21 22 -16 28 24 30 -55 8 -34 -6
6487 -6 55 -10 19 -11 -32 -5 54 11 -21 -1 -27 -24 12 -18 -42 -60 16 -9 20 23 3 -15 13 7 -58 66 1 -13 27 36 -23 58
6519 58 7 -27 1 -2 6 -13 -23 9 -31 -16 78 29 14 55 -46 61 1 6 90 -2 -38 7 -30 -23 -18 -51 17 -83 -32 12 11 -56
6551 -56 56 -17 2 46 -49 -14 60 0 72 22 -54 18 -45 27 36 -24 8 34 -18 23 17 -8 -8 4 -68 37 4 -23 39 -16 11
6582 11 27 25 40 -16 14 19 -62 -41 36 5 -63 16 -17 -17 32 8 -31 -6 9 -25 18 -70 26 -23 51 45 -2 54 9 -9 40 13
6614 13 30 31 -12 -16 -46 -14 -41 -3 -40 38 9 -3 -8 29 19 14 -41 -59 31 -2 9 14 6 1 -11 -22 22 13 14 -36 -28 14 9 -61 -2 -15
6650 -15 -18 -37 31 8 11 -18 -24 32 15 -45 26 -13 -22 27 25 -11 19 40 -4 11 12 65 -79 -10 87 -30 -14 43 -2 5 -14 -11 -1
$$ packed form
6424G9j01P2q6RmP1n2N6n2m0J14l3pJ1o0%M1M1m8p9M5L1j8L8K7p8L3j3l7N8M1
6455E9j27J1K7nJ7M5k6l0M2k6%m3O7k2k9N5m2l9Q4o2RJ22o6Jl8M4mOq5O3m2K8
6487fO1o5K9l0k1K7N9m3l2K0k6LL6l0k4j8P6k5K9Lk0j8K8oo5J24o5j4M0Rn9Q1
6519E8n1l4K8lQj9j0L2m0J5R4m9j5M1j01J07o0NQ4r2l6M5l7PNl3O8j00N1M4jo7
6551e6J12p3J9M4r5L5P4o0P2n0p6P2o3P2Ro0L2K6n2M1ok5%J2p2J05l3k7O2n5K7
6582A1J6kJ5n6L0Nq1K1P7l1o8P9l3%M9k4l9K5J5l4M3q8R6m9P4om7N6m5j8M9k7
6614A3J7Jm3ml0L2k7L8l7P8k9j2nL7j0nn5j8R0l3J1Nqnj2j1M4rJn0QM2np0N9j3
6650a5lj9O8k3Lk9oN6j7o0P1l9rM9kl6L0K1m4J5JN3j44O9R7j17J6N7m5Pj9LJ0
$$ plain form
6683 -1 19 -1 54 -13 -3 2 -53 53 3 32 78 25 -25 25 2 -38 -14 18 14 20 -60 -2 -51 -13 -13 -44 19 16 -20 -37 23 -17 -43
6716 -43 -29 -81 34 48 -13 -35 -13 22 78 -27 30 -40 -34 45 9 -75 65 -1 -34 45 -28 -88 18 -17 -15 1 -5 13 16 41
6746 41 37 -1 -14 32 13 15 23 -63 -41 -4 -102 18 -43 -13 9 -26 5 17 -12 -27 42 -3 3 -6 -20 26 -2 2 -3 40 8 -40 3
6779 3 -8 6 6 54 3 -45 19 27 70 18 -41 28 85 -54 -10 34 -43 -15 -52 -38 -3 2 -8 53 1 35 3 20 -15 1 11 0
6811 0 -50 -8 71 -10 -3 25 15 10 38 -29 -8 -3 27 27 13 -12 28 53 19 -50 -9 19 29 -47 9 62 -61 -74 -19 -27 42 51 -53
6844 -53 3 -51 -19 -9 -4 16 11 -74 11 -14 -1 17 -7 19 71 26 -19 7 0 17 -13 37 -11 -26 25 -4 6 4 9 -42 39 46 2
6877 2 20 7 -26 15 31 -15 30 -14 -61 16 -20 17 21 -81 13 56 -61 20 16 -30 36 4 12 40 -10 -44 -21 -7 -16 50 -16 -4
6909 -4 -9 34 7 -8 -27 -9 -37 14 41 -9 -5 10 -83 -5 -5 -16 -44 -27 135 -37 -16 -8 -14 -24 9 19 3 32 -10 -28 -44 -35 54
$$ packed form
6683aK0k0N5o7J0Nn5J06n0K9M6n3n0N0k3m0K4L2mOq0N8m9L8%l1O3ll6j7O0m0k6
6716d3J4n2J15J4o1k2K2L5N6j05N7p0OP9l6q4J40o6l3P9p3o0J06l5KJ6oJ8LK5
6746D1ml8j3M6j9KQq6K2L7r8J20o1L0K2l5L1J2k9j5O9m5Orj4M6k8MnM3l2m8M3
6779Cj1J4%M8n1m8O4QM3n2n9O9N7j39M4M4p7K8l7J4L5Nj0O1n2L4l2J7l5J6J0j1
6811@n0M2P9q1PK8j0nK8o7K1NL0%j4k5M0K5l4o9M1K8J0p6N6N3j23j3N5qO9Rj04
6844e3N6n4L2J0NK0nq5Q5k5J3J8k4K6N2m5m5K6pJ7l0N0m8j5N1k9J0kNn1Q1Pm4
6877BJ8j3l3M1J6m6M5m4m7P7l6L7Mj02R4M3j17Q1mm6O6l2QK8n0l4K3J4rO6o6J2
6909dnM3k7j5j9J8k8N1K7n0MJ5r3P8%j1k8J7J62j72K1Qoj0L3J0j6K9m2j8j6RQ9
$$ plain form
6942 54 52 -1 -46 14 5 41 1 -5 -17 -38 85 -18 -33 35 -44 -18 23 16 -38 19 -42 -10 50 6 -22 23 22 41 -3 0 -10 32
6974 32 -81 9 -7 14 4 -53 -4 -1 5 26 44 28 33 16 -18 6 44 29 -20 -2 -16 -33 -39 9 1 -25 -14 -16 -19 49 8 -5 61
7007 61 40 13 -52 47 44 -27 2 7 -9 9 11 -1 -16 1 28 22 -22 -11 62 -47 -42 8 -58 18 36 -31 19 -5 -19 52 55 10 8
7040 8 12 -34 29 -32 -19 27 -65 25 25 -31 -4 -42 24 49 -14 -22 9 15 80 -26 31 2 21 12 -15 4 -45 43 -77 2 10 -13 41
7073 41 14 -7 -7 22 25 34 -20 -18 35 68 3 58 -47 -15 25 -14 22 29 19 27 -27 7 45 -57 -15 30 -4 22 45 -60 -16 20
7105 20 16 3 -18 -44 -14 5 -2 4 -30 30 -15 -10 15 -29 -45 60 16 -9 37 -25 14 3 27 96 -12 -3 6 -47 9 21 -45 32
7137 32 28 -24 -21 44 -24 46 19 -34 -15 15 4 21 -38 -44 25 -58 -50 0 9 -32 -14 -3 50 -18 16 -16 -54 59 16 -14 -47 -19
7169 -19 7 61 36 0 68 -14 44 36 64 27 -1 -14 7 -60 -43 -15 -8 -65 1 -30 18 53 1 -30 -12 -44 10 -27 11 -23 -25 -39
$$ packed form
6942E4kn3m5O0rL6m0oj2k1J23j03j5O8p9K6M1pn4N7o1L2O0m4k8M5jJ9m4Lj0M2
6974C2j13R0j6K1j0n7M9LOK1J8j6Nj7l4K4L8j5m9J8j4j7oM8qk6J1klO8m1j3O6
7007F1k1k7o5R9lp1K9Nj6J8Kj2j5J7K7om4J1P3j09NN0o6P6J8o7N0k4j4P1Lm5k
7040HMm6O3o1J3M6r2R0%n6K7l8O6K5o3qL1OO5j06N7k9J9rk7J9m9Q8j20P9Qk3N4
7073D1k7k1%K9LRn4KN3L3o5N5j05L2M0l9L6Pj0Qn4L4L8j02M2M5l4K6K3j05M4L6
7105B0mj3k1k6L0J9pOl4O0m5NK5m4j6J05m4k5M6o2L9j1K4O9j08RRn3N6J2o6P7
7137C2mn2LO5o8P0k7n3J9L0j1J7n9oO9q3QN0Rm1J8J1N3o8L4l2l8J13m3l0l3K8
7169a9K6N4k5l6O8q2N8qK8l7k8j3K1o7J7K8Pn7O6l1M8L5n2l1J8l2N4l7L8l4kj4
$$ plain form
7201 -39 -7 -24 11 36 -53 -47 50 2 -18 25 -35 7 30 -6 34 -11 2 -8 -34 27 -9 2 65 8 -33 73 -35 -18 10 -21
7231 -21 19 31 -19 44 5 -34 -8 -35 -4 59 -16 -3 68 -42 27 28 -44 35 44 -53 37 -26 24 36 -30 38 23 6 15 14 -2 46
7263 46 20 -14 42 40 -2 110 -26 -3 38 -88 -14 -30 5 17 -14 -3 5 -48 35 48 -46 -36 -8 -39 66 -50 -17 -1 10
7292 10 -13 -28 3 -39 16 23 29 2 34 -26 17 -13 33 15 27 21 -39 3 23 34 -50 -6 13 24 -30 28 47 49 25 -32 2 31
7324 31 25 -61 54 -13 -41 70 -27 17 -23 5 17 39 32 69 -15 -51 13 24 24 34 -26 -32 4 -11 -31 62 -39 -27 -9 -29 13
7355 13 -11 -47 4 -17 43 19 -46 9 16 -28 41 -10 -30 16 68 -13 52 -17 -18 14 62 32 -70 26 20 25 -4 31 -37 2 6 -40
7387 -40 -4 33 13 3 4 -8 81 7 84 -20 25 -45 -16 4 25 41 -31 -23 -33 -9 52 -9 -5 -14 63 -14 27 -24 31 47 -25 9
7419 9 53 1 -12 26 11 22 -6 -11 19 53 13 31 -8 -29 -36 -9 1 -36 -49 -15 1 15 24 62 27 -24 0 24 3 -25 23 6
$$ packed form
7201c9L2j7L5K5q9OR7m8k0M3o0M2K3l6M0m5J3j0k6O1l6J1O3n7m1J06j08J7K8l1
7231b1M0J2n0O3l9l9K6k7L1O3p5J3P1j10O9Jp2P9Rr7R0o3N0J2o6O8j5j7Rjj6M8
7263D6k6l4N6km2J12j36K3M1j26P4j6L5J2l1J1Qn3Q3J3r4J0K8l1J05j16L3J6J1
7292A0k3j5L1m2N5POk7L2o0M3l0M6j8J2oo0M2K0J1q4M4J9J1n4N8J9Kk4n7L4K9
7324C1oq6J15o7k8J11r7M4m0K8J2K2pL7q4l6O4J1%J0o0oL6j5k0R3j01J2J8k0M2
7355A3k4l6N1k1O0k4o5N5Pm4O9n1k0M6N2q1O5o9jL2M8l0j02R6oNk9L5o8L9Mm6
7387d0L6L7k0j0Jj2Q9p4P7j04M5p0K9K0K1J6p2Qj0K4O1o1MrP7p7M1n1N5J6p2L4
7419IM4n2j3L8j5J1k8nL0L4m0J8l9k1pK7J0l7j3L4J6J4RL8l5n1K4K4k1k8M8j7
$$ plain form
7451 6 29 32 -4 15 -40 -50 72 20 -31 9 -53 11 -3 -23 12 16 -53 -47 -24 0 40 -32 -20 -7 13 -2 45 -25 -16 27 -1 -43
7483 -43 40 -37 1 17 -10 7 -6 19 -47 5 12 10 -33 14 34 16 29 -26 -48 44 -33 60 18 10 -23 3 -30 -36 63 5 -15 -45
7515 -45 -65 20 17 27 38 -18 52 72 16 25 -21 -34 36 -29 -2 0 -21 3 8 39 14 13 30 48 12 25 -46 4 1 26 -6 8 48
7548 48 -60 -17 23 22 -15 74 -14 13 1 -49 13 -17 -3 13 -11 105 21 12 -4 -12 67 54 32 30 1 -8 -80 -29 -39 20 -11 -20
7580 -20 -6 5 -3 -14 21 -9 -13 3 23 43 -21 19 16 -89 47 -31 -30 67 -39 26 37 -45 -42 37 -32 60 7 -42 3 3 3 -28
7612 -28 -37 -29 4 -18 -48 -9 30 -32 0 -15 7 -41 19 -7 -34 5 5 36 17 6 -8 33 -30 31 41 -13 5 16 -32 13 -61 -63
7644 -63 26 71 10 40 21 5 -9 -34 22 1 -9 -38 5 -35 13 -41 34 2 -17 28 -11 -12 38 -14 -36 -8 73 -3 41 -7 -8
7675 -8 11 24 -6 -5 60 76 22 -33 -18 -13 -20 -41 -49 62 22 -32 18 48 -8 4 12 -59 -30 16 -23 47 49 -29 -6 -8 76 18 -82
$$ packed form
7451FK3Ll6J9n5j0J22n2n1M0o2O4j4k0L5Mo9OK3K4M0p2J2J3K0j5M7p0RM3k8m2
7483d3Q3p7L8J6k7J7j3K5o6N2Pkm3M7K0j8J3n5k2R2p7R3m2ql3K6l3oR9n8k0l0
7515d5k0Q5lJ0J1n6P0K0n6Rm6j3P0o5K7Kk1K4NL1k5jJ7J8l6J3p1N0lK5l2J4M0
7548D8j08M3M0jl7Q9q8K7j2n0O2l0J4J6k4J16q4rj6qP9j3k2kk9rp2N1j0N9l1r
7580b0J4J1qj1L5l0mJ6K0K0o4M0lj05J36p8JR7j06O5J1q2LP9o9R2n3m9M5%%l1
7612b8rQL3k2l0L9L9o2L2j5K2m8O0k6k7L9%L1j9j1j4M1o3O1J0n4J8J1m8M5p4k
7644f3Q9M5o1L0j9j6j4k5N6k1j0k9M3m0M8n4P5l2j9M5l9jN0n2k2K8Q1p6M4m8j
7675hJ9J3l0JO5J6n4n5J5Npk1qJ11m0n4N0L0n6J2Qp1K9M6l9P0Kp8K3kQ4n8j00
$$ plain form
7708 -82 7 14 -13 16 -70 -6 35 -77 -52 -8 -28 32 40 17 27 3 5 -17 -22 -17 -24 -68 42 48 -27 -13 7 -27 2 19 -10 18 2
7741 2 -10 21 -27 -36 65 -20 6 -11 3 -2 2 36 -23 -17 22 5 33 -17 -19 47 -51 -18 -2 4 -41 22 25 12 46 67 -77 14 -62
7774 -62 -13 34 56 -50 9 28 -59 -23 54 18 4 -14 40 -23 -9 35 -31 -4 20 -1 -15 25 -4 -45 3 -21 -28 -9 -3 1 4 79
7806 79 -42 -3 -28 3 -14 28 6 -20 3 -28 -29 25 -43 -32 12 37 19 8 -56 -1 48 -20 63 -53 26 -5 -14 18 51 -20
7836 -20 -14 9 -21 50 21 -36 8 -46 -11 0 -72 5 -27 23 -45 -45 -3 -6 -6 -7 -12 6 -67 59 -61 0 -38 32 -12 5 -80 -28
7868 -28 24 -36 61 -23 -73 77 16 37 -21 -19 -47 -18 -43 17 6 -14 -29 -32 33 16 43 -34 -45 25 20 -17 -52 8 -68 -63 24 41
7900 41 4 2 7 26 16 -15 7 -70 -18 3 -44 -35 13 -23 -6 87 5 32 21 12 41 -3 -19 -6 -58 -21 50 -42 75 -8 -54 5
7932 5 26 -57 32 -1 -46 3 -17 -6 42 -5 -9 -19 -18 31 -29 56 5 -81 6 18 -8 55 -41 5 -24 -5 -3 59 9 -2 -21 -22 -7
$$ packed form
7708h2Q9Pk7K9q6O4M1j12K5M4k0O0Qk3J0k4Kk2nNpm4J10Op5J4K0l4K9J7k9K8j6
7741Bj2L1m8rJ01q5K6j7J4nML4n9OL9j7K8n0kO6r8L3J6Om5O3Lj3L4K1j44R1p6
7774f2M9M7K2j06N9J9q7L6P7l6j4j8N4o3J4M4o6K7K4k1j4M0k9m1M8k4pJ9OMLP5
7806G9j21L9k5L1j7M2k2k6K3l1jN4o8J1M4K5j8j1o4N5M9o8Q3j16P9l1rL2L3p1
7836b0OK3l0P1k9n7M4n4L5J1p2P7l2N0o8%M2l%jnJ8p3J26j20O1l8P0m4J7q5N2
7868b8N2o0R7q4n0J50o1K1n8Kk8K9k5O0j1k0j5lO5j7K7p7j1P0nl7l5O0p6NQ7J7
7900D1l7kNJ9j0l1K2p7N2K1m7RM8l6J7R3q2K7j1rK9m4j6J3n2L7P1r2J17q3m6N9
7932EK1q3Q9l3m5M9k0J1M8m7mj0JM9o0Q5n1q6Q7J2k6O3r6M6k9J9KO2n0j1j9jJ5
$$ plain form
7965 -7 -10 -6 14 15 -26 74 -44 0 51 28 -15 28 -29 -56 -13 -30 1 -6 -24 -4 -35 -8 73 5 -39 38 -44 7 31 -15 -33 4
7997 4 27 57 4 17 21 -24 -19 40 33 2 -83 -7 -46 14 -3 39 -50 10 39 -23 18 36 0 45 59 -61 44 -47 -13 -32 9
8028 9 29 61 -11 35 -14 -3 39 24 -37 37 -21 -34 12 3 -51 53 -34 16 -24 32 -5 -46 -15 27 11 -20 57 -70 10 47
8058 47 -31 -7 -15 18 24 -13 35 -16 48 17 6 -1 -30 21 -53 4 12 -15 -28 17 -61 -3 19 -35 -5 -11 31 -35 -30 41 -24 -26 23 2
8092 2 2 22 -4 30 76 -15 32 40 -12 -27 43 0 14 -44 -26 9 -3 -8 1 -18 -32 16 -12 4 -44 21 -17 15 -27 64 37 -23 6
8125 6 -42 8 0 9 -29 12 33 36 -57 24 -16 -61 40 -28 -20 18 27 2 50 -10 -8 -4 -11 -33 -2 -21 -5 -9 -48 -16 -8 2 1 43 -7 10
8161 10 -21 8 -35 -3 32 19 -44 3 -33 11 -49 6 -13 -13 -3 18 -11 -4 -31 -25 -35 5 7 2 -16 -13 35 50 -18 65
$$ packed form
7965glMK0Jm1J00j18M4N1k3m3M3n7k7M3j7L1pj8K0l1K7Q1o8m4P7q2N1K4m6j8L7
7997DK3L0n3J3Mm5NN9pl1q5P6l9O0j7M2q9O0K9o2M1J8l6M5J4j20J05r1L4j9M1
8028IK0L2p2M6m9J1M2j5o1P4n8j3M6rn4J04q7N0m0N6l7m1L1M2j6l1P7j27Q0L7
8058D7p8K4qL3Ol7M8n1O4l1j1pk9N1p4N7Qk7j3M5p8N8K2n4L0oM2o6NP1o5kM9k1
8092B%K0k6L4M6r1M7Qn2j5P0m3J4n8J8L5j2nRj9j4M8k8J6m8O5l8L2m2R1k7o0K9
8125Fm8N0qRl8M1K1Lr3Q1m0m5J01o8QL8Rk5M8o0KMpk2L1j9J6ml9L2QJ0jM2n0J7
8161A0l1K9m3L2L5j3o3M7l6M4o0N5j9%J0K1k9Pk7Oj0M0Knj8LM8J5o8Q3
8191F5
$$ Imaginary data points
##PAGE= N=2
##DATA TABLE= (X++(I..I)), XYDATA
$$ plain form
0 0 0 0 0 0 0 0 0 8 -8 8 -8 16 -19 24 -32 40 -48 57 -72 85 -104 121 -145 169 -201 233 -270 314 -359 412
30 412 -472 539 -609 689 -782 880 -988 1105 -1236 1379 -1536 1703 -1889 2092 -2315 2556
46 2556 -2819 3108 -3425 3774 -4156 4580 -5048 5571 -6158 6817 -7569 8432 -9440 10624
60 10624 -12053 13800 -16009 18894 -22836 28563 -37676 54396 -94900 392329 142018 -773671
72 -773671 239608 406458 -427835 -138655 597900 -95575 -520516 147418 318390 -182628
82 -182628 -20286 178415 -162736 -200021 204644 163184 -111870 -84011 52631 -51386 -82538
93 -82538 170572 195435 -249981 -247785 271057 162324 -285157 62644 306660 -313706 -319278
104 -319278 477251 239204 -488886 -35640 374010 -236830 -202698 433889 49306 -440061
$$ packed form
0@%%%%%%%Qj6J6j6K4l5M3n6P2q8J05j29J57j89K25k66L14l70M34n03N84o73P71
30D12q84J011j148J298j471J662j868K093k341K615k915L239l592L981m407M871
46B556n375N927o533P199p930Q736r628J0619j1729J2975j4386J6001j7872K0064
60A0624k2677K5853k9809L4903m1730N1399o6239R2072j49296M87229k50311r15689
72g73671J013279J66850q34293K89180P36555o93475m24941O67934J70972n01018
82a82628J62342J98701l41151l7285M04665m1460k75054K7859J36642j04017l1152
93h2538K53110K4863m45416K196N18842j08733m47481L47801K44016o20366n572
104c19278P96529k38047p28090M53246M09650o10840L4132O36587l84583m89367
$$ plain form
114 -440061 64317 256990 -143317 431 194990 -188666 -188014 234034 91368 -163444
124 -163444 72803 59125 -222017 1168 266189 -3986 -194763 -10288 80976 -11698
134 -11698 -19031 80457 46025 -150455 -112404 175575 138846 -149046 -72906 109947 -64091
145 -64091 -88084 190792 67155 -225318 -14137 137653 -78744 17466 162173 -149714
155 -149714 -170770 198767 76275 -170703 88141 114311 -237679 -57310 295363 -4031
165 -4031 -233964 80880 98550 -156664 23720 189738 -73172 -158231 52312 76443 -18883
176 -18883 7868 19763 -51296 -50974 42984 74584 -6790 -58957 -9318 12878 -21364 38064
188 38064 81515 -75197 -114998 95980 73526 -107587 31710 107377 -142425 -89015 195031
$$ packed form
114d40061N04378J92673m00307J43748J94559l83656O52M22048j42666k54812
124a63444K36247j3678k81142K23185K65021k70175j90777J84475R1264r2674
134a1698p333R9488l4432j96480L8051K87979l6729k87892P6140J82853j74038
145f4091k3993K78876j23637k92473K11181J51790k16397R6210J44707l11887
155a49714k1056L69537j22492k46978K58844K6170l51990J80369L52673k99394
165d031k29933L14844J7670k55214J80384J66018k62910q5059K10543K4131r5326
176a8883K6751J1895p1059L22R3958L1600q1374n2167M9639K2196l4242N9428
188C8064M3451j56712l9801K10978k2454j81113J39297P5667k49802N3410K84046
$$ plain form
199 195031 41529 -172092 36333 103054 -121999 -26060 175936 -32334 -159411 68918
209 68918 76797 -85295 24323 83925 -87187 -67451 87996 34033 -53401 9875 21253
220 21253 -51453 -11917 70278 17618 -57150 -18786 29861 6308 -14647 21067 24914 -51968
232 -51968 -40770 71739 32401 -70225 7582 47634 -60089 -19024 92073 -7941 -87792
243 -87792 33596 50612 -60322 3093 79297 -50581 -70472 75912 29863 -71070 25333
254 25333 46861 -65587 -19796 74285 -2528 -57556 20943 28318 -39536 -1661 49544 -15911
266 -15911 -42842 21463 23092 -18571 -3210 18559 -5015 -24602 7579 32122 -12415 -28951
278 -28951 22347 12003 -32577 8643 35541 -25195 -30916 34407 15934 -40003 8364 39307
$$ packed form
199A95031j53502k13621K08425O6721k25053R5939K01996k08270j27077K28329
209F8918P879j62092J09618N9602j71112J9736J55447n3963q7434O3276J1378
220B1253p2706L9536Q2195n2660p4768L8364M8647k3553k0955L5714L847p6882
232e1968J1198J12509l9338j02626P7807M0052j07723M1065J11097j00014p9851
243h7792J21388J7016j10934O3415P6204j29878j9891J46384m6049j00933R6403
254B5333K1528j12448M5791R4081p6813n5028P8499P375o7854L7875N1205o5455
266a5911k6931O4305J629m1663J5361K1769k3574j9587L2181K4543m4537j6536
278b8951N1298j0344m4580M1220K6898o0736n721O5323j8473n5937M8367L0943
$$ plain form
290 39307 -35020 -25474 51703 688 -47498 25889 27908 -41237 -3943 43068 -15145 -34851
302 -34851 28155 18492 -36678 2077 35172 -21921 -22973 30957 5267 -27595 8321 19187
314 19187 -13613 -12084 16591 7978 -19110 -942 20381 -8448 -16317 15305 8535 -18206 -2549
327 -2549 18409 -3867 -19652 12602 16842 -23506 -5870 28982 -10295 -23189 23894 10274
339 10274 -28000 4097 25392 -15239 -18211 23990 6581 -28595 8817 23940 -23226 -10962
351 -10962 27254 -4728 -21161 14321 10621 -17103 -2314 17431 -2806 -15700 8577 10898
363 10898 -12693 -2023 13600 -5132 -11376 6474 9183 -5775 -8462 7942 3901 -14379 4864
376 4864 17712 -14082 -13071 17621 2723 -15086 9062 12145 -17697 -8910 22557 2667 -20022
$$ packed form
290C9307p4327R546P7177n1015m8186P3387K019o9145L7294M7011n8213j9706
302c4851O3006r663n5170L8755L3095n7093j052N3930k5690l2862L5916J0866
314A9187l2800J529K8675q613k7088J8168K1323k8829p869L1622o770k6741J5657
327b549K0958k2276j5785L2254M240m0348J7636L4852l9277j2894M7083j3620
339A0274l8274L2097K1295m0631k972M2201j7409l5176L7412J5123m7166J2264
351a0962L8216l1982j6433L5482l700k7724J4789J9745k0237j2894K4277K321
363A0898k3591J0670J5623j8732o244J7850K709j4958k687J6404m041j8280J9243
376D864J2848l1794J011L0692j4898j7809K4148L083k9842Q787L1467j9890k2689
$$ plain form
389 -20022 9227 9612 -21178 3429 23769 -11741 -15836 11205 2081 -8578 9057 8905 -13940
402 -13940 -10158 12735 6665 -6102 3346 -202 -11815 1450 12897 4278 -7452 -9975 2058
415 2058 5623 -2231 7371 5280 -19551 -8290 19923 6763 -10067 1757 206 -14746 3991
428 3991 24964 -3496 -21222 4674 2882 -8373 18310 11271 -26400 -9804 16097 966 198
441 198 12187 -9098 -24076 6173 25099 313 -11281 -885 -7609 -5112 16500 13649 -6727
454 -6727 -16983 -10921 12426 17831 -2941 -6157 -4400 -14858 1972 26308 6748 -20048 -11057
467 -11057 1398 1922 16190 14990 -21545 -21565 14192 7015 -972 20992 -6762 -40512 4644 36476
481 36476 370 -13686 2338 -10585 -16282 18926 28462 -9021 -24997 -8796 5595 18966
$$ packed form
389b0022K9249L85l0790K4607K0340l5510m095K7041r124j0659J7635j52k2845
402a3940L782K2893o070j2767R448l548j1613J3265J1447q619j1730k523J2033
415B058L565p854R602k091k4831J1261K8213j3160j6830J1824j551j4952J8737
428C991K0973k8460j7726K5896j792j1255K6683p039l7671J6596K5901j5131p68
441A98J1989k1285j4978L0249J8926k4786j1594J0396o724K497K1612k851k0376
454f727j0256O062K3347N405k0772l216J757j0458J6830K4336j9560k6796Q991
467a1057J2455N24J4268j200l6535k0L5757p177p987K1964k7754l3750M5156L1832
481C6476l6106j4056J6024j2923n697L5208R536l7483j5976J6201J4391J3371
$$ plain form
493 18966 13190 -11630 -12969 -6364 -5491 19557 26226 -14844 -29902 -2568 12847 14448 11098 -10068
507 -10068 -23246 -4686 11813 11480 15575 -2527 -39055 -11640 40439 13985 -18578 2791 -6503
520 -6503 -26638 14708 39373 -2418 -29515 -13814 2707 16116 20565 -4453 -22082 -7198
532 -7198 -1699 4939 31900 9059 -43657 -20073 27853 15951 606 3073 -15078 -21995 4873
545 4873 24859 17994 -7175 -31619 -17844 25354 26635 -8799 -8600 -1895 -24360 -1727 44402
558 44402 13216 -33866 -18540 2912 10509 22372 6193 -21699 -14487 -559 3087 23959 22085
571 22085 -31566 -39683 21665 30431 -7839 746 3404 -29870 -11872 33481 23481 -10424 -24011
584 -24011 -17081 10513 26334 6046 -10779 -7619 -14844 -9619 29986 29894 -24524 -32451 4524 11253
$$ packed form
493A8966n776k4820j339O605Q73K5048O669m1070j5058K7334J5415J601l350k1166
507a0068j3178J8560J6499l33M095j8102l6528K7415N2079k6454l2563K1369r294
520f503k0135M1346K4665m1791k7097J5701J6521J3409M449k5018j7629J4884
532g198N499O638K6961k2841n2716K3584M7926j1902j5345K467j8151o917K6868
545D873J9986o865k5169k4444J3775M3198J281l5434J99O705k2465K2633M6129
558D4402l1186m7082J5326K1452P597J1863j6179k7892P212J3928L646K0872j874
571B2085n3651q117O1348Q766l8270Q585K658l3274J7998M5353j0000l3905j3587
584b4011O930K7594J5821k0288j6825L160p225N225L9605r2n4418p927L6975O729
$$ plain form
598 11253 11468 15560 -10897 -24588 -3748 7453 16831 21929 -14962 -39588 2742 32823 3813
611 3813 -6954 6389 -17992 -25567 24359 34171 -10445 -22053 -9811 -2541 17144 18880 -6898
624 -6898 -13636 -9120 -8503 14485 30449 -4749 -34059 -6998 16740 7002 8521 5702 -21484 -18149
638 -18149 11621 16823 11180 -2402 -27110 -12908 22767 14500 -4843 731 -9073 -22118 8729
651 8729 32875 1505 -22561 -7431 -1625 3099 20775 6187 -19531 -9996 -392 2820 20191
664 20191 9492 -24330 -16496 11887 10062 3426 6978 -8425 -21511 2380 20874 6502 -3731
677 -3731 -8859 -15359 3911 20053 2832 -6512 -4312 -13058 -1881 21847 9628 -14821 -10361
690 -10361 -372 495 11006 12771 -10471 -16433 2462 5535 5840 11788 -7535 -20164 3220 12482
$$ packed form
598A1253K15M092k6457j3691K0840J1201R378N098l6891k4626M2330L0081k9010
611C813j0767J3343k4381p575M9926R812m4616j1608J2242P270J9685J736k5778
624f898o738M516O17K2988J5964l5198k9310K7061K3738r738J519k819k7186L335
638a8149K9770N202n643j3582k4708J4202L5675q267j9343N574r804j3045L0847
651H729K4146l1370k4066J5130N806M724J7676j4588k5718R535R604L212J7371
664B0191j0699l3822P834K8383j825o636L552j5403j3086K3891J8494j4372j0233
677c731n128o500J9270J6142j7221r344K200q746J1177K3728j2219k4449M460
690a0361R989Q67J0511J765k3242n962J8895L073L05N948j9323j2629K3384R262
$$ plain form
704 12482 1462 4018 -1179 -16200 -4409 15533 7744 -4932 -3284 -6715 -6671 11527 12850 -7213
718 -7213 -7738 -1148 -4398 6883 13463 -5389 -11659 -452 976 3785 9526 -1444 -12781 -3310
732 -3310 6858 3442 3121 1913 -10163 -7010 9368 5883 -1334 1394 -6800 -7657 8891 7844 -4187
747 -4187 -1383 -1581 -7070 2900 11619 -1159 -9692 219 1719 -2670 6763 5292 -9814 -4377 5517
762 5517 189 2177 4510 -6152 -6011 4506 3724 -389 1084 -1594 -5516 506 6262 603 -2603
777 -2603 -605 -3422 82 6394 -646 -3342 2122 -3046 -2670 7599 2268 -6913 -471 3354 -2473
792 -2473 -11 5589 -1992 -6846 3011 3895 -3777 1699 2786 -6071 -591 5700 -1455 -1831 2363 -1642
808 -1642 -2337 2707 2108 -1799 -1121 848 -799 147 2137 -1338 -1315 1546 -1826 -209 3810 -2358 -2720
$$ packed form
704A2482j1020K556n197j5021J1791J9942p789j2676J648l431M4J8198J323k0063
718g213n25O590l250J1281O580j8852o270J1207J428K809N741j0970j1337R471
732c310J0168l416l21j208j2076L153J6378l485p217K728q194q57J6548j047j2031
747d187K804j98n489R970Q719j2778q533R911J500m389R433j471j5106N437R894
762E517n328J988K333j0662J41J0517p82m113J473k678l922O022N756n659l206
777b603J998k817L504O312p040k696N464n168L76J0269n331r181O442L825n827
792b473K462N600p581m854R857Q84p672N476J087q857N480O291p155l76M194m005
808a642o95N044n99l907O78J969j647R46J990l475K3K861l372J617M019o168l62
$$ plain form
825 -2720 3823 -539 -2938 3322 1227 -3824 558 3342 -1883 -1941 3446 -213 -4069 2930 2253 -4638
841 -4638 1045 3409 -3736 -517 3569 -1864 -1623 2402 42 -1797 921 1352 -1404 -265 1865 -1200
857 -1200 -943 2124 -1072 -1153 2242 -1245 -1395 2519 -1063 -1702 2265 -369 -1988 1746 1023 -2104 114
874 114 2289 -1299 -1631 2947 -187 -3499 3000 1702 -4311 1348 2816 -3700 -61 3617 -1968 -2211
890 -2211 2143 513 -2002 1110 1804 -2478 -802 2935 -933 -1001 2340 -1690 -1854 2906 147 -1501
906 -1501 1262 -1039 -1644 2000 987 -1195 -197 -230 -1316 897 2967 -1294 -2817 2073 -40 -2126
922 -2126 4205 1294 -5692 366 3481 -1756 543 2450 -3178 -2999 2948 2398 -1436 107 -174 -3814
938 -3814 1135 5462 -1530 -2680 1370 -2278 -726 5369 737 -4107 -1076 45 574 3037 1140
$$ packed form
825b720O543m362k399O260k095n051M382K784n225n8N387l659l856O999o77o891
841d638N683K364p145L219M086n433K41M025k360j839K718M31k756J139K130l065
857a200K57L067l196q1L395l487j50L914l582o39L967k634j619L734p23l127K218
874A14K175l588l32M578l134l312O499j298o013N659J468o516L639L678n585k43
890b211M354j630k515L112O94m282J676L737l868o8L341m030j64M760k759j648
906a501K763k301o05L644j013k182R98l3j086K213K070m261j523M890k113k086
922b126O331k911o986O058L115n237K299J907n628J79N947n50l834J543k81l640
938c814M949M327o992j150M050l648J552O095m632m844L031J121N29K463j897
$$ plain form
953 1140 -3253 -2637 792 1278 2196 2489 -3854 -4919 3387 3040 -821 2443 -1405 -6488 1697 6006
969 6006 162 -1340 -1326 -3997 -254 6113 2479 -4220 -2099 -622 -2040 5052 6254 -5679 -6028 2607
985 2607 1077 1422 5029 -2088 -7167 -813 4247 3536 1578 -2646 -5962 -1118 5415 3016 -265 -748
1001 -748 -5947 -3675 7730 5593 -3538 -2879 -2897 -2554 5557 6300 -2415 -4871 -2768 -1083 4689 7537
1017 7537 -2306 -9480 -939 4176 667 4583 2930 -9789 -6412 7171 5925 567 -1099 -5850
1031 -5850 -4660 4497 6802 1390 -2541 -5366 -5297 4238 10241 -181 -7575 -2533 -1411 968 8645
1046 8645 2977 -7729 -5737 -267 4184 7984 1088 -8795 -4986 3078 3270 3863 4250 -6226 -11356
1061 -11356 3416 10952 996 -2626 -2847 -7097 169 9528 4123 -3236 -5367 -6083 1449 10669 4463
$$ packed form
953A140m393O16L429M86R18K93o343j065Q306l47l861L264l848n083Q185M309
969F006n844j502J4k671L743O367l634o699K121J477j418P092J202j1933l49Q635
985B607j530L45L607p117n079O354N060p11j958m224l316M844O533k399l281m83
1001g48n199K272J1405k137r131O59j8L43Q111P43q715k456K103J685N772K848
1017G537r843p174Q541N115l509L916j653j2719L377J3583j246n358j666m751
1031e850J190R157K305n412l931k825O9R535O003j0422p394N042J122K379P677
1046H645n668j0706J992N470M451L800o896r883L809Q064J92N93L87j0476n130
1061a1356J4772P536r956l622k21m250P266R359n405p359k131p16P532R220o206
$$ plain form
1076 4463 -7171 -5967 -334 377 5632 8064 -4910 -11368 -549 5768 5335 3783 -5161 -8912 48
1091 48 5105 4323 4046 -3390 -10955 -2047 10525 6022 -3346 -3307 -4462 -4214 7086 9400 -2664 -6931
1107 -6931 -4495 -1632 7573 8599 -4268 -8186 -1772 634 3831 8083 95 -11326 -5367 6632
1121 6632 5943 2304 -391 -7859 -5754 5617 6730 2093 -1224 -8176 -6130 7064 8722 -868 -4396
1136 -4396 -3962 -4082 2855 9868 2209 -7991 -5228 -227 3035 8020 2191 -8636 -5063 1892 2647
1151 2647 5832 3309 -8029 -8015 3320 6731 2655 51 -4253 -7286 1036 8817 3075 -2677 -3861
1166 -3861 -5848 830 9421 3078 -4870 -3822 -3294 255 7733 4703 -5484 -6405 -575 2184 4646
1181 4646 4727 -3976 -8385 240 4880 2825 3130 -2283 -8231 -753 6447 3234 385 -2150 -6140 -1956
$$ packed form
1076D463j1634J204N633P11N255K432j2974o458J0819O317m33j552q944l751Q960
1091D8N057p82k77p436p565Q908J2572m503r368L9j155K48J1300K314j2064m267
1107f931K436K863R205J026j2867l918O414K406L197M252p988j1421N959J1999
1121F632o89l639k695p468K105J1371J113m637l317o952K046J3194J658r590l528
1136d396M34j20O937P013p659j0200K763N001L262M985n829j0827L573O955P55
1151B647L185k523j1338J4J1335L411m076k604m304l033Q322P781n742n752j184
1166c861j987O678Q591o343p948J048N28L549P478l030j0187r21N830K759K462
1181D646Q1q703m409Q625M640k055L05n413n948P478P200l213k849k535l990M184
$$ plain form
1197 -1956 6331 5013 -2047 -3610 -2853 -2053 4411 6685 -2115 -5759 -1582 -44 3492 5721 -1858
1212 -1858 -6099 -1271 1405 2631 4417 -399 -6824 -2996 4362 3352 414 137 -3971 -4502 3743
1227 3743 5286 -404 -1450 -2993 -3506 3319 5521 -721 -2988 -1548 -1756 960 5110 1642 -4812
1242 -4812 -3165 1384 1436 2593 1821 -3928 -3260 1613 1525 2130 1978 -3836 -4061 2528 3322 76 -121 -884
1260 -884 -3380 -450 4531 1765 -2585 -1405 -1307 -433 3830 1673 -3007 -1042 -275 -975 2868 2886 -2621
1277 -2621 -3123 816 1498 569 1299 -339 -3284 -466 2503 516 446 111 -3253 -627 3378 303 -1146
1294 -1146 548 -1343 -1604 2116 2378 -1054 -1616 28 -170 419 2042 -432 -2128 444 11 -319 2282
1311 2282 -51 -2979 314 1513 -666 505 1044 -1529 -1316 1529 1126 -827 280 172 -1764 650
$$ packed form
1197a956Q287j318p060j563P57Q00O464K274q800l644M177J538L536K229p579
1212a858m241M828K676J226J786m816o425L828P358j010k938k77m108n31Q245
1227C743J543n690j046j543n13O825K202o242k267J440k08K716M150l468o454
1242d812J647M549N2J157p72n749O68M873q8O05j52n814k25O589P94l246j97p63
1260h84k496K930M981k766m350J180R8Q74M263k157m680J965P67p00L843J8n507
1277b621n02L939O82r29P30j638k945K818K969j987p0l35l364K626M005l075j449
1294a146J694j891k61L720K62l432n62J644j98N89J623k474j696K572m33l30K601
1311B282k333k928L293J199k179J171N39k573K13K845m03j953J107j08j936K414
$$ plain form
1327 650 2067 -1222 -736 1148 -1232 -446 1996 -155 -1431 323 189 -411 581 594 -823 -416 844
1344 844 -251 -260 1229 -731 -1306 1596 75 -1422 1234 324 -1770 590 1176 -1013 -323 1020 -386
1361 -386 -943 1052 606 -1427 442 1101 -1331 27 1431 -1133 -476 1274 -665 -657 1030 -268 -658
1378 -658 620 197 -699 237 752 -743 -331 1086 -549 -773 1422 -221 -1279 1270 132 -1253 958
1395 958 473 -1238 313 802 -727 -334 827 -362 -931 959 529 -1347 549 1033 -1401 264 1475
1412 1475 -1286 -432 1259 -489 -563 878 -234 -954 428 663 -613 -152 613 -864 -511 1447 -183
1429 -183 -976 908 -363 -838 1409 335 -1209 326 80 -655 729 884 -1072 -840 959 101 -597
1446 -597 1191 16 -2221 549 1772 -857 61 831 -1606 -438 1871 293 -749 -11 -605 -623 1226
$$ packed form
1327F50J417l289M86J884k380P86K442k151j276J754j34o00R92J3j417M07J260
1344H44j095rJ489j960n75K902j521j497K656r10k094K360N86k189O90J343j406
1361c86n57J995m46k033J869O59k432J358J404k564O57J750j939QJ687j298l90
1378f58J278m23q96R36N15j495M12J417j635k24K195j643j058K549j138j385K211
1395I58m85j711J551M89j529L93J161j189n69J890m30j876J896M84k434J665J211
1412A475k761Q54J691j748p4J441j112p20J382K35j276M61P65j477L53J958j630
1429a83p93J884j271m75K247j074j544J535k46p35J384J55j956K32J799q58o98
1446e97J788j175k237K770J223k629R18P70k437J168K309j578j042P38n94j8J849
$$ plain form
1463 1226 1234 -1131 -1052 361 -464 464 1985 -867 -1996 542 316 228 1652 -534 -2133 137 1070 377
1481 377 769 100 -2082 -1087 2163 1314 -1026 -37 -709 -1955 1616 2643 -1128 -1374 -420 -912 1234
1498 1234 2491 -529 -2023 -661 161 788 2105 410 -3049 -1547 1730 995 713 884 -2568 -2410
1514 -2410 1925 1990 386 65 -2103 -2183 1694 2842 145 -1191 -1186 -1690 437 3702 1154 -3065 -1686
1531 -1686 -89 401 2859 1408 -2840 -2251 89 996 2690 1380 -3112 -3078 1107 2409 1101 773
1547 773 -1347 -3903 -66 4280 1490 -1299 -1464 -2747 -231 3983 1989 -1790 -2056 -1905 -91 3611
1563 3611 2861 -2160 -3710 -473 1381 2074 2608 -1283 -4343 -957 2152 2402 2149 -1859 -4536 -318
1579 -318 3054 1868 966 -932 -4096 -1814 3947 3824 -1164 -2465 -1883 -1511 2752 4441 -865 -3676
$$ packed form
1463A226Qk365P9J413q25R28J521k852j129K538k26q8J424k186j599K270R33o93
1481C77L92o69k182R95L250q49k340R89o72j246L571J027l771k46R54m92K146
1498A234J257l020j494J362Q22O27J317j695l459J502L277p35k82J71l452J58
1514b410M335O5j604l21k168q0L877J148k697j336Nn04K127L265k548m219J379
1531a686J597M90K458j451m248N89K340R07J694j310m492L4M185J302j308l28
1547G73k120k556L837M346k790k789j65j283K516M214j994l779k66J51J814L702
1563C611p50n021j550L237J854O93N34l891l060L386L109K50k53m008k677M218
1579c18L372j186r02j898l164K282N761j23m988j301N82L72M263J689n306k811
$$ plain form
1595 -3676 -1727 -484 2521 4253 -705 -4641 -1899 1364 2310 2578 106 -4107 -3249 2232 3718 1441
1611 1441 -755 -3674 -2889 2609 3674 792 -860 -3333 -3208 2569 4823 357 -2809 -2506 -1539 1426
1627 1426 4562 1516 -3919 -3110 176 1546 3658 1859 -4252 -3826 1314 2457 2358 1360 -3296 -4475
1643 -4475 822 4134 2036 -732 -2469 -3386 118 4659 2475 -1945 -2618 -2459 280 4528 2508 -2480
1659 -2480 -2978 -1636 601 3946 2609 -2645 -3970 -640 1779 2670 2385 -1858 -4802 -671 3341 2171
1675 2171 1146 -1280 -4458 -970 3886 2512 -246 -1537 -3199 -1497 3485 3880 -1224 -3267 -1489
1690 -1489 -355 2035 3805 -353 -3969 -1820 710 2458 3063 -874 -3941 -1418 1449 2115 2167 -260
1706 -260 -3700 -2359 2243 3133 565 -1020 -2525 -2329 2012 3426 149 -1298 -2047 -2298 1854 4133
$$ packed form
1595c676J949J243L005J732m958l936K742L263R46K68k472m213Q58N481J486k277
1611A441k196k919P85N498J065k882j652k473J25N777K254m466l166L03R67K965
1627A426L136l046n435Q09L286J370K112j799o111M26N140J143r9r98m656j179
1643d475N297L312k098k768j737r17L504M541k184m420o73J59K739M248k020m988
1659b480m98J342K237L345j337n254j325L330K419Q91k85m243k944M131M012j170
1675B171j025k426l178L488M856j374k758j291j662J702M982L95n104k043J778
1690a489J134K390J770m158l616K149K530J748O05l937l067K523K867O66N2k427
1706b60l440J341M602Q90k568j585j505J96M341J414l277j447p49k51M152K279
$$ plain form
1722 4133 28 -2880 -1365 -234 687 2832 1562 -2974 -3088 836 1937 1530 695 -2422 -2724 1011
1738 1011 1989 1164 661 -2073 -2856 866 3072 980 -1027 -1522 -1480 90 2570 1551 -1350 -1675 -1200
1755 -1200 161 2937 1383 -2419 -1481 205 -132 1482 2098 -1389 -2922 -18 1924 1004 361 -519
1771 -519 -2130 -680 2056 1119 -56 -375 -2016 -833 2432 1330 -1033 -800 -760 -613 1235 1764 -366
1788 -366 -1660 -683 302 976 1432 -414 -1968 -124 653 167 1288 207 -2260 -696 1505 690 49
1805 49 33 -1004 -959 816 1286 -73 -488 -436 -991 655 1683 -535 -1031 222 -524 -123 1574 213
1823 213 -1415 -341 338 139 562 501 -853 -913 670 538 -88 557 -305 -1260 580 1043 -449 29 12
1842 12 -835 93 940 15 -379 -86 -275 -136 680 388 -708 -139 417 -564 332 914 -772 -651 797
$$ packed form
1722D133m105k908J515J131R21K145j270m536j14L924J101m07q35l117l02L735
1738A011R78q25n03k734p83L722K206k092k007m95M2J570K480j019k901l25M75
1755a200J361K776j554l802R38J686l37J614O16l487j533K904J942r20o43q80
1771e19j611J450K736r37j175l19j641J183L265j102k363K33M0J47J848N29k130
1788c66j294R77R85O74M56j846j554J844P77m86J121j081k467J564K201q15o41
1805D9j6j037M5J775M70j359m15N2n55J646J028k218m96J253p46M01J697j361
1823B13j628J074O79j99M23o1j354o0J583j32o26O45q62r55J840M63j492M78j7
1842A2q47R28Q47r25l94K93j89J39Q16k92j096N69N56r81Q96N82j686J21J448
$$ plain form
1861 797 -60 -363 722 -65 -827 210 558 -314 -90 403 -330 -500 701 128 -631 363 151 -668 454
1880 454 405 -575 89 345 -396 116 370 -231 -284 168 62 -327 242 340 -639 116 594 -570 -74 662 -544
1901 -544 -272 671 -257 -425 467 63 -505 157 346 -364 -135 537 -264 -467 641 -9 -610 508 221
1920 221 -622 317 327 -520 172 368 -292 -42 387 -56 -399 269 183 -475 202 290 -576 40 531 -396 -93
1941 -93 468 -475 -161 546 -140 -283 300 -23 -353 250 474 -448 -316 480 -200 -286 683 -121 -760 374
1961 374 223 -374 339 149 -644 45 475 55 -117 146 -233 -438 486 506 -429 -39 94 -518 381 637
1981 637 -463 -252 170 -369 248 651 -256 -638 55 189 64 370 266 -834 -450 769 258 -134 279
2000 279 -560 -808 703 596 -218 -105 -426 -581 410 813 21 -578 -280 -132 94 899 339 -1021 -411
$$ packed form
1861G97q57l03J085p87p62J037L48q72K24M93p33j70J201n73p59R94k12q19J122
1880D54m9r80O64K56p41N12K54o01n3M52j06l89N69R8r79P55M78j164M96P36j206
1901e44K72R43r28j68Q92m04n68O62J89p10K29O72q01k03J108o50o01J118k87
1920B21q43R39J0q47O92J96o60K50M29m43l43O68q6o58O77Q8q66O16M91r27L03
1941i3N61r43L14P07o86j43N83l23l30O03K24r22J32P96o80q6R69q04o39J134
1961C74j51n97P13j90p93O89M30m20j72K63l79k05R24K0r35L90J33o12Q99K56
1981F37j100K11M22n39O17M03r07l82O93J34j25L06j04j100L84J219n11l92M13
2000B79q39k48J511j07q14J13l21j55R91M03p92n99K98J48K26Q05n60j360O10
$$ plain form
2019 -411 253 92 728 381 -1086 -597 440 333 425 204 -821 -880 390 1017 222 -178 -397 -873 119
2038 119 1348 379 -737 -480 -606 163 1285 440 -824 -679 -306 176 1035 669 -901 -1219 103 690
2056 690 517 608 -489 -1484 12 1179 584 234 -563 -1319 -18 1245 744 -217 -688 -937 -140 1178
2074 1178 1177 -545 -1165 -480 102 1030 1233 -561 -1363 -365 263 992 1147 -661 -1619 -373 888 872 567
2093 567 -362 -1403 -814 1186 1338 3 -637 -1155 -747 1223 1506 -176 -836 -1033 -492 1144 1562 -53
2111 -53 -1378 -999 78 906 1254 132 -1558 -1139 541 1023 1028 -13 -1677 -1007 813 1148 697 -97
2129 -97 -1492 -1220 811 1657 484 -837 -1042 -897 475 1769 573 -1231 -1133 -434 572 1681 516
2146 516 -1421 -1198 -55 779 1366 558 -1233 -1562 89 1291 1007 100 -956 -1522 54 1545 917
$$ packed form
2019d11O64j61O36l47j467M89J037j07R2k21j025n9J270O27p95m00k19m76R92
2038A19J229r69j116K57j26P69J122q45j264J45L73M82Q59l66j570l18J322N87
2056F90j73R1j097r95J496J167n95l50p97p56J301J263n01r61m71k49P97J318
2074A178jj722o20O85N82R28K03j794q02R98O28P29J55j808r58J246J261j6l05
2093E67r29j041N89K000J52j335o40n18M08J970K83j682o60j97N41J636M18j615
2111e3j325L79J077Q28L48j122j690M19J680M82Nj041j664O70J820L35m51p94
2129i7j395K72K031Q46j173j321k05J45J372J294j196j804R8O99J006J109j165
2146E16j937K23J143Q34N87q08j791l29J651J202k84r07j056n66J576J491o28
$$ plain form
2163 917 -131 -1017 -1400 197 1687 791 -565 -1038 -940 112 1499 1194 -717 -1570 -464 568 1100
2180 1100 981 -769 -1656 -363 745 1039 855 -808 -1730 -294 1165 1054 226 -646 -1285 -529 1161
2197 1161 1449 -25 -998 -1070 -314 1191 1345 -312 -1059 -795 -239 1084 1453 -322 -1451 -712 366 951
2215 951 762 -94 -1256 -949 652 1146 616 -177 -1330 -873 913 1102 196 -363 -986 -818 674 1407
2233 1407 372 -917 -960 -194 590 1093 301 -892 -866 -127 525 1176 309 -1209 -896 299 660 720 250
2252 250 -878 -1022 189 1084 649 -180 -753 -850 222 1047 417 -329 -492 -782 39 1186 502 -681 -743
2271 -743 -210 252 756 485 -454 -918 -247 487 656 403 -450 -947 18 586 345 251 -287 -924 -107 666
2291 666 540 -58 -481 -526 -70 585 542 -109 -483 -335 -156 483 696 -308 -726 -105 81 285 518 -94
$$ packed form
2163I17j048q86l83J597J490q96j356m73R8J052J387l05j911q53J106J032N32
2180A100j19j750q87J293J108K94j84j663r22J436J459j11q28q72o39P56J690
2197A161K88j474r73p2P56J505J54j657p47K64N56J323L69j775j129P39J078N85
2215I51j89q56j162L07J601M94n30p93j153M57J786J89r06n59o23J68J492P33
2233A407j035j289m3P66P84N03p92j193K6P39O52O51q67j518L13J195L61O0m70
2252B50j128j44J211Q95m35q29n73r7J072Q25o30p46j63k90Q21J147o84j183o2
2271g43N33M62N04k71r39m64O71P34J69k53q53m97R65N68k41r4n38o37Q17P73
2291F66j26n98m23m5M56O55m3o51l74J48J79O39K13j004m18O21J86K04K33o12
$$ plain form
2311 -94 -666 -238 278 382 216 -167 -508 -281 375 439 7 -95 -380 -400 429 465 -128 -186 -237 -158 264 408
2333 408 -32 -296 -225 -109 182 326 132 -392 -193 166 54 280 218 -389 -354 251 219 45 106 -172 -296 145
2355 145 283 82 -97 -70 -143 -112 372 119 -279 -84 -19 -102 272 162 -312 -161 35 57 122 112 -118 -139 -32
2378 -32 138 44 113 -23 -274 20 194 -90 -16 172 -201 -74 286 20 -96 -3 10 -126 80 148 -129 -75 65
2401 65 -25 -128 207 -22 -191 65 138 -123 66 41 -146 -9 58 -42 -7 -2 -1 -42 8 36 -99 -13 52 -171 18
2426 18 139 -136 1 183 -94 -119 97 -57 -71 30 65 -84 -12 106 -72 -113 79 -46 -151 133 58 -125
2448 -125 64 22 -75 -8 76 -54 0 11 -9 -37 39 2 -46 15 73 -93 23 57 -76 33 69 -123 -69 88 -34
2473 -34 -29 91 -61 -119 46 67 -70 -50 124 -56 -89 166 -5 -67 81 -74 -178 60 94 -69 -45 13 -35 11
$$ packed form
2311i4n72M28N16J04j66l83l41K27O56O4m32j02k85k0Q29L6n93n8n1P9M22J44
2333D08m40k64P1J16K91J44j94n24J99L59j12K26o2o07L5O05l2j74O1k78j24M41
2355A45J38k01j79K7p3L1M84k53l98J95O5q3L74j10m74J51J96K2O5j0k30k1J07
2378c2J70r4O9j36k51K94J74k84P4J88l73J27L60k66j16R3J3j36K06O8k77N4J40
2401F5r0j03L35k29j69K56P3k61J89k5j87J37O7j00L5NJm1N0K8j35Q6O5k23J89
2426A8J21k75J37J82k77k5K16j54j4J01L5j49P2J18j78m1J92j25j05K84p5j83
2448a25J89m2r7O7Q4j30N4J1k0k8P6l7m8O1N8j66J16L4j33J09L6j92N4J57j22
2473c4NJ20j52n8J65K1j37K0J74j80l3K55j71o2J48j55j04K38L4j63K4N8m8M6
$$ plain form
2497 11 125 -25 -94 -21 74 6 102 50 -127 -46 91 20 94 32 -240 -181 88 103 -19 28 -58 -124 92 160 -2 -139
2523 -139 -87 -53 -16 220 45 -206 -102 -30 -22 193 2 -192 -188 52 141 131 48 -159 -198 21 212 84 -26 -127
2547 -127 -184 29 269 75 -72 -182 -164 44 261 132 -96 -197 -120 -6 215 253 -175 -335 -28 151 198 245
2569 245 -124 -358 -25 207 168 116 -140 -329 -65 245 298 37 -150 -252 -96 272 386 -60 -254 -193 -46
2590 -46 232 303 -58 -302 -200 -10 236 291 16 -366 -231 130 268 182 -9 -332 -259 164 342 127 -30 -278
2612 -278 -276 242 414 93 -190 -274 -221 162 503 153 -336 -354 -143 152 302 211 -296 -368 -25 288 373 140 -311
2635 -311 -398 18 282 304 72 -287 -333 -50 416 306 -55 -311 -334 -35 467 319 -169 -282 -235 51 420 296
2657 296 -209 -441 -186 139 361 265 -81 -473 -176 212 340 196 -146 -447 -208 384 374 109 -188 -372 -199
$$ packed form
2497A1J14j50o9P3R5o8R6n2j77Q1J37p1P4o2k72N9K69J5j22M7q6o6K16O8j62j37
2523a39N2L4L7K36j75k51J04P2QK15j91j94MK40Q9j0q3k07l9K19J91j28j10j01
2547a27n7K13K40j94j47j10J8K08K17j29k28j01P7J14K21L8m28j60L07J79M7M7
2569B45l69k34L33K32l9n2k56j89K64L10N3k61j87j02J56L68J14m46j94O1J47
2590d6K78P1l61k44J02J90K46N5k75l82J35L61J38q6j91l23P3M23J78k15j57k48
2612b78KN18J72l21k83q4N3L83L41l50m89j8K11K95J50r1n07p2L43L13Q5k33m51
2635c11q7M16K64K2k32l59m6K83M66j10l61k56k3K99N02j48m88j13M7K86L69j24
2657B96n05k32K55L25K22r6l46l92K97L88J28j44l42l01K39N92j0k65k97j84J73
$$ plain form
2678 -199 330 385 101 -296 -309 -63 207 492 54 -394 -311 -80 244 343 69 -416 -287 71 248 309 30 -413
2700 -413 -320 123 447 228 -76 -301 -401 115 485 132 -160 -292 -305 91 563 139 -270 -292 -152 121 394
2721 394 219 -186 -409 -63 182 338 228 -217 -412 13 214 224 109 -284 -417 -57 391 279 25 -210
2741 -210 -282 -36 323 299 -12 -266 -254 -18 359 362 -202 -288 -39 -56 268 421 -104 -422 -205 178 232 201 -27
2764 -27 -343 -172 253 311 132 -21 -308 -227 241 334 -6 -99 -168 -217 114 324 33 -186 -179 -134 148 295 6
2787 6 -288 -198 14 73 218 211 -296 -298 129 118 116 67 -227 -253 82 258 110 -22 -142 -201 7 325 126 -118 -81
2812 -81 -182 -98 327 160 -77 -174 -44 -35 145 198 -109 -212 -32 66 91 163 -75 -292 0 147 61 64 25 -264
2836 -264 -123 238 90 6 10 -96 -72 152 188 -33 -81 -25 -72 31 248 -92 -254 21 -32 -8 119 32 -208 -61
$$ packed form
2678a99N29N5k84l97j3K46K70K85m38m48Q3K31L24R9k74m85J29L58J77O1k79m43
2700d13R3M43L24k19l04k25j00N16L70l53k92j32j3L96M72m24m09k2J40K73K73
2721C94j75m05k23L46K45J56j10m45j95M25K01J0j15l93j33L60M48j12k54k35
2741b10p2K46L59k4l11k54J2K36L77Ln64q6K49j7L24J53n25l18K17L83N4l1k28
2764b7l16J71M25N8j79j53k87Q1M68R3l40r3o9m9L31K10k91k19PM5K82J47k89
2787Fk94R0K12N9J45pn07kM27j1km9k94k6L35J76j48j32j20n9K08L18j99k44L7
2812h1j01Q4M25j67k37r7J30RJ80N3l07j03J80R8K5P2k38k17K92J47q6Ll9k89
2836b64J41L61j48q4Mj06K4K24L6k21m8N6m7J03K17l40j62K75n3K4J27q7k40J47
$$ plain form
2860 -61 54 65 80 54 -138 -152 8 67 -8 2 -34 -145 34 174 -57 -14 20 -129 21 229 13 -100 -29 -29 -2
2885 -2 71 137 -146 -48 94 -22 -27 178 -40 -255 125 55 -84 141 -42 -165 66 109 32 -17 36 -19 -47 115 49
2910 49 -157 42 15 -195 33 129 -135 -16 88 -6 28 111 -44 -23 49 -44 -52 91 50 -100 -35 182 -73 -87 147
2935 147 -51 -91 81 17 -145 50 43 -95 93 72 -99 -51 112 3 -156 132 86 -149 51 118 -192 0 101
2958 101 -135 8 43 -13 -68 93 -25 -48 -13 64 -33 14 121 -58 -17 136 -46 -29 147 -63 -108 149 -65 -175
2982 -175 93 33 -74 49 78 -72 -39 88 34 -101 120 54 -201 98 121 -203 68 129 -147 -51 67 -25 -62
3005 -62 17 -50 -69 22 75 -47 -14 62 -96 -26 144 -42 -96 165 -73 -22 181 -38 -147 30 -21 -103 21 125
3029 125 -80 -97 169 31 -73 148 -4 -211 70 148 -140 5 83 -98 -26 162 5 -72 -29 -33 -86 81 132
$$ packed form
2860f1J15J1J5k6j92j4J60N9p5J0l6j11J79J40k31M3L4j49J50K08k16j13P1%K7
2885bP3O6k83R8J42j16nK05k18k15L80p0j39K25j83j23K31M3p7m9N3n5k8J62o6
2910D9k06J99k7k10K28R6k64J19J04r4L4Q3j55K1P2r3qJ43m1j50O5K17k55j4K34
2935A47j98m0J72o4j62J95pj38J88k1j71M8J63j09j59K88m6k35K00O7l10J92J01
2958A01k36J43L5n6n5J61j18k3L5P7r7M7J07j79M1J53j82J7J76k10m5K57k14j10
2982a75K68o0j07J23K9j50L3J27n4j35K21o6k55K99K3l24K71O1k76R6J18r2l7
3005f2P9o7j9R1N3j22L3P6j58P0J70j86n4K61k38N1K03k19j09J77n1q2J24J04
3029A25k05j7K66j38j04K21j52k07K81P8k88J45P8j81P2J88j57p7M3mn3J67N1
$$ plain form
3052 132 -119 -95 111 -81 6 180 -163 -163 123 -37 10 179 -135 -110 59 87 26 -70 -10 -135 -110 234 80 -138
3076 -138 40 -33 -157 257 190 -158 -65 41 -79 146 198 -27 -225 -15 106 8 124 74 -278 -103 216 16
3098 16 19 61 -250 -116 270 141 -18 -46 -123 -65 154 207 -3 -197 -91 -33 83 333 -31 -296 -5 -110 61
3121 61 302 29 -327 -85 96 35 91 36 -215 -240 145 361 49 -17 -76 -298 81 380 -62 -74 -106 -194 43
3144 43 372 110 -140 -184 -86 95 146 157 -179 -308 77 74 168 240 -203 -345 165 204 78 140 -208 -337 49 354
3168 354 129 -27 -135 -175 -86 289 274 -191 -159 -80 -104 280 352 -214 -320 -34 6 163 265 -19 -376 -138 152
3191 152 233 158 0 -332 -196 292 202 40 44 -343 -302 351 310 -48 -105 -238 -127 231 268 64 -232 -168 -85 120
3215 120 365 80 -407 -91 183 66 282 148 -382 -303 162 254 167 29 -249 -235 101 339 100 -98 -107 -316
$$ packed form
3052A32k51K4K06j92Q7J74l43%K86j60M7J69l14K5J69K8o1r6O0j25K5L44j54k18
3076a38J78p3j24M14o7l48R3J06j20K25N2k25j98K10J21r8J16n0l52J75L19k00
3098A6LM2l11J34L86j29j59k8p7N8K19N3k10j94J06N8J16K50l64k65K91j05J71
3121F1K41k73l56K42J81o1N6n5k51k5L85K16l12o6n9k22L79K99m42j2l2q8K37
3144D3L29k62k50m4R8J81N1J1l36j29L85lR4P2m43j42N10L9j26O2l48j29L86L05
3168C54k25j56j08m0Q9L75j5m65L2P9k4L84P2n66j06K86M0J57J02k84l57K38K90
3191A52Q1p5j58l32J36M88r0j62Ml87M1O53m1l58n7j33J11L58L7k04k96O4Q3K05
3215A20K45k85m87L16K74j17K16j34n30P9M65R2q7j38k78J4L36K38k39j98rk09
$$ plain form
3237 -316 74 492 120 -245 -107 -191 10 451 151 -221 -240 -106 87 291 185 -221 -364 56 173 135 198
3258 198 -99 -483 48 305 51 92 -105 -409 -63 409 152 -53 -137 -168 -68 312 304 -146 -267 -44 -20 139
3280 139 398 -150 -342 6 33 198 271 -117 -342 -137 131 173 82 -28 -291 -191 285 273 -40 -26 -202 -240
3302 -240 324 293 -104 -74 -118 -138 188 298 -5 -202 -165 10 111 244 118 -334 -270 160 64 94 110 -246 -228
3325 -228 218 146 69 39 -198 -167 64 229 138 -126 -129 -145 -41 368 80 -255 -68 -43 -86 270 169 -243 -63
3348 -63 30 -40 116 139 -150 -193 -37 221 24 65 32 -319 -25 312 -32 -49 51 -238 -44 252 109 -39 -62
3371 -62 -67 5 147 44 -71 -171 58 14 -9 236 -25 -280 6 81 -68 154 -24 -130 -3 71 45 28 6 -103
3395 -103 -137 153 132 -96 -14 83 -178 49 212 -110 -81 69 -100 -48 136 6 -112 -11 47 -10 15 149 -119
$$ packed form
3237c16L90M18l72l65J38q4K01M41l00l72j9J34J93K04j06m06j43M20J17l8O3
3258A98k97l84N31K57k54M1j97l04L46M72k57k05q4l1J00L80qm50j21K23K4J59
3280A39K59n48j92L48K7J65P3l88k25K05K68M2r1j10k63J00M76j2l13J4j76l8
3302b40N64l1l97L0m4k0L26J10l03j97L7J75J01J33j26m52O4M30r6L0J6l56J8
3325b28M46p2p7l0k37L1K31J65r1k64lj6J04M09k88l35J87K5m3L56j01m12J80
3348f3R3p0J56K3k89m3J56K58j97M1l3l51K94L37l44j7J00k89J94K96j43j48k3
3371f2nP2J42j03j15j00K29m4k3K45k61k55K86P5j49K22j78j06J27P4k6j7k2j09
3395a03l4K90k1k28Q2R7k61K27J63l22K9J50j69N2J84j30j18J01N8n7K5J34k68
$$ plain form
3418 -119 -134 147 88 -85 152 -9 -134 143 63 -85 142 -6 -87 56 29 12 -28 44 15 -76 116 79 -161 46
3442 46 142 -106 28 131 -121 -78 106 -65 -67 66 -85 -91 -20 89 -82 -9 78 -91 -37 185 -50 -159 124 -32
3466 -32 -105 143 62 -120 42 23 -31 49 78 -37 -52 69 36 -123 116 88 -198 74 88 -178 45 105 -118 26
3490 26 103 -68 -2 73 -3 -52 -2 103 -98 1 134 -104 -114 175 -44 -142 151 -42 -62 179 81 -57 79 -25
3514 -25 -44 -49 14 75 -126 91 12 -177 66 90 -166 86 103 -188 55 52 -92 -9 78 -50 -10 73 41 -67 31 151
3540 151 -112 -52 93 -118 5 174 -111 -72 109 -19 -42 136 -11 -87 37 84 8 -6 108 -27 -128 135
3562 135 56 -130 19 28 -149 141 155 -58 23 3 -55 55 139 32 -86 -18 91 14 31 33 -112 -54 114 -56 -12
3587 -12 99 -157 -113 155 22 -16 16 -14 -102 75 185 15 -186 16 -39 -46 225 73 -254 -23 -4 -75 105 143
$$ packed form
3418a19j5K81n9j73K37j61j25K77q0j48K27j48q1J43k7j7m0P2k9r1J92l7k40K07
3442D6R6k48J34J03k52M3J84j71kJ33j51oP1J09j71P3Q7j69N4K22k35j09K83j56
3466c2p3K48q1j82J62j9n4Q0K9j15j5J21l3j59K39k8k86K72J4k66K23O0k23J44
3490B6P7j71O6P5p6m9N0J05k01R9J33k38j0K89k19r8K93j93k0K41r8j38J36j04
3514b5j9nO3O1k01K17p9j89K43K4k56K52J7k91K43lj44Q3Q7j28M0Q3l2j08R8J20
3540A51k63O0J45k11J23J69k85L9J81j28k3J78j47p6J24M7p6j4J14j35j01K63
3562A35p9j86J49Rj77K90J4k13Q1k0n8J10Q4j07j18O8J09p7J7Kj45N8J68j70M4
3587a2J11k56M4K68j33l8L2l0q8J77J10j70k01K02n5pK71j52l27K31J9p1J80L8
$$ plain form
3611 143 -182 -125 9 57 70 37 -71 -68 44 153 26 39 -6 -200 -16 235 -25 -84 30 -107 -38 210 64
3634 64 -131 -147 -26 -8 52 216 -31 -245 41 108 -29 170 -81 -312 12 101 30 121 -31 -229 -3 61 155
3657 155 7 -58 -120 -92 188 177 -67 -159 -23 -58 157 227 -94 -129 -51 -22 101 221 -51 -213 -132 103 114 100
3681 100 47 -223 -218 224 195 -32 31 -165 -202 189 291 23 -74 -190 -96 87 245 60 -185 -145 -16 52 224
3704 224 192 -206 -200 75 102 183 107 -256 -153 73 169 59 -9 -180 -164 52 236 90 -90 -84 -126 -68 306 123
3728 123 -157 -162 -142 15 258 197 -132 -192 -147 96 158 154 -50 -323 -18 181 135 45 -68 -281 -34 194 119 71
3752 71 -82 -309 -46 223 166 45 -121 -143 -49 190 230 -42 -273 -129 -51 130 278 -77 -236 -41 -1 135
3774 135 247 14 -233 -195 67 233 110 -72 -118 -156 92 242 9 -8 -170 -125 156 211 -77 -142 -73 -131 70
$$ packed form
3611A43l25N7J34M8J3l3j08LJ12J09j27J3m5j94J84K51k60n9J14j37O9K48j46
3634F4j95j6J21J8O0J64k47k14K86O7j37J99k51k31L24Q9p1R1j52j98K26O4R4
3657A55j48o5o2K8K80j1k44r2J36l5K15P0l21l5P8K9J23J20k72j62Q1K35J1j4
3681A00n3k70NM42k9k27O3j96l7L91J02k68r7j16R4J83J58j85k45M0J29O8J72
3704B24l2l98OK75K7Q1p6l63J03K26R6j10o8j71J6K16J84j46j80Om2N8L74j83
3728A23k80nK0J57K43o1l29o0M5K43O2mk04k73L05J99m6r0j13k13K47K28p5m8
3752G1j53k27K63K69n7j21j66k2R4K39M0k72k31J44P8J81J48l55j59J95M0J36
3774A35J12k33k47L8K62J66j23j82m6l8K48J50k33j7j62M5K81N5k88o5O9n8K01
$$ plain form
3797 70 235 58 -173 -154 16 84 77 62 -198 -217 83 74 96 100 -162 -266 86 191 72 9 -120 -169 59 180 137
3822 137 -81 -147 -130 -63 270 161 -204 -75 -47 -64 195 191 -149 -163 -34 71 142 27 -92 -137 -32 184 33
3845 33 85 12 -202 -94 212 117 -99 9 -170 -47 173 95 -18 -147 -104 41 115 165 -4 -172 -67 -10 0
3868 0 159 25 -148 -116 47 4 143 37 -158 -94 53 78 45 -4 -108 -109 40 214 -53 -3 -3 -85 -11 231 21
3893 21 -58 -5 -30 -37 147 47 -109 -63 40 33 87 90 -67 -100 82 134 -78 55 -52 -165 70 80 -9 48 31 -109
3919 -109 0 113 56 -118 -22 1 -22 28 133 -83 -67 71 -60 -12 121 -143 -81 53 37 25 74 8 -114 -38
3943 -38 41 30 -50 50 15 -38 104 102 -61 31 58 -58 96 50 -82 -31 17 -2 51 70 12 -28 18 59 -51 -15 99
3970 99 -66 -59 107 -66 19 60 -56 -15 42 13 -72 93 -4 1 -60 70 -28 -95 93 -40 -49 76 53 -71 72 -34
$$ packed form
3797G0J65j77k31J9J70O8pj5k60j9L00rK2Mk62j04L52J05j19o3j29m9K28J21m3
3822A37k18o6J7O7L33j09l65J29K8j7K59ml40j4J29J05P1j15j19m5J05K16j51
3845C3N2p3k14J08L06r5k16J08j79J23K20p8j13j29M3J45P4N0j69j68J05N7J0
3868@J59j34j73L2J63m3J39j06j95O4J47K5l3m9j04jJ49J74k67N0%q2P4K42k10
3893B1p9N3k5pJ84j00j56M6J03pN4Lj57l3J82N2k12J33j07j13K35J0q9N7j7j40
3919a09J09J13n7j74R6K3k3N0J05k16J6J38j31M8J33k64O2J34j6j2M9o6j22P6
3943c8P9j1q0J00l5n3J42kj63R2K7j16J54m6j32N1M8j9N3J9n8m0M6M1j10L6J14
3970I9j65PJ66j73Q5M1j16M1N7k9q5J65r7No1J30r8o7J88j33rJ25k3j24J43j06
$$ plain form
3996 -34 -91 15 17 -24 4 -3 -19 -2 90 65 -68 61 44 -79 -40 59 -78 24 105 -79 -32 54 -56 -5 -1 16 14 3
4024 3 14 -21 -19 69 -2 -57 103 -98 -67 100 57 -88 36 41 -21 7 -1 -41 15 51 71 -83 6 45 -61 20 97 -63
4052 -63 -6 72 -104 60 111 -72 0 30 39 -20 9 7 7 -3 27 -19 -18 82 -33 -56 -1 1 -56 19 25 -157 72 63 -84 53
4082 53 23 -34 -47 47 42 -16 -3 55 -70 84 73 -61 -19 24 -79 88 104 -55 -57 27 33 66 31 37 -117 -39 147 36
4110 36 3 64 -21 -108 88 90 -51 38 -104 -58 79 75 -23 -44 -126 12 54 52 20 -120 -33 57 36 60 73 -171 19 112
4138 112 64 45 25 -86 -52 31 9 45 -11 -41 -77 5 179 -5 -56 -8 1 21 189 4 -123 -32 20 51 122 54 -143
4165 -143 -107 21 89 32 56 -35 -122 22 173 58 19 12 -143 57 180 -25 -24 -69 -110 16 135 72 -73 -167 1
4190 1 22 86 190 -27 -175 4 46 58 97 -77 -139 23 77 113 83 -39 -103 -31 183 124 -40 -57 -62 6 109 180
$$ packed form
3996c4n7J06Km1K8pj6J7R2k5j33J29j7j23L9R9j37J02Q1j84M7Q6j10N1MJ7kj1
4024CJ1l5KQ8p1n5J60k01L1J67m3j45J24No2K8qm0N6L6K0j54Q9L9j06Q1P7j60
4052f3N7P8j76J64N1j83P2L0Rn9K9k%j0L0m6JJ00j15k3N5Kn7P5Oj82K29rj47J37
4082E3l0n7j3R4nn8J3N8j25J54j1j34M2M3j03J67J6j59kQ4OL3l5Oj54P8J86j11
4110C6l3O1q5q7J96Kj41Q9j42M6J37mr8k1q2J38M2kl2j40Q7R0k1K4J3k44J90R3
4138A12m8j9k0j11L4Q3k2L6n6l0l6Q2J74j84n1M8RK0J68j85j27R1N2L1P1o8j97
4165a43L6J28O8n7K4r1q7J44J51j15l9pj55K00J23k05Jm5m1J26J19o3j45r4J68
4190AK1O4J04k17j48J79M2J2L9j74o2J62N4L6l0j22o4P2K14n9j64j7nO8J03P1
$$ plain form
4216 180 -70 -68 -42 -17 157 171 -28 -131 -88 9 70 80 28 -214 -155 117 125 109 19 -146 -145 119 96 99 30 -143 -117
4243 -117 93 154 84 -47 -119 -77 35 197 107 -95 -158 -7 12 168 19 -187 -113 12 79 174 74 -135 -128 -12
4267 -12 164 114 20 -151 -158 -28 142 72 -12 -36 -174 8 266 122 -106 -90 -128 19 122 177 -54 -185 -95 102
4291 102 126 135 -99 -226 -19 99 142 99 -25 -174 -90 186 89 70 -80 -183 -31 94 176 23 -89 -76 -74 137
4315 137 255 -84 -190 -61 -35 147 153 8 -130 -78 -4 126 50 -25 -127 -96 42 104 53 11 -128 -160 100 196
4339 196 36 14 -82 -82 113 180 52 -115 -83 -24 73 133 67 -148 -106 -4 5 97 177 -119 -157 25 83 74 88 -159 -117
4366 -117 28 85 85 6 -89 -101 -29 214 118 -53 -32 -91 -36 149 76 -42 -1 -111 6 171 52 -89 -86 -35 85
4391 85 71 74 -5 -121 4 156 61 22 -20 -151 -1 109 41 9 -62 -74 -29 86 89 -33 -118 22 -47 -6 129 -17
$$ packed form
4216A80k50KK6K5J74J4j99j03M3R7O1J0n2k42N9K72Qj6r0j65JK64k3Lo9j73K6
4243a17K10O1p0j31p2M2J12J62r0k02o3J51J9J56j49k06P4J25O7R5j00k09PJ16
4267a2J76n0r4j71pJ30J70p0q4k4j38J82K58j44k28J6l8J47J03N5k31j31R0J97
4291A02K4Rk34j27K07J18M3m3j24j49Q4K76r7j9j50j03J52J25Q2j53j12J3KK11
4315A37J18l39j06J29K6J82Oj45j38N2P4J30p6p5j02L1J38O2n1m2j39l2K60R6
4339A96j60k2r6%J95O7j28j67L2N9R7O0o6k15M2J02RR2Q0k96l8J82N8rJ4k47M2
4366a17J45N7%p9r5j2P2K43r6j71K1n9N5J85p3j18M1j10J17J65j19j41LN1J20
4391H5j4Lp9j16J25J52r5l9m2j31J50J10o8l2p1j2M5J15Lj22q5J40o9M1J35j46
$$ plain form
4417 -17 -78 12 -29 -67 169 -24 -146 -3 12 -9 88 34 -59 -85 -8 102 -24 21 -42 -89 82 109 -79 -30 4 -36
4443 -36 27 142 58 41 -27 20 33 9 81 -51 -61 22 53 -25 100 17 -80 51 26 8 -10 7 -49 -5 89 1 -24 -14
4471 -14 6 -12 41 40 -61 -38 12 -87 8 52 -94 31 49 -69 13 -15 11 -44 14 19 9 -32 74 -43 -44 73 45 -79
4499 -79 61 -6 -53 74 25 -61 47 -19 -33 101 41 13 -31 29 -14 -41 40 36 -76 20 56 -30 26 26 -58 86 -2 -20
4527 -20 25 32 -31 -36 37 81 -32 11 83 1 60 64 -8 -34 59 -14 -92 60 -98 11 16 -14 -28 37 14 -31 -8 3 15 -14
4557 -14 85 19 -34 101 -3 -34 56 54 -28 11 19 -34 3 -5 44 -33 -36 55 -27 6 18 -22 -47 27 10 -45 49 -33 49 70 -12
4588 -12 47 39 34 -4 38 0 18 -27 53 66 39 26 13 -54 43 67 -13 27 -35 -10 1 40 2 -5 0 1 -10 53 59 -94 -29 66 -12
4621 -12 -7 62 -26 -85 59 -16 79 12 -28 -101 40 72 -20 10 -12 16 23 73 7 -56 33 -23 -32 98 60 -83 -15 -30 -31 70
$$ packed form
4417a7o1R0m1l8K36j93j22J43J5k1R7n4r3k6P7J10j26M5o3m7J71K7j88M9L4m0
4443c6O3J15q4j7o8M7J3k4P2j32j0Q3L1p8J25q3r7J31k5j8j8J7n6M4R4q8k5J0
4471a4K0j8N3jj01K3N0r9R5M4j46J25J8j18Q2k8K6n5N8Nj0m1J06j17jJ17k8j24
4499g9J40o7m7J27m9q6J08o6j4J34o0k8m4O0m3k7Q1mj12R6L6q6N6%q4J44q8j8
4527b0M5Po3nP3M4j13M3P2q2N9Mp2k6R3p3p8J52j58J09Nl0j4O5k3m5K3J1J2k9
4557a4R9o6n3J35j04l1R0kq2L9Qn3L7qM9p7lR1q2L3J2m0k5P4j7n5R4q2Q2K1q2
4588a2N9qnl8M2l8J8m5Q0J3k7j3j3o7R7K4q0M0o2K5J1L9l8pNJj1O3Oj53O5R5p8
4621a2NO9q8n9J44p5R5o7m0p3J41L2r2L0k2K8PN0o6o3Q9n6rJ30l8j43O8j5jJ01
$$ plain form
4651 70 37 -41 -102 -18 68 56 66 30 -73 -13 95 -21 1 0 -65 48 102 7 -24 -44 -70 -39 49 56 30 -82 -11 -39 46
4680 46 118 -6 -105 -27 52 91 72 -43 -109 -61 62 38 -12 -54 -109 -17 24 79 -6 -42 -23 -50 22 116 -9 -39 -31 -34 71
4709 71 101 22 -60 -88 -5 19 25 37 -74 -120 122 36 61 81 -59 -108 73 79 71 19 -110 -107 29 65 35 -34 -72 -48 6
4738 6 121 53 -96 -59 4 23 131 103 -91 -115 -29 53 70 56 -109 -107 -35 103 115 45 -81 -107 18 142 85 -26
4764 -26 -50 -120 -10 89 96 -14 -57 -72 86 154 69 4 -93 -90 5 79 95 -58 -148 -33 80 114 46 -38 -150 -64 38
4791 38 98 31 -73 -76 -30 45 90 20 -71 -102 -88 9 141 -18 -130 -73 -73 115 100 59 -105 -79 18 135 132 -29 -151
4818 -151 -124 49 95 18 14 -86 -99 84 130 42 -63 -68 -59 40 103 31 -19 -126 -43 -34 128 37 -114 -73 -15 45 100 97 -74
4847 -74 -104 8 47 157 48 -128 -126 -8 66 60 19 -68 -47 -28 17 113 -38 -86 -42 11 147 64 -47 -47 -49 35 92 30
$$ packed form
4651G0l3p8o1Q4Q6j2J0l6j03O0J08j16K2jo5J13N4r5l1k0k6L1Q8Pk6j12P1k8Q5
4680D6P2j24r9P8P9L9j9j15o6M8J23k4n0m2n5R2M1N5q5l6J9k7P2R4j25l0QlJ05
4709G1L0p9q2k8Q3K4OJ2j11m6K42q6K5K0j40m9J81Oqn2j29LJ36L6l0o9l8K4N4
4738FJ15o8j49L7O3J9J08k8j94k4Q6Q2J7j4j65KP2J38J2p0j26k6J25J24n7j11
4764b6k4p0J10R9Pj10m3j5J58O8q5o5r7LR5P4J6j53r0J15J13L4o8q4j12Q6J02
4791C8O0o7j04lM6P5M5p0r1l1J4R7J32j59j12N7%J88j5m1j64K6R7J17lj61j22
4818a51K7J73M6p7mj00j3J83M6q8j05nRR9O3p2n0j07Q3RJ62r1j51M1N8O0N5lj71
4847g4l0J12L9J10j09j76KJ18P4om1q7K1J9M5R6j51m8M4N3J36q3j11%kQ4N7o2
$$ plain form
4875 30 -94 -87 38 4 112 64 -33 -151 -61 54 39 71 13 -96 -20 49 60 8 -40 -94 -73 115 108 35 -113 -81 -37
4902 -37 112 92 28 -71 -74 19 77 92 50 -59 -47 43 38 33 -35 -32 -13 -24 66 82 0 -66 -34 6 96 42 -39 -17 -29 25 24 14
4934 14 -56 -39 -40 -9 39 29 -70 -48 68 16 1 36 -36 -91 24 39 38 -23 -19 -20 -14 40 -16 42 -26 -58 -4 88 11 -76 29
4965 29 -26 -14 32 20 -22 -53 11 -9 33 30 43 -64 -20 -18 2 6 72 -34 -16 34 -11 -19 4 -29 0 67 30 61 1 -62 -9
4996 -9 -2 45 9 -6 -52 -25 37 36 -9 -47 -47 10 7 17 26 -43 -37 42 21 62 -11 -85 -42 -5 59 0 -37 22 64 36 91 -52 -8
5029 -8 -60 -4 61 23 -35 -54 -12 -7 69 47 -4 -25 32 -18 9 -44 25 -5 -49 16 32 15 12 -22 -20 -4 49 42 22 39 -28 -27 -29 -54
5063 -54 -52 -34 29 -41 63 17 -20 2 42 16 -21 47 3 49 -18 -40 44 11 12 -50 -31 45 14 13 -32 38 4 27 6 -8 11
5094 11 -16 -22 4 42 -22 9 27 30 -34 -11 21 -11 -11 30 54 15 34 -14 -40 13 43 9 35 33 -6 17 25 2 -3 2 -20 16 46 -52
$$ packed form
4875C0j24PJ25l4J08m8r7j18R0J15j5L2n8j09P6O9J1n2m8n4K1J88pp3j48L2M4
4902c7J49k0o4r9lR3N8J5m2j09J2R0nno8LJ9j1R0J6q2o6L2M0R0n4q1K2j2N4jj0
4934A4p0J7jL1M8j0r9K2J16n2j5L5p2n5J15J5jo1MjON4n6N8o8l2N4R2p7q7J05
4965B9n5J2M6j2m2l1O4k0M2lJ3j07M4KK0MO6j06J8N0m5qK3l3K9O7l7L1o0o3N3
4996iPM7l6j5m6K7O2jm5l8%N7lJ0Ro9OP9k1M1p3p4M3L7O4n9l7N9M2k8N5j43M4
5029hn2N6O5l8n8j9M2NP6k2n1k1N7n0K7n3O9l0m4O5J6j7ll4KJ6N3pk0J7o7Jkk5
5063e4KJ8O3p0J04m6l7K2M0k6l7O8m4M6o7k2Q4l3Jo2J9P6l1jm5P0l4K3k1j4J9
5094A1k7oK6L8o4L1J8Lo4K3L2l2%M1K4l9J9m8k6N3L0l4K6kl9K3Qk3nNk2L6L0r8
$$ plain form
5128 -52 -33 -5 -42 -13 6 33 6 6 14 -39 3 -31 -16 49 18 0 12 19 -3 -25 -15 -4 71 -17 -10 -56 27 57 34 -9 -33 -18
5160 -18 -15 37 4 3 -67 -51 25 18 -11 14 -42 7 87 10 42 74 -5 -37 26 -3 23 -17 -21 29 47 42 13 -23 -20 18 66 55 11
5193 11 17 -46 14 36 37 -26 -72 -44 -32 28 41 -28 -80 1 -26 -27 23 37 -10 -27 -7 -9 -47 -41 -42 -25 47 20 65 -38 -16 -23 -17 40
5227 40 8 -8 -22 -39 38 82 -8 -28 -85 -1 38 15 62 -58 -50 -50 6 21 -16 -34 -47 16 97 15 3 -65 -32 26 2 6 -14
5258 -14 -28 -62 -14 37 45 -26 -5 -42 -30 40 -15 -44 -91 -22 -4 84 60 -28 -60 -32 33 54 -24 -29 -75 -41 29 13 76 -7 -31
5289 -31 -10 76 16 41 18 -52 25 52 29 24 -95 -72 -6 41 51 21 -28 -56 0 33 61 -58 -132 25 58 21 50 2 -20
5318 -20 -61 43 33 -39 -21 -80 -46 26 75 18 -40 10 -32 40 115 2 -41 2 -21 -6 59 2 -26 -55 -27 19 30 -21 -21 -82
5348 -82 -63 -2 -14 32 -4 18 49 93 -2 30 -27 -69 24 -3 54 18 -52 13 -10 77 49 6 -12 -27 -5 -17 61 -106 68
$$ packed form
5128e2J9K8l7K9J9K7k7%Qn3M2l4J5O5l1j8J2Pk2k2J0J1P5q8Pm6Q3L0k3m3k4J5
5160a8LN2l3jp0J6P6pk9K5n6M9Q0p7L2L2p9l2O3k9K6m0mN0J8nk9l6LL8M8j1m4
5193A1Oo3O0K2Jo3m6K8J2O0J3o9n2Q1k7jN0J4m7j7K0kl8OjJ7P2k7M5j03K2pON7
5227D0l2j6j4j7P7M4r0k0n7Q4L9k3M7j20Q%N6J5l7j8j3O3Q1q2j2o8L3N8k4Mk0
5258a4j4l4M8N1Qp1K1l7J2P0n5k9m7O9J8Q8k4q8l2K8O5K1p8nm6L4P0j6O3q3k4
5289c1K1Q6o0K5k3p0P7K7k3nj19K3O6M7J0l0m9k8N6L3K8j19p4J57L3l7K9m8k2
5318b0m1J04j0p2J8n9L4P2M9n7n8N0m2P2P5j13m3M3k3J5O5n7k8k9K8M6J1n1%o1
5348h2J9O1j2M6l6K2L1M4r5L2n7m2R3k7N7l6p0O5k3Q7k8m3j8j5K2j2P8j67J74
$$ plain form
5377 68 -1 34 29 13 -39 -30 20 60 78 23 -65 -6 -3 41 -8 4 -5 -33 41 42 24 -75 13 -41 -14 10 13 38 -52 27 23 -35 -12 -31
5411 -31 -59 8 23 18 -31 12 -30 -5 15 -16 36 1 -84 10 1 -34 7 -10 5 -77 -19 61 15 -88 -20 21 -20 66 -9 -47 -26
5442 -26 -40 51 -51 -25 5 3 20 -68 -26 44 -44 -36 77 44 0 14 1 -2 -20 51 -16 -39 -16 -53 -46 59 -10 -36 -46 -16 -43
5473 -43 -2 42 -56 -58 15 -6 54 -30 -64 1 -4 14 -24 -11 37 -16 -28 -33 11 -38 -24 20 6 76 14 -82 -5 15 -15 53 37 -14
5505 -14 35 14 -15 1 43 9 -81 -4 68 -36 43 46 -33 -1 -22 -49 64 17 -60 -24 18 26 54 -32 8 28 -13 25 -3 -26
5535 -26 36 26 18 13 53 -68 14 -32 3 -25 -7 -15 23 -5 31 22 -23 24 -84 29 15 4 -20 23 -28 -16 -7 -5 2 23 -2 -16
5567 -16 -13 -11 4 23 -21 18 -30 56 68 -8 55 12 4 -31 -7 -37 62 -14 -4 18 98 -61 -1 -38 17 -32 44 50 -43 -32 -36 -51
5599 -51 37 33 -25 23 28 -40 14 -21 -53 39 -16 29 22 -3 33 18 20 47 -48 -51 60 -6 -11 -20 -36 6 12 -29 -4 -31 52 7 -31 36
$$ packed form
5377F8o9L5nj6n2RN0M0J8n5q8N9LM4m9J2rk8P4Jj8r9Q8n4K7K4LK5r0P9mn8K3j9
5411c1k8O7J5nm9M3m2K5K0l1N2l5q5R4rl5M1j7J5q2N8Q0m6j03O8M1m1Q6p5l8K1
5442b6j4R1j02K6L0kJ7q8M2P0q8QJ13l3m4J4j3lj8P1o7k3K3l7PJ05o9k6j0L0k7
5473d3M1M4r8kP3k1O0q4l4O5nJ8l8J3M8n3j2nM4m9J4M4j4P0o2r6P7K0l0O8j6n1
5505a4M9k1k9J6M2l4r0P7P2j04P9Lp9L2k1k7J13m7p7L6M2QK8q6M0K0m1L8k8k3
5535b6O2j0qnM0j21Q2m6L5k8J8qL8k8L6rm5M7j08J13j4j1k4M3n1J2RKPK1k5j4
5567a6LKJ5J9m4L9m8Q6J2p6O3m3ql5K4l0R9p6J0K2Q0j59O0l7N5m9P6Or3J1mj5
5599e1Q8mn8M8No8N4l5l2R2n5M5pk5L6j5KK7r5lJ11o6nrj6M2Om1K5k7Q3m5l8O7
$$ plain form
5633 36 36 -49 -26 -10 -16 -4 50 -38 -29 46 -33 27 9 -4 27 1 41 22 -23 63 37 -19 32 -10 -28 74 -56 55 82 -1
5663 -1 -86 -32 23 -2 9 -8 15 -31 20 -18 -52 85 13 -35 12 30 9 41 -43 -39 3 -8 -3 -20 74 -3 -20 -42 18 -32 -18
5694 -18 17 -41 -47 14 -47 34 27 43 -24 73 -14 -25 5 -12 -19 34 -14 -45 -32 -13 12 -20 -5 -28 -41 3 -4 -38 25 63 -57 28
5726 28 -45 -23 -4 -8 38 2 22 49 -90 -11 41 -51 -4 56 -8 -43 53 -16 2 16 -28 24 18 12 18 8 -16 38 11 -5 -1 -28
5758 -28 72 20 -14 27 -64 -25 66 -12 7 -14 -7 -3 12 -15 26 -55 53 31 -31 -21 33 -6 45 43 -1 0 36 3 11 40 14 16
$$ packed form
5633C6%q5K3J6oJ2N4q8RP5p9O0j8j3L1k6M0j9m5Q6k6n6N1m2j8J02j30J11K7q3
5663aq5N4N5k5J1j7K3m6N1l8l4J37p2m8M7J8k1L2q4MM2j1Nj7R4p7j7k2O0n0J4
5694a8L5n8oO1o1Q1pJ6o7R7q7j1L0j7pN3m8l1J3J9K5l2J5k3j3M4pl4O3L8j20Q5
5726B8p3K2J9mM6l6K0K7j39P9N2r2M7O0o4l5R6o9J8J4m4N2ooOj0k4N4k7j6Mk7
5758b8J00n2l4M1r1L9R1p8J9k1PMJ5k7M1q1J08k2o2J0N4l9N1km4JL6l3QK9k6K
$$ [...]
8191a4
##END NTUPLES=NMR FID
##END=
