##TITLE=1H_48-2024
 DMSO-d6
 8 sc, 
 3.7.2024
##JCAMPDX= 6.0         $$ Bruker NMR JCAMP-DX V2.0
##DATA TYPE= NMR FID
##DATA CLASS= NTUPLES
##ORIGIN= UXNMR, Bruker Analytische Messtechnik GmbH
##OWNER= root
$$ XWIN-NMR		Version 3.5
$$ Wed Jul  3 14:26:29 2024 Russian Standard Time (UT+4h)  she@DPX200
##.OBSERVE FREQUENCY= 200.1314
##.OBSERVE NUCLEUS= ^1H
##.DELAY= (6, 6)
##.ACQUISITION MODE= SIMULTANEOUS
##.ACQUISITION SCHEME= undefined
##.AVERAGES= 8
##.DIGITISER RES= 18
##SPECTROMETER/DATA SYSTEM= spect
##.PULSE SEQUENCE= zg30
##.SOLVENT NAME= DMSO
##.SHIFT REFERENCE= (INTERNAL, DMSO, 0, 15.7039)
##AUDIT TRAIL= $$ (NUMBER, WHEN, WHO, WHERE, WHAT)
$$ ##TITLE= Audit trail, XWIN-NMR		Version 3.5
$$ ##JCAMPDX= 5.01
$$ ##ORIGIN= Bruker BioSpin GmbH
$$ ##OWNER= she
$$ F:/spectra/data/she/nmr/H-F/1/audita.txt
$$ ##AUDIT TRAIL=  $$ (NUMBER, WHEN, WHO, WHERE, WHAT)
(   1,<2024-07-03 14:25:35.50 +0400>,<she>,<DPX200>,
      <created by zg, POWCHK disabled, PULCHK disabled
       configuration hash MD5:
       00 E9 B6 7A A2 85 ED C7 34 08 36 98 17 FE 4E 26
       data hash MD5: 16K
       97 43 69 AC 62 23 39 6A 5D 23 5A 5B 9F 61 27 3F>)
$$ ##END=
$$ 
$$ hash MD5
$$ 97 DA B7 88 28 C1 E5 AA DD CE 52 80 81 AE 27 BB
##$RELAX= 
##$RELAX= 
##$RELAX= 
##$RELAX= 
##$RELAX= 
##$RELAX= 
$$ Bruker specific parameters
$$ --------------------------
##$DU= <F:/spectra>
##$EXPNO= 1
##$NAME= <H-F>
##$PROCNO= 1
##$TYPE= <nmr>
##$USER= <she>
##$AMP= (0..31)
100 100 100 100 100 100 100 100 100 100 100 100 100 100 100 100 100 100 
100 100 100 100 100 100 100 100 100 100 100 100 100 100 
##$AQSEQ= 0
##$AQ_mod= 1
##$AUNM= <au_zg>
##$AUTOPOS= <>
##$BF1= 200.13
##$BF2= 200.13
##$BF3= 200.13
##$BF4= 200.13
##$BF5= 200.13
##$BF6= 200.13
##$BF7= 200.13
##$BF8= 200.13
##$BYTORDA= 1
##$CFDGTYP= 0
##$CFRGTYP= 5
##$CHEMSTR= <none>
##$CNST= (0..31)
1 1 145 1 1 1 1 1 1 1 1 1 1 1 1 1 1 1 1 1 1 1 1 1 1 1 1 1 1 1 1 1 
##$CPDPRG= <>
##$CPDPRG1= <>
##$CPDPRG2= <>
##$CPDPRG3= <>
##$CPDPRG4= <mlev>
##$CPDPRG5= <mlev>
##$CPDPRG6= <mlev>
##$CPDPRG7= <mlev>
##$CPDPRG8= <mlev>
##$CPDPRGB= <>
##$CPDPRGT= <>
##$D= (0..31)
0 1.2 0 0 0 0 0 0 0 0.06 0 0.03 0 0 0 0 0.0002 0 0 0 0 0 0 0 0 0 0 0 0 
0 0 0 
##$DATE= 1720002335
##$DBL= (0..7)
120 120 120 120 120 120 120 120 
##$DBP= (0..7)
150 150 150 150 150 150 150 150 
##$DBP07= 0
##$DBPNAM0= <>
##$DBPNAM1= <>
##$DBPNAM2= <>
##$DBPNAM3= <>
##$DBPNAM4= <>
##$DBPNAM5= <>
##$DBPNAM6= <>
##$DBPNAM7= <>
##$DBPOAL= (0..7)
0.5 0.5 0.5 0.5 0.5 0.5 0.5 0.5 
##$DBPOFFS= (0..7)
0 0 0 0 0 0 0 0 
##$DE= 6
##$DECBNUC= <off>
##$DECIM= 24
##$DECNUC= <off>
##$DECSTAT= 4
##$DIGMOD= 1
##$DIGTYP= 9
##$DL= (0..7)
0 120 120 120 120 120 120 120 
##$DP= (0..7)
150 150 150 150 150 150 150 150 
##$DP07= 0
##$DPNAME0= <>
##$DPNAME1= <>
##$DPNAME2= <>
##$DPNAME3= <>
##$DPNAME4= <>
##$DPNAME5= <>
##$DPNAME6= <>
##$DPNAME7= <>
##$DPOAL= (0..7)
0.5 0.5 0.5 0.5 0.5 0.5 0.5 0.5 
##$DPOFFS= (0..7)
0 0 0 0 0 0 0 0 
##$DQDMODE= 0
##$DR= 18
##$DS= 0
##$DSLIST= <SSSSSSSSSSSSSSS>
$$ [...]
##$SUBNAM2= <"">
##$SUBNAM3= <"">
##$SUBNAM4= <"">
##$SUBNAM5= <"">
##$SUBNAM6= <"">
##$SUBNAM7= <"">
##$SUBNAM8= <"">
##$SUBNAM9= <"">
##$SW= 24.0689651099613
##$SWIBOX= (0..15)
0 0 2 0 0 0 0 0 0 0 0 0 0 0 0 0 
##$SW_h= 4816.95568400771
##$TD= 16384
##$TD0= 1
##$TE= 0
##$TE2= 300
##$TE3= 300
##$TEG= 300
##$TL= (0..7)
0 120 120 120 120 120 120 120 
##$TP= (0..7)
150 150 150 150 150 150 150 150 
##$TP07= 0
##$TPNAME0= <>
##$TPNAME1= <>
##$TPNAME2= <>
##$TPNAME3= <>
##$TPNAME4= <>
##$TPNAME5= <>
##$TPNAME6= <>
##$TPNAME7= <>
##$TPOAL= (0..7)
0.5 0.5 0.5 0.5 0.5 0.5 0.5 0.5 
##$TPOFFS= (0..7)
0 0 0 0 0 0 0 0 
##$TUNHIN= 0
##$TUNHOUT= 0
##$TUNXOUT= 0
##$USERA1= <user>
##$USERA2= <user>
##$USERA3= <user>
##$USERA4= <user>
##$USERA5= <user>
##$V9= 5
##$VALIST= <valist>
##$VCLIST= <CCCCCCCCCCCCCCC>
##$VD= 0
##$VDLIST= <DDDDDDDDDDDDDDD>
##$VPLIST= <PPPPPPPPPPPPPPP>
##$VTLIST= <TTTTTTTTTTTTTTT>
##$WBST= 1024
##$WBSW= 4
##$XGAIN= (0..3)
0 0 0 0 
##$XL= 0
##$YL= 0
##$YMAX_a= 182512
##$YMIN_a= -252421
##$ZGOPTNS= <>
##$ZL1= 120
##$ZL2= 120
##$ZL3= 120
##$ZL4= 120
##$ABSF1= 10
##$ABSF2= 0
##$ABSG= 5
##$ABSL= 3
##$ALPHA= 0
##$AQORDER= 0
##$ASSFAC= 0
##$ASSFACI= 0
##$ASSFACX= 0
##$ASSWID= 0
##$AUNMP= <proc_1d>
##$AZFE= 0.1
##$AZFW= 0.1
##$BCFW= 1
##$BC_mod= 2
##$BYTORDP= 1
##$COROFFS= 0
##$CY= 11.3945322036743
##$DATMOD= 1
##$DC= 2
##$DFILT= <>
##$DTYPP= 0
##$F1P= 15.6554695791079
##$F2P= 12.8336369535428
##$FCOR= 0.5
##$FTSIZE= 0
##$FT_mod= 4
##$GAMMA= 1
##$GB= 0.15
##$INTBC= 1
##$INTSCL= 1
##$ISEN= 128
##$LB= 0.24
##$LEV0= 0
##$LPBIN= 0
##$MAXI= 10000
##$MC2= 0
##$MEAN= 0
##$ME_mod= 0
##$MI= 1.114404
##$NCOEF= 0
##$NC_proc= 0
##$NLEV= 6
##$NOISF1= 3.799351
##$NOISF2= 2.8
##$NSP= 1
##$NTH_PI= 0
##$NZP= 0
##$OFFSET= 15.70392
##$PC= 1
##$PHC0= -25505.51
##$PHC1= 15.98748
##$PH_mod= 1
##$PKNL= yes
##$PPARMOD= 0
##$PSCAL= 0
##$PSIGN= 0
##$REVERSE= no
##$SF= 200.130013532006
##$SI= 16384
##$SIGF1= 3
##$SIGF2= 2
##$SINO= 400
##$SIOLD= 16384
##$SREGLST= <1H.CDCl3>
##$SSB= 0
##$STSI= 0
##$STSR= 0
##$SW_p= 3612.71676300578
##$SYMM= 0
##$S_DEV= 0
##$TDeff= 0
##$TDoff= 0
##$TI= <>
##$TILT= no
##$TM1= 0
##$TM2= 0
##$TOPLEV= 0
##$USERP1= <user>
##$USERP2= <user>
##$USERP3= <user>
##$USERP4= <user>
##$USERP5= <user>
##$WDW= 1
##$XDIM= 8192
##$YMAX_p= 0
##$YMIN_p= 0
$$ End of Bruker specific parameters
$$ ---------------------------------
##NTUPLES= NMR FID
##VAR_NAME=  TIME,          FID/REAL,        FID/IMAG
##SYMBOL=    X,             R,               I
##VAR_TYPE=  INDEPENDENT,   DEPENDENT,       DEPENDENT
##VAR_FORM=  AFFN,          ASDF,            ASDF
##VAR_DIM=   8192,          8192,            8192
##UNITS=     SECONDS,       ARBITRARY UNITS, ARBITRARY UNITS
##FACTOR=    0.0002076,     1,               1
##FIRST=     0,             0,               0
##LAST=      1.7004516,     0,               0
##MIN=       0,             -252421,         0
##MAX=       1.7004516,     182512,          0
$$ Real data points
##PAGE= N=1
##DATA TABLE= (X++(R..R)), XYDATA
$$ [...]
1856c116P18L398K445j324l385j794J135L638J207j601l350j217K000L435R71
$$ -3116 -2398 1000 3445 2121 -1264 -3058 -1923 1715 2922 1321 -2029 -3246 -1246 2189 3160
1871C160k535l086p08K729K869M77k885k918L6K828K893l23k923k463M88L020
$$ 3160 625 -2461 -3169 -440 2429 2906 21 -2897 -2861 -33 2860 2537 -386 -2849 -2361 659
1887F59K307r05l263j995J597L071J563j722l200j414K005L248R64k019l203n57
$$ 659 2966 2061 -1202 -3197 -1600 1471 3034 1312 -1888 -3302 -1297 1951 2915 896 -2307 -2864
1903b864K255K941L84k857k444j50K815K770m97l172k167N52L257K287j206l032
$$ -2864 -609 2332 2716 -141 -2585 -2735 80 2850 2353 -819 -2986 -2434 823 3110 1904 -1128
1919a128j919R92L280J778j510l107j408J817K950J035j963k984p76K343K838
$$ -1128 -3047 -2055 1225 3003 1493 -1614 -3022 -1205 1745 2780 817 -2167 -2943 -600 2238
1934B238M24k425k807l41K883K626j78k831k200K26K646K399p85k737k184J354
$$ 2238 2662 237 -2570 -2911 -28 2598 2420 -411 -2611 -2385 261 2660 1875 -862 -3046 -1692
1950a692K775J753j461k952j311J444L144J092j677l244p73K179K761L73k062
$$ -1692 1083 2836 1375 -1577 -2888 -1444 1700 2792 1115 -2129 -2902 -723 2038 2411 349
1965C49k694mK360K396k78k506k354P04K402K072o64k687j745P13K866J851j327
$$ 349 -2345 -2349 11 2407 2129 -377 -2731 -2027 375 2447 1783 -904 -2649 -1936 930 2781 1454
1982A454k921j236J293K632J437j642k731j162K107K582P21k027k735J9K081K305
$$ 1454 -1467 -2703 -1410 1222 2659 1017 -1714 -2876 -769 1813 2534 507 -2228 -2209 -128 2177
1998B177M6k278k403K48K576K048n27k492j868O63K549J607q78k729j433J476
$$ 2177 2223 -55 -2458 -2210 366 2414 1887 -605 -2473 -1810 739 2346 1468 -1261 -2694 -1218
2014a218K628J113j473k646j028J792K709M71j791k511m97K413J885K45j942k485
$$ -1218 1410 2523 1050 -1596 -2624 -832 1877 2348 557 -1954 -2451 -38 1847 2092 150 -2335
2030b335K15K513J868k99k645j712P89K402J588q47k630j565J466K467J065j493
$$ -2335 -2120 393 2261 1962 -683 -2395 -1606 796 2384 1537 -1093 -2658 -1192 1275 2340 847
2046H47k309q87J688K175P49j508k651k33J858K340o3j980k049j05K405K188n67
$$ 847 -1462 -2349 -661 1514 2263 755 -1896 -2129 -271 2069 2006 26 -2023 -2128 277 2465 1898
2063A898k470j675O90K423J391p85k453j268R83K400J196j472k092r27J399K133
$$ 1898 -572 -2247 -1557 866 2257 1472 -981 -2249 -1266 1134 2330 858 -1234 -2161 -762 1371
2079A371Q60j600k377o56K213J871M45j919k152M6K041K100k78k275j859N64K168
$$ 1371 2231 631 -1746 -2402 -189 1682 2127 208 -1944 -1898 143 2243 1965 -310 -2169 -1605 563
2096E63J381m40k396j425R41K456J205j259k334q41J329J971J011j347k288n73
$$ 563 1944 1504 -892 -2317 -1376 1080 2285 1026 -1308 -2149 -820 1151 2162 815 -1473 -2046
2112b046J725K251P9k167j600p3J800K043l87j793j771N07K148J226o78j878j442
$$ -2046 -321 1930 2009 -158 -1758 -1831 -31 2012 1625 -168 -1939 -1432 716 1942 1264 -614 -2056
2129b056P38K328J077j040k332r04J642J927O55j267k188o47J609K318r0j583
$$ -2056 -1318 1010 2087 1047 -1285 -2189 -547 1380 2035 768 -1420 -2067 -458 1860 1770 187
2145A87j963R4J611J765J19k042j607J85K023J694o79j849j293N14K057J266r59
$$ 187 -1776 -1682 -71 1694 1813 -229 -1836 -1651 372 2066 1387 -462 -1755 -1241 816 2082 1123
2162A123k189j087J106K394N88j330j880o95J221K206M21j710j663pJ610J441
$$ 1123 -1066 -2153 -1047 1347 1935 605 -1275 -1970 -749 1457 1878 168 -1495 -1502 108 1549
2178A549J44j849j588J23J950J659m26k123j486P92J879J235o72k072j065J047
$$ 1549 1693 -156 -1744 -1621 329 1988 1562 -561 -2047 -1255 624 1859 1187 -885 -1950 -903
2194i03K114O48j274j770n98J332J686P27j588k001j49J745J676q8j666j649K81
$$ -903 1211 1859 585 -1185 -1783 -451 1235 1962 374 -1627 -1776 -31 1645 1557 -109 -1758 -1477
2211a477J645J756o42j908j339J067J621R64o59j883r63J008J756Q25j336j567
$$ -1477 168 1924 1282 -626 -1965 -898 723 1687 1028 -855 -1818 -810 946 1771 435 -1132
2227a132n42J074J728N00j069j996m20J453K068j32j705j386j47J799J483k48
$$ -1132 -1674 -600 1128 1628 559 -1437 -1857 -404 1664 1532 -173 -1559 -1706 93 1576 1328
2243A328j750j698R01J899J044p10j917p95O67J902N40o46j830q45J129J887M55
$$ 1328 -422 -2120 -1219 680 1724 1014 -903 -1698 -1031 871 1411 765 -1065 -1910 -781 1106 1561
2260A561j197j838k12J609J558j3j689j410K01J335J699m00j540j236L58J673
$$ 1561 364 -1474 -1686 -77 1481 1468 -221 -1631 -1430 -95 1604 1204 -336 -1572 -1214 459
2276D59J082n56j781q58P49J541J040r24j818m53Q40J792M67j101j552n18J438
$$ 459 1541 985 -796 -1654 -905 636 1676 752 -1066 -1519 -679 1113 1580 479 -1073 -1591 -153
2293a53J423K86j626j405J15J626J346o92j020j330J58J644J247n99j428j199
$$ -153 1270 1556 -70 -1475 -1360 266 1612 920 -100 -1430 -1272 372 1619 1020 -408 -1607
2309a607P36J657P82o82j822q53J239J630N13j262j296m81J514J339J06j381j622
$$ -1607 -871 786 1568 886 -936 -1789 -550 1080 1593 331 -965 -1446 68 1407 1513 132 -1490
2326a490J94J337J225q1j319j338K39J615J303o05j375j350Q42J351J171p83j790
$$ -1490 -1296 41 1266 1185 -134 -1472 -1233 382 1685 1080 -295 -1645 -803 548 1719 936 -854
2343h54p43Q14J842L79j110j539k32J187J598r6j205j287P8R46J459j23j182j370
$$ -854 -1597 -783 1059 1438 328 -1211 -1443 -256 1342 1246 41 -1246 -1168 -222 1237 1114 -68 -1438
2361a438L06J466J194l70j746r75N87J585P15o01j352p11O26J592N95r93j369
$$ -1438 -1132 334 1528 1158 -588 -1563 -976 609 1324 723 -629 -1340 -714 878 1473 480 -889
2378h89l81O85J579M20r63j731n7J372J177l8j213j287J75J430J088k62j601r84
$$ -889 -1270 -585 994 1414 451 -1280 -1337 35 1212 1174 -39 -1326 -1151 279 1367 1105 -496 -1480
2396a480Q72J113Q79m53j735n13O58J454N24o70j527l31Q90J345M71j206j229
$$ -1480 -608 505 1384 931 -804 -1317 -659 795 1319 649 -878 -1209 -319 1026 1497 291 -938
2413i38l94J219J385J7j537j256M46J479P95l44j329p55L78J220R37p49j092p02
$$ -938 -1332 -113 1272 1289 -248 -1504 -1058 421 1216 872 -457 -1212 -834 386 1323 574 -518 -1220
2431a220M46J635K90m52j505n27P62J580J45j005j083l06J149J273R7j530r72
$$ -1220 -774 861 1151 699 -806 -1333 -571 1009 1154 149 -934 -1240 -91 1182 1279 -251 -1223
2448a223J52J379O35j49r18j086M06J237Q48l78j262r95P25J286P32o76j644k84
$$ -1223 -1071 308 943 794 -124 -1210 -804 433 1281 903 -359 -1354 -629 657 1389 713 -931 -1215
2466a215P90J235K71r10j078k48J034J068j21r83q83J04R93J049j56j155q51L40
$$ -1215 -425 810 1081 171 -907 -1155 -121 947 826 -157 -1040 -936 57 1106 950 -205 -1056 -716
2484g16J123O47k85j324n61K77J621N43p91j366k16P26J169K97j066j005m4Q47
$$ -716 407 1054 769 -555 -1116 -839 782 1325 534 -832 -1048 -322 847 1144 78 -927 -971 -124
2502a24J130P6q95j009n7Q98R28m5r04j047J60J201O72j58j296p12P13J144O08
$$ -124 1006 1082 187 -822 -879 19 947 902 -2 -1049 -889 312 984 826 -470 -1182 -469 675 1283
2521A283o90j181m20N86J262J59q32n50o61Q80J178K04r83j015j05Q43J044j16
$$ 1283 593 -588 -1008 -422 840 999 167 -383 -1044 -164 1014 1218 235 -780 -885 -42 1002 886
2539H86q37j110K22J085J009m78j158p31N22J205M74o05j012m20O07J073L66p06
$$ 886 49 -1061 -839 246 1255 777 -381 -1112 -590 615 1089 484 -528 -948 -341 732 1098 392
2557C92q87n51O48J083M34q45j010k11J051J052j36j127p54M9J107Q27m49j061
$$ 392 -495 -1046 -398 685 1119 274 -736 -947 104 1156 1020 -107 -861 -812 295 1122 673 -388
2575c88m32J88J052O96n06j186j94L03Q43Q02n52j161l91N82J244J85p95j188
$$ -388 -820 -632 420 1116 610 -576 -770 -467 376 1178 626 -535 -926 -344 900 1085 290 -898
2593h98J50Q75P26J15j114p70J64Q46Q74l20q88o41N72P00O17m52r17p01O78P20
$$ -898 -748 127 853 968 -146 -916 -752 94 968 648 -240 -881 -309 391 1008 556 -361 -1062 -384 336
2613C36N45l51j101n63O96J487J11r90q74l43J124Q30q0j048n51p2J161O81m36
$$ 336 881 530 -571 -1134 -438 1049 1160 170 -704 -1047 77 907 827 -221 -772 -844 317 998 562
2632E62p44q16L43Q43N94k23p95p29K58J266M37o21r09k62N14J115J0q47q72J02
$$ 562 -182 -998 -655 188 782 559 -236 -965 -707 559 996 375 -534 -796 -282 833 843 -4 -876 -774
2652g74O67P94J55p47p57J1O25Q17n0q50p73L24O62P97m17q74p46P69P57N03o09
$$ -774 -107 687 842 95 -662 -651 -26 791 741 -109 -882 -558 104 901 484 -390 -1136 -367 390 893 284
2673B84q13k09N79P49j6m31p08k86N47R26K74q36p63o6Q60P88l71n53q81L73Q24
$$ 284 -529 -738 -159 590 574 143 -565 -851 -304 622 896 60 -703 -769 91 879 508 -45 -926 -553 271
2694B71M49k58r14n62N87J130L17p82q17l00M71Q57M36p49p71k60O86Q25O8p79
$$ 271 720 462 -452 -1014 -427 703 1020 238 -579 -879 -408 449 885 136 -635 -895 -209 616 684 -95
2714i5m00j49M89J076j90q67r19M23J039L25k77r18k51J50Q98M59p20o06k07L47
$$ -95 -495 -644 -155 921 731 -136 -1055 -632 407 732 455 -463 -714 -564 334 793 73 -533 -740 -393
2734c93P31K79k66q37n49P10P27N34r19o69mQ43Q21k78q68p88K91R67L65m57n02
$$ -393 338 617 351 -486 -1035 -325 402 936 17 -652 -656 187 1008 730 -138 -926 -635 332 697 240 -262
2755b62n03J66Q31N94n25n28n54L97O20M98k80j096k43O03J144j26j062m72J68
$$ -262 -765 -599 232 826 301 -227 -781 -384 236 734 454 -642 -885 -282 862 736 -326 -798 -630
2774f30N58N93K21q30m88j16Q18N65l00p38l03O1P01O84j79r77m47L46R39M19
$$ -630 -72 521 742 -88 -576 -692 126 691 391 -347 -650 -589 112 796 617 -360 -807 -461 478 897
2794H97q10o16l17O09O05L36o04p49Q5N95M97k5m00p44M6P52N26k77n56m10L2
$$ 897 87 -529 -846 -237 368 704 100 -649 -564 31 528 503 103 -641 -595 157 683 406 -150 -560 -528
2815e28Q79L67n8p48r29N90R91J14n31p75J32K44P97N0m32p69J94M95N85p0n77
$$ -528 351 718 660 -88 -1017 -427 564 678 147 -628 -496 -252 545 595 163 -606 -412 83 668 598 21
2836B1m99k4O95M25q2o84n90K86O14N38l39n61o20M89Q10K59m45m90m39M15Q40
$$ 21 -478 -502 193 618 536 -148 -738 -452 162 700 361 -200 -820 -331 479 738 293 -197 -636 -221 619
2857F19l8m44m42l21N68M94J08m77p69J25M55P65j45q42k63K92M46M43j91p12
$$ 619 581 137 -305 -626 -58 436 544 67 -702 -577 -122 643 498 -344 -607 -315 131 574 383 -329
2877c29l87K40Q91K13m47m29l09M06M87J72k92o64j96O69M08J23p83l91J28L07
$$ -329 -716 -476 415 628 181 -248 -557 -151 336 508 216 -448 -644 25 433 556 -227 -618 -490 -183
2897a83M68K88p81n36K74O71M78k77n51m22L04N47J53o6p31l35N81M48J36j80
$$ -183 285 573 -208 -744 -470 201 679 402 -149 -571 -267 280 433 367 -364 -699 -118 330 466 286
2917B86o50l56N16P15J21q34m83J75O24L36j42l03n43J86N05L89k78o16k02J41
$$ 286 -364 -720 -204 511 632 -202 -685 -510 114 450 308 5 -538 -352 153 542 264 -352 -554 -413
2937d13P57J01k07n38j92L04M27K28l52m19n22O77P37P2m98p54O0L91P45k94m44
$$ -413 344 445 238 -300 -492 -188 239 467 115 -304 -826 -149 588 660 162 -592 -532 -141 604 310 -134
2958a34l38J47L53O19j50n31m42J05M79M68j82o02k99K41O85K40n34n75o0L18
$$ -134 -472 -325 28 647 497 -34 -476 -371 108 576 394 -208 -507 -266 419 659 125 -450 -510 -192
2978a92M77J32m33n25J79K84M53K81o47n07J99M80N50k64o20m90L66O47R1j94
$$ -192 285 417 -16 -541 -362 -78 375 656 9 -498 -299 181 731 467 -153 -643 -277 370 461 267
2998B67o33o8K21N13L39o48k95l4L25L41J04k39n97K5L48N94j46k61o59R4M97
$$ 267 -366 -434 -213 300 639 -9 -304 -338 -13 328 432 193 -404 -379 -31 563 417 156 -503 -409 88
3019H8M83j88m82k88l1P10K44k64o51k64M18O51N2k81n73J12J26M89J80n24l64
$$ 88 571 383 -99 -387 -418 292 536 272 -379 -643 -225 426 478 197 -376 -264 -138 351 531 7 -357
3040c57kJ40P37m2m08m84L7L20O60k99o38m7J57M75K94j27n65k80J93L38M75l92
$$ -357 -359 -219 518 476 68 -416 -379 -59 601 302 -336 -383 -226 249 543 416 -149 -429 -236 102 577 185
3062A85l18k86L10L09K43k20o19q2M18M57K3k28n70o3O11K02J56o32m16L96L80
$$ 185 -133 -419 -109 200 443 223 -396 -478 -60 397 420 192 -378 -441 170 372 528 -104 -520 -124 256
3083B56l3J30l16n06K84L57K74j45n65q9L0O32K43l97n69o8M43M97J01n01m10
$$ 256 223 353 37 -469 -185 172 446 301 -264 -353 -323 309 552 155 -414 -482 -39 458 559 58 -352
3104c52J4M88L09p4m09m63J68M51K11K7m64m34J75O12L32m27l56l96L46M62L7
$$ -352 -338 150 459 385 -24 -487 -319 132 343 370 -94 -528 -353 259 591 164 -192 -588 -242 220 257
3125B57j39k98l38O13L25j59k25l49j02N56J80M5m03l43L3M27L25j31m52k52J84
$$ 257 118 -180 -518 95 420 261 36 -313 -415 141 321 366 -37 -380 -347 80 405 274 -178 -430 -246
3146b46L37K38j42j60m45J50O71J88m52l31Q0N7J62K56l29n47L11J99M13K5n55
$$ -246 91 329 187 27 -418 -268 403 591 139 -192 -112 -55 107 363 34 -513 -202 -3 410 435 -120
3167a20l26J09N52K29j89m06k68J21M05J57Q0n35k15J59N47K5k88j49j85J33M82
$$ -120 -446 -337 215 444 255 -151 -419 -298 107 264 344 -191 -406 -247 300 325 37 -112 -297 -164 318
3188C18m8r6m30l02O92J14Q8l22l40M8K28L01O6m85k23L05K91L35m10q6o16M30
$$ 318 270 174 -256 -558 134 248 336 14 -326 -278 -50 251 317 -168 -391 -86 205 540 130 44 -572 -142
3210a42M58j8j62l12k09K80L49r3j17l50lK40J73L75n41l79N8M24M15j94k33m72
$$ -142 316 298 136 -176 -385 -105 244 151 34 -316 -319 -79 94 469 -72 -451 -393 31 446 252 19 -453
3232d53M52K87K3r3l00l61K26M61J77j32o48j10L38K84K31l31j55k80L73K97K6
$$ -453 -1 286 309 216 -84 -445 -219 242 419 287 -361 -471 -133 151 382 51 -104 -384 -11 286 312
3253C12l41k75J19J82L81o0k77k62M3L63R8J36o73L0J09J36J11L5k60k61J48L60
$$ 312 -29 -304 -185 -3 378 318 41 -221 -178 185 283 419 -254 -224 -115 21 132 167 -93 -354 -206 154
3275A54J50j03m97lL23J92J03k65k52k1J69L25j01k33P4j62K05P5M6m87K2J24
$$ 154 304 201 -296 -299 24 216 319 54 -198 -219 -50 275 174 -59 15 -147 58 133 179 -308 -286 -162
3297a62L59J35k93n7n03M02K17K67l57l33L3J17M61J50l91m33J91J89K17j57M9
$$ -162 197 332 39 -18 -521 -119 98 365 8 -325 -292 -175 286 436 45 -388 -197 -8 209 52 101
3318A01l92Q1J84M13k28j32j94J37J40J10j09k54j12J32K62K6q2l66K01k1L31
$$ 101 -291 -210 -26 387 159 27 -167 -30 110 220 111 -143 -255 -123 139 165 83 -283 -82 -103 228
3339B28j02j60q7o4L29K75Q7l95n33K57K85K08r6j17n54R4L35J45J19m77j39K64
$$ 228 126 -34 -121 -185 144 419 506 111 -422 -165 120 328 232 115 -439 -345 -10 135 254 -223 -362 -98
3361i8J91K28k77k53QN2L35M2r7k67j8P0K86K26n47k62J87J55J91J4j57k91N3
$$ -98 93 321 44 -209 -201 -149 186 228 131 -136 -154 -84 202 428 -119 -381 -194 -39 152 166 9 -282 -229
3384b29L29K38k77k02j59K07J82K87l76l68r8L33L75n4k68Q0j36k1J19L35k69
$$ -229 100 338 61 -141 -300 -93 89 376 0 -368 -466 -133 242 188 -80 0 -136 -157 -38 297 28
3405B8j58n8L17J89j97j18r7j23K4M63k39k21r0J60J09J34J3l73JP1L01J78k55
$$ 28 -130 -188 129 318 121 3 -94 -217 -193 270 31 -190 -280 -120 -11 123 136 -237 -236 -165 136 314 59
3428E9m18Q6L72J15p9J4m32j40L09L26q9k14k62L33j3J95K9j88j84N4J81K03j31
$$ 59 -359 -273 99 214 135 149 -283 -423 -114 212 123 -91 -353 -20 -33 162 191 3 -181 -127 54 257 126
3451A26k55j93O3L99J01p4m54j79N96P5m8k29kl55L55K44k4l63kJ17J09O2p0p7
$$ 126 -129 -322 -259 140 241 167 -287 -466 130 205 157 -72 -74 -429 -74 170 146 -217 -219 -102 7 69 -1 -78
3475g8k56K02L44K79m62k23q2L26n3L13k09m46P2L29J64j13N8l45j24P2N07k44
$$ -78 -334 -132 212 491 29 -194 -276 50 -3 310 101 -345 -273 56 220 107 165 -180 -304 -232 275 31
3497C1r7k49L05O3J70k8j63m23J91K96M1o1k89l2J10K65J65j69k65j31K14K04
$$ 31 -66 -315 -10 53 223 195 32 -391 -200 96 137 76 -213 -245 -135 130 295 126 -139 -270 -56 148
3519A48N1j90j86oK02K89j86j32n02J60L13K25j41N7k29M9K26J58j11m05n0K03
$$ 148 199 9 -177 -183 19 308 122 -10 -512 -352 -39 186 45 102 -127 -78 148 306 195 -210 -260 -57
3541e7K24Ll4l82O0N6J48P4K1l05rlM21ol47j75R5M41q2J36k15m39K06K26J74
$$ -57 167 170 136 -246 -186 -130 18 92 113 -192 -201 -204 217 211 -136 -311 -216 225 143 279 64 -375 -169 57 231
3566B31j32k70O4p0K45J56k47N8j42J11J29J42l40j13J12M4K42j58j31m1q0L76
$$ 231 99 -171 -107 -177 68 224 -23 35 -107 4 133 275 -65 -178 -66 -22 220 62 -69 -110 -190 186
3588A86J61r3k23k16P0L66j69Q1k20k94L9N67R2l18l46Q5J40K11J23k07k91P8
$$ 186 347 254 31 -185 -115 251 82 163 -57 -351 -312 255 347 29 -317 -232 -92 119 242 35 -256 -178
3610a78K74JK53l35j60p3L0K36K21k06k53J25J75O4L8j56j05r0Q6M52j42m66k
$$ -178 96 97 350 15 -145 -218 -188 48 269 63 -190 -65 110 174 212 56 -49 -139 -53 399 257 -209 -211
3633b11R6J82J95k78j22N7J15J06N0j24j04q1J64J25j2k99j71L9L92J97k05k57
$$ -211 -115 67 262 -16 -138 -81 34 140 190 66 -38 -119 45 170 158 -141 -312 -273 119 316 111 -146
3655a46R2j14K40O9q1l01J54m5K32J29n9k87j00K01J91q3n2k51J79j6K68j67k45
$$ -146 -54 -168 72 141 60 -241 -87 -132 100 229 170 -117 -217 -16 175 92 40 -211 -32 -48 220 53 -192
3678a92K2LJ21K47Mk92j75L76J36Km15K9j4J99R9J41l50oK1n0L09kj75l27K94
$$ -192 -170 -167 -46 201 205 -87 -262 114 250 252 -163 -134 -148 51 150 291 -59 -65 -44 -94 215 213 38 -289 5
3703Er2K36j03j73q1MP9N06j62k41q8NK11N6j20m5j55j0L09n0j53N8j65O4K72
$$ 5 -87 149 46 -127 -208 -204 -125 381 219 -22 -110 -105 106 162 42 -3 -158 -168 141 91 -62 -4 -169 -105 167
3728A67n7m9k36j10K08L92j74j66k8m1K22orj72j01n1L09K11k36q0k14L70j20
$$ 167 110 61 -175 -285 -77 315 141 -25 -53 -94 128 122 113 -59 -160 -211 98 309 73 -7 -221 149 29
3751B9L5Q0l11p9L12J1K06k20o2j67K46K6N4kl19K64j16K25j92mk83J38J35K32
$$ 29 64 144 -167 -246 66 77 283 63 1 -166 80 106 160 158 -161 103 -13 212 20 16 -267 -129 6 238
3775B38N8m39j52J09K23Q3j0k75J7J70M72n68L4j01oJ12j00J33n3O2r6JK01q8
$$ 238 296 -143 -295 -186 37 120 110 -165 -148 22 494 -74 -40 -141 -147 -35 -135 -2 -55 7 -89 -88 113 25
3799B5k40J13n2Q0L53j49m9j49L2o8K44m5l2k80L63j32J7M5j00q8N4K35r5k32
$$ 25 -215 -102 -154 -74 279 130 81 -68 -36 -104 140 95 63 -217 146 14 31 76 -24 -112 -58 177 82 -150
3823a50J7N1J91o3K77l63q1q6K71M5m9J3j81J29j10K63q4j91j03J65K77j56q0
$$ -150 -133 -82 109 46 323 -40 -121 -207 64 109 60 73 -108 21 -89 174 90 -101 -204 -39 238 82 2
3846Bj27k1L30j93J51j83N9k85L03ol6L6j42J96j45K88p2q6j12l3J32Q4j70K9
$$ 2 -125 -146 184 -9 142 -41 18 -267 36 30 -6 30 -112 84 -61 227 155 69 -43 -76 56 140 -30 -1
3870aj80J26J68n0j9k67K3K85j4n7M8k10Q3rJ17Km5n9j9J06K18j88k12j49L84
$$ -1 -181 -55 113 63 44 -223 -200 85 71 14 62 -148 -65 -74 43 45 0 -59 -78 28 246 58 -154 -303 81
3895H1j10J69o2k81J37N1K22l07L02j88j05N4j7J68O2k77J4k9J15M2NM4j84K77
$$ 81 -29 140 78 -203 -66 -15 207 -100 202 14 -91 -37 -54 114 176 -101 -87 -116 -1 41 46 90 -94 183
3919A83o8r0k29J36r0J09K35k8o8k46J20R0J48j84j62j0J53j06M11k94J9p7K91
$$ 183 115 25 -204 -68 -158 -49 186 158 90 -156 -36 54 202 18 -144 -154 -1 -107 304 10 29 -48 243
3942B43j06j44N1j23J0J89%j99K01k83J42K5Lj5M0j57Q8l4L0M6j86M5K3J05Q6
$$ 243 137 -7 44 -79 -69 120 120 -79 122 -161 -19 6 9 -6 34 -123 -35 -69 -39 7 -179 -134 -111 -6 80
3967H0j18q2J26P0lj9J42l59K7K86k06j64J88m4p4K70J37K9l19j29O9M1KL31l54
$$ 80 -38 -120 6 76 73 54 196 -163 -136 150 -56 -220 -32 -76 -150 120 257 286 -33 -162 -93 -52 -50 281 -73
3992g3K03pj8N3k24J59j76J00j17J28M0j29J6J34j45J35j66q1J72Q5K3j38J6Q9
$$ -73 130 123 105 158 -66 93 -83 17 -100 28 68 -61 -45 89 -56 79 -87 -168 4 89 112 -26 -10 79
4016G9o9J14m0n1j75L1J36O3J4j20j18K7O1J58J89k75n6R9m1k3j50J87k9o5J15
$$ 79 10 124 84 33 -142 -111 25 88 102 -18 -136 -109 -48 110 299 24 -32 67 26 3 -147 40 11 -54 61
4041F1RJ51k28j35Q7N0k4J5K26l44pJ23J72j56j54N4K08j31L9m0K00j39L2n8K66
$$ 61 70 221 -7 -142 -55 -5 -29 -14 212 -132 -139 -16 156 0 -154 -100 108 -23 16 -24 176 37 69 11 277
4066B77j76j57n1O4Q1J38j62j70J46l1Q4J10j26p8K8P3J48Jl37L2J35K2L8N1r9
$$ 277 101 -56 -107 -43 38 176 14 -156 -10 -41 43 153 27 -51 -23 50 198 199 -138 -106 29 51 89 140 41
4091D1j03J1M2n4L7l0N1o4Q4mJ09j76L10k51J06m8J39j72j26J49K45j2j90k43
$$ 41 -62 -51 -9 -63 -26 -56 -5 -69 15 11 120 -56 254 3 109 61 200 28 -98 51 296 284 94 -149
4115a49J72l8n8J21K3n8m7J86J21k66j96J22o2q9N5J64k32M6K12j38J36nj02q6
$$ -149 23 -15 -73 48 71 13 -34 152 273 7 -189 -67 -129 -218 -163 1 -231 -185 27 -111 25 20 -82 -168
4139a68J12O8J11j30j7k0J28J64j02l01J20J6j17L43k21J29k50K5K0P8J88j82
$$ -168 -56 12 123 -7 -24 -44 84 248 146 -155 -35 -19 -136 207 -14 115 -135 -110 -90 -12 176 -6
4161fL1K0QJ64k71j29L02k23P3K77j07k91L57j46m7Q9o7J46j80Q6N1p8k02J67
$$ -6 25 45 53 217 -54 -183 119 -104 -31 246 139 -152 205 59 12 101 34 180 0 86 137 59 -143 24
4185B4J8p8q5l5N2J20L7M0n3k69J64L3R8K1j9n2j22J19J44j89o8M0j20R9K15m1
$$ 24 42 -36 -121 -156 -104 16 53 93 40 -229 -65 -32 66 87 68 16 -106 13 157 -32 -100 -60 -180 -81 134 93
4211I3o0O4j28j74L75r7j6j90K8N1q2K31n3r1MJ1Q9j10J03k42J87k14J12L24k04
$$ 93 33 97 -31 -205 170 73 57 -133 -105 -54 -136 95 42 -49 -45 -34 55 -55 48 -194 -7 -221 -109 215 11
4236A1L3j4k9r0K57k05p1j2K78j9j14M5N5j57J13p7k2j19jJ57r0J65j06M7n9q3
$$ 11 44 30 1 -89 168 -37 -108 -120 158 139 25 70 125 -32 81 4 -18 -137 -138 19 -71 94 -12 35 -24 -107
4262a07j01K67j40J21j71K05l8j35N8J44j11J53N4j13j64N0J22m1J33k44M6j55
$$ -107 -208 59 -81 40 -131 74 36 -99 -41 103 -8 145 199 86 -78 -28 94 53 186 -58 -12 -167
4284a67K43MM4j86j40L00L2n8K3m4l00K16N3oJ2q9m6J64j25pN4j17J77j7R2N2
$$ -167 76 80 124 -62 -202 98 130 72 95 51 -249 -33 20 14 26 -63 -109 55 -70 -77 -23 -140 37 20 112 164
4310A64j65p8J63r4j07J07Q2n7j13L1k8K24j28o5j55J98Q9r2j20M2J18O0k6M8
$$ 164 -1 -79 84 -10 -117 -10 72 15 -98 -67 -95 129 1 -64 -219 -21 68 -24 -144 -102 16 76 50 98
4334I8R1k75N6p0K03j43r7L72k72n9J80k06L5lM3K79j67l1O3p0j01J82m2k62L30
$$ 98 189 -86 -30 -100 103 -40 -137 235 -37 -96 84 -122 -87 -90 -47 232 65 34 97 27 -74 108 66 -196 134
4359A34r2q5J66m8j54N9LM9l1m2J56k26O4M3O1j60N2j2K57j64j23Q7J97j62K7
$$ 134 42 -43 123 75 -79 -20 -17 32 1 -41 115 -111 -47 -4 57 -103 -51 -63 194 30 -93 -6 191 29 56
4384E6jP9k73k1Q8N4k9L4O7k62J16K35k37Pj10K0R8J28j32mJ98j61LJ11j08l1
$$ 56 55 134 -139 -160 -72 -18 -47 -13 54 -208 -92 143 -94 -87 -197 -177 -79 49 -83 -87 111 -50 -47 64 -44 -75
4410g5j17K24L2j7m9j98J65j72J72P6J24j32m4j34N6P6lO6N0k9j02KJ06q9m3J76
$$ -75 -192 32 64 47 -2 -200 -35 -207 -35 41 165 33 -11 -145 -89 -13 -16 50 100 71 -31 -29 77 -12 -55 121
4436A21R1k60N1k39Q5L07j97j22J26p2J62M9j85J06k1J19k47K14K2l3k19J53R3
$$ 121 212 -48 3 -236 -151 156 -41 -163 -37 -109 53 102 -83 23 2 121 -126 88 110 77 -142 11 104
4459A04j66K39j08j75j5R0J22J19j65j52L9J18k12R5j6J08j76K63j27J17j37l1
$$ 104 -62 177 69 -106 -121 -31 91 210 45 -107 -68 50 -162 -67 -83 25 -151 112 -15 102 -35 -66
4481f6J20p6M1J86n0j69P8N0r7L9L2k0j9n9J31l27K78l58J95L39k45N2l2l9k3
$$ -66 54 -22 19 205 155 -14 64 114 17 56 88 68 49 -10 121 -206 72 -286 -91 248 3 55 23 -16 -39
4506c9j3J00j9L3l3l4j37J18m9J94j62J63K6j97O9j66K20o7J8K6jl17N16j95j86
$$ -39 -52 48 29 62 29 -5 -142 -24 -73 121 -41 122 148 -49 20 -146 74 7 25 51 50 -267 249 54 -132
4531a32K76m02L29j74J00J68j02m3lP0J7k7k45O4J32o0j0o7O3J54j57J48j95M4
$$ -132 144 -258 71 -103 -3 165 63 20 17 87 104 77 -168 -104 28 -32 -42 -109 -46 108 -49 99 -96 -52
4555e2J04j5L2q8J24l4j47n7K04L6L2k18Q4q6J45J38l61N7P3N7J1PK11m34J32
$$ -52 52 37 69 -19 105 71 -76 -133 71 107 139 -79 5 -81 64 202 -159 -102 -29 28 39 46 257 -177 -45
4580d5OJ32k40J54q8Q4R7kn5n5j70J48l0J26m5r4q4N4J56k00J55q2K19j29J01
$$ -45 -39 93 -147 7 -81 3 100 98 43 -12 -182 -34 -64 62 17 -77 -161 -107 49 -151 4 -78 141 12 113
4605A13L02k82p5k0n0J3J99l86K73J0Lr5qK13j41J00j10L2k25M5K21j54n2O8P2
$$ 113 415 133 58 38 -12 1 200 -186 87 97 100 5 -3 210 69 169 59 91 -134 -89 132 -22 -74 -6 66
4630F6K0k57O1K49j17j99J55q8K01j1j83J38k14J30N8q3R9j45J34N7j76K48j51
$$ 66 86 -171 -110 139 22 -177 -22 -110 91 80 -103 35 -179 -49 9 -74 25 -120 14 71 -105 143 -8
4653hk6l5Q0Oj8p7J01L1J03m3k27L24k86nn9K04l1k8j1p1p2J87o0J55l10K28q3
$$ -8 -34 -69 11 17 -1 -78 23 54 157 114 -113 211 -75 -80 -139 65 34 6 -5 -76 -148 39 -21 134 -176 52 -31
4680c1J99j22j41K20j69O7l2P0Rj54O4K23j82Mj33p8L01q8j2j17L9Q6J24p3j18
$$ -31 168 46 -95 125 -44 23 -9 61 70 -84 -20 203 21 25 -108 -186 115 27 15 -102 -63 23 147 74 -44
4705d4j30K03j05K22k7j54J18p9j18K12k02K0J05M4m9L60j97k32l6J51J32j11
$$ -44 -174 29 -76 146 119 -35 83 4 -114 98 -104 -84 21 65 16 376 179 -53 -89 62 194 83
4727H3l2k55J39j19J89K12q5k75o3J72p5K51K5k51J15q8Q9o4J09kl68K33O8K10
$$ 83 51 -204 -65 -184 5 217 132 -143 -206 -34 -109 142 167 -84 31 -57 32 -32 77 75 -293 -60 8 218
4751B18j01k54J2O5J62j1j26M4k6P2KK1m3j78O9R4kl3p0R0O8j38J30r0J97L1l38
$$ 218 117 -137 -125 -60 102 91 -35 9 -17 55 57 78 35 -143 -74 20 18 -15 -85 5 73 -65 65 -25 172 203 -135
4778a35L88l61J32L2P5j38P3j07K6n4O3J07R1j84o9K02k79J84L7r1l1J0r3l1L40
$$ -135 253 -108 24 56 131 -7 66 -41 -15 -69 -6 101 192 8 -61 141 -138 46 83 -8 -39 -29 -122 -153 187
4803A87k52O2J05q7k8J27j02p1K69j21Or5lj62R0L7J01L6j28j7j91K69n3K28j76
$$ 187 -65 -3 102 15 -13 114 12 -59 210 89 95 0 -3 -165 -75 -38 63 99 -29 -46 -237 32 -21 207 31
4828C1o7k47L12K40k54m8n5J43%r7R8j11Q2m9P1N1j90P1n7j22K55N2j58J11l70
$$ 31 -36 -283 29 269 15 -33 -88 55 55 -42 56 -55 27 -22 49 100 -90 -19 -76 -198 57 109 -49 62 -308
4853c08L36M6j64K06j02J58j63j7K2J40k99K53m2Q5m8o8j19r8K95oj15l8P7l5
$$ -308 28 74 -90 116 14 172 9 -8 14 154 -145 108 66 151 103 35 -84 -182 113 107 -8 -46 31 -4
4877dM3k1K15l15k1MK47j31K01k29p8N6L1J3K6N9k78j6P1J71p1J06o4Nn3K0J56
$$ -4 39 18 233 -82 -103 -99 148 17 218 -11 -89 -33 -2 11 37 96 -182 -198 -127 44 -27 79 15 20 -33 -13 143
4904A43n6k60K73k35O4J70l44K59k6oj42rL27j44K7j04L5M4P5J24l53K13m1k68
$$ 143 87 -173 100 -135 -71 99 -245 14 -12 -18 -160 -169 158 14 41 -63 -28 16 91 215 -138 75 34 -234
4928b34L76q5j02O8K27k35j74J98R1j13Oj04J79j43kK02o5j90Q6Q2j04K44k81
$$ -234 142 57 -45 23 250 15 -159 39 130 17 23 -81 98 -45 -47 155 90 -100 -14 68 -36 208 -73
4951g3K2J01J76l51K01j43J41R8k26K20l06J50N4j24J46n9n8r1O5MJ30m0j36L3
$$ -73 -51 50 226 -125 76 -67 74 172 -54 166 -140 10 64 -60 86 27 -31 -122 -57 -53 77 37 -99 -66
4975f6J3m7j4LL6n3J72j37j8L7MN4J05j85K01j96J41j65J16K02k74J34l6m4n8
$$ -66 -53 -100 -114 -111 -75 -128 44 -93 -111 -74 -70 -16 89 -96 105 -91 50 -115 1 203 -71 63 27 -17 -75
5000g5O7K26k50k8J44J7M6k36J9O7J02Kk16Q0l5QJ32J03k56J05q5j43J37J8J38
$$ -75 -8 218 -32 -60 84 101 147 -89 -70 -3 99 101 -115 -35 -70 -62 70 173 -83 22 -63 -206 -69 -51 87
5025H7j03m5o5p0K65M2k65J9N3J7J66p2j32RJ24j32R7K2n4J55r5J1j05P5ol0j
$$ 87 -16 -61 -126 -196 69 111 -154 -135 -82 -65 101 29 -103 -94 30 -102 -5 17 -37 118 23 34 -71 4 -2 -32 -33
5052c3n0J59J27k84J09m6n1j1J21l3J24j81J63j02K6n4o7J92M1Q9Pj90q9R9j06
$$ -33 -83 76 203 -81 28 -18 -69 -80 41 8 132 -49 114 12 38 -16 -83 109 150 239 246 56 -33 66 -40
5077d0n7J4N7J77j04j8j03K8J04p8j42K54J54k63j34O8P5L8j8m4j12l2K60j07
$$ -40 -97 -83 -26 151 47 29 -74 -46 58 -20 -162 92 246 -17 -151 -83 -8 30 12 -32 -144 -176 84 -23
5101b3p6K84j74j39M4K93k24Mj7J9Jk6K3J60k85J26M3j11j4J32R9j72M3J0j80
$$ -23 -99 185 11 -128 -84 209 -15 -11 -28 -9 -8 -34 -11 149 -136 -10 33 -78 -92 40 139 -33 10 20 -160
5126a60L9Q5J41k16J15k5L2K26l76N4N7J58l16J92o2%q3J21j40J73j85K11j72
$$ -160 -121 -36 105 -111 4 -21 11 237 -139 -85 -28 130 -186 6 -56 -56 -139 -18 -158 15 -170 41 -131
5149a31K46q4N8j77P7J29l4P1j17n7K4M4r9k4O2j13K24n8m2J03l4n2j07J17N4
$$ -131 115 31 89 -88 -11 118 84 155 38 -19 5 49 -50 -74 -12 -125 99 41 -1 102 68 16 -91 26 80
5174H0J14j07j90J82k2qn3p5J78m7J48p3q3k3j22J08j31K70Qk23Q0P1j33J31O9
$$ 80 194 87 -103 79 57 49 -4 -79 99 52 200 127 44 21 -101 7 -124 146 154 -69 11 82 -51 80 149
5199A49r7J04j90P4k73L14j57rK8L23l77R9P8j18M7J04J17l27J91M2j08j50J28
$$ 149 52 156 -34 40 -233 81 -76 -85 -57 266 -111 -12 66 -52 -5 99 216 -111 80 122 14 -136 -8
5222hj5P7q1O3j17J48j78K76p2r2l3%J90j95q6K71p8rj6k19J48Q8L1n0J46o8k40
$$ -8 -23 54 -27 36 -81 67 -111 165 93 1 -32 -32 158 -37 -123 148 70 61 45 -174 -26 62 93 43 189 121 -119
5249a19J79j12J73j51n9J75k7k3q9P2Jj1r5N9J13j4k29L14q8j06J1j22Q1J11j04
$$ -119 60 -52 121 -30 -89 86 59 36 -53 19 20 9 -86 -27 86 72 -157 157 69 -37 -26 -148 -67 44 -60
5274f0K19k01R9J15j89J73j52j14J43o0J14K05l00k10K77j45m3K07q7Q5K5j07
$$ -60 159 -42 57 172 -17 156 4 -110 33 -27 87 292 -8 -218 59 -86 -129 78 -9 76 101 -6
5296fL5R5j08j16p2P4J66lN0P4k18M6Ok27O1J79l8O9j27M6r4L4J38O1j22K2k69
$$ -6 29 124 16 -100 -172 -98 68 65 115 189 -29 17 23 -204 -143 36 -2 67 -60 -14 -108 -74 64 125 3 25 -244
5323b44J81m6J39RJ03j54P4j51L6Q7j4m4LJ8j03J14o9J50j63P6k7N0j97P7R3m5
$$ -244 -63 -109 30 39 142 -12 62 -89 -53 34 20 -24 -21 -3 -106 8 -61 89 -74 2 -25 25 -172 -95 -2 -47
5349d7K22j21j09J32r3L8Q2j31M7J9j87K54r2j10K96l06N9R0K5m0J1l9j00J46
$$ -47 175 54 -55 77 -16 22 104 -27 20 39 -148 106 14 -96 200 -106 -47 43 68 28 39 0 -100 46
5373D6j79j3J78J27k32l1K33l53K00j8Q7l3r4J34j38M19m82J89J14k6j78P1o2
$$ 46 -133 -146 32 159 -73 -104 129 -224 -24 -42 45 12 -82 52 -86 333 -149 40 154 128 -50 21 -41
5396d1K42n3k24L1q3K26r2K4k38K09pj49J69q4J27nm5M4J49l19J20m1J18j73R7
$$ -41 201 148 -76 -45 -128 98 6 30 -208 1 -6 -155 14 -70 57 52 7 51 200 -119 1 -40 78 -95 2
5421BK4M5o6j27n5O1K9K45j11j54J82m8k3K1L7o5N8L5j28J85l02k4Q6K22j40r1
$$ 2 26 71 5 -122 -177 -116 -87 158 47 -107 75 27 4 25 62 -3 55 90 -38 147 -155 -179 -93 129 -11 -102
5447a02O5J11m1qK1K8N5k10J06j91L41p3l29K05l5j15O6K43j98K4L7p7p8K68j4
$$ -102 -37 74 33 25 46 74 129 -81 25 -166 175 102 -227 -22 -57 -172 -106 137 -61 -37 0 -77 -155 113 99
5472I9j69L5K5j06J13M2l02J30J10K23J5k68nj76J84K58k06n9M8k1P4R7p8M3j70
$$ 99 -70 -35 -10 -116 -3 39 -263 -133 -23 200 215 -53 -58 -234 -50 208 2 -57 -9 -30 44 141 63 106 -64
5497f4k3k1O0j2J82j39Qj2jM3K0N6j55N2P4o7k0k1k5j2m7K26j73RJ07m2J64k58
$$ -64 -87 -108 -48 -60 122 -17 -9 -21 -22 21 41 97 -58 -6 68 1 -19 -40 -65 -77 -124 102 -71 -62 45 3 167 -91
5525i1K17j84J71q6Mp9K27q6k62K00k0J5J10o1j17O3p6R7j25M6J15j2J42j90N0
$$ -91 126 -58 113 27 31 -48 179 93 -169 31 11 26 136 75 -42 21 -55 42 -83 -37 78 66 208 18 68
5550F8J35k54Q4K6J04p1J2r4j26M2r3K01K34k68j66K86o0J23k51o0K48k30J95
$$ 68 203 -51 33 59 163 92 104 10 -116 -74 -167 34 268 0 -166 120 60 183 -68 -128 120 -110 85
5573H5m7j26KO9Oj9J52j45k5J69l2j13o7l9R9m8J05j12J07k03Q2R4k4m1n2L3O4
$$ 85 38 -88 -86 -17 -11 -30 122 -23 -48 121 89 -24 -91 -130 -31 -79 26 -86 21 -182 -100 -6 -30 -71 -123 -90 -26
5600b6R0k00M9j90K35J05N3j3j35R3p0J82j42j2j02J29N3j06J25k05k0J94k19
$$ -26 64 -136 -87 -277 -42 63 116 103 -32 61 -9 173 31 19 -83 46 99 -7 118 -87 -107 87 -132
5623a32K26j49J26N9l1j84J19k05J42P1q2k3k9K19r4j11K74l46K14r9N3L0j08
$$ -132 94 -55 71 130 99 -85 34 -171 -29 42 -40 -63 -92 127 33 -78 196 -150 64 -35 18 48 -60
5646f0J23J9o6q1J29j13J5J30k67J22J43m7k60J35k8Q2J14k70J14Q6l0l2Q5r9
$$ -60 63 82 16 -65 64 -49 -34 96 -171 -49 94 47 -213 -78 -106 -24 90 -180 -66 20 -10 -42 43 -56
5670e6J12k47K34o7j0J83l5j28L9lj52P4O9j7nk7M2k1O2Nj03J57jN5j82Q8J31
$$ -56 56 -191 43 -24 -34 149 114 -14 25 22 -130 -56 13 -4 -9 -36 6 -15 47 52 -51 106 105 160 -22 66 197
5697A97k98J39r6O6N2O0k86J17l0J11r0O4K6m5j29J41K5J19K2k21q4N6K0k1J06
$$ 197 -101 38 -58 8 60 120 -166 -49 -79 32 -58 6 32 -13 -142 -1 24 143 165 -56 -140 -84 -64 -85 21
5722B1l6J42k38n8K66j66jJ21J8j4j38J33q5j30k1K89Rj76P6j5J05k8j60P4m1
$$ 21 -15 127 -111 -169 97 -69 -70 51 69 55 -83 50 -35 -165 -186 103 112 -64 12 -3 102 74 -86 -12 -53
5747e3Q0J46l8j08MJ21l54K00J26j43j23Q0o5K38J1j49K2Q4R5j57O1Jk8N5L8r8
$$ -53 27 173 135 27 31 152 -202 -2 124 -19 -142 -62 -127 111 122 -27 -5 79 174 17 78 79 51 106 144 46
5773D6n6J5j25K17oj26O0r2r5J56j11J92O2k13J80q7n7J38k87J71k6n9O2q0J79
$$ 46 -10 5 -120 97 91 -35 25 -67 -162 -6 -117 75 137 -76 104 17 -40 98 -189 -18 -44 -103 -41 -121 58
5798E8N5j96MJ34r3J8k2P8Rr5R7M0j94J22L9O6o2j46q4J08K0j39J83j34J7K4J24
$$ 58 113 -83 -79 55 -38 -20 -42 36 45 -50 47 87 -107 15 54 120 58 -88 -172 -64 -44 -183 0 -134 -117 -93 31
5825C1R2j98P2L3J8J5j82R5J41K9r9M3j12K4n1J5J30Qj2k42J74J41k22P8j13J90
$$ 31 123 -75 -3 30 48 63 -119 -24 117 146 47 90 -22 2 -49 -34 96 104 92 -150 24 165 -57 21 -92 98
5851I8j05J98r5r8j38J83j08q8L03k3j75P4J04K7O1k33m0N1J09p5j30R9P2j11
$$ 98 -7 191 96 -2 -140 43 -65 -153 150 127 -48 26 130 157 218 -15 -55 -4 105 30 -100 -1 71 -40
5875d0M5J3K4R6o3j69L15j54Q8j05o1%j47J18J00M2k00j17L19j58M0K3o2k4O6
$$ -40 5 18 42 138 75 -94 221 67 155 50 -11 -11 -158 -40 60 102 -98 -215 104 -54 -14 9 -53 -77 -11
5900a1j43J51q0J74j92o7K00j08K15k12K25k87K61j61K79k47Ol5L4J29q2j61J35
$$ -11 -154 -3 -83 91 -101 -168 32 -76 139 -73 152 -135 126 -35 244 -3 3 -32 2 131 49 -112 23
5923B3j33L8J12j86J67p9K62k74q5K57p6p9J3J17j54K37m74J88P2j8K25N2j15
$$ 23 -110 -72 40 -146 21 -58 204 -70 -155 102 26 -53 -40 77 -77 160 -314 -126 -54 -72 153 205 90
5946I0j00n1M3r3K45r0j26PmJ36o8R3J3j10L1%j88K12r8m1l0J88k24J82q9O9J3
$$ 90 -10 -61 -18 -111 134 44 -82 -75 -79 57 -11 82 95 -15 16 16 -172 40 -58 -99 -129 59 -165 17 -72 -3 10
5973A0j16L34l09P2M4o5J03j85J64o1M1M4j59L4K27k22OJ6K05j79j80K44rj78
$$ 10 -106 228 -81 -9 35 -30 73 -112 52 -9 32 76 -83 -49 178 -44 -38 -22 183 4 -176 68 59 -119
5997a19K2m1J32N4L6p1j03J06K0j27l2K12n0K9o1n4P8O5p3P1N1j61R3K5m7q3J5
$$ -119 -97 -138 -6 48 84 13 -90 16 36 -91 -123 89 39 68 7 -47 31 96 23 94 145 -16 77 102 55 -28 -13
6024a3J99j21j02P6P6o1j1M8j78J2K15k11J71j88J43M9j19P9O8kj63j3j18K25
$$ -13 186 65 -37 39 115 54 43 91 -87 -75 140 -71 100 -88 55 104 -15 64 132 130 -33 -46 -164 61
6048F1j43J33J7k64J05J88ll05O1j7K01j07J32m4p8P2J7j0j55K15K8j75N3j33
$$ 61 -82 51 68 -196 -91 97 94 -211 -150 -167 34 -73 59 15 -63 9 26 16 -139 76 104 -71 -18 -151
6072a51J73L4j61L0J45j17J21o0O8N3p6k5Q7n7j24O8n1j1J6qM1l8k2k59J66J11
$$ -151 22 56 -105 -75 70 -47 74 14 82 135 59 34 121 64 -60 8 -43 -54 -38 -46 -5 -43 -65 -324 -158 -47
6098d7O4k1M0r8N5j58J46M0p5J29j36R9rk3o9K68j29j44J60k7l12J37mK45q7j70
$$ -47 17 -4 36 -62 -7 -165 -19 21 -54 75 -61 38 29 6 -63 205 76 -68 92 65 -247 -110 -114 131 44 -126
6124a26K29j55J29o5J26j33q5P7n4j9O6j64P1J86o7j53J37K60m48J70J90j80J53
$$ -126 103 -52 77 12 138 5 -80 -3 -57 -76 -10 -174 -103 83 16 -137 0 260 -188 -18 172 -8 145
6147A45r5q0K9M6J7L3j87K09j3k22M5P9q8K25n4k07R7K2j12NJ58K1j17P5mko9
$$ 145 50 -30 -1 45 62 95 -92 117 104 -118 -73 6 -82 143 89 -118 -21 1 -111 -106 52 73 -44 31 27 25 -44
6174d4R8j34O5J16j11J63k15K05j37n5m8J65o9J27j64J1M9L9j58O4K6J83n3j69
$$ -44 54 -80 -15 101 -10 153 -62 143 6 -49 -97 68 -1 126 -38 -27 22 61 -97 -33 -7 176 123 -46
6198d6M1J11q3R0Q4j10k34O3n6J13l6J1K3j44J49J6J35j68kk5p0N4k0J93m88M04
$$ -46 -5 106 23 113 197 87 -147 -84 -140 -27 -63 -52 -29 -173 -24 -8 127 -41 -43 -68 -138 -84 -104 89 -399 5
6224EJ2J40j90R7K06k33N1j12mk1m6L8O1q7N1J49j58r7L02j21k58K02O1o4j51
$$ 5 17 157 -33 64 270 37 88 -24 -28 -49 -95 -57 4 -83 -32 117 -41 -138 164 43 -215 -13 48 -16 -167
6249a67J77J8O9R5j5k8o6j70k0K51%Lj68J06j98J13Q1p8j28k1K42r9l9J5K6k8
$$ -167 10 28 97 192 177 149 83 -87 -107 144 144 147 -21 85 -113 0 81 3 -125 -146 96 -3 -42 -27 -1 -29
6275b9l8j25K85k16o7K77j79J71m9r6K9m2J72n1l6p6k8N7QJ00k52L50j53j85L19
$$ -29 -67 -192 93 -123 -190 87 -92 79 30 -66 -37 -79 93 42 6 -70 -98 -41 -33 67 -185 165 12 -173 146
6300A46j82J07J0j05K5P0k60J15R3q4j07K90j93J93Oj66P7j81J77qK44k12m1K06
$$ 146 -36 71 81 -24 1 71 -189 -74 19 -65 -172 118 -75 118 124 -42 35 -146 31 23 267 55 14 220
6324B20p9j67L1r9J43j18K6J23j55J17l2L0k5j23j89J63J22n6K9R2j9n9L4J42
$$ 220 141 -26 5 -94 49 -69 -43 80 -75 42 10 40 15 -108 -297 -134 -12 -68 -39 53 34 -25 9 151
6348A51k64K16k31K38l80K87K56k66j19K6K65j96j18M5N5Rq6J81j87K95j52k1
$$ 151 -113 103 -128 110 -270 17 273 7 -112 -86 179 -17 -135 -90 -35 -26 -112 69 -118 177 25 4
6370Dn2j24J33o4J86r0n5J06m3J3l7L7O5q8O0k0qJ24j36j64K21j23J70k12K79
$$ 4 -48 -172 -39 -103 83 -7 -62 44 1 14 -23 14 79 -9 51 31 23 147 11 -153 68 -55 115 -97 182
6395A82j62l6lm2J07o7N7J39Kj15j76N3J33k5m6J45mr4j36R2j27J09M1j36N7M7
$$ 182 20 -16 -19 -61 46 -21 36 175 177 62 -114 -61 72 47 1 146 142 48 -88 4 -123 -14 27 -109 -52 -5
6421eL6j65P2Q8k1J24J01k68q6P7R6o8j84K55j55P7N3O5k27J70j42R0J09j59p9
$$ -5 31 -134 -62 26 5 129 230 -38 -124 -47 49 -19 -203 52 -103 -26 27 92 -135 35 -107 -17 92 -67 -146
6446a46Q5Q4l0K7l8Q9o2rLMj46j29K36J7p1K24j83K01j34J26jk25J7j1J17j36
$$ -146 -61 23 -7 20 -18 71 9 0 3 7 -139 -268 -32 -15 -86 138 -45 156 22 148 147 -78 -61 -72 45 -91
6472i1l5L2J99q1m7J59l46K63M6q9J71q2j65kk9J37l4P4j48k6N0J0N4j4P7R6k16
$$ -91 -126 -94 105 24 -23 136 -210 53 99 10 181 99 -66 -68 -97 40 6 80 -68 -94 -44 -34 20 6 83 179 -37
6499c7J05o2r9N0J14J06r8j95Q6O2Lj26J6J53j22O3J05j76j4J5n1P5P8q5J5J30
$$ -37 68 6 -93 -43 71 177 79 -116 -30 32 35 -91 -75 78 -44 19 124 -52 -66 -51 -102 -27 51 -34 -19 111
6525A11k10J25r0J93j92l3l7J77k8j76K84j85J11j22O3R1n4j1K22k33j87K87q2
$$ 111 -99 26 -64 129 -63 -96 -133 44 16 -160 124 -61 50 -72 -9 82 28 17 239 6 -181 106 24
6548B4J66j35j71R7O7o3k8J75j65J03j05J7L0j92K63r5q8M0K1Q1k9pK35k88N2
$$ 24 190 55 -116 -19 48 -15 -43 132 -33 70 -35 -18 12 -180 83 -12 -100 -60 -39 42 13 6 241 -47 5
6573EJ76j65n5L47l40Q2Qj34Q8j21O0J4k0K7k2J75k71P5N3k28J1L41j02R2j12
$$ 5 181 16 -39 308 -32 50 58 -76 12 -109 -49 -35 -55 -28 -50 125 -146 -71 -18 -246 -235 106 4 96 -16
6598a6j51J41j55J3J70K8l6J01q5j09J43p9L2J55ml8n0r5L1k43J41M02k05r0j53
$$ -16 -167 -26 -181 -168 2 30 -6 95 10 -99 44 -35 -3 152 148 110 60 -35 -4 -247 -106 296 91 1 -152
6623a52J19j61K0K32M5q5o9oj14K7J53rj32J24M2j74L9N7J00m5Q6J08j39m9ml6
$$ -152 -33 -194 -174 58 103 18 -51 -57 -171 -144 9 0 -132 -8 34 -140 -101 -44 56 11 97 205 66 17 13 -23
6649b3j2K63j12k06J66j39R8j03j30J40J35NM5k64N3P0L1nN2m5M1o8l09K32N0
$$ -23 -35 228 116 -90 76 -63 35 -68 -198 -58 77 82 127 -137 -84 -14 17 12 64 19 60 -8 -317 -85 -35
6674c5NR0J3o7k0j03J27k17R3J02%KJ3K5J4j2l9K52k31j41J86O6j45J38k48K10
$$ -35 -30 60 73 6 -14 -117 10 -207 -114 -12 -12 -10 3 28 42 30 -9 243 12 -129 57 123 -22 116 -132 78
6700G8m4N2k49j31K88J81j27J13L8o7k41o7J89L1j05L7q4J17J4j9J7K05j25j67
$$ 78 34 86 -163 -294 -6 175 48 161 199 132 -109 -176 13 44 -61 -24 -108 9 23 4 21 226 101 -66
6724f6Q1L2r5J50kj60N9K7k1l0j18N3j52J80K23R6k28R7j16k2p2K20j28J81k78
$$ -66 15 47 -48 102 100 -60 -1 26 5 -25 -143 -90 -242 -62 161 257 29 126 10 -12 -84 136 8 189 -89
6749h9J19j68J85l0j75J74N2j4l7j23jJ39p9q8j10J94mk5J08ln3J43k52K1N6m
$$ -89 30 -138 47 17 -158 16 68 54 17 -106 -107 32 -47 -135 -245 -51 -55 -80 28 25 -28 115 -137 -116 -60 -64
6775f4N7l5K8J19j97P9j59J23R7m3r0J5R4N4l37J12K32j76K80k92J55j19J4N7
$$ -64 -7 -42 -14 105 -92 -13 -172 -49 48 5 -85 -70 24 78 -259 -147 85 -91 189 -103 52 -67 -53 4
6799Dn9J9J90j40j45J65j63J84j35K41j66k1J46r7o3K62m15L76m23J39K49r3j96
$$ 4 -55 -36 154 14 -131 34 -129 55 -80 161 -5 -26 120 23 -40 222 -193 183 -240 -101 148 55 -141
6822a41R9K68o9q8M2o1O8m5O4k78J08RQJ3p1K6J26j03M4l7j79K63p3pM2P3N1j47
$$ -141 -42 226 157 69 111 50 118 73 137 -141 -33 -24 -16 -3 -74 -48 78 -25 19 -18 -197 66 -7 -14 28 101 152 5
6850EM3N1j47K79l64J29n7P0Qk1L4j23J70j4J33j05l5m3j9J81j00J14l21J28m8
$$ 5 48 99 -48 231 -133 -4 -61 9 17 -4 30 -93 77 63 196 91 56 13 -6 175 75 189 -132 -4 -52
6875e2m3J08k1j77J49Q3Lk9J4jN1j29J37l2j26m5L08l07j6J28j13N9j83Q8n2K04
$$ -52 -95 13 -8 -185 -36 47 50 21 35 34 85 -44 93 61 -65 -110 198 -109 -125 3 -110 -51 -234 -146 -198 6
6901FO6K9j07N0j31l4J82J14K3j66K7k70L98k53K83j48J02m6j02R6j47m8J21P1
$$ 6 72 101 -6 44 -87 -121 61 175 198 32 59 -211 187 -66 217 69 171 125 23 119 -28 -76 45 116
6925A16k74K93j00J4O4l3j34J95j55J92j31Jq1O4q1J14o2P6J8k44K68j80Q0r9
$$ 116 -158 135 35 49 113 80 -54 141 -14 178 47 48 -33 31 -50 64 2 78 96 -148 120 -60 20 -79
6949g9n7J62j06j2M04n10K48q0Q7J04j03l6j94K23J7p8j52P4K36k78J44J05j69
$$ -79 -136 26 -80 -92 312 -198 50 -30 57 161 58 22 -172 51 68 -10 -162 -88 148 -130 14 119 -50
6972e0j1J59o1r0O5qR9j77J01m8M4m6M4m2P5J5l1j07J42m9n1K54j81M7j48J13
$$ -50 -61 98 37 -53 12 4 103 -74 27 -21 23 -23 21 -21 54 69 38 -69 73 24 -27 227 46 93 -55 58
6998E8j77M06k31J7j19J05j25K06j11k16K04p7j14K10L5p2O9q5o9J56j15j0J02
$$ 58 -119 287 56 73 -46 59 -66 140 29 -187 17 -60 -174 36 71 -1 68 -17 -86 70 -45 -55 47
7021D7j19p3K86j13j94J85K1L7m5J7j00m8P3k3Q4R8k5j29Q7o7m5J04J0l6J95m29
$$ 47 -72 -145 141 28 -166 19 40 77 32 49 -51 -99 -26 -49 35 133 108 -21 66 -1 -46 58 68 32 227 -202
7047b02M10k07J3J12q5p0j38K13j56J16Q2q2j92K37m09K95J97j38O6j37n2K20
$$ -202 208 1 14 126 41 -29 -167 46 -110 6 88 6 -186 51 -358 -63 134 -4 62 -75 -127 93
7069I3j91N7%o2O5o1m8J31J68q8k01K52j63j26K37j26J54j10mp0N6O2j4Q2j08
$$ 93 -98 -41 -41 -103 -38 -99 -147 -16 152 64 -137 115 -48 -174 63 -63 91 -19 -23 -93 -37 25 11 93 -15
7094a5r1M8J27jl7r8j12J47O3m7Q4j46J43j78K33j09J78j50m2J3k10K95p9K6q
$$ -15 -106 -58 69 68 31 -67 -179 -32 31 -16 68 -78 65 -113 120 11 189 39 -3 10 -200 95 16 42 34
7119C4r9mJ55k51J83K40j95J6k72Q8j7N5K7J32j28J76k7k56K03j12OK07k24N9
$$ 34 -65 -69 86 -165 18 258 63 79 -193 -105 -122 -67 -40 92 -36 140 113 -143 60 -52 -46 161 -63 -4
7143dM2K8j59J89j13R8j78rQ3k02L22j78l2R5n9J03q7%j05K50p9J43k18qj30J74
$$ -4 38 66 -93 96 -17 81 -97 -106 -23 -225 97 -81 -113 -18 -77 26 -61 -61 -166 84 5 148 -70 -78 -208 -34
7169c4N5NJ9j06j13K7K14q4j05M2k6K02j89R6J01k61K47l28L02k80K35j12r3K75
$$ -34 21 26 45 -61 -174 -147 67 -17 -122 -80 -106 96 -93 3 104 -157 90 -238 64 -216 19 -93 -186 89
7193H9k3l8J22k33K09k4j09R2km7j7J47q8l8j11J65j67m5J92n0P0q7j98J24O3
$$ 89 66 28 150 -83 126 102 -7 85 83 36 19 166 78 40 -71 94 -73 -118 74 24 94 7 -191 -67 -4
7218dJ53k24N6J4o0K59j75k63J10L3Q2NqP3j95J24J54m8K23n07N1K25J93k07n0
$$ -4 149 -75 -19 -5 -65 194 19 -244 -134 -101 -19 -14 -22 51 -144 -20 134 86 309 -198 -147 78 271 64 14
7243A4J42k91K52J5k33j8J58j63P5Qq0J9Q2L7j32Q6o2K2N1Q4j66K9P3l8n6L53
$$ 14 156 -135 117 132 -101 -119 39 -124 -49 -41 -121 -102 -20 17 -115 -29 -91 -69 -18 66 -100 -71 2 -36 -92 261
7269B61k03o7J51j11P8k69K50j15K8j33K54l1j4q7J54j39lJ43j26M0Q7k18N4n0
$$ 261 58 -9 142 31 109 -160 90 -25 3 -130 124 93 79 -8 146 7 4 147 21 61 148 -70 -16 -66
7293f6J13O8j86J49k8k01K34j32K06p5j42J94j8p2p3k9K91l38J27j21K00j04J4
$$ -66 47 115 -71 78 50 -151 83 -49 157 82 -60 134 116 44 -29 -58 233 -105 22 -99 101 -3 11
7316A1K45j08j38j4nl3R8L2j03n8n8R0J35l40L39k12K34j62K5l4JJ65k1r9r8K67
$$ 11 256 148 10 -4 -9 -42 56 88 -15 -73 -131 -41 94 -246 93 -119 115 -47 -22 -56 -55 110 89 -10 -108 159
7342A59j71nM7j06k2J84j80PL8rNn3J89j00NK2J9k8n3o2P6N0K30j79l5j07J31
$$ 159 -12 -17 30 -76 -98 86 -94 -87 -49 -58 -53 -106 83 -17 -12 10 29 1 -52 -114 -38 12 242 63 28 -79 52
7369E2jO6J5k08R8j19j8Kn7J89n3Kj95M87m14k1K89r6n7j40K91o5j72P5J15p3
$$ 52 51 117 132 -76 22 -97 -115 -113 -170 19 -34 -32 -227 260 -154 -175 114 18 -39 -179 112 47 -125 -50 65 -8
7395hK8O6j22j1J50j60M0J36k35j38R1O4o8J69j57J80j61N2M8J00j85K31nk75
$$ -8 20 86 -36 -47 103 -57 -17 119 -116 -254 -163 -99 -167 2 -155 25 -136 -84 -36 64 -121 110 105 -170
7419a70L51l32K58k27lK1L36j74P3l9k22L00j08k6Q8j33Q6n9p7Q6M4rJ48k39n4
$$ -170 181 -151 107 -120 -123 -102 234 60 133 94 -128 172 64 38 126 -7 79 20 -57 29 73 64 212 -27 -81
7444h1K3Q6j80L0L8N9P3j20J05R3j75R5j65m6J59J80k29J17j83J10j00K47N8k08
$$ -81 -58 28 -152 -122 -84 -25 48 -72 33 126 -49 46 -119 -165 -6 174 -55 62 -121 -11 -111 136 194 -14
7468a4N6qm2j34P0J33j13QJ40j68KJ00K18j90J42j2k10J96j77o6J53j30K2q4l2
$$ -14 42 34 -8 -142 -72 61 -52 -44 96 -72 -70 30 248 58 200 188 -22 174 -3 -69 84 -46 -24 -108 -140
7493a40RJ39J42j79r5J32R6j56L1O4k00K76j40n7J61j86M7R3k6o7jk9K20j00p2
$$ -140 -131 8 150 -29 -124 8 104 -52 -21 43 -157 119 -21 -78 83 -103 -56 37 11 -56 -57 -86 134 34 -38
7518c8q1K78k91J57Jj25K04k21J30J05j44n8J0Q8j87M00l19J08M5%l00M26o8j1
$$ -38 -119 159 -132 25 26 -99 105 -116 14 119 -25 -83 -73 15 -172 228 -91 17 62 62 -238 188 120 109
7542A09L5j0qo9J32j79O8j31j9k5K31j12L3j97P1J28N4j19Q6j45j0J67N6j54J12
$$ 109 144 134 126 57 189 10 78 -53 -72 -97 134 22 55 -142 -71 57 111 -8 78 -67 -77 90 146 -8 104
7567A04j22P8pj82j9K06l6j40N8J34j68j6K77k62J29L3k16J37R5MJ19j93Q1m0
$$ 104 -18 60 53 -129 -148 58 22 -118 -60 74 -94 -110 167 -95 34 67 -149 -12 83 87 206 13 94 54
7591E4J11q7j15KJ43m9nl5Q9j9l4J9m9r7P0J8k8j27P8J18j93L0J3J12J32k19L9
$$ 54 165 78 -37 -35 108 59 54 19 108 89 55 74 25 -72 -2 16 -12 -139 -61 57 -136 -106 -93 19 151 -68 -29
7618b9p4J28j33J29j16Q4J58j94J9K32k56R1p1K1m2R3J79k53P7J46j43J05k45
$$ -29 -103 25 -108 21 -95 -11 147 -47 -28 204 -52 39 -32 -11 -53 40 219 -34 43 189 46 151 -94
7641i4J01K20l70J20J10p3j31K93j90q4J21K5jj06K29j04n6j5j05j2K7J4J03J7
$$ -94 7 227 -143 -23 87 14 -117 176 -14 -98 23 48 47 -59 170 66 10 -5 -110 -122 -95 -81 22 39
7665C9j08m3K33l1j36qr0J8K57k53J9j43R9J23Q2q8Lo3K1J15j14J08q4J00L8q8
$$ 39 -69 -112 121 90 -46 -54 -144 -126 131 -122 -103 -246 -147 -24 58 -30 -27 -90 -69 46 -68 40 -44 56 94 6
7691FJ9m5m8q6N1J69o1M5O6j99J06r1j27L19j42M7O1L3j55K58k24M6q6J34j17
$$ 6 25 -20 -68 -154 -103 66 5 50 116 -83 23 -68 -195 124 -18 29 90 123 -32 226 2 48 -38 96 -21
7716b1J77o1j03O7l2l9oO1m9Q5J92k77j14J23MR6j36n6RO2q9J27m8L7M1o0N1j4
$$ -21 156 95 -8 59 27 -12 -18 43 -6 79 271 -6 -120 3 7 103 -33 -89 -80 -18 -107 20 -28 9 50 -10 41 27
7744B7r6J4o2J33J43k34J56N7j45J82j62l7K5p7Jn1K30k63O1MJ21rM3k29L25k81
$$ 27 -69 -55 -117 16 159 -75 81 138 -7 175 13 -24 1 -76 -75 -126 104 -159 -98 -94 27 18 61 -168 157 -124
7770a24K70j0j8k22L6J60l9l02K24j09J85l9j14J35L2K2j77O9K5M3n1l0Q0m1j62
$$ -124 146 136 118 -104 -68 92 53 -249 -25 -134 51 12 -102 33 65 87 -90 -21 4 47 -4 -34 46 5 -157
7795a57J93L2j88J06J34k41J10L8j19K4n2J8J31L4j11J71r1m9J98l20Q2J62k08
$$ -157 36 68 -120 -14 120 -121 -11 27 -92 -68 -120 -102 29 63 -48 123 32 -17 181 -139 -57 105 -103
7818a03J43k38O9K08j00PQ4N3j97P9O4m5o9L4P3M1l3r7L1r5K47j58j19P1nj16
$$ -103 40 -198 -129 79 -21 -14 70 123 -74 5 69 24 -45 -11 62 103 70 -27 4 -91 156 -2 -121 -50 -55 -171
7844a71J05M7m6J31j81K57j89R0m2J56o6j67j11K32J88l38K2J09JMj62J9j9K18
$$ -171 -66 -19 -65 66 -115 142 -47 43 1 157 91 -76 -187 45 233 -105 -83 26 27 31 -131 -112 -131 87
7868H7j65J35k0N2Q1k46K62j83qM6l9K38k03j48N3j4o1L53j45J7j76j0l0L36k77
$$ 87 -78 57 37 89 170 -76 186 3 -5 41 2 240 37 -111 -58 -72 -133 220 75 92 -84 -94 -124 212 -65
7893f5K62j51j43J06nk0n8j45L12Qk51K28k48J56J94r6r9O9k61J36J39k56P8K15
$$ -65 197 46 -97 9 4 -16 -74 -219 93 101 -150 78 -170 -14 180 84 -15 54 -207 -71 68 -188 -110 105
7917A05M4l0j81N1j00J77j15J26q0M2j13Q8o3L1p1pK58j39j87K53j01p4k7J40
$$ 105 149 119 -62 -11 -111 66 -49 77 -3 39 -74 14 -49 -18 -89 -96 162 23 -164 89 -12 -86 -113 27
7941B7p1K49o0j84j84J95o1N4J30l73K74r4J13n6j2O0j65K33N7m7L1l4k8j44q9
$$ 27 -44 205 145 -39 -223 -28 -89 -35 95 -278 -4 -98 15 -41 -53 7 -158 75 132 85 116 82 54 -90 -179
7966a79N23k82k46J77k8J17j9p0j62K75j41n2J82N4k86J38j44J78N6k6j06k46
$$ -179 344 62 -184 -7 -35 82 63 -7 -169 106 -35 -87 95 149 -137 1 -143 35 91 65 -41 -287
7988b87K47j1J8M0l6%K11k04L2K39l12k2O7k3N2j03J45p6M5J01m3j02J05J00r2
$$ -287 -40 -51 -33 7 -29 -29 182 -22 10 249 -63 -85 -18 -41 11 -92 53 -23 22 123 80 -22 83 183 91
8013I1m2Q1j84K3M3J5o4m5K51k69L37k21mp8O7M1J84k44J26j52K5M5j09MO2J71
$$ 91 49 130 -54 -31 12 27 -37 -82 169 -100 237 16 12 -66 1 42 226 -18 108 -44 -19 26 -83 -79 -17 154
8039A54k33R4r5Jj55L48j15J15j9j50J66N7q7L7j66q4J84j73M5m7L5K25l89K93
$$ 154 -79 15 -80 -79 -234 114 -1 114 95 -55 111 168 81 118 -48 -132 52 -121 -76 -123 -88 137 -252 41
8063D1k54OJ46P0j14lJ27P3j23P1Kq0qL3K3J54O2p7Rk34K10j81k3Q6j74K54nr0
$$ 41 -213 -207 -61 9 -105 -108 19 92 -31 40 42 -38 -46 -13 10 164 226 149 158 -76 134 -47 -70 16 -158 96 91 1
8091AmJ3n0J70p7j03m9J73Q2l8r8Q5j72J81o5p8J01RL2j91M6q4J26R4q4J11Nj40
$$ 1 -3 10 -40 130 53 -50 -99 74 156 118 20 105 -67 114 49 -29 72 81 113 -78 -32 -116 10 104 20 131 136 -4
8119dK7J42q8k8N5j35L4j54K07j38K6J66L0p4n2R1j90k8L0K17j44L0j22K1K07
$$ -4 23 165 77 49 104 -31 3 -151 56 -82 -56 110 140 66 14 105 -85 -113 -83 134 -10 20 -102 -81 126
8144A26o7M5k6k2l8q4J6m6j0O2j1QQ2Q7j36K45k31n6J79ml41K55J97q0j62j04
$$ 126 59 104 78 56 18 -66 -50 -96 -106 -44 -55 -47 35 122 -14 231 0 -56 123 119 -222 33 230 150 -12 -116
8170a16K19Qr8M3Qj06J05jr5r0J91p4J71l51K79k24J21j13N0J04J48
$$ -116 103 111 13 56 64 -42 63 62 -33 -123 68 -6 165 -186 93 -131 -10 -123 -73 31 179
8191A79
$$ Imaginary data points
##PAGE= N=2
##DATA TABLE= (X++(I..I)), XYDATA
0@%%%%%%pJ4j4J4k1K8l5M2m9O3p7R1j05J26j52J73k02K37k70L10l54M01m56N17
$$ 0 0 0 0 0 0 0 -7 7 -7 7 -14 14 -21 21 -28 35 -42 49 -56 70 -82 91 -111 126 -144 166 -188 213 -243 274
30B74n81O55p38Q25r21J028j145J274j413J565j736J924k129K357k611K892l211
$$ 274 -307 348 -390 435 -486 542 -603 671 -742 823 -913 1011 -1118 1239 -1372 1520 -1691
47a691L575l986M462n023N686o492P497q783J0508j2956J6721k3346L8438j35316
$$ -1691 1884 -2102 2360 -2663 3023 -3469 4028 -4755 5753 -7203 9518 -13828 24610 -110706
61a10706r954K46783p733j58019j93906J1217J62380J65240k6126j66503j41158
$$ -110706 -120660 126123 118390 -39629 -233535 -222318 -59938 105302 79176 -87327 -228485
72b28485N2415J73139J22759o6959j79669j15919Q2655J97071J14205r8639k02632
$$ -228485 -176070 -2931 119828 52869 -126800 -242719 -160064 37007 151212 52573 -150059
83a50059r5221J14933J97095P6175j22234j80698m5878J38499J66699J5983j46427
$$ -150059 -245280 -130347 66748 142923 20689 -160009 -205887 -67388 99311 115294 -31133
94c1133j44697R970J54867J39796j7841j59960j37066L0168J70643J35288l7439
$$ -31133 -175830 -165860 -10993 128803 110962 -48998 -186064 -155896 14747 150035 112596
105A12596j68407j21827N2421J71192J06850p1263j67940p6584R8849J63962N0917
$$ 112596 -55811 -177638 -125217 45975 152825 81562 -86378 -162962 -64113 99849 150766
116A50766j13573j55324l1294J26315J53491K2262j29648j45431j3161J29327
$$ 150766 37193 -118131 -149425 -23110 130381 152643 22995 -122436 -135597 -6270
126f270J39261Q009j29027j30031P331J38359J17819l1094j46736j00463N6225
$$ -6270 132991 141000 11973 -118058 -110727 27632 145451 114357 -32379 -132842 -76617
137g6617J53902Q6140p5793j57733p1858Q8778J53009N7656r1544j41749m8292
$$ -76617 77285 163425 87632 -70101 -141959 -53181 99828 157484 65940 -75809 -124101
148a24101R0522J32417L6779r6723j25769k0739J06157J19432L287j20284j18072
$$ -124101 -33579 98838 135617 38894 -86875 -107614 -1457 117975 121262 978 -117094
159a17094J3074J34618J12777l1813j42486j01160M3406J37752Q5913n1473j30742
$$ -117094 -104020 30598 143375 111562 -30924 -132084 -88678 49074 134987 83514 -47228
170d7228p1340N9462J22431N3503o9298j16765m1835P7894J18438L3510r2311
$$ -47228 -118568 -59106 63325 116828 47530 -69235 -111070 -33176 85262 118772 26461
181B6461j23974k3722J04900J22803J0968j10892j15430M41J13784J02785j7507
$$ 26461 -97513 -121235 -16335 106468 117436 6544 -108886 -108445 5339 108124 90617
192I0617j13752q4324L3231J10513O8298m4074j09705o0905N3272J14450N6577
$$ 90617 -23135 -107459 -74228 36285 104583 60509 -49196 -110101 -56829 57621 114198
203A14198o2162j17298n1354O8682J17884M4541p5688j15243l0286Q5855J06422
$$ 114198 52036 -65262 -116616 -47934 69950 114491 38803 -76440 -106726 -20871 85551
214H5551J0705r3251r3200O969R8236Q3628j9208j02177p7443K8557J03994P2206
$$ 85551 96256 3005 -90195 -83226 15010 98638 79430 -22747 -100190 -71633 32361 104567
226A04567l2073j03194o8517L6042J03755O2692m5084j04086n0028N8301J01983
$$ 104567 72494 -30700 -99217 -63175 40580 103272 58188 -45898 -95926 -37625 64358
237F4358L4190p0888r8905j9697Q1783R5528O649q8142q8964J561Q7908Q2365
$$ 64358 98548 27660 -71245 -90942 -9159 86369 93018 4876 -84088 -82527 5381 87746
249H7746o243q6258p6858J1658Q6649O9742k1417q9374o1737L3105R3999N3396
$$ 87746 81503 -4755 -81613 -69955 16694 86436 65019 -24355 -86092 -52987 41012 94408
261I4408m7445r8823m3600N9400R8725L2578o6497r3851k3566O8477Q6348J4794
$$ 94408 46963 -51860 -95460 -36060 62665 95243 28746 -65105 -88671 -20194 66154 80948
273H0948o9752p8495o149P1018P2233k506p5738o9359J1767Q2980O6898k2352
$$ 80948 11196 -67299 -73448 -2430 69803 67297 -8441 -77800 -66033 16947 83845 61493
285F1493q9678o2369L2151R2501N4330m0900r0619m3473M7750Q4807L1703n2964
$$ 61493 -28185 -90554 -58403 34098 88428 47528 -43091 -86564 -38814 45993 77696 24732
297B4732p8670k1326N7671P5024J3290o2721p4009p084O8552P4010J506p4069
$$ 24732 -53938 -75264 -17593 57431 70721 8000 -66009 -73093 -4541 69469 70975 -3094
309c094p2386O030P8337O7051j5802q0232n7163K6555P9662M5866l5836p7740
$$ -3094 -75480 -69450 8887 75938 60136 -20096 -77259 -50704 28958 74824 38988 -38752
321c8752l6089M3314P6504K9011m8401p5348k4635N1822P5294K1130n6023p4592
$$ -38752 -74841 -31527 44977 73988 25587 -49761 -74396 -22574 52720 73850 17827 -56765
333e6765j4193O0731P1038N160o6197o5237O568P0670N8210j7894p4064n0222
$$ -56765 -70958 -10227 60811 65971 -226 -65463 -58895 11775 69985 52091 -21973 -72195
345g2195K6888P4227M3528l1596p3104l8953L4570P1879L4605l8472p0389k8947
$$ -72195 -45307 28920 72448 40852 -32252 -71205 -36635 35244 69849 31377 -39012 -67959
357f7959M3461O9643K1032n0704o8277j1864N8454O6004J474o4602o1267P248
$$ -67959 -24498 45145 66177 15473 -52804 -64668 -6214 59790 61264 -3338 -64605 -57357
369e7357O6960N5648j3597o6681m9778J8138O5369M3888k2684o4739l8178K7979
$$ -57357 9603 65251 51654 -15027 -64805 -46667 18702 62590 39906 -24833 -63011 -35032
381c5032O5365L3081l5209o6949k7614M3497O8211J9885m9973o6906j2185N4649
$$ -35032 30333 63414 28205 -38744 -66358 -22861 45350 65235 15262 -51644 -63829 -9180
393i180O2542M606n6702n6780K603N7226N0534q630n7665m5803J4369N9332M2294
$$ -9180 53362 57968 1266 -55514 -52911 4315 54849 46219 -11446 -57249 -42880 16452 58746
406E8746j9909o2330l9292K6298O4672L5088l2790o5475k8715L8766O3858K0460
$$ 58746 38837 -23493 -62785 -36487 28185 63273 30483 -34992 -63707 -24941 38917 59377
418E9377m3648o0282j1972M7313N5522M638m9839n1625O63N1838M9093n260n4242
$$ 59377 15729 -44553 -56525 -9212 46310 50948 1109 -50516 -49853 1985 51078 45818 -8424
431h424m7221R833N6923M4190j5591n8789l9931K2041N9755L3631k9075n9932
$$ -8424 -55645 -45812 11111 55301 39710 -19079 -59010 -36969 22786 56417 27342 -32590
443c2590k5838L5104N7835J8514l9548n5442j3010M2586N2977Q504m4886n0842
$$ -32590 -58428 -23324 34511 53025 13477 -41965 -54975 -12389 40588 49092 4206 -46636
455d6636m076M6543M9013o73m9692m6002O400N3075M2235j4067n5063l6970K0992
$$ -46636 -50712 -4169 44844 44171 -5521 -51523 -45123 7952 50187 36120 -18943 -55913 -34921
468c4921N6081L0980k6611n5187k5574L1145N3673K0298l3611n1699j5605L6242
$$ -34921 21160 52140 25529 -29658 -55232 -24087 29586 49884 16273 -35426 -51031 -14789
480a4789N0099J1273l9063m8824o182M3609M7032L35m7099m4233O200N0342M0529
$$ -14789 35310 46583 7520 -41304 -47486 -3877 43155 43490 -3609 -47842 -41642 8700 49229
493D9229j2300n1652l5146J8017N1495K9747k1755m9982k5128K5435M9265K1472
$$ 49229 36929 -14723 -49869 -31852 19643 49390 27635 -22347 -47475 -22040 27225 48697
505D8697k9244m8500j6890L3027M8140J2747l6666m7493p302M1042M5431J327
$$ 48697 19453 -29047 -45937 -12910 35230 47977 11311 -36182 -43484 -2442 42989 44316
517D4316m3970m1912M919M5679L7546r890m6529l3473J4534M6792K9431j8754
$$ 44316 346 -41566 -36647 9032 46578 36688 -9841 -43314 -28780 18012 47443 28689
529B8689m6340k5613K1678M6351K2629k5795m7364j8157L0148M6255J3090l4217
$$ 28689 -17651 -43264 -21586 24765 47394 21599 -25765 -43922 -13774 32481 45571 11354
541A1354m5173p983L7624M2693J945m0322l9841L307M1390L5338p350m1988l2801
$$ 11354 -33819 -41802 -4178 38515 40460 138 -39703 -36396 4994 40332 32982 -9006 -41807
554d1807J0757M2648K9491j5255m3727k6298J8767M4292K2623k3573m4980j8682
$$ -41807 -31050 11598 41089 25834 -17893 -44191 -25424 18868 41491 17918 -27062 -45744
566d5744K7926M4083J3125l1654m2248q643L3907L9601L585l5977l7517R37L7659
$$ -45744 -17818 26265 39390 7736 -34512 -43155 -9248 30353 33938 -2039 -39556 -38619 -960
579i60L3867m990l8566l1993Q210M0270K9842j2612m2284k6354J7022M2178K2344
$$ -960 32907 27917 -10649 -42642 -34432 5838 35680 23068 -19216 -45570 -28548 13630 35974
592C5974k0773m1979j8359K4917M1254J3050k8469l9069q198L0490L7123N054
$$ 35974 15201 -26778 -45137 -20220 21034 34084 5615 -33454 -41652 -11162 25961 31015
604C1015l2684l5856j317L4952L4021k565l6045l1567O123L7612K9445j0375l9296
$$ 31015 -1669 -37525 -38842 -3890 30131 27566 -8479 -40046 -33923 3689 33134 22759 -16537
617a6537k5493J5741L9448K1047j9172l8839j7326K2754L8627J3958k5661l7461
$$ -16537 -42030 -26289 13159 34206 15034 -23805 -41131 -18377 20250 34208 8547 -28914
629b8914r762K7387L6000O857k8706l4604l826L1753L3191j435l3653k9835N749
$$ -28914 -38676 -11289 24711 31568 2862 -31742 -35568 -3815 29376 27941 -5712 -35547 -29798
642b9798L5227K7592r686l6813k5184J4036L7860K1099j6914l6547j7564J8407
$$ -29798 5429 33021 23335 -13478 -38662 -24626 13234 34333 17419 -19128 -36692 -18285
654a8285L5739J5337k1830l5305j0728K4812L3532P072k6721l2991l889L0064
$$ -18285 17454 32791 10961 -24344 -35072 -10260 23272 30344 3623 -29368 -33257 -3193
666c193L2221l39l2665k9857M523L3227K6757p067l3249k4844J0903L3886K0989
$$ -3193 29028 28689 -3976 -33833 -29310 3917 30674 23607 -9642 -34486 -23583 10303 31292
679C1292j4536l3451j6872J6853L3184J4805j9733l4292j1713K3499L3577P934
$$ 31292 16756 -16695 -33567 -16714 16470 31275 11542 -22750 -34463 -10964 22613 30547
691C0547k5337l1872n179K6794L0901J626k8959k8121K874L0142K4491n808l0701
$$ 30547 5210 -26662 -31841 -5047 25854 27480 -1479 -29600 -26726 3416 27907 22099 -8602
704h602k2775R111L2331K0854j2728l2887j7817J5366L2356J5841j7397l2067
$$ -8602 -31377 -22266 10065 30919 18191 -14696 -32513 -17147 15209 31050 13653 -18414
716a8414j3282K0253L1466R259k2979k9389m836K4582K8183J799k7058k7184K013
$$ -18414 -31696 -11443 20023 29282 6303 -23086 -27922 -3340 24843 26642 -416 -27600 -25587
729b5587K8783K5176m868k8891k3015O643K9288K1781r721l0220j8264J3315K9613
$$ -25587 3196 28372 23504 -5387 -28402 -21759 7529 29310 19589 -10631 -28895 -15580 14033
742A4033J4594j5604k9511j2142J8710L0286Q800k2093k9067n701K3066K7427
$$ 14033 28627 13023 -16488 -28630 -9920 20366 29166 7073 -21994 -27695 -4629 22798
754B2798L758k4010k6581j043K5604K4422k787k6463k1655N865K6857J9936r146
$$ 22798 26556 2546 -24035 -25078 526 24948 22161 -4302 -25957 -20092 6765 26701 17555
767A7555k8741j7973J2842K9242J4729j4840k8566j2921J6149K8371J0211j8570
$$ 17555 -11186 -29159 -16317 12925 27654 12814 -15752 -28673 -12524 15847 26058 7488
779G488k7213o691K0177K5169L337k1456k4053j184K4028K3314k486k5870k1479
$$ 7488 -19725 -26416 -6239 18930 22267 811 -23242 -24426 -398 22916 20430 -5440 -26919
792b6919N124K6012K0080o671k6879j8438R788K6607J5190j2604k5635j1693J4287
$$ -26919 -21795 4217 24297 17626 -9253 -27691 -17903 8704 23894 11290 -14345 -26038 -11751
805a1751K5433R446j6693k5870o634J9577K4850M216k0727k3881k544K1977K3204
$$ -11751 13682 23128 6435 -19435 -26069 -6492 18358 22574 1847 -22034 -24578 -2601 20603
818B0603N3k3101k1016L330K3361J8108n518k3747j6497Q919K5125J4260j1907
$$ 20603 20656 -2445 -23461 -20131 3230 21338 15820 -7927 -24424 -15505 9620 23880 11973
831A1973k5261j1754J3435K5092J0719j5053k4888q530J6875K4051N276j7977
$$ 11973 -13288 -25042 -11607 13485 24204 9151 -15737 -24267 -7392 16659 21935 3958
843C958k1764k549J9064K0805N6k1173j9690L223K3017J7791n607k2870j6950
$$ 3958 -17806 -20355 -1291 19514 19570 -1603 -21293 -18070 4947 22738 17131 -5739 -22689
856b2689P134K3445J5755r445k3647j2579J1205K2724J0068j2861k2217p763J5351
$$ -22689 -15555 7890 23645 14200 -9447 -22026 -10821 11903 21971 9110 -13107 -20870 -5519
869e519K2149M817j7554k1470k554J8829K0370J150j9794j9639Q14K0587J8080
$$ -5519 16630 21447 3893 -17577 -20131 -1302 19068 20218 424 -19215 -18401 2186 20266
882B0266l907k0470j5670N602K0942J3745q267k1701j1668J0856K2090R452j2817
$$ 20266 16359 -4111 -19781 -14179 6763 20508 12241 -9460 -21128 -10272 11818 21270 8453
895H453k1742q252J4190K1544O408j5618k0753l840J6410J8886J511j7215j7758
$$ 8453 -13289 -21541 -7351 14193 20601 4983 -15770 -19610 -3200 15686 17197 -18 -17776
908a7776R29J8607J6438l302k0195j4894N530K0596J3745p003k1082j2748R225
$$ -17776 -16847 1760 18198 14896 -5299 -20193 -14663 5933 19678 12675 -8407 -21155 -11930
921a1930K0663J0250j0483j9725q340J2274J9227N829j4147j8763l390J5805J8309
$$ -11930 8733 18983 8500 -11225 -19565 -7291 11936 17765 3618 -15145 -18535 -2730 15579
934A5579J311j6895j7746J05J7938J6923k057j8368j4963L742J8269J3493n850
$$ 15579 16890 -5 -17751 -17646 292 17215 15158 -3210 -18173 -14431 3838 17331 11481
947A1481j8688j1194P967J8859R504j0010j9049p790J1891J9078O167j2957j8704
$$ 11481 -7207 -18401 -10434 8425 17929 7919 -11130 -18920 -7029 12049 18216 5259 -13445
960a3445m825J4307J7927K697j4752j6492r78J5564J5473j517j6778j3819L949
$$ -13445 -18270 -3963 13964 16661 1909 -14583 -15561 3 15476 13959 -2819 -16638 -12689
973a2689J7373J2617n585j8267j1327P021J8574J0399q483j8518q431R625J7554
$$ -12689 4684 17301 11716 -6551 -17878 -10857 7717 18116 9633 -8885 -17316 -7691 9863
986I863O809j1046j6864m646J2618J6293K097j4052j5204n88J5376J4890j109
$$ 9863 16672 5626 -11238 -15884 -3266 13027 15124 1072 -14132 -14720 656 15546 14437
999A4437j6273j3980K398J6565J2952m156j6373j1305N501J6567R441p459j6420
$$ 14437 -1836 -15816 -13418 3147 16099 11943 -4430 -15735 -10234 6333 15774 8315 -8105
1012h105p704R501J6386N997j0845j6609m604J2209J6131L329j3020j5583j706
$$ -8105 -15809 -6308 10078 16075 5230 -11379 -15983 -3774 12357 15686 2666 -12917 -14623
1025a4623J3651J4307Pj4165j3086K027J4728J1738l814j5357j0613N629J5981
$$ -14623 -972 13335 13342 -823 -13909 -11882 2846 14584 10770 -4587 -15200 -9571 6410
1038F410R626p279j6234q277Q298J6096O811r506j5279n186J0264J4823L523j1741
$$ 6410 16036 8757 -7477 -15754 -7456 8640 15451 5945 -9334 -14520 -4256 10567 14090 2349
1052B349j3874j679J2724J3466r9j4017j2453J536J4568J1966k941j4586j1241
$$ 2349 -11525 -13204 -480 12986 12887 -1130 -13583 -12047 2521 14487 11546 -3040 -14281
1065a4281M148J4813R789n611j4788q027P091J4638O255q402j4769m600R868J4334
$$ -14281 -10133 4680 14469 8858 -5930 -13957 -6866 7772 14027 5625 -9144 -13744 -3876 10458
1079A0458L600j1173j4057k240J1808J3417J006j2378j2400L94J2815J1449k306
$$ 10458 14058 2885 -11172 -13412 -1604 11813 12819 441 -11959 -11565 1250 12699 10393
1092A0393j3400r731L938J3491Q741n323j4278p744O920J4389O633p713j4395
$$ 10393 -3007 -12738 -8800 4691 13432 8109 -6169 -13913 -6993 7396 14029 6316 -8079
1105h079n517Q740J3655M394r569j3250k194J0209J2177Q99j1311j1495O90J2198
$$ -8079 -13596 -4856 8799 13193 3624 -9626 -11820 -1611 10566 11465 154 -11341 -10651 1547
1119A547J0795j978j3055j0225L283J3318R340m427j3094q064N271J2956O697
$$ 1547 12342 10364 -2691 -12916 -9633 3685 13025 8598 -4496 -12560 -7289 5667 12364
1132A2364o512j2618n290P799J2625L762q914j2454k361R885J2063J339j0695
$$ 12364 5852 -6766 -12056 -4257 8368 12130 3216 -9238 -11599 -1714 10349 11688 993
1145I93j1484k58J1274J0867j166j1609r654K412J1787Q367l652j2140p258M970
$$ 993 -10491 -10749 525 11392 10226 -1383 -11037 -8625 3162 11529 7877 -4263 -11521 -6551
1159f551J2508O248o373j2549n377P388J2446M504q304j1931l370Q881J1382J962
$$ -6551 5957 12205 5832 -6717 -12094 -4706 7740 12244 3940 -7991 -11361 -2480 8902 10864
1173A0864r562j0996K3J0246R559p64j0906r227K113J1534Q339l129j1833p665
$$ 10864 1302 -9694 -9671 575 10134 9370 -1536 -10763 -8650 2884 11223 8094 -3739 -11404
1187a1404M290J1721O710n182j1663n594O424J0979M576p340j1046k944Q206J0635
$$ -11404 -7114 4607 11317 6135 -5528 -11122 -4698 6281 10857 3517 -7529 -10473 -2267 8368
1201H368J829r042j0487p78R879R989l04j0198r228J334J0581Q280k611j0677
$$ 8368 10197 1155 -9332 -10110 -231 9758 9454 -744 -9972 -8638 1943 10223 7612 -3065
1215c065p016L468J0777O373m972j0887n428N963J1289M276o925j0859l455P807
$$ -3065 -10081 -6613 4164 10537 5565 -5322 -10750 -4787 6502 10778 3853 -7006 -10461 -2654
1229b654J0107K675q265r844j419Q891R444l27r180q433J104R916P858k370j0390
$$ -2654 7453 10128 1863 -7981 -9400 -509 8935 8608 -572 -9005 -7901 2015 9873 7503 -2887
1244b887p139L525J0489O113m185j0221n706M837J0529M727o208r960l323O842
$$ -2887 -10026 -6501 3988 10101 5916 -4305 -10011 -5174 5355 10082 3874 -6086 -9409 -2567
1258b567R443K367p541r290j473Q479R201l10q794q300P46R191P872j528r505
$$ -2567 6876 9243 1702 -7588 -9061 -582 8619 8309 -485 -8785 -8039 1152 9024 7496 -2009
1273b009p463K609R874O218l982r393n290M582R709M619n980r888l139O489R224
$$ -2009 -9472 -6863 3011 9229 5247 -4146 -9436 -4854 4855 9474 3494 -6394 -9533 -3044 6180
1288F180K479o752r278j655P518Q600P85q164q220P29Q272P268j261q849o969
$$ 6180 8659 1907 -7371 -9026 -1508 7092 7877 -287 -8507 -7778 494 7762 6501 -2348 -9317
1303i317K510R244O034l601r273n094L915R373M592m916r242l726N665Q789K821
$$ -9317 -6807 2437 8471 4870 -4403 -9497 -5582 3791 8383 3467 -5775 -9501 -3836 4953 7774
1318G774o437q473j661O687Q571P41p720p847K28Q066P323j159q188o745J801
$$ 7774 1337 -7136 -8797 -2110 6461 7202 -518 -8365 -8137 -71 7252 6093 -2095 -8840 -7039
1333g039Q765O116l251q555m990L609Q594M192m221q351m080N358Q758K545n827
$$ -7039 1726 7842 4591 -3964 -8954 -5345 3249 7441 3220 -5131 -9211 -3853 4905 7450 1623
1348A623q120k288O729Q154J018o870q057N7P595P206r36p806o376J589Q084O113
$$ 1623 -6497 -8785 -2056 6098 7116 246 -7811 -7754 -159 7047 6111 -1695 -8071 -6482 1602 7715
1364G715k750q440n113L651P945M315l577q518l669M602Q458L099n569q137j661
$$ 7715 4965 -3475 -8588 -4937 3008 7323 3746 -4772 -8441 -3839 4619 7718 2149 -5988 -7649
1379g649N814P335J566o550p283l93P143O803q64p041o001J101P119O266k128
$$ -7649 -1835 5500 7066 516 -6767 -7160 -17 6786 5922 -1119 -7120 -6019 1100 7366 5238
1394E238p815n288K978P872M220l256p939l612L999Q050L017n009p803j850N364
$$ 5238 -2577 -7865 -4887 2985 7205 3949 -3990 -7602 -3603 4447 7464 2455 -5348 -7198 -1834
1409a834P361J195n493p087j043O619O654k08o907n952R61O768N747j521p267
$$ -1834 5527 6722 1229 -5858 -6901 -282 6372 6164 -743 -6695 -5734 1034 6781 5260 -2007
1424b007n130K601P450M358l638p020l518L604P160L322m453p393k205N285O885
$$ -2007 -7137 -4536 2914 7272 3634 -3386 -6904 -3300 3860 7182 2729 -4664 -6869 -1584 5301
1439E301J006n149o651q29N703O801m6o383o134R44O495N242j170o649n163K040
$$ 5301 6307 1158 -5493 -6322 -619 6182 6136 -247 -6381 -5437 1058 6300 5130 -1519 -6682 -4642
1455d642P112M386k799p194l373L404O817L195l914p156k418M892O662J332m900
$$ -4642 2470 6856 4057 -3137 -6510 -3106 3711 6906 2992 -4164 -6582 -1690 4972 6304 1404
1470A404o184j132N275O261N92o178n818P64O286M928j209o274m667J743O730
$$ 1404 -4780 -5912 -637 5624 6216 38 -5780 -5016 1270 6198 4989 -1285 -5952 -4209 2521
1485B521M163k568o570l700L223O243L086l412o475k711M227O737J393m379o417
$$ 2521 6684 4116 -2454 -6154 -2931 3312 6398 2986 -3489 -6200 -1973 4764 6157 1778 -4639
1500d639p67M728N951M42n099o036L43N921N087j023n821m691J461O064M309k114
$$ -4639 -5406 -678 5273 5715 616 -5420 -5077 844 5931 4908 -913 -5604 -4143 1921 6230 4116
1516D116o398l499K585O370K999l356o056k439L629O270J891m481o042r20M726
$$ 4116 -2282 -5781 -3196 3174 6173 2817 -3239 -5678 -2049 4221 6112 1631 -4411 -5331 -605
1531f05N355P78n021n392J7N575M904q87n655m416J115N724M344j790n955l821
$$ -605 4750 5528 507 -4885 -4868 707 5611 4724 -931 -5347 -4232 1492 5836 4046 -1909 -5730
1547e730K664N815L147k989n933k509L470N907J875m132n693r62M114N653L48
$$ -5730 -3066 2749 5896 2907 -3026 -5535 -2065 3842 5717 1585 -4108 -5070 -956 4697 5045
1562E045m571n085l08N215M912m84n476m371J174N067M252j349n561l761K019
$$ 5045 474 -4611 -4919 296 5208 4724 -752 -5123 -3949 1118 5370 4021 -1540 -5301 -3282
1577c282N852K796k562n540k502K755N843K062l653n719j041L873N287Q66m335
$$ -3282 2570 5366 2804 -2736 -5238 -2483 3360 5422 1769 -3950 -4991 -1118 4169 5035 700
1592G00m947k87M322M792j83m886m497J104N017L761j244n118l682J915N410L164
$$ 700 -4247 -4534 -212 4580 4397 -489 -4986 -3882 1135 4896 3652 -1466 -5148 -3233 2177 5341
1608E341k700n382k440K965N329J958l291n219j603L756M928R97m103m594k99
$$ 5341 2641 -2741 -5181 -2216 3113 5071 1780 -3439 -5042 -1286 3642 4639 536 -4058 -4357
1623d357M253M445M4m713m315P23M905L666j049m748l580J649N050K922k169n263
$$ -4357 -104 4341 4385 -328 -4643 -3920 985 4651 3602 -1146 -4726 -3077 1973 4895 2726 -2537
1639b537k269K769M878K112l227m783j612L346M981J130m003m727l82M149M328
$$ -2537 -4806 -2037 2841 4953 1726 -3057 -4669 -1323 3658 4788 785 -3942 -4324 -175 4153
1654D153j68m016m239N68M442L708j290m574k963J432M816K764j836m991k520
$$ 4153 3985 -31 -4270 -3702 740 4448 3158 -1416 -4379 -2947 1869 4633 2797 -2194 -4714
1669d714K542M732K175k779m763j870L174M756J124l612m204m08L764L804J88
$$ -4714 -2172 2560 4735 1956 -2807 -4677 -1503 3253 4377 765 -3439 -3847 -83 3721 3909
1684C909l919l988M00M358L608p46m598l388J275M584L056j662m572k724K014
$$ 3909 -10 -3998 -3598 760 4368 3622 -976 -4364 -3089 1495 4551 2889 -1683 -4407 -2393
1699b393M794K052k621m351j606K965M172J317l390m223q10L555M107L61l752
$$ -2393 2401 4453 1832 -2519 -4125 -1160 3012 4329 939 -3284 -4094 -539 3568 3929 177
1714A77m036K42M023L506o96m002l110J187L906K794j403m370k317J836M356J956
$$ 177 -3859 -3617 406 3912 3216 -786 -3896 -2709 1197 3991 2588 -1782 -4099 -2263 2093 4049
1730D049k215m293j725K736M432J126k869m242q60L192L913L81l383l624k37L666
$$ 4049 1834 -2459 -4184 -1448 2984 4110 1241 -3001 -3861 -669 3244 3625 242 -3382 -3619 47
1746D7L560m68l874l204Q73M070K754j241l969k541J515M355K019j850m161j988
$$ 47 3607 3139 -735 -3939 -3066 1004 3758 2517 -1452 -3993 -2478 1877 3896 2046 -2115 -4103
1762d103K574L881J611k728m109j014L035L761P34l310l879q8L773L216m1l677
$$ -4103 -1529 2352 3963 1235 -2874 -3888 -853 2908 3642 332 -3547 -3635 138 3354 3313 -364
1778c64l211O26L658K773j178l414k597J417L834K286k069l934j739K302M122
$$ -364 -3575 -2949 709 3482 2304 -1110 -3707 -2290 1544 3830 1761 -2173 -3912 -1610 2512
1793B512J253k739l618j182K910L473O16k743l533l34L348L142j38l591k718N07
$$ 2512 3765 1026 -2592 -3774 -864 2609 3225 482 -3051 -3385 -37 3105 2967 -624 -3342 -2835
1809b835L520K828j021l639k618J266L621K429j538l898k083K213L744J445k303
$$ -2835 685 3513 2492 -1147 -3765 -2499 1122 3551 2013 -1885 -3968 -1755 1989 3434 1131
1824A131l677p18K301L355Q10k985l191l09L042L112R8l273k961K99L401K731
$$ 1131 -2546 -3264 -963 2392 3202 217 -2974 -3283 -241 2871 2969 -304 -3265 -2966 435 3166
1840C166q20l335k419R51L560K045j551l384j645J685L787J248k234l418j156
$$ 3166 2346 -989 -3408 -2457 1103 3148 1597 -1787 -3432 -1747 2040 3288 1054 -2364 -3520
1855c520K252L413Q85k452l336k76K797K862J09k934k844K18L144K460l42l306
$$ -3520 -1268 2145 3030 578 -2758 -3034 -237 2625 2734 -200 -3044 -2826 318 2778 2436 -870
1871h70k393R83L328K234j282l432k118J782L327J623j988l207j233K055L105
$$ -870 -3263 -2280 1048 3282 2000 -1432 -3550 -1768 1559 3182 1194 -2013 -3246 -1191 1914
1886A914R36k393l142j67K599L020nk914k683P2K958K503k17l000k498O24L039
$$ 1914 2850 457 -2685 -2852 -253 2767 2762 -152 -2835 -2763 195 2698 2481 -519 -3017 -2393 646
1903F46K229j061l015j805J447L000J626j986l077j047K085L033Q90k463k948
$$ 646 2875 1814 -1201 -3006 -1559 1441 3067 1081 -1996 -3043 -958 2075 2965 502 -2446
1918b446l51K380K874L08k724k638k2K654K684o45k506k381O15K891K095j199
$$ -2446 -2797 -417 2457 2765 41 -2597 -2619 35 2719 2074 -432 -2813 -2198 693 2788 1589
1934A589k799j521J163K923J567j501l317r21J692K930R16k103k745o16K301K694
$$ 1589 -1210 -2731 -1568 1355 2922 1421 -1896 -2817 -1125 1805 2721 618 -2127 -2743 -442 2252
1950B252L73k520k376j50K434K598k43k562k369N33K787K178q22l082j594J005
$$ 2252 2625 105 -2271 -2421 13 2611 2368 -194 -2563 -2030 757 2935 2113 -969 -2563 -1558
1966a558K688J674j452k892r38J415L035P32j896k610o90K041K727L01k284k663
$$ -1558 1130 2804 1352 -1540 -2478 -1063 1972 2704 808 -1802 -2492 -451 2276 2577 293 -2370
1982b370p6K747K207j31k314k410L28K420K267o67k792j888J286K499J501j268
$$ -2370 -2446 301 2508 2377 63 -2347 -2019 401 2668 2001 -791 -2679 -1393 1106 2607 1339
1998A339k659j431J596K895J049j889k522p67J725K549O01j919k811q4K280K563
$$ 1339 -1320 -2751 -1155 1740 2789 900 -1622 -2389 -664 1885 2486 567 -2244 -2328 -48 2515
2014B515m17k441k101N30K240K288o56k610j672Q67K521J400r12k582j347J235
$$ 2515 2098 -343 -2444 -1914 326 2614 1958 -652 -2324 -1457 1064 2464 1552 -1030 -2377 -1142
2030a142K530J075j348k771p83K089K220N18j695k607k19K151K238J2k439j855
$$ -1142 1388 2463 1115 -1656 -2439 -350 1870 2388 693 -1914 -2133 18 2256 2268 -171 -2026
2046b026M05K068J878l76k360j759P39K640J069q71k302j386J226K362J339j444
$$ -2026 -1621 447 2325 1949 -411 -2170 -1431 1209 2278 1407 -895 -2281 -1055 1307 2646 1202
2062A202k689r06J744K554L01j499k397k08J704K334k7k064j940Q1K253J884n30
$$ 1202 -1487 -2393 -649 1905 2206 707 -1690 -1898 -194 2140 2113 49 -1891 -1810 443 2327 1797
2079A797k186j684L09K611J802j276k104j623J301K336J103j224k460r87J866
$$ 1797 -389 -2073 -1764 847 2649 1373 -731 -2354 -1053 1283 2386 1162 -1298 -2285 -419
2094d19K250J44j373j929o67J787K258J32k015k162K05K034J854l14k034j721
$$ -419 1831 1975 602 -1327 -1994 -207 2051 2183 168 -1994 -1789 245 2099 1785 -249 -1970
2110a970M24K283J546o12k675j022J112K163R12j114k429o98J492K039O84j582
$$ -1970 -1546 737 2283 1671 -1004 -2026 -914 1249 2161 1047 -1382 -2080 -588 1451 2135 553
2126E53j859o00J542K252N8j925j831J7K003J817o09j932j435M51J928J492o29
$$ 553 -1306 -1906 -364 1888 1946 21 -1810 -1793 210 2027 1418 -514 -1949 -1498 430 1922 1293
2143A293k041j548J356K062Q02r51j971j124J215K196O78j279k155m49J455J894
$$ 1293 -748 -2296 -940 1122 1924 973 -998 -2122 -907 1289 1967 688 -1467 -1916 -461 1433
2159A433N47j829j987K6J877K002n24j874j392K35J948J462o09j939j349Q84J877
$$ 1433 1980 151 -1836 -1810 67 2069 1545 -329 -1721 -1486 462 1924 1315 -624 -1973 -1089 788
2176G88J169j071j695j066J105J923Q86j405j990o62J584J740O52j811j860j32
$$ 788 1957 886 -809 -1875 -770 1153 2039 634 -1356 -2018 -434 1306 1958 147 -1713 -1845
2192a845K032J569k50j799j515M32J791J352l44j993j522R82J853J102j074j528
$$ -1845 187 1756 1506 -293 -1808 -1376 415 1767 1423 -570 -2092 -1110 743 1845 771 -757
2208g57j048Q82J921R59j213k223l96J515J756K28j569j481j83J652J720l56j636
$$ -757 -1805 -923 998 1957 744 -1479 -1875 -360 1396 1624 55 -1426 -1609 43 1763 1407 -229
2225b29j414M02J461J179J2j982j177N73J996J056q73j864r83J031J660R52j128
$$ -229 -1643 -1241 220 1399 1411 -571 -1748 -1175 821 1877 1004 -860 -1843 -812 848 1800 672
2242F72j805p37J694J426L45j270j679l37J639J409J24j560j520L48J573J274
$$ 672 -1133 -1870 -176 1250 1595 325 -1354 -1691 -52 1357 1481 -79 -1599 -1251 322 1596
2258A596m73j410j543O08J928J138r90j718j084J285J533N41q28j769m43J243
$$ 1596 1123 -287 -1830 -1222 706 1844 854 -864 -1948 -663 870 1411 583 -1186 -1629 -386
2274c86J667L58j437j421m08J601J386jj201j710J65J493J493l39j865j238P73
$$ -386 1281 1639 202 -1219 -1627 -26 1360 1359 158 -1552 -1387 106 1599 1260 -605 -1843 -1070
2291a070J854Q32o18j863q91J060J702L45r39j040r01Q92J603O50j260j623k22
$$ -1070 784 1616 998 -865 -1756 -696 1006 1351 412 -628 -1529 -637 966 1616 356 -1267 -1489
2308a489J189J536L85j462j657K49J316J475l42j659j065L29J767R62o79j683
$$ -1489 -300 1236 1621 159 -1498 -1249 67 1542 1200 -459 -1524 -1195 572 1534 855 -828
2324h28p94Q89J328Q17p55j528n80Q51J451P18r28j847k10J162J504J47j313j479
$$ -828 -1622 -733 595 1412 657 -871 -1451 -600 851 1569 641 -1206 -1416 -254 1250 1397 84 -1395
2342a395O7J561J190m63j381r34L29J409R80m36j437j033O07J481Q86o14j506
$$ -1395 -1328 233 1423 960 -421 -1355 -1026 383 1363 927 -510 -1543 -936 545 1431 817 -689
2359f89p44P18J537P34j032j699k04J046J754m6j598j158J26J460J044j3j616
$$ -689 -1433 -715 822 1556 524 -1175 -1379 -333 1421 1375 -223 -1381 -1255 205 1249 1236 -380
2376c80j010J91J563R42l06j520q71M12J513Q74p51j560n60R22J452L93r91j293
$$ -380 -1390 -1199 364 1306 1000 -520 -1391 -979 534 1408 657 -903 -1463 -541 911 1304 313 -980
2394i80n33J281J236J36j131j388J76J001J426j56j051j298K30J194J172m04j233
$$ -980 -1513 -232 1004 1140 9 -1379 -1203 -202 1224 1068 17 -1281 -1051 143 1315 911 -322
2411c22j274O67J331R68o52j400o69P31J626L54q81j447j96P22J378K85j058j182
$$ -322 -1596 -929 402 1370 718 -682 -1351 -620 1006 1360 479 -968 -1164 -442 936 1221 163 -1019
2429a019j76J248J023j31q44j368J41J183J152M7j552j168O60J353R03q40j139
$$ -1019 -1195 53 1076 945 101 -1267 -1126 57 1209 1256 -296 -1464 -804 549 1452 612 -527
2446e27p88P03J365K52q33j107l44Q84J177L89q89j197j76O61J503Mj313r09N2
$$ -527 -1315 -612 753 1005 172 -935 -1279 -395 782 1171 282 -915 -1091 -430 1073 1077 -236 -1145 -1093
2465a093J090J323l97j295q87L43J455O83o13j137o32P83J008N00n89j153m42
$$ -1093 -3 1320 923 -372 -1259 -916 539 1222 609 -528 -1160 -377 631 1131 542 -611 -1053
2482a053N66J277J65p08j136l06P74J428J29j315j050P4J333Q77k01j241q27N00
$$ -1053 -487 790 955 247 -889 -1195 -421 1007 1136 -179 -1229 -1155 178 1055 854 -387 -1214 -714
2500g14J154O30l12j473m83O03J174N66p02j003o00P88J004O11q12j285l55J116
$$ -714 440 1070 758 -715 -1198 -595 579 1145 443 -560 -1160 -372 632 1243 431 -854 -1209 -93
2518i3J155j03j011j153L38R73R57l55r69q29R8J343O05l80r05p00L27J230O89
$$ -93 1062 959 -52 -1205 -867 106 1063 708 -261 -1090 -992 351 956 576 -329 -1029 -702 528 1217
2537A217n91j258o11O79J316M31r35j031j74R95R83j00r38j196L64R23R61k83
$$ 1217 626 -632 -1243 -564 752 1183 248 -783 -957 38 1021 921 -17 -1213 -849 74 1035 752
2555G52r01p98M5J082Q97l01j037q67N27J131Q04p06j340m19J031J148o0r19p76
$$ 752 -149 -947 -902 180 1077 776 -261 -1128 -601 530 1334 628 -712 -1131 -100 1048 988 69 -707
2574g07k57R89R45J14j020p65J9P81Q30Q6j022q02N6R16Q60l51r02o05K66J033
$$ -707 -964 25 970 1084 64 -701 -682 99 929 1015 -7 -809 -753 163 1023 672 -230 -835 -569 464
2594D64M59k91j224l61O21R86M38q79q54k79Q43Q43L53q90j001j54Q41J010j3
$$ 464 923 632 -592 -953 -332 654 1092 213 -641 -920 -77 766 1119 229 -772 -926 -85 925 912
2613I12r05q97J46J048P16j18j230o87L18J202M64n78r22j73M28P79M36q15p33
$$ 912 7 -890 -744 304 1020 902 -328 -1015 -697 505 969 391 -531 -704 -276 503 939 124 -609
2632f09o3L74R63K87o78j050j51P79J082n6q41r65J46J087N91oj107o36K83R07
$$ -609 -672 -298 665 952 274 -776 -927 -148 934 878 37 -928 -782 305 896 890 -217 -853 -570 337
2652C37O35m87p62o17N17Q71J97k72r02k62P14O47M95q03j149M2P19J140p1r64
$$ 337 972 485 -277 -894 -377 494 691 419 -483 -745 -31 616 1111 308 -841 -799 -80 1060 989 25
2672B5q82K24O34Q91j20j060n46L55P58O30m30p77p23L92J121N45m18j275m07
$$ 25 -857 -633 1 892 772 -288 -834 -479 279 909 479 -298 -1021 -629 492 1037 619 -656 -1063
2691a063Q55P38L05o37j033j94J104Q00j85o89o06P0P42N88k11o62q38L90Q40
$$ -1063 -208 530 835 198 -835 -1029 75 875 690 1 -605 -535 207 795 584 -78 -916 -526 314
2710C14P74m27j020l80J33Q15R09n56j249J3N33J011M6p57q48J27N43P20J47q13
$$ 314 1088 661 -359 -739 -606 209 1118 562 -687 -674 -141 870 916 159 -689 -562 -19 701 848 35
2730C5n09o8N50P60j8q26o90R3J057N97m17o73o36M17O97M26l97q30m75P61O79
$$ 35 -474 -542 8 768 750 -76 -766 -673 384 981 564 -109 -745 -328 369 795 398 -432 -907 -146 533
2751E33K92m62r40Q3O83M31O6m09o72k45Q50N12J0r07l46j27P94P13k39q29o70
$$ 533 825 363 -577 -494 189 620 686 277 -395 -640 210 722 732 -175 -521 -648 146 859 620 -209 -879
2772h79N89N46N79m77p02m14L57J044m7n13o50J9N58N19K06n91p52l11R45P18
$$ -879 -290 256 835 358 -344 -758 -401 643 596 83 -567 -548 10 529 735 144 -608 -919 26 744
2792G44rp87o20O0Q03Q03n58q04n34M69R30J90k62p59k06L11N34L74m44o99LL42
$$ 744 735 -52 -672 -612 191 994 436 -368 -902 -433 497 687 425 -334 -540 -229 305 679 235 -464 -461 -119
2814a19O30L27o93q06j33Q91O77j48o82p14J49P54N01n5p07k58J07O33K97k82
$$ -119 511 838 145 -661 -794 97 774 626 -56 -770 -621 133 634 579 -128 -386 -279 354 651 369
2834C69p71k06K80M80O22o04n91k52O40N11J67n82n83j76P76O60k35p42m62K16
$$ 369 -402 -608 -328 152 774 170 -421 -673 -33 478 645 63 -520 -696 80 740 505 -237 -699 -483
2854d83P75K33j0n13n83L27N59K18j39m97o10K00P31O23o29p98j38M76Q71L7p80
$$ -483 292 525 515 2 -581 -254 305 523 384 -113 -723 -523 208 831 202 -596 -734 -258 613 650 -130
2875a30m16j73O07N92M8n58m48ON29M74k02l76o29J60O44L41j19n01o85O54M53
$$ -130 -546 -719 -112 480 528 -30 -478 -472 57 531 329 -47 -676 -516 128 469 350 -151 -836 -182 271
2896B71M55l85o03n34P30N91J4o32m03J25L07M96K15o73o39K17O27M16k72o12
$$ 271 726 341 -262 -796 -66 525 539 -93 -496 -371 -64 432 647 -26 -665 -448 179 595 323 -289
2916b89k65Q1N96N48k62o41n53N25O75J70m29n32k84N01N38J83m41n14Q1J78N13
$$ -289 -554 -473 123 671 409 -232 -785 -260 415 585 156 -376 -660 -159 379 562 121 -393 -312 -134 379
2937C79K23m78n55k06P01M32j5m36n68j13P63M76j11o05l42L04L44N14o17l45
$$ 379 602 124 -431 -637 64 496 481 45 -523 -636 127 603 492 -113 -455 -151 193 707 90 -255
2957b55j00L32N18k4k60o00j43N34N45J65n42n56j32N74M70j75m71k57pN25M40
$$ -255 -355 -23 495 471 211 -389 -532 2 547 712 170 -386 -518 56 526 351 -120 -377 -384 141 581
2978E81j20o04m49K64P97R5j98m10m91L36N36J05k47m96o4K53O78l8k81q05J41
$$ 581 461 -143 -592 -328 469 564 366 -44 -535 -199 337 442 195 -301 -365 -112 566 528 247 -558 -417
2999d17M12N58J24o20l41K0N23M08l59m69l63K84M85K90n5p76n8Q5O67m6m3o11
$$ -417 -5 553 677 57 -284 -264 259 667 308 -161 -524 -240 245 535 480 -296 -354 -269 398 352 309 -302
3021c02k61M36O07O1n26m19R4K96N20k21n65j02O4L87K34R5n85k42J07M29M62
$$ -302 -563 -127 480 541 15 -404 -310 -14 506 285 -280 -382 -318 69 303 398 -187 -429 -322 107 569
3042E69l84l09j59r9O99L41l78n55j02K35O55nm54l65o3N08O4J44m39m61k3O44
$$ 569 185 -124 -283 -382 317 658 280 -275 -377 -142 513 508 54 -311 -374 134 198 342 -97 -558 -581 63
3064F3M77j34n89l41K08M68L01j95l35l56J77N76m7j24k93k80J79N66r3l61k04
$$ 63 540 406 -183 -524 -316 152 453 258 -77 -433 -256 320 273 149 -144 -424 -245 321 228 -133 -337
3085c37j67N22J28J87l44m46k60O34K71J01l71l37K67J12O42m58m20r9J30N45
$$ -337 -504 18 146 333 -11 -457 -717 -83 188 289 -82 -419 -152 -40 602 144 -276 -375 -245 300
3105C00J12k89l21l11K24O30n6k55k00m25L46N07K76l92o07O4J94N81j49l75k86
$$ 300 412 123 -198 -509 -285 345 289 34 -166 -591 -245 262 538 146 -461 -397 -203 378 229 -146 -432
3126d32K12M41K63k56k38m89K87M00R8J00o26q4NM56J89k42o37J26J91M83K4l96
$$ -432 -220 221 484 228 -10 -499 -212 188 286 386 -240 -324 -319 137 326 84 -553 -427 -236 247 271 -125
3148a25k89p4N81L13Ro37%j5M34J21p4l34j05M4K10K72k37l49q1J10L60K32k55
$$ -125 -414 -488 93 406 415 -222 -222 -237 197 318 244 -90 -195 -151 59 331 94 -255 -336 -226 134 366 111
3171A11m22k62M39L99Q1l09m30q3N96M02q7m38n48M28K67J26k1l23k93K39L13
$$ 111 -311 -573 -134 265 346 37 -393 -476 120 522 435 -3 -551 -123 144 270 249 -74 -367 -128 185
3192A85J97k79m70M4K43K22J87j85m31k05N20K45N2j71n50P1K99K95K1k07l28
$$ 185 382 103 -367 -323 -80 142 329 144 -287 -492 28 273 325 154 -396 -325 -26 269 290 83 -245
3213b45k12L46N04p2n34j61K52L81J31m38j65k10L15K90P1j32k56j79K18L32J82
$$ -245 -457 -111 393 321 -213 -374 -122 259 390 -48 -213 -423 -108 182 253 121 -135 -314 -96 236 418
3234D18l01l28l3K74P3L70m34m35J08M51L54m13j41m25L14K66K83k86k77j12J25
$$ 418 117 -211 -244 30 103 473 39 -396 -288 163 517 104 -37 -462 -148 118 401 115 -162 -274 -149
3255a49K68R0j9l62K5J87Q9K38l54r0k96L61K82J27m90k58J82L91J50j13k31j94
$$ -149 119 209 190 -172 -147 40 129 367 13 -77 -373 -12 270 397 -93 -351 -169 222 372 259 28 -166
3277a66r2L32K08q8k94k60N49O6K62k84m87Q1J46K96K0j41n38K53K95K23k3m41
$$ -166 -258 74 282 194 -100 -360 189 255 517 233 -254 -173 -27 269 289 148 -390 -137 158 381 358 -83
3299h3j32p4K87M48p4l67n00K20M96L3j12j04k95R3M71J12k66k32j11N0L74r5
$$ -83 -215 -289 -2 446 372 5 -495 -275 221 254 142 38 -257 -164 307 419 153 -79 -190 -140 234 139
3321A39J28k83k14K26L62j56j70m02Q5L18M29j92j79k71M8J39M30j90l64j71K12
$$ 139 267 -16 -230 -4 358 202 32 -370 -285 33 462 270 91 -180 -132 7 437 247 -117 -288 -76
3342g6N5L50Q6m26j00O3K57r2N4m06k4J27L37L6l57M6j49K92M25m37j0k18Q9J82
$$ -76 -21 329 415 -11 -111 -48 209 117 171 -235 -259 -132 205 241 -116 -70 -219 73 498 61 51 -167 -78 104
3366A04J49O3l92j56O3L56J04q8j81k84M3K93R8j01j23j15J29L25M4j59m24q2
$$ 104 253 316 -76 -232 -169 187 291 203 22 -262 -219 74 172 71 -52 -167 -38 287 331 172 -252 -334
3388c34L14L60r8k53j01j32K13L36l28j22j41J77J84k4L05m21j91K8L74J88k06
$$ -334 -20 340 242 -11 -112 -244 -31 305 -23 -145 -286 -109 75 51 356 -65 -256 -228 146 334 128
3409A28j7l81L57K4J35l4k60j66L06J62j53nl77K3K45L11k3l09m59K87L15J7O4
$$ 128 111 -270 87 111 246 212 -48 -214 92 254 101 96 -281 -258 -13 298 275 -34 -493 -206 109 126 190
3432A90m91Q5Q6K98K75m68o2k22K55J84O8k39k24P5K30Q0N6j58k25K7J07L66r2
$$ 190 -301 -216 -130 168 443 -25 -87 -309 -54 130 198 -41 -265 -190 40 120 176 18 -207 -180 -73 293 201
3455B01j59j96J30l4K56P0m51j5J78J84K01l77j17k23K54J39L0J5j72k61L29R4
$$ 201 42 -154 -24 -58 198 268 -183 -198 -20 164 365 -12 -129 -352 -98 41 71 86 -86 -347 -18 76
3477G6n4N7k70J02J47J2N3j79k95J07L35K31k98nk80J34J73K08k78k56o9L69J67
$$ 76 22 79 -191 -89 58 70 123 -56 -351 -244 91 322 24 19 -261 -127 46 254 -24 -280 -349 20 187
3500A87r9M1m12J41K71p3J26k23k66J96K54J4j08m3j18l8L15K21j52n45J3L79
$$ 187 88 129 -283 -142 129 56 182 -41 -307 -111 143 157 49 6 -112 -150 165 386 234 -311 -298 81
3522H1J05J05j32k78k45M26o8K18k21j31M1P6K87o8k24k04k1M14J60n1k68k03
$$ 81 186 291 159 -119 -364 62 -6 212 -9 -140 -99 -23 264 196 -28 -232 -253 161 321 270 2 -201
3544b01l7K36Q5L3j56k38l5M76K8p6j27l18J97L54m3k62r0j12K54O6K70j64j59
$$ -201 -238 -2 83 116 -40 -278 -313 163 191 115 -12 -330 -133 221 178 -84 -174 -286 -32 34 304 140 -19
3567a9j84L97Q6k74R7j75m3Q5K33M3k38l24K03K72N2j84k19j23J14L92o5l6k38
$$ -19 -203 194 280 6 103 -72 -115 -30 203 246 8 -316 -113 159 211 27 -192 -315 -201 191 126 90 -148
3590a48p0K72K83j89J0k61l42K55M05L3k41q7L7o1K28q1R2m31kL77K37k59k61
$$ -148 -218 54 337 148 158 -103 -445 -190 215 248 7 -80 -43 -104 124 43 135 -296 -298 79 316 57 -204
3613b04O6M7K90L0l1l13n1J91J89k25l6p2r0K78k0J45j23l11J80K61k2j15p7k93
$$ -204 -138 -91 199 229 198 -115 -166 25 214 -11 -47 -119 -209 69 49 194 71 -240 -60 201 179 64 -13 -306
3637c06rM50J16k40k46L58k20Q7K59l03J6Kk36K58J67k0k48k2kL22K5k89k7R4
$$ -306 -315 135 251 11 -235 123 -97 -10 249 -54 -38 -36 -272 -14 153 133 -115 -137 -139 183 208 -81 -108 -14
3661a4J10J46j27K1l39%J79O3J3q5m6m4J98j1Q4k54k48L42J45r5j13n9k6l1M10
$$ -14 96 242 115 136 -203 -203 -24 39 52 -33 -79 -123 75 64 148 -106 -354 -12 133 38 -75 -134 -160 -191 219
3686B19j83j76r5O8K58j53J13r5p4j2K59L7p7j62l31K90L37r9j06K1j47R3L0J60
$$ 219 36 -140 -235 -167 91 -62 51 -44 -118 -130 129 166 89 -73 -404 -114 223 124 18 39 -108 -15 15 175
3710A75k71j6K9p3L09q7l8j32m9J09K29p1k53J3J88k0P7R9n28J07R4K19r3J82
$$ 175 -96 -112 -83 -156 153 66 28 -104 -153 -44 185 114 -139 -126 62 42 119 218 -310 -203 -109 110 17 199
3734A99pk82LJ24J46m8k38j04K86K6j44O6n8L6j56J94N0j70k5r6J78M8k3J8l22
$$ 199 192 -90 -87 37 183 135 -103 -207 79 105 -39 27 -31 5 -151 43 93 -77 -102 -198 -20 28 5 23 -299
3759b99J33J72J62j70o6l6JQ5K25j91j13Ok0L43j95Mk14l9R3J82K55l24j08r0
$$ -299 -166 6 168 -2 -68 -104 -103 -18 207 16 -97 -91 -111 232 37 41 -173 -212 -119 63 318 -6 -114 -204
3783b04K55J71q2r9j26p9K59N0j91j12n9J92o9K56k6k38N9L8J81o6k08j07J93
$$ -204 51 222 140 41 -85 -164 95 145 -46 -158 -217 -25 -94 162 136 -102 -43 -5 176 110 -98 -205 -12
3806a2m4Q5j12N8j66N0N9J74O6l04Q4j00K85j58P7k10k0J29J77L5j97j98P7J02
$$ -12 -56 29 -83 -25 -191 -141 -82 92 158 -146 -62 -162 123 -35 42 -168 -188 -59 118 153 -44 -242 -165 -63
3830f3J63j5o6j55M7J38J63Q4k89j49K3K16j06J84l6m38K41J34L02k66n7q4q5
$$ -63 100 85 19 -136 -89 49 212 296 7 -142 -119 97 -9 175 139 -299 -58 76 378 112 55 -29 -114
3853a14L26P5j16k72l6J43Q5J50j53j72r5K77k5J4l1l04K14R8l3L35m19j27K59
$$ -114 212 287 171 -101 -137 6 91 241 88 -84 -179 98 73 87 56 -248 -34 64 31 366 -53 -180 79
3876G9j18k0J84k21q8J07N2J41P7k63k15J67J50J56j70j02r7JO4O3L8j73K03k0
$$ 79 -39 -59 125 -96 -184 -77 -25 116 193 -70 -285 -118 32 188 18 -84 -181 -180 -116 -53 -15 -188 15 -5
3900eJ82P1k55j55N0R1J52j40n6N2p7K27j3j01L8k90P3M04M4j16j96j13R8M6P0
$$ -5 177 248 -7 -162 -112 -21 131 -9 -65 -13 -90 137 124 23 61 -229 -156 248 292 176 -20 -133 -35 11 81
3925H1k40J36j08K46m2N2r2o7m6J72K15j35j72L1k5j06J49rj83J16J02R0R4k01
$$ 81 -159 -23 -131 115 73 125 33 -34 -80 92 307 172 0 31 6 -100 49 40 -143 -27 75 165 259 58
3949E8j10J7O4M6K40m04J20j26j00J12L05j87p5M5J42j6j79l3L3j92K83l0N8q
$$ 58 -52 -35 29 75 315 -89 31 -95 -195 -83 222 35 -40 5 147 131 -48 -81 -48 -240 43 13 71 63
3973F3j58J95n3O1j62k8k0J70o6O7J48k02j13J71M2Q9n04J45P5L1M7Ko7l6pJ50
$$ 63 -95 100 47 108 -54 -82 -102 68 2 69 217 15 -98 73 115 204 -300 -155 -80 -49 -2 0 -67 -103 -110 40
3999D0L4j45J19r3N4J67K33l28j22L6j12J27K41j03M2j21J3Q1l7K5j39k15J32
$$ 40 74 -71 48 -45 9 176 409 81 -41 -5 -117 10 251 148 190 69 82 163 126 151 12 -203 -71
4022g1J40J1j56j82J83O9K38r3k7j29j37K89j28M0j39O1o8L31k16M6j26j04N5
$$ -71 69 80 -76 -258 -75 -6 232 139 112 -17 -154 135 7 47 -92 -31 -99 232 16 62 -64 -168 -113
4045a13J64L0k22N3m5JK7K84j65J7j95K34KR7j35k08J58J10N3j69l6j74j5L74
$$ -113 51 81 -141 -88 -133 -132 -105 179 14 31 -164 70 72 169 34 -174 -16 94 147 -22 -58 -232 -247 127
4069A27J63l72q1N2J9J30nj35J45j05K70Rk6j67j79J46Q8k9k06J1o5J28N8J54
$$ 127 290 -82 -163 -111 -92 38 33 -102 43 -62 208 217 191 24 -155 -9 79 50 -156 -145 -210 -82 -24 130
4093A30o6k27J53l9J23j0k18N7N3k0J30k1k5j70k59L58M7J28j26l7p2k4L75j98
$$ 130 64 -163 -10 -49 74 64 -154 -97 -44 -64 66 45 20 -150 -409 -51 -4 124 -2 -39 -111 -135 240 42
4117D2j88J19P2r1J45k66J7k7J52K33k29J37j44Q5q0J01j40L03l40M5P4N7n4j52
$$ 42 -146 -27 45 -46 99 -167 -150 -177 -25 208 -21 116 -28 57 -23 78 -62 241 -99 -54 20 77 23 -129
4141a29J57j58R2J73j13J4j32P0j4J24j87J07l30J36K08M28l48k57N1L2j9R9n0
$$ -129 28 -130 -38 135 22 36 -96 -26 -40 84 -103 4 -326 -190 18 446 98 -159 -108 -76 -95 4 -46
4164d6j70L7J28L11j89p7j43P3L6N3P9N7j71J36p0mL2n2OJr1M8P0k82JJ13K12
$$ -46 -216 -179 -51 260 71 -6 -149 -76 -40 13 92 149 -22 114 44 40 72 20 26 27 -64 -16 54 -228 -227 -114 98
4191I8J45k14j42M6p3K21k05K03l8O2p0O4K6M6k46n7OJ95j25r7K63k55J56O5j0
$$ 98 243 29 -113 -67 -140 81 -124 79 41 103 33 97 123 169 -77 -134 -128 67 -58 -155 108 -147 9 74 64
4216F4N4l45K22M8o0jl6J33j24J02P9k00R3K9m5Q5j5j13Q4O0j81R2j58j2Q6K09
$$ 64 118 -227 -5 43 -17 -18 -54 79 -45 57 136 -64 29 58 13 98 83 -30 54 114 -67 25 -133 -145 -59 150
4242A50j62JJ8q9O8J86j45q6K9m3n1J39K1j8m9R3l5J4r7l2P7J1p2J29J01k95P6
$$ 150 -12 -11 7 -82 -14 172 27 -59 -30 -73 -124 15 36 18 -31 62 27 41 -56 -88 -11 0 -72 57 158 -137 -61
4269f1l2o7K27m2K18k98ljJ50o0j40J55q9J27j5q5J02q9j11p3J85n8l1J09J7k40
$$ -61 -93 -160 67 25 243 -55 -58 -59 91 31 -109 46 -43 84 69 -16 86 -3 -114 -187 -2 -60 -91 18 35 -205
4295b05J51J54n1k26K21l6j92K59j49J30k36K02L09n09J64p2q0K03NJ1l2k09K32
$$ -205 -54 100 49 -177 44 8 -184 75 -74 56 -180 22 331 -178 -14 -86 -166 37 42 53 21 -188 44
4318D4j59K46q6j28k1M8J08j4o2k0j25K61j20m5Ql5J55p7J27J00j35j47n1K07
$$ 44 -115 131 45 -83 -104 -56 52 38 -24 -44 -169 92 -28 -73 -65 -100 55 -22 105 205 70 -77 -128 79
4342G9J26k79J11j16K41j40j26J19k0m8K37k58J53O9l08J30l6J79m3J45k62J59
$$ 79 205 -74 37 -79 162 22 -104 15 -5 -53 184 -74 79 148 -160 -30 -66 113 70 215 -47 112
4364A12q5L3q2Q1p1KN8q2n3pj2K52kr2J89l86Q0M6K22r1j25j16N9n6K24r5j67
$$ 112 27 60 -22 59 -12 -10 48 -34 -87 -94 -106 146 144 52 241 -145 -65 -19 203 112 -13 -129 -70 -126 98 3 -164
4391a64K96j98N8J67j18N5j69K1Q4n5l5j14K15k7K11j69J01l64J23J27j6n7K0
$$ -164 132 -66 -8 159 41 96 -73 -52 32 -23 -58 -172 43 16 227 58 159 -205 -82 45 29 -28 -8
4414hM6q2j8O1Q9l7j57J48j30J28R3k16r7R8J35J09j43Qq7j36J46m1K13j96on2
$$ -8 38 -44 -62 -1 88 51 -106 42 -88 40 133 -83 -180 -82 53 162 19 27 -60 -196 -50 -91 122 -74 -80 -132
4440a32J60j3kl9p6O7J55r7m7j74J66J5M0j99J07J48k14K26j03k0k24J55N1K31
$$ -132 28 15 13 -26 -102 -35 120 23 -24 -198 -32 -17 23 -176 -69 79 -135 91 -12 -32 -256 -101 -50 181
4464A81k8J79l79R2J70k97oJ58k16K02p4l6K24k80L1Q5o7J6Q8J35l00j9J58R6
$$ 181 153 332 -47 45 215 -82 -88 70 -146 56 -18 -54 170 -110 -79 6 -61 -45 43 178 -122 -141 17 113
4488A13p7p7lN6J17k32K31j67J30l15M29r9j58R5l1k6lJ94q5j55K9J9J73q9k17
$$ 113 36 -41 -44 12 129 -103 128 -39 91 -224 205 106 -52 43 12 -14 -17 177 92 -63 -34 -15 158 69 -148
4513a48J32k19L56p5R2N0K7k06%P7%j24j3j42K66o1j15J60k17K88j60oJ3q4J92
$$ -148 -16 -235 121 46 138 188 215 9 9 86 86 -38 -51 -193 73 12 -103 57 -160 128 -32 -38 -25 -109 83
4538H3n3Q5j56J16j87J89m7J03k5k51K44k81L25k23J54P2k25j35K31j96J15J43
$$ 83 30 115 -41 75 -112 77 30 133 108 -143 101 -180 145 -78 76 148 -77 -212 19 -177 -62 81
4560H1n6q6O2P8j46J13j51p6O0K20K5j25o8J0O9j07J78M7k51J00O5J33j58J02
$$ 81 25 -61 1 79 -67 46 -105 -181 -121 99 124 -1 -69 -59 10 -97 81 128 -123 -23 42 175 17 119
4584A19r2M1J7j34K50l27K08o3j1j44M8L6J33P8j50l7J9j24J07L43l64N7j48p4
$$ 119 27 68 85 -49 201 -126 82 19 8 -136 -88 -52 81 159 9 -28 -9 -133 -26 317 -47 10 -138 -212
4608b12K60j6J9k5j59J93j31Q2r2mq8l2M04j35j47K0J63k23M4J48k4J1l9p4J31
$$ -212 48 32 51 26 -133 60 -71 11 -81 -85 -173 -205 199 64 -83 -63 100 -123 -79 69 45 56 17 -57 74
4633G4P2j40L5P0j50J22o3o5r7J66j5L9j18J18k07K13r3P7J15k42M9J17j34M2
$$ 74 146 6 41 111 -39 83 20 -45 -142 24 9 48 -70 48 -159 54 -39 38 153 -89 -40 77 -57 -15
4657a5K05k42QK7K0nk8P2j27N7K9o0J1M2J31k9j96J80j23J79j1k24K43j13J50
$$ -15 190 -52 -44 -17 3 -2 -30 42 -85 -28 1 -59 -48 -6 125 96 -100 80 -43 136 125 -99 144 31 181
4682A81k70J05j52J51k3P8m0M1Lo7N3n5J6j3K9m2R8j78m9J23N7k11K56o6J52j12
$$ 181 -89 16 -136 15 -8 70 30 71 74 7 60 5 21 8 37 -5 93 -85 -134 -11 46 -165 91 25 177 65
4708F5q0J2k02j8J85o7J31j22P8j97J20L4J65p2j00J03o3J23k29J03P6Nj50J93
$$ 65 -15 -3 -205 -223 -38 -105 26 -96 -18 -215 -95 -61 104 32 -68 35 -28 95 -134 -31 45 50 -100 93
4732I3K0k45m8J72rJ17r2N7p3k0J34o6J01j56M7L8j17J83l1j25J63j63J64k96
$$ 93 113 -132 -180 -8 -17 100 8 65 -8 -28 106 40 141 -15 32 70 -47 136 105 -20 143 -20 144 -152
4756a52K16j45J34q9j8K02k48J4j91L77j85J82k9j5r6p6N4N7k0R5j05J96k14L3
$$ -152 64 -81 53 -36 -54 148 -100 -86 -277 100 -85 97 68 53 -43 -119 -65 -8 -28 67 -38 158 -56 -23
4780b3k7L24l21J21j3r7M6j75J41P0j07%j81K46J03j84Q6k15J39Q0J3L9k71J81
$$ -23 -50 274 -47 74 61 -36 10 -165 -24 46 -61 -61 -242 4 107 -77 9 -206 -67 13 26 65 -206 -25
4804b5K2J73o1M0j92N4J1O2j52m1MJ9M1K0J80q2o1M5o2O4n2r3j17M0Q7K5Q5l5
$$ -25 -3 170 109 149 -43 11 22 84 -68 -109 -105 -86 -45 -25 155 73 12 57 -5 59 7 -86 -203 -163 -76 -51 34 -1
4832aj00mj1K95r1k9j89J52r2jR1j16J39q5Q2O8j35K0r2R1N1R6L4M9l72J51M8
$$ -1 -101 -105 -116 179 88 59 -130 22 -70 -71 20 -96 43 -42 40 108 -27 -7 -99 -8 43 139 173 222 -150 1 49
4859D9N6j23n0LJ90m1n1k29J96K29j64Q8q8L2j16l6L04q7k19J17J07l28K63j03
$$ 49 105 -18 -68 -65 125 84 33 -196 0 229 65 153 65 97 -19 -55 249 162 -57 60 167 -161 102 -1
4883aK31j40r0M7k7J10j23R5k48L64k10R5j63o9J52r4J19m1k48J57m8kK47l97
$$ -1 230 90 0 47 20 130 7 102 -146 218 8 103 -60 -129 23 -71 48 7 -241 -84 -132 -134 113 -284
4907b84L92j63J50j15J04Q6j69k03K09n6J70j85N3K8j69N4N8PPQ9m7%K16j83j21
$$ -284 108 -55 95 -20 84 170 1 -202 7 -49 121 -64 -11 17 -152 -98 -40 -33 -26 63 16 16 232 49 -72
4932g2J67l75L24j05q1K57J22m83K95lj68J24j78K73k6o6J35M3l06K4R8K41j17
$$ -72 95 -280 44 -61 -142 115 237 -246 49 46 -122 2 -176 97 71 5 140 183 -123 -99 -1 240 123
4955A23j22K39k66nO3R8K9j52K1j17R6o7k8Q2J26L1r2r6j31P7P6J27n3J42r7Q8
$$ 123 1 240 -26 -31 32 130 159 7 28 -89 7 -60 -88 -6 120 151 59 -37 -168 -91 -15 112 59 201 104 192
4981A92j41P3j35j37K15j05l5J25p6L5j8J27j59qj14J30k8N3j11K65k20O9jK09
$$ 192 51 124 -11 -148 67 -38 -73 52 -24 11 -7 120 -39 -47 -161 -31 -59 -6 -117 148 -72 -3 -4 205
5005B05l16J59NJ14k67Q5O8j6J2j7O7k16j03K53j08Q4J64k06J22j57m2J87o3n4
$$ 205 -111 48 53 167 -100 -15 53 37 49 32 99 -117 -220 33 -75 9 173 -33 89 -68 -110 77 14 -40
5029d0j06O3o9J69n9J37k62J92q5L2J34j47j33J60O0L1o3j78J01%RM4J73L1j89
$$ -40 -146 -83 -152 17 -42 95 -167 25 -60 -28 106 -41 -174 -14 46 77 14 -164 -63 -63 -54 -10 163 194 5
5054Ek2O2n3m7L6j39J17J0k6n6K10J58k47J34j68J86r2j51p8J40O2j39o1J48J17
$$ 5 -17 45 -8 -55 -19 -158 -41 -31 -57 -113 97 255 8 142 -26 160 68 -83 -161 -21 41 -98 -159 -11 106
$$ [...]
8191D
##END NTUPLES=NMR FID
##END=
