##TITLE=1H_48-2022
 CDCl3
 8 sc, 
 25.07.2022
##JCAMPDX= 6.0         $$ Bruker NMR JCAMP-DX V2.0
##DATA TYPE= NMR FID
##DATA CLASS= NTUPLES
##ORIGIN= UXNMR, Bruker Analytische Messtechnik GmbH
##OWNER= root
$$ XWIN-NMR		Version 3.5
$$ Mon Jul 25 14:46:31 2022 Russian Standard Time (UT+4h)  she@DPX200
##.OBSERVE FREQUENCY= 200.1313499994
##.OBSERVE NUCLEUS= ^1H
##.DELAY= (6, 6)
##.ACQUISITION MODE= SIMULTANEOUS
##.ACQUISITION SCHEME= undefined
##.AVERAGES= 8
##.DIGITISER RES= 18
##SPECTROMETER/DATA SYSTEM= spect
##.PULSE SEQUENCE= zg30
##.SOLVENT NAME= DMSO
##.SHIFT REFERENCE= (INTERNAL, DMSO, 0, 15.7039)
##AUDIT TRAIL= $$ (NUMBER, WHEN, WHO, WHERE, WHAT)
$$ ##TITLE= Audit trail, XWIN-NMR		Version 3.5
$$ ##JCAMPDX= 5.01
$$ ##ORIGIN= Bruker BioSpin GmbH
$$ ##OWNER= she
$$ F:/spectra/data/she/nmr/H-F/1/audita.txt
$$ ##AUDIT TRAIL=  $$ (NUMBER, WHEN, WHO, WHERE, WHAT)
(   1,<2022-07-25 14:45:30.53 +0400>,<she>,<DPX200>,
      <created by zg, POWCHK disabled, PULCHK disabled
       configuration hash MD5:
       00 E9 B6 7A A2 85 ED C7 34 08 36 98 17 FE 4E 26
       data hash MD5: 16K
       9B F4 66 F8 E3 62 87 37 A9 37 89 7A C3 4A 86 10>)
$$ ##END=
$$ 
$$ hash MD5
$$ F9 C5 14 1E CC 08 B2 D2 9C A3 92 82 D0 97 06 3D
##$RELAX= 
##$RELAX= 
##$RELAX= 
##$RELAX= 
##$RELAX= 
##$RELAX= 
$$ Bruker specific parameters
$$ --------------------------
##$DU= <F:/spectra>
##$EXPNO= 1
##$NAME= <H-F>
##$PROCNO= 1
##$TYPE= <nmr>
##$USER= <she>
##$AMP= (0..31)
100 100 100 100 100 100 100 100 100 100 100 100 100 100 100 100 100 100 
100 100 100 100 100 100 100 100 100 100 100 100 100 100 
##$AQSEQ= 0
##$AQ_mod= 1
##$AUNM= <au_zg>
##$AUTOPOS= <>
##$BF1= 200.13
##$BF2= 200.13
##$BF3= 200.13
##$BF4= 200.13
##$BF5= 200.13
##$BF6= 200.13
##$BF7= 200.13
##$BF8= 200.13
##$BYTORDA= 1
##$CFDGTYP= 0
##$CFRGTYP= 5
##$CHEMSTR= <none>
##$CNST= (0..31)
1 1 145 1 1 1 1 1 1 1 1 1 1 1 1 1 1 1 1 1 1 1 1 1 1 1 1 1 1 1 1 1 
##$CPDPRG= <>
##$CPDPRG1= <>
##$CPDPRG2= <>
##$CPDPRG3= <>
##$CPDPRG4= <mlev>
##$CPDPRG5= <mlev>
##$CPDPRG6= <mlev>
##$CPDPRG7= <mlev>
##$CPDPRG8= <mlev>
##$CPDPRGB= <>
##$CPDPRGT= <>
##$D= (0..31)
0 1.2 0 0 0 0 0 0 0 0.06 0 0.03 0 0 0 0 0.0002 0 0 0 0 0 0 0 0 0 0 0 0 
0 0 0 
##$DATE= 1658745929
##$DBL= (0..7)
120 120 120 120 120 120 120 120 
##$DBP= (0..7)
150 150 150 150 150 150 150 150 
##$DBP07= 0
##$DBPNAM0= <>
##$DBPNAM1= <>
##$DBPNAM2= <>
##$DBPNAM3= <>
##$DBPNAM4= <>
##$DBPNAM5= <>
##$DBPNAM6= <>
##$DBPNAM7= <>
##$DBPOAL= (0..7)
0.5 0.5 0.5 0.5 0.5 0.5 0.5 0.5 
##$DBPOFFS= (0..7)
0 0 0 0 0 0 0 0 
##$DE= 6
##$DECBNUC= <off>
##$DECIM= 32
##$DECNUC= <off>
##$DECSTAT= 4
##$DIGMOD= 1
##$DIGTYP= 9
##$DL= (0..7)
0 120 120 120 120 120 120 120 
##$DP= (0..7)
150 150 150 150 150 150 150 150 
##$DP07= 0
##$DPNAME0= <>
##$DPNAME1= <>
##$DPNAME2= <>
##$DPNAME3= <>
##$DPNAME4= <>
##$DPNAME5= <>
##$DPNAME6= <>
##$DPNAME7= <>
##$DPOAL= (0..7)
0.5 0.5 0.5 0.5 0.5 0.5 0.5 0.5 
##$DPOFFS= (0..7)
0 0 0 0 0 0 0 0 
##$DQDMODE= 0
##$DR= 18
##$DS= 0
##$DSLIST= <SSSSSSSSSSSSSSS>
$$ [...]
##$SUBNAM2= <"">
##$SUBNAM3= <"">
##$SUBNAM4= <"">
##$SUBNAM5= <"">
##$SUBNAM6= <"">
##$SUBNAM7= <"">
##$SUBNAM8= <"">
##$SUBNAM9= <"">
##$SW= 18.0517283424941
##$SWIBOX= (0..15)
0 0 2 0 0 0 0 0 0 0 0 0 0 0 0 0 
##$SW_h= 3612.71676300578
##$TD= 16384
##$TD0= 1
##$TE= 0
##$TE2= 300
##$TE3= 300
##$TEG= 300
##$TL= (0..7)
0 120 120 120 120 120 120 120 
##$TP= (0..7)
150 150 150 150 150 150 150 150 
##$TP07= 0
##$TPNAME0= <>
##$TPNAME1= <>
##$TPNAME2= <>
##$TPNAME3= <>
##$TPNAME4= <>
##$TPNAME5= <>
##$TPNAME6= <>
##$TPNAME7= <>
##$TPOAL= (0..7)
0.5 0.5 0.5 0.5 0.5 0.5 0.5 0.5 
##$TPOFFS= (0..7)
0 0 0 0 0 0 0 0 
##$TUNHIN= 0
##$TUNHOUT= 0
##$TUNXOUT= 0
##$USERA1= <user>
##$USERA2= <user>
##$USERA3= <user>
##$USERA4= <user>
##$USERA5= <user>
##$V9= 5
##$VALIST= <valist>
##$VCLIST= <CCCCCCCCCCCCCCC>
##$VD= 0
##$VDLIST= <DDDDDDDDDDDDDDD>
##$VPLIST= <PPPPPPPPPPPPPPP>
##$VTLIST= <TTTTTTTTTTTTTTT>
##$WBST= 1024
##$WBSW= 4
##$XGAIN= (0..3)
0 0 0 0 
##$XL= 0
##$YL= 0
##$YMAX_a= 285380
##$YMIN_a= -242894
##$ZGOPTNS= <>
##$ZL1= 120
##$ZL2= 120
##$ZL3= 120
##$ZL4= 120
##$ABSF1= 10
##$ABSF2= 0
##$ABSG= 5
##$ABSL= 3
##$ALPHA= 0
##$AQORDER= 0
##$ASSFAC= 0
##$ASSFACI= 0
##$ASSFACX= 0
##$ASSWID= 0
##$AUNMP= <proc_1d>
##$AZFE= 0.1
##$AZFW= 0.1
##$BCFW= 1
##$BC_mod= 2
##$BYTORDP= 1
##$COROFFS= 0
##$CY= 11.3945322036743
##$DATMOD= 1
##$DC= 2
##$DFILT= <>
##$DTYPP= 0
##$F1P= 2.36226072786647
##$F2P= -0.459571619588291
##$FCOR= 0.5
##$FTSIZE= 0
##$FT_mod= 4
##$GAMMA= 1
##$GB= 0.15
##$INTBC= 1
##$INTSCL= 1
##$ISEN= 128
##$LB= 0.24
##$LEV0= 0
##$LPBIN= 0
##$MAXI= 10000
##$MC2= 0
##$MEAN= 0
##$ME_mod= 0
##$MI= 1.114404
##$NCOEF= 0
##$NC_proc= 0
##$NLEV= 6
##$NOISF1= 3.799351
##$NOISF2= 2.8
##$NSP= 1
##$NTH_PI= 0
##$NZP= 0
##$OFFSET= 15.70392
##$PC= 1
##$PHC0= -18038.4
##$PHC1= 9.20068
##$PH_mod= 1
##$PKNL= yes
##$PPARMOD= 0
##$PSCAL= 0
##$PSIGN= 0
##$REVERSE= no
##$SF= 200.130013532006
##$SI= 16384
##$SIGF1= 3
##$SIGF2= 2
##$SINO= 400
##$SIOLD= 16384
##$SREGLST= <1H.CDCl3>
##$SSB= 0
##$STSI= 0
##$STSR= 0
##$SW_p= 3612.71676300578
##$SYMM= 0
##$S_DEV= 0
##$TDeff= 0
##$TDoff= 0
##$TI= <>
##$TILT= no
##$TM1= 0
##$TM2= 0
##$TOPLEV= 0
##$USERP1= <user>
##$USERP2= <user>
##$USERP3= <user>
##$USERP4= <user>
##$USERP5= <user>
##$WDW= 1
##$XDIM= 8192
##$YMAX_p= 0
##$YMIN_p= 0
$$ End of Bruker specific parameters
$$ ---------------------------------
##NTUPLES= NMR FID
##VAR_NAME=  TIME,          FID/REAL,        FID/IMAG
##SYMBOL=    X,             R,               I
##VAR_TYPE=  INDEPENDENT,   DEPENDENT,       DEPENDENT
##VAR_FORM=  AFFN,          ASDF,            ASDF
##VAR_DIM=   8192,          8192,            8192
##UNITS=     SECONDS,       ARBITRARY UNITS, ARBITRARY UNITS
##FACTOR=    0.0002768,     1,               1
##FIRST=     0,             0,               0
##LAST=      2.2672688,     0,               0
##MIN=       0,             -242894,         0
##MAX=       2.2672688,     285380,          0
$$ Real data points
##PAGE= N=1
##DATA TABLE= (X++(R..R)), XYDATA
0 0 0 0 0 0 0 0 0 0 0 0 0 8 -8 8 -8 16 -16 24 -31 32 -40 48 -56 72 -80 96 -112 128 -147 169 -194 221 -251
33 -251 285 -323 363 -409 459 -513 572 -637 707 -787 871 -965 1066 -1176 1297 -1429 1574
50 1574 -1734 1911 -2106 2323 -2565 2838 -3146 3499 -3909 4392 -4962 5658 -6527 7643 -9140
65 -9140 11262 -14528 20238 -33166 128772 -79015 -77162 285380 -23695 -58179 170201 7205
77 7205 -217152 16495 99723 -154893 -97317 98414 -137995 -88230 170674 -36258 -126224
88 -126224 102438 48672 -61781 14563 79548 -21881 -66571 97885 58525 -100745 68665
99 68665 100740 -69317 13325 68338 -51697 -43892 39328 -30650 -141194 -1778 50086 -140264
111 -140264 -7569 115118 -115193 -1886 194764 -17755 -37645 135251 37460 -56272
121 -56272 62961 57189 -116536 -39744 74126 -111507 -71783 90385 -90676 -84370 101224
132 101224 -10877 -58173 60023 37478 -36655 -2772 77887 13091 -52962 50516 28530
143 28530 -40059 49083 34349 -33653 -4888 13872 10581 -32674 -22345 6527 -79763 -24048
155 -24048 58033 -76846 -50245 66605 -16119 -19428 68103 31184 -24654 30754 82705 -13525
167 -13525 -30171 62104 -26343 -44550 56799 -44821 -65523 41877 -17093 -40560 16185
178 16185 -2404 -21255 1199 38070 -55 -38095 35696 22393 -23121 29148 783 -16970
190 -16970 24138 -1397 5737 -766 -23923 16515 -10892 -17912 18928 -34858 -16383 30935 -19816
203 -19816 -14785 17689 10030 -1308 -1413 35626 2275 -23994 49749 4264 -40499 34569 -4709
216 -4709 -30523 24329 -15901 -30729 4191 985 -9762 -18680 9061 1117 -29742 31646 20294
229 20294 -32801 21470 17927 -5519 23590 2564 4293 4979 -13658 19140 -2605 -20528 9664
242 9664 -22751 -12457 16816 -15899 -6881 846 -4919 5262 -5523 21697 7028 -34348 26214
255 26214 17293 -28302 23551 4160 -27461 11681 6511 -284 -1142 -5789 2963 -13861 11658
268 11658 18353 -32832 5490 16347 -28753 17369 19531 -19064 1245 3903 11630 7171 -9164
281 -9164 14439 -11066 -17290 23060 -10407 -14965 5169 -23154 -3192 9512 -4713 1984 -11825
294 -11825 9011 16144 -12652 26550 13700 -29305 20068 16745 -12693 8454 -2329 -7091 -6708
307 -6708 -2431 14014 -18101 -9606 12872 -25897 6539 23301 -28777 118 12851 -13410 7462
320 7462 8936 3131 -7175 -9520 25549 209 -13504 21695 -13154 -11943 22628 -7258 -3799
333 -3799 2661 -12514 3874 -1228 4898 4673 -21833 12067 10920 -19187 19542 7021 -19934
346 -19934 8508 5690 2403 -1431 -8066 7570 -14802 -6706 19310 -20959 -7271 14060 -20751
359 -20751 6358 18212 -11388 2798 7096 8428 5086 -2028 19179 -6994 -16781 24455 -6948
372 -6948 -16751 13127 -14205 -8298 7091 -7443 2255 -5568 -1921 7052 -12102 11041 6687 -21687
386 -21687 12901 6203 -14563 11810 3191 -2416 2121 993 16610 -5340 -5779 18603 -14412
399 -14412 -4490 15645 -20305 -4572 7181 -14009 188 2101 -664 32 -2304 18546 -1971
412 -1971 -11336 23702 -4663 -13196 16199 -11690 -10815 5612 -7756 -14 -6006 -3692 8602 -7071
426 -7071 10242 8682 -14828 14730 8158 -11120 10801 -980 -5591 1995 -2193 9940 -7983
439 -7983 -7375 18461 -11131 -5783 16681 -14957 -4519 7324 -13681 -2765 -597 -3419 -2659 -6817
453 -6817 12397 -843 -5731 25763 -2397 -9179 24496 -937 -3705 10637 -8209 -3493 -2712
466 -2712 -2759 3046 -14146 -1428 2351 -12550 11878 2637 -13917 8706 -250 -1255 7405 -4228
480 -4228 4928 -5933 -5907 20139 -6109 -7367 14335 -11343 -1540 14604 -5303 -3390 -4433 -1490
494 -1490 2743 -4463 9046 -7796 -15797 20617 417 -9257 18938 -8079 -8477 17025 1461
507 1461 -1259 -3170 -4674 3311 -6625 2998 -144 -17191 5764 -71 -10653 10318 -4789 -5973
521 -5973 9140 -3407 7168 4646 -3165 15226 -3179 -4847 16727 -3253 -2543 5453 -8689
534 -8689 -2428 -1390 764 -1241 -16137 2414 -209 -10062 16899 -5579 -17998 17321 1801
547 1801 -5002 12866 -4916 -5483 4385 7583 6618 -9364 2250 5069 -8011 13367 1951 -15349
561 -15349 7941 -4044 -6268 9217 -9531 -4560 806 -6370 9605 -995 -4637 10286 -3828
574 -3828 1541 9315 -2013 1949 -5532 -1988 4511 -11595 3040 1530 -17348 9244 3355 -10203
588 -10203 14470 192 -7317 12427 3399 -584 1021 1164 2087 -9185 4443 4702 -14822 7022
602 7022 2856 -12574 11198 -703 -8622 8592 -6213 -4374 3534 -5456 1964 -5028 -4167 7810
616 7810 -3779 4403 7435 -4065 8021 2682 1445 9719 -9945 61 6547 -13092 3965
629 3965 117 -14948 6104 524 -5895 6356 -732 122 1831 2667 5243 -9792 2327 7185
643 7185 -14604 4513 3953 -14591 8290 3207 -7798 8482 -398 -461 6575 -1316 3078 -3007
657 -3007 -1220 6710 -7669 941 4096 -9678 5854 1662 -4865 8115 -5963 -1132 8295 -9122
671 -9122 1786 2327 -11025 2976 -1299 -4636 3820 -3445 1217 794 633 9886 -4292 1855 10047
686 10047 -10400 4878 9211 -12483 2644 1937 -8213 5098 -781 -2871 361 -3377 5075 -1146
700 -1146 -1169 5941 -9542 582 7379 -8895 3259 683 -8511 6237 -1022 -551 6768 -7115
714 -7115 1677 5181 -3965 5436 -1304 -3825 3476 -3286 3875 1345 -5382 5579 -4276 -467 10621
729 10621 -8404 -324 6291 -9732 3443 4019 -7191 451 -3433 -629 1409 -3535 4856 -3940
743 -3940 -4313 9523 -4049 1386 8512 -9064 2590 6493 -3656 5619 -1955 -3596 4266 -3846
757 -3846 4582 1755 -8810 2692 -1417 -1177 5572 -6736 -825 426 -5205 7881 -2353 -5314
771 -5314 6010 -6215 1353 8892 -7336 817 2664 -3217 4702 -444 1109 416 -5353 7121
785 7121 -18 -4505 8571 -5948 -3162 8575 -5325 1250 3877 -6653 2312 -253 -219 3230
799 3230 -6648 1417 944 -6086 6757 -1663 -5267 4704 -4309 2261 4469 -5555 4545 -826 -2616
814 -2616 8625 -3537 -198 5350 -5909 3230 3389 -3827 2481 -2955 147 2724 -5238 5007
828 5007 -1523 -7732 7441 -2735 -3723 6580 -6320 -1012 4161 -3385 3170 -1335 -1437 3291 -4094
843 -4094 4802 2212 -7346 6315 140 -4195 7330 -3396 -880 4209 -3932 3985 -22 -3882
857 -3882 5421 -4065 -423 4082 -6667 2075 810 -5350 3467 -3334 -817 3288 -5522 4095 624
872 624 -6239 7417 -1508 -3752 6723 -3576 628 4031 -2856 3579 -570 -119 4300 -4875 3275
887 3275 2561 -7508 5213 -958 -6493 5426 -3783 -2959 2859 -4641 2979 677 -2767 4758 -3779
902 -3779 396 5916 -4816 2970 812 -5342 5228 -1395 -1253 3440 -5802 3009 3005 -4733 6184
917 6184 -1309 -4406 6080 -2503 170 2506 -4628 2346 -1575 -1247 4461 -5980 975 3001 -6840
932 -6840 5538 448 -6716 4578 -2433 -1837 3930 -3723 1249 -551 -2311 6343 -1575 484 5207
947 5207 -4586 4034 3719 -3736 5098 -2429 -3340 4090 -4281 644 720 -7570 3237 -844 -3549 4634
963 4634 -4068 -1637 2123 -2201 4627 -1056 -2644 4407 -4175 3020 5684 -6099 3431 1382 -4171
978 -4171 6845 -656 -3063 2164 -3458 2233 267 -3792 2557 -5187 -837 5666 -4890 1803 1120
993 1120 -5380 5695 76 -2235 4351 -4525 726 3098 -4292 3586 -1360 -4132 3855 -2620 714
1008 714 2807 -4041 3127 -710 -1236 6671 -3653 405 4496 -5430 4029 2989 -5227 3527 -1677
1023 -1677 -2724 3488 -3071 203 -1808 -3882 4181 -3723 -1499 4015 -6697 1867 3975 -4298 4728
1038 4728 -77 -2631 5766 -1163 1653 3220 -3726 3263 95 -2016 4310 -3899 -1399 1684 -4569
1053 -4569 2981 -1529 -4447 3990 -4308 -148 5184 -5472 1916 2735 -3843 4575 2 -1614 2675
1068 2675 -2061 2062 444 -2676 4290 -3374 -1374 5543 -5510 889 3525 -5470 3094 721 -3354
1083 -3354 3933 -2058 98 2369 -3409 3148 -232 -2350 3693 -3811 -468 3093 -4882 2175 -547
1098 -547 -4535 4604 -3264 -1332 4917 -4433 2028 3418 -3028 4130 635 -435 3679 -1996 2686
1113 2686 702 -2877 4648 -3440 -2550 4784 -5683 -480 2858 -6563 1107 605 -3619 2594 -2261
1128 -2261 -407 2275 -2198 3738 -32 -2045 5567 -2109 1256 4920 -4364 2363 1238 -3926 4110
1143 4110 -2160 -2506 3164 -4505 670 2117 -3829 2159 -1360 -1331 3380 -2887 1714 496 -4091 4859
1159 4859 -1233 -2242 5421 -4576 -345 4617 -4052 1860 503 -3637 2244 -1421 484 1661 -3692
1174 -3692 2576 -108 -2027 6123 -2622 -666 4610 -3850 2945 2419 -4565 2041 -1816 -2026 2848
1189 2848 -3915 -585 -169 -3896 2937 -683 -1224 3080 -3581 1863 3154 -3089 4014 -857 -3009
1204 -3009 5530 -1789 -112 3655 -3709 1704 1710 -1553 2569 -2593 -950 1067 -4275 2345 -766 -4972
1220 -4972 3541 -2926 -1601 4911 -3619 810 2461 -2644 3721 753 -1051 2565 -3220 1498 2172
1235 2172 -3133 2845 -1762 -2403 4292 -2742 786 2403 -4394 3243 793 -2539 3651 -3197 -2149
1250 -2149 2787 -2957 1154 134 -2888 2473 -1497 761 2576 -3956 2281 823 -3499 4335 -1517
1265 -1517 -2838 3571 -2822 627 2731 -2524 2211 -187 -401 3493 -2106 1190 1193 -3884 3101 -898
1281 -898 -2729 2916 -3544 -594 2295 -3613 2008 448 -2976 3570 -1431 -453 2730 -2911 1514
1296 1514 746 -2338 3114 -1656 -399 3010 -3287 2709 2214 -3198 3933 -294 -1865 3689 -2267
1311 -2267 -365 1143 -3028 1710 -1503 -1702 1951 -3570 539 1874 -3862 2718 -53 -2985 4036
1326 4036 -1426 -424 2640 -2469 2168 1055 -1929 3421 -1212 -69 3116 -2808 1722 869 -2883
1341 -2883 3091 -2076 -1850 2392 -4152 396 1252 -4031 2230 -579 -2062 3342 -1753 407 1795
1356 1795 -2165 3087 -235 -1133 3280 -2936 669 2681 -3596 2221 113 -3155 3457 -1176 -956
1371 -956 2265 -2973 1318 634 -1775 3144 -1687 -952 2569 -2802 1764 1037 -3310 2587 -1377 -1472
1387 -1472 2884 -3160 43 1135 -3294 2561 -72 -2130 2578 -1579 894 2318 -1863 2923 -266
1402 -266 -1186 4110 -1851 -84 2234 -3727 1558 794 -3015 1938 -2342 -2003 1292 -2832 985 -499
1418 -499 -2969 2411 -1415 -234 3227 -2475 1471 2416 -1737 3799 32 -1487 2961 -2205 498
1433 498 1987 -3542 1048 -1150 -2271 2336 -2038 -97 1055 -3153 2217 111 -2004 3221 -2624
1448 -2624 -680 2941 -2690 1463 741 -2769 2542 -318 -361 1903 -2396 801 808 -2004 2842 -1900
1464 -1900 -1675 2559 -2597 1272 2207 -2860 2499 553 -917 3464 -1620 126 1155 -2935 1391
1479 1391 -487 -2876 1242 -3074 -742 1743 -2736 1890 50 -1897 3620 -917 64 3085 -2245
1494 -2245 998 1754 -1620 2396 -538 -879 2232 -1847 1392 609 -2696 2088 -1503 -1868 2368 -3312
1510 -3312 -874 1053 -3230 1369 16 -1619 2782 -824 1156 2732 -1426 2101 273 -1645 2764
1525 2764 -1622 -600 1215 -3384 960 271 -2249 2468 -1267 -553 3182 -1691 833 1178 -2233 1857
1541 1857 -925 -1122 1507 -2590 733 369 -2373 2644 -898 -1687 2884 -1992 -248 1868 -2545 1043
1557 1043 232 -1398 2113 -1044 463 2202 -1453 2562 917 -1182 3084 -1252 -449 1576 -3229
1572 -3229 292 -262 -3439 1230 -1843 -1342 2157 -1920 601 1713 -1761 2384 28 -192 2358 -1907
1588 -1907 767 1065 -2206 2581 -444 -1821 2822 -1724 166 1965 -2301 1076 -65 -1902 1877
1603 1877 -1714 -444 916 -2418 1769 576 -1750 2622 -1475 -552 2505 -2028 801 771 -2412 1507
1619 1507 -709 -1099 1938 -1981 291 1425 -1207 2362 -226 -620 2516 -1387 1148 1609 -2430 1458
1635 1458 -137 -2240 2407 -1726 -1454 1262 -2337 895 158 -1875 1324 -1588 33 2120 -1943
1650 -1943 1561 287 -1870 3202 -203 -434 2657 -1972 685 1635 -1454 1732 -708 -1494 1411 -1521
1666 -1521 574 801 -2638 1224 -190 -1306 2212 -2026 66 1544 -1879 1881 275 -2003 1924
1681 1924 -1004 -314 1741 -1867 523 183 -1177 2198 -740 -200 1621 -1963 1474 1365 -1777 2180
1697 2180 -601 -1326 2228 -1696 114 932 -2411 762 -420 -1129 1001 -2422 -71 674 -2163 2015
1713 2015 -89 -1418 2440 -1259 524 2239 -1835 1497 662 -1582 2487 -568 -753 1349 -2064
1728 -2064 778 162 -1852 1480 -1680 -800 1641 -2324 799 524 -2439 1919 -118 -1056 2241 -1470
1744 -1470 260 1413 -1147 1652 -379 -967 1617 -1728 333 1190 -2449 1416 -60 -2125 2140
1759 2140 -1230 -536 2035 -1488 1409 895 -1174 1966 -788 -569 1443 -2047 280 84 -2366 1222
1775 1222 -1239 -1177 1594 -2110 646 1352 -1658 1773 446 -931 2303 -823 308 1421 -1250 1479
1791 1479 3 -1025 1910 -1660 350 1290 -2264 1164 68 -2183 1257 -1533 -1247 976 -1868
1806 -1868 368 436 -1490 1863 -355 246 2590 -1025 1331 988 -1801 1889 -385 -1312 1310 -2196
1822 -2196 -158 704 -2020 1513 20 -843 2022 -787 580 1292 -1683 1281 -223 -1390 1505 -1919
1838 -1919 -428 1549 -1961 1128 487 -1638 1780 -483 -507 1746 -1464 499 220 -1611 1872 -800
1854 -800 -459 2013 -1372 1284 1739 -1055 1717 -118 -1224 1486 -1486 -610 55 -2669 373 -498
1870 -498 -1644 1186 -1130 198 1695 -970 2318 585 -1145 2144 -1104 -206 1529 -2086 747
1885 747 473 -1541 1464 -604 -741 1396 -1383 813 726 -1654 1296 -1262 -1345 1726 -1824 228 1024
1902 1024 -1961 1833 558 -620 2051 -1060 106 1320 -1724 576 -492 -1576 1287 -1236 -106
1917 -106 1523 -1447 1564 872 -932 2484 -268 -410 1672 -1763 703 433 -2084 752 -1161 -1178
1933 -1178 1147 -1621 294 669 -1664 1903 -291 -892 1787 -1313 204 1457 -1410 1567 394
1948 394 -766 2096 -411 407 1065 -1684 1129 -242 -1680 1131 -1615 -1130 809 -1864 644 157
1964 157 -1853 1627 -441 -247 1916 -1077 661 784 -1107 1277 -301 -620 1062 -1481 370 966
1980 966 -1832 1421 -371 -1132 1878 -1181 24 1457 -1556 1270 343 -950 1558 -965 -80 1247
1996 1247 -2002 639 -45 -1740 1151 -1469 -619 1471 -1757 560 426 -1510 1508 -266 -371 2152
2012 2152 -1060 660 1224 -1256 1752 -233 -627 1612 -1432 -20 778 -1997 1003 -420 -1709 1177
2028 1177 -1370 -432 1098 -1911 703 489 -1077 1985 -475 259 1666 -1103 1000 741 -1188 1666
2044 1666 -764 -735 1267 -1557 107 544 -1662 1050 -451 -495 1631 -1228 630 925 -1295 1231
2060 1231 -104 -950 1507 -1313 95 1167 -1773 908 376 -1362 1303 -893 -324 1251 -1467 789
2076 789 115 -1254 1630 -525 132 1782 -1151 1020 853 -1072 1753 -841 -896 1155 -1745 -10
2092 -10 311 -2073 513 -934 -1020 1477 -1387 145 1155 -1360 1564 168 -745 1839 -760 472
2108 472 1457 -1486 1118 114 -1198 1702 -698 -262 809 -1694 243 61 -1425 987 -943 -876
2124 -876 1297 -1537 699 776 -1426 1338 -219 -258 1487 -1254 290 629 -1459 1227 -59 -947 1069
2141 1069 -1117 250 1317 -1233 1164 14 -974 1924 -1048 -66 942 -1584 869 256 -1377 1206
2157 1206 -1061 -470 987 -1378 524 -120 -1588 1205 -1043 -398 1249 -1360 625 654 -884 1386
2173 1386 212 -573 1590 -784 548 992 -1516 797 -324 -1230 1396 -1151 -344 623 -1496 827
2189 827 138 -1480 1115 -884 -517 1104 -1541 629 168 -956 1404 -196 -334 1200 -1296 586
2205 586 697 -1216 1293 -638 -439 1286 -1125 301 1119 -1317 1366 -309 -864 1477 -693 60
2221 60 857 -1520 837 -448 -1237 903 -1351 -326 855 -1304 1203 491 -1049 1627 -373 -121
2237 -121 1170 -889 569 488 -1136 1124 -469 -548 1261 -1127 638 489 -1478 982 -543 -930 1209
2254 1209 -1489 -146 848 -1734 726 -122 -634 1434 -705 396 1056 -778 1078 440 -973 1050
2270 1050 -951 62 1096 -1453 618 456 -955 1147 -529 -304 1190 -1181 598 472 -1245 1020
2286 1020 -643 -858 1122 -1100 474 386 -1435 1164 -226 -959 1343 -996 -84 818 -1341 861
2302 861 123 -815 1375 -381 64 1204 -849 1092 365 -1011 1144 -529 -154 916 -1547 213
2318 213 358 -1353 787 -849 -826 901 -1013 423 363 -1274 922 -77 -422 1283 -853 271 867
2335 867 -798 1174 61 -1126 1230 -879 -51 1067 -1602 633 -148 -1116 1039 -576 -436 777
2351 777 -1169 441 512 -1085 1039 -834 -542 733 -842 563 469 -1076 930 150 -193 1288 -844
2368 -844 380 808 -986 1012 -212 -803 1235 -1041 26 888 -1115 518 259 -676 836 -729
2384 -729 -372 502 -1324 409 -29 -1131 845 -680 -122 1083 -757 646 265 -986 1033 -481
2400 -481 -508 1140 -970 366 573 -1008 902 -289 -726 1243 -912 371 436 -1181 648 -346 -1174
2417 -1174 929 -938 -168 895 -782 662 122 -887 1076 -328 -35 915 -1181 615 33 -1104
2433 -1104 1037 -569 -489 1034 -1055 507 703 -945 1040 -134 -357 978 -995 108 63 -1292
2449 -1292 544 -411 -849 882 -885 -4 822 -1006 877 48 -634 1102 -431 -133 799 -659 923
2466 923 148 -858 1070 -454 -116 1117 -806 440 99 -1127 597 -644 -643 613 -1157 84 385
2483 385 -1103 841 -60 -495 1071 -643 191 552 -767 805 -92 -427 967 -851 -269 692 -994
2500 -994 873 30 -711 1216 -843 -310 783 -1058 355 184 -779 779 -518 -310 839 -1109 444
2517 444 475 -831 990 -339 -604 805 -638 83 464 -918 800 152 -631 1119 -479 295 787
2534 787 -617 607 31 -840 969 -535 120 667 -1239 326 129 -815 644 -531 -470 516 -1064
2551 -1064 299 314 -665 988 -224 -65 1103 -406 491 581 -605 933 41 -401 983 -729 3
2568 3 472 -864 843 -324 -693 765 -946 56 635 -1043 625 187 -610 870 -631 -129 692
2585 692 -775 438 303 -788 747 -217 -240 792 -587 272 336 -926 685 48 -199 741 -760 382
2603 382 663 -722 707 -94 -696 827 -762 -31 546 -1107 204 -104 -535 665 -625 -21 865
2620 865 -768 509 140 -536 655 -368 -164 819 -815 482 261 -582 711 -143 -518 736 -425
2637 -425 416 408 -974 559 -336 -496 849 -949 -22 330 -685 678 -23 -359 700 -590 -350 668
2655 668 -845 443 292 -590 843 -343 139 664 -879 326 226 -622 629 -352 -505 643 -692
2672 -692 261 323 -992 753 -206 -378 714 -662 113 142 -578 361 -38 -533 725 -458 221 975 -662
2691 -662 846 221 -459 847 -205 -330 519 -862 194 79 -801 466 -361 -191 534 -853 230
2708 230 198 -485 594 -417 -363 450 -720 96 461 -577 833 -3 -195 945 -283 79 366 -788
2726 -788 530 97 -525 496 -825 -141 482 -848 696 104 -522 697 -202 -289 441 -836 -21 -84
2744 -84 -869 623 -416 -271 454 -620 480 480 -545 799 -34 -115 900 -671 224 317 -519 538 -27
2763 -27 -487 696 -312 44 459 -647 578 -65 -727 410 -559 -558 430 -939 384 145 -516 700
2781 700 -22 4 507 -269 358 625 -531 690 -306 -397 611 -601 188 426 -490 838 -192 -201 677
2800 677 -590 197 582 -1037 635 -77 -550 538 -565 -61 445 -738 354 156 -494 720 -387
2817 -387 60 578 -579 296 190 -499 787 -261 190 820 -531 344 224 -919 550 -367 -386 443
2835 443 -731 30 430 -891 471 -181 -519 711 -150 247 347 -254 328 210 -311 869 -375 -53
2853 -53 586 -767 453 390 -508 632 -262 -48 543 -471 166 81 -625 626 -458 -485 373 -618 127
2872 127 289 -465 617 -38 -406 571 -365 -22 309 -530 487 68 -408 423 -303 -71 370 -672 471
2891 471 297 -407 503 -339 -172 457 -746 317 -28 -673 415 -327 -300 482 -411 90 327 -691 499
2910 499 -50 -99 676 -442 96 522 -530 587 208 -262 730 -213 75 354 -537 254 -6 -519 548
2929 548 -459 -39 289 -407 498 109 -556 584 -213 -69 534 -566 76 312 -382 508 -38 -249 732
2948 732 -429 74 232 -580 440 -221 -581 717 -508 102 122 -434 352 -357 -549 349 -338 -290 274
2967 274 -577 285 -78 -319 581 -263 -214 566 -444 315 266 -617 297 -138 -148 535 -335 248 650 -427
2987 -427 441 -116 124 541 -566 -191 512 -480 478 -72 -697 466 -549 -300 111 -573 110 18 -501
3006 -501 381 -280 138 364 -391 378 164 -480 313 -246 -8 761 -348 128 283 -296 457 -152 -142 108
3026 108 -457 2 103 -740 66 -346 -108 331 -130 86 416 -306 226 -147 -341 484 -366 -128 147 -467
3046 -467 402 255 -456 452 -484 -129 401 -206 1 47 -440 449 -242 -347 355 -263 101 135 -538 648
3066 648 -308 -447 754 -659 57 219 -371 543 157 17 441 -71 180 427 -579 362 3 -455 292
3085 292 -130 208 427 -614 71 -205 -135 160 -454 -59 540 -481 -171 219 -268 456 -435 -69 613 -332
3105 -332 178 171 -402 662 -112 101 244 -379 -31 218 -492 329 -113 -641 137 -307 117 327 -248 8
3125 8 153 -310 193 -325 -384 273 -457 38 20 -547 397 -153 -256 526 -356 329 249 -376 497 -199 -91 400
3147 400 -225 58 446 -446 189 -9 -93 458 -361 25 347 -261 365 -393 -338 561 -484 174 417 -569
3167 -569 223 -161 -302 449 7 7 160 -463 -243 85 -313 463 -298 -35 464 -351 229 234 -436 433 62
3188 62 -232 351 -158 -28 169 -501 404 5 -367 81 -464 217 464 -522 338 29 -236 623 -36 64
3208 64 157 -337 237 -47 -272 728 -298 -44 118 -407 19 317 -372 159 -94 -547 221 -328 128 221
3228 221 -370 101 50 -424 416 -170 -132 304 -528 424 52 -136 476 -201 -95 512 -300 450 177 -422 322
3249 322 -277 0 269 -428 196 194 -380 273 -114 -251 34 -474 296 276 -501 4 -48 -302 376 -235 -21
3270 -21 401 -154 299 88 -215 431 -68 21 257 -166 139 -102 7 275 -336 -195 434 -433 269 45 -443
3291 -443 299 -193 -155 444 -429 200 96 -171 422 -290 -195 514 -176 338 206 -151 349 105 -415 358 -123
3312 -123 86 49 -287 293 97 -317 186 66 -156 244 -145 218 48 -499 243 -54 -235 316 -275 337
3332 337 133 -612 204 -102 -343 264 -248 18 120 -176 337 -44 -112 295 -176 -87 103 -443 232 -89 -171
3353 -171 308 -260 -73 210 -95 144 16 -261 509 -80 253 101 -154 227 -246 -334 484 228 77 301
3373 301 -374 112 21 -539 328 -121 -309 366 -224 -112 8 -232 31 -179 -187 99 -116 -61 26 -590 370 43
3395 43 -177 471 -276 196 482 -303 177 263 -435 559 140 -219 258 -317 -179 259 -82 211 41 -62 457
3416 457 -457 -148 71 -433 88 -89 -394 313 -24 -71 178 -244 362 -227 -115 273 -443 -131 282 -223
3436 -223 103 150 -57 244 -269 -112 142 -215 33 409 -16 256 84 -234 97 -157 222 234 -340 89 -184
3457 -184 -134 292 -65 73 193 -159 31 135 -337 197 -182 -90 203 101 38 -111 -21 167 -145 -188 130 -406
3479 -406 30 23 -512 88 -94 -91 116 -381 -114 48 -183 141 -118 -229 65 -272 -104 -11 -382 299 -210 9
3501 9 158 -60 -161 255 -162 170 -49 -335 356 -175 -30 188 -89 89 -7 -113 345 -201 -221 39 -208
3522 -208 337 -252 -238 242 -70 195 309 6 262 281 -151 363 -71 27 58 -232 23 61 -232 321 -64 -108
3544 -108 305 -173 8 197 -91 -55 -158 -391 104 -324 -204 213 -238 186 104 -141 -57 -97 -284 192 -213
3565 -213 258 -57 -388 218 -210 1 484 -15 171 285 -200 19 56 -247 19 -142 -73 186 -182 -159 -73
3586 -73 -23 197 -91 299 -50 -162 130 299 -223 200 -67 33 95 -189 138 165 -291 237 8 -279 -2
3607 -2 -243 -33 196 -412 -106 106 -281 91 -213 31 -76 60 350 217 -19 123 -123 68 -44 -257 79
3628 79 118 21 256 4 -143 130 98 268 -103 -196 325 -20 -120 176 -262 86 -217 -237 242 158 -134 51
3650 51 -135 342 -24 -270 -79 -220 -95 322 -192 207 396 168 -32 429 -115 175 28 -157 96 -202
3670 -202 39 95 -319 168 -39 -167 152 -18 28 305 -347 353 269 -188 326 -236 306 185 -28 199 -51
3691 -51 -187 212 -3 192 -13 219 44 133 -161 240 6 -29 -79 -181 290 -138 -23 194 -240 -36 85
3712 85 56 -64 -250 -195 -213 -89 -52 164 -122 -148 14 -213 23 -96 -120 115 -153 484 3 -143 296 -171
3734 -171 33 6 -366 226 316 -191 170 57 -66 63 -327 -64 -44 -311 -268 -51 -200 198 -100 124 178 -309
3756 -309 228 -1 100 -7 -160 -98 99 -62 259 237 46 83 15 -344 149 -285 -32 -2 -144 -7 -176 24
3778 24 -18 52 -246 373 -320 351 -7 -217 -7 7 -121 -90 -175 300 27 -211 95 -48 -69 76 -348 -143
3800 -143 225 -120 33 -159 -204 -75 -53 -80 323 -123 39 191 -117 -42 -50 10 314 -159 151 55 -66 354 -189
3823 -189 -72 207 -233 37 167 -97 164 6 -46 -37 -113 -157 17 -183 165 -93 -307 144 -238 -116 48 -239
3845 -239 67 47 -269 223 -39 279 303 67 80 61 -73 105 68 -142 -61 -99 160 25 -85 173 -223 -98
3867 -98 20 44 -130 172 -52 179 -148 -23 -20 -277 -79 201 -173 123 38 -109 -41 164 -89 135 113 59 201
3890 201 -367 397 -17 -265 50 67 187 2 -148 348 -108 -59 167 -344 -61 127 -208 194 -41 -21 45
3911 45 -437 -85 -89 -71 56 184 30 -42 -127 114 13 -145 -51 -3 -165 97 -16 -28 5 10 125 -13 -68 -40 -67
3936 -67 21 63 -149 -289 88 -253 109 179 -144 49 -96 -183 81 -58 93 -94 174 77 -138 -106 24 -94
3958 -94 182 -67 -200 64 -110 -204 134 -5 123 4 -123 112 166 34 200 -98 -127 -37 -120 -86 205 -41
3980 -41 -35 -272 -46 57 -206 150 102 44 -39 -197 -124 32 52 98 -41 -143 -307 8 -81 379 -50 170 -68
4003 -68 -173 212 -62 -125 302 -37 28 215 -131 56 22 161 -199 -90 -212 -308 56 253 -110 -175 -8 73
4025 73 -320 164 -24 100 89 14 288 -171 -106 119 -134 -104 86 60 -282 -56 -101 92 -12 -115 108 -96
4047 -96 211 -13 -66 85 67 33 168 -78 69 37 -362 -35 -168 -125 124 -306 -108 45 -270 -13 47 -247
4069 -247 45 218 67 19 -353 150 324 120 160 46 -8 -8 -32 31 281 -85 53 -85 -8 -31 -361 -175 -9
4092 -9 -257 179 -4 -75 -88 184 -13 185 -264 130 86 202 176 -360 -90 -72 -87 -196 136 -244 119 -37 61
4115 61 -41 110 116 -175 16 -169 58 -280 329 233 -117 -11 13 55 95 100 87 -190 25 -86 -262 122 59 -108
4139 -108 29 -39 203 290 286 -153 143 -95 110 13 -24 -148 46 333 50 71 171 -117 54 194 79 -309
4161 -309 -102 108 130 -37 108 344 -118 -279 -70 72 332 -2 -203 112 -42 -39 -237 316 -106 77 -88
4182 -88 -131 -105 -160 138 -97 -27 135 -107 -68 -148 167 -287 85 81 228 -166 -175 -234 -200 144 -235 -191 284 -18 293
4207 293 -330 -150 -169 -99 -100 161 -151 99 62 -335 -92 -115 228 90 164 -13 -102 -234 -10 -107 212 -162 -154 -25
4231 -25 60 -299 92 55 -85 79 -122 -31 319 -81 -40 138 -95 64 -5 -31 420 -7 50 255 -129 -39 -127
4254 -127 121 150 -167 -123 35 -245 184 -219 -143 59 -17 -13 -83 -316 -115 126 24 -57 -153 -211 171 275 221 333
4278 333 9 51 147 -105 104 68 -68 -81 -37 209 -234 28 138 -40 42 140 -274 78 -89 -40 256 -417 -57
4301 -57 -130 -92 130 77 -2 8 -96 -184 130 -121 -3 112 -217 50 -100 88 156 -136 121 -94 -3 16 95 -96
4325 -96 181 -98 90 169 -90 135 -172 50 -65 41 70 7 -82 111 -197 52 166 -59 -297 104 12 130
4347 130 -44 79 121 55 24 -125 -79 42 22 -333 198 74 -91 -24 59 -86 417 -16 137 -243 -134 73
4369 73 -12 72 136 -119 180 -104 -133 247 -260 -115 -76 -56 12 -75 -70 470 57 -169 -28 -133 79 25 -30 -70 -65
4394 -65 77 329 -133 201 99 -163 40 -205 -190 45 -338 -173 -68 -299 -69 -158 -132 124 -304 -83 -43 -203
4416 -203 146 -113 -67 -102 -116 -175 199 14 56 -85 -54 350 -129 159 -9 -316 -11 -12 -77 92 -159 -30 99
4439 99 -237 -116 135 -141 181 -20 104 -137 -56 -35 24 22 -50 19 41 289 -141 -189 144 -51 -102 30 7 -41
4463 -41 -193 -110 157 -6 234 71 -174 140 -109 -200 227 -32 1 158 -15 -5 -128 45 137 139 97 190 -239
4486 -239 108 -19 -242 207 -148 60 192 -118 68 331 63 91 -12 206 105 -158 37 -200 -4 246
4506 246 -202 -15 8 -209 242 55 -121 109 233 -294 290 -127 70 73 -50 224 78 -179 166 -216 -124
4527 -124 130 -129 -30 -6 -101 250 70 8 25 37 89 -29 -263 98 -57 -92 197 -313 -139 49 -39 46 -41 39
4551 39 -16 -105 34 -64 -127 181 -144 -86 206 -343 -217 -82 54 417 96 -121 118 -46 -209 160 91 -21
4573 -21 13 -45 -113 -284 -100 111 60 84 118 -26 141 112 9 179 91 120 32 -129 -11 -70 -159 263 68 -170
4597 -170 123 25 75 -238 -173 -42 -43 220 170 -134 238 91 -86 165 -55 -67 253 -133 73 276 -261 117
4619 117 -63 202 87 -69 -1 18 -158 155 98 -100 283 -21 14 306 -14 -112 132 -429 302 -20 -144 -345
4641 -345 -157 201 -179 -156 75 83 126 277 39 326 261 -249 121 -170 -97 39 -106 114 -76 -124 148 -279
4663 -279 91 147 -187 -5 61 -52 -68 -32 -121 206 -72 14 112 24 -44 -237 -31 163 140 -422 140 81 380 -131
4687 -131 -304 -191 -264 -74 -132 -328 -13 50 -134 154 -170 -252 108 -59 163 -221 -313 -112 -133 -268 214 -131
4709 -131 -49 46 -160 -15 195 -165 38 -213 -102 102 -295 147 53 -75 183 110 19 385 -98 -227 -194 -196 472
4732 472 29 -138 43 -72 306 188 -206 55 -70 81 171 -15 -134 80 -277 290 -31 -321 255 -379
4752 -379 122 5 -70 -80 -247 -104 -26 -101 -58 -7 -266 8 5 -281 -56 -106 -179 4 -122 47 -4 -156 232 94
4776 94 -163 58 -90 -30 -4 -199 101 -78 284 46 -280 -33 201 -65 168 -42 -17 338 -28 167 -31
4797 -31 3 150 183 -61 284 -31 127 184 -145 200 114 -76 276 5 -197 191 -156 -42 165 -302 320 -160
4819 -160 -85 259 17 27 97 -387 274 -245 -334 150 -25 46 173 55 196 -14 -143 151 -161 -164 197 -177
4841 -177 50 -188 -93 277 -260 235 213 -136 265 101 -57 260 -3 -39 109 -209 -463 21 -122 -190 125
4862 125 -321 54 -48 -163 -19 -211 335 -39 -88 -18 109 -48 484 -376 -8 392 -49 191 30 -157 25
4883 25 -105 168 -164 -141 39 78 -96 45 -156 -129 74 -60 122 73 -70 -80 37 82 42 -27 14 259 43
4906 43 105 40 155 193 -132 152 133 -126 186 -219 -41 256 -158 27 278 -206 -36 104 -75 78 -311 -191
4928 -191 39 -89 25 -95 44 295 -219 34 -40 -4 25 -99 -203 223 154 -47 -67 -144 68 -103 -43 -4 134
4951 134 -78 -32 -66 330 15 -200 249 -262 -30 -42 -305 123 13 -217 85 -101 -41 95 23 79 85 -225 94
4974 94 -152 -167 134 -48 8 112 -126 112 161 -122 207 -159 -33 242 -333 -194 -18 -68 -128 -286 -210 71
4996 71 -51 -109 219 -137 304 -136 108 290 66 66 230 -72 273 -46 128 198 -156 30 -33 -244 191 132
5018 132 -292 284 -185 90 -124 -249 168 -35 -140 243 -388 -145 156 -178 163 1 -261 -2 -186 50
5038 50 283 -160 -47 -87 -3 166 28 -16 72 -40 -36 111 -179 -5 -340 -57 244 -298 -62 141 -216 44
5060 44 -111 -76 62 48 462 69 -29 109 207 3 112 163 34 176 -73 229 -93 -184 243 -58 -47 200 3
5083 3 74 -78 -211 83 -126 -219 87 -77 50 -110 -47 349 13 -246 280 -125 -24 -56 -265 120 -85 -113
5105 -113 81 116 55 -58 -164 177 175 -239 159 130 -58 61 -238 148 42 -352 152 73 95 161 -141 93 189
5128 189 10 363 247 12 59 -268 -162 130 -97 183 -161 77 361 1 -221 82 -202 -29 190 -339
5148 -339 9 -63 36 134 -429 -3 303 -223 16 -81 151 4 20 -129 21 123 211 81 -277 -22 -40 -112 230
5171 230 -4 240 -115 -32 -99 -244 -55 -11 -239 -65 44 -174 134 -223 -17 59 14 -5 -166 -154 179 -191
5193 -191 1 124 -435 51 -129 -294 198 89 -81 107 -10 149 81 -130 166 -4 -68 163 -432 17 -118
5214 -118 -444 3 16 82 -51 132 -134 21 -217 91 181 -386 -46 8 29 87 -135 2 36 -46 249 27 -174
5237 -174 -123 -157 378 35 -84 245 -411 -26 62 -225 -87 1 -297 204 5 132 330 -316 -74 138 -258
5258 -258 236 -7 -391 261 13 -48 110 -37 -30 19 -385 442 4 -136 196 -151 275 160 58 156 -296 -117
5280 -117 88 -211 -72 -48 -354 125 -123 -155 316 -265 -121 115 38 173 -85 -132 179 -43 -171 165 24
5301 24 -79 -84 -43 35 76 -140 277 -299 248 209 42 -165 -72 -58 295 -286 -20 -88 -205 -15 -103 -101 177 -197
5325 -197 -66 76 -408 171 -126 -197 203 -239 -100 -65 -263 205 -32 -9 94 -314 -137 -24 -231 74 -229
5346 -229 -2 16 109 -243 355 -199 231 -93 -3 202 -151 -106 47 -189 -187 223 -268 194 -275 6 106 11
5368 11 -125 202 -165 -65 -26 -101 -69 -244 -163 124 -76 -51 152 -47 42 -10 -89 87 -287 108 41 -287 157
5391 157 -42 -224 158 -121 160 84 -131 97 -27 -171 -51 -251 75 62 -92 532 2 -113 10 182 29
5412 29 172 -124 118 178 -137 196 -73 -218 266 -310 53 43 -158 296 -99 -147 216 -83 62 -14 11 153
5434 153 23 40 294 -365 16 245 -14 55 -87 -208 252 75 81 39 -155 310 -133 -60 223 42 -232 284
5456 284 -136 226 47 -427 156 -166 -130 156 -187 87 60 40 112 -4 -52 -7 -282 -67 -68 40 -22 -47 -204
5479 -204 70 124 53 -145 -241 152 -109 -133 393 -48 -166 406 -95 59 -188 -144 273 -68 166 161 -208 -44
5501 -44 239 -57 78 -43 -105 -63 -136 133 126 -127 366 -13 -271 57 -380 142 20 -225 -53 -10 -156 315
5523 315 -76 115 349 -240 77 162 -240 151 -10 -143 396 -158 52 97 -67 336 -125 1 285 -82 -88
5544 -88 -29 -71 386 132 -38 272 60 197 89 -171 236 -112 -270 149 -172 30 300 -140 -60 256 -222
5565 -222 34 -236 77 285 -234 94 -289 -198 247 -287 -142 -83 -191 300 146 -162 144 -166 -57 274 -32
5586 -32 -107 -75 -413 160 -83 -47 129 -61 155 15 -102 324 101 -20 145 -262 45 11 -194 174 207 -437
5608 -437 187 -348 -18 332 -328 56 261 -45 327 6 188 121 15 -17 -3 -52 168 -89 -104 173 -232 145
5630 145 -98 -178 -25 -306 -172 203 -197 31 47 62 147 -263 -189 86 -136 71 369 -178 171 319 -54 38
5652 38 -237 -87 28 -166 13 315 -51 362 34 -23 200 -179 -14 92 -166 -23 -24 112 163 -232 16 155
5674 155 -423 277 84 -110 477 -298 -50 -86 36 311 -177 -35 267 43 47 45 -119 75 36 36 166 144 -38
5697 -38 -126 -208 -66 135 -46 183 -100 37 100 -41 -41 398 -117 -69 49 -107 339 4 0 145 -59 213 -111
5720 -111 -200 244 -221 -68 390 -357 54 67 10 230 -367 70 92 -193 50 -69 22 133 -85 -5 80 -157
5742 -157 106 0 -293 220 42 -57 35 -266 6 -7 -119 213 34 -113 153 -54 7 272 -327 318 362 -101
5764 -101 88 -87 -150 44 41 -30 -10 -245 15 -57 -235 7 -133 61 166 -203 114 68 -118 239 -319 36
5786 36 134 -228 196 -117 28 196 84 -116 245 -280 202 141 -297 142 -281 23 73 -215 144 -183 -266 204
5808 204 -241 105 82 -407 207 -105 -118 81 28 -9 227 -178 121 87 -103 255 -2 -186 73 -137 -133 59
5830 59 -173 126 -88 85 93 16 -31 122 -156 -95 73 -240 2 123 -61 186 -265 206 19 -166 209 -89
5852 -89 -118 353 230 187 125 -136 162 -16 -152 -59 -320 -64 -131 -384 125 29 -94 201 -325 160 -19 -229
5874 -229 -23 44 -149 -7 8 43 226 -20 251 -40 -182 147 -50 -24 228 -207 278 10 -71 421 -31 -14
5896 -14 41 -46 -155 67 -159 135 -162 -34 87 -357 -5 -45 -61 216 183 -26 -6 13 -11 104 -99 43 49 11
5920 11 118 -21 1 -200 49 333 66 -60 -46 -98 -136 -24 -97 25 -167 -127 327 197 65 221 -79 2 144
5943 144 -335 70 -220 128 177 -191 30 -169 -232 203 -101 -250 187 -32 -250 -81 -486 -27 23 -4 227
5964 227 -134 78 266 93 375 151 -109 111 42 -152 379 -133 -49 55 -291 317 1 -31 -104 -1 114
5985 114 288 -286 257 147 -92 292 111 -77 40 -71 94 80 -108 194 -246 8 83 -130 -202 149 33
6006 33 94 113 88 208 -29 1 204 -172 258 -72 -145 262 -192 169 -231 123 67 -4 -198 183 -196 -74 36
6029 36 -164 84 -160 -120 264 48 -46 220 -44 -18 28 95 303 -139 200 117 -69 -155 81 -126 381 -53 -51
6052 -51 187 -346 -57 -31 -264 148 -12 -153 219 -60 -114 31 -230 -58 -130 -532 129 -121 -19 155 -300
6073 -300 13 308 -8 201 -426 127 45 -17 -42 -127 120 269 -60 -146 -194 -169 -6 62 -42 130 251 205 68
6096 68 -183 114 329 -95 275 -165 -199 245 -93 -55 140 -210 109 152 -15 179 89 -301 315 -92 -38 159
6118 159 -181 379 -211 -83 68 -278 -118 -114 -261 237 83 -33 200 -338 -19 87 38 -44 118 67 75 -196
6140 -196 213 105 -358 60 15 -369 101 -206 51 133 -276 275 -117 -54 99 -377 12 153 60 122 -6 -88
6162 -88 200 65 -156 210 -70 -10 -55 -335 18 -187 -83 294 37 282 -127 -371 127 -74 -309 121 96
6183 96 141 218 141 49 29 -63 18 -177 -6 -12 -130 66 134 -3 133 -149 196 329 -330 94 89 -288 -50 118
6207 118 197 -45 -257 -82 149 -207 -11 -115 109 93 -27 -139 16 -255 121 -52 48 128 -21 141 19
6228 19 -339 292 -101 -179 29 -72 19 194 17 109 177 -176 229 -94 -107 555 -21 86 108 -251 128 -106
6250 -106 113 149 -136 -68 -32 -227 -19 -306 24 143 -43 91 -135 -66 66 37 -106 41 8 10 22 -477 141
6273 141 35 -118 113 -90 -143 214 -271 58 11 -209 294 -185 -183 33 -563 -20 77 -267 387 -90 -23 241
6295 241 26 219 292 -167 -179 -146 -135 231 -108 -342 157 -191 176 31 10 37 -108 204 82 -317 29 0
6317 0 -264 290 98 -6 263 -209 214 117 -300 391 -120 -40 245 -401 53 122 -157 18 -132 -200 -12 -110
6339 -110 47 63 -482 155 -141 -296 76 -274 1 -18 -303 -84 -79 94 71 -233 -155 162 -278 151 102 -503
6361 -503 405 -218 -285 181 -297 254 254 -142 132 239 -34 7 -107 11 118 -255 -59 -183 13 149 -122
6382 -122 32 -277 -425 186 128 -140 158 -230 82 -27 -357 -20 103 -288 154 -14 -101 308 -122 148 69
6403 69 16 111 -20 -10 -7 -161 28 -77 -106 238 45 -363 78 -317 32 160 -134 151 238 173 295 -17 -6
6426 -6 351 -24 202 48 -107 121 -25 -94 24 25 38 -67 -290 -19 -58 -137 206 -155 -208 207 117 206 167 -61
6450 -61 260 -291 42 171 -291 131 -49 -247 144 -271 -83 293 -45 283 64 -112 190 -183 -84 77 -260
6471 -260 8 171 -49 229 -105 -298 227 -38 253 25 24 91 -30 -155 218 -351 -158 133 30 305 -7
6492 -7 -204 61 -54 24 424 -10 86 15 -225 223 -18 -281 -55 -479 123 -54 -109 224 -170 -109 114 -388
6514 -388 -46 235 -194 225 30 -134 -121 -119 138 192 -35 234 106 66 241 16 96 220 -190 65 -11 -123
6536 -123 161 -127 -24 -47 -340 -8 34 -336 305 -470 31 31 -204 262 -90 -183 29 -368 14 4 -334 265
6558 265 78 24 239 -183 -177 194 -130 79 -39 -72 89 48 -143 263 -206 -73 -24 -89 253 55 -178 100
6580 100 111 -105 -54 -366 162 -187 -3 393 -214 -43 193 -440 170 -89 -368 344 -139 -78 76 -122 -94
6601 -94 -28 -143 144 -43 -76 11 -77 -3 264 -416 254 -112 -312 283 -265 169 111 16 153 13 -46 170 -312
6624 -312 -44 250 -270 -92 -96 -154 362 -313 -222 82 -270 -122 70 -246 344 -117 -64 -10 -75 196 -268 -113
6646 -113 192 -177 -181 164 -344 76 61 -142 -89 50 -286 402 -245 -3 190 -109 58 286 -182 31 105 -79
6668 -79 122 -28 150 -22 -213 45 75 -156 67 -276 145 293 -287 249 4 -54 79 -269 7 44 97 67
6690 67 242 -64 363 47 -266 451 66 78 -10 -237 -63 -8 18 -32 -211 290 207 -112 29 -250 122 107 -185
6713 -185 172 214 -299 179 93 -196 198 -181 -51 -19 -30 -74 144 -219 265 -136 -20 135 -225 8 -99 -80
6735 -80 50 55 46 292 -514 53 27 -50 -10 -182 45 30 -263 38 124 -114 156 -3 -13 216 -136 114 140 -288
6759 -288 73 3 62 103 -29 -30 132 -151 129 135 117 206 -383 45 -118 -257 197 -49 -240 350 -145 -3 22
6782 22 -303 14 74 46 412 -127 -24 207 -241 166 82 -367 130 40 -121 284 -281 207 -25 -218 303 -214
6804 -214 -164 412 -188 -175 300 -364 551 60 152 389 131 49 164 -47 54 -120 -274 262 99 -75 281
6825 281 -119 86 -35 59 165 22 -116 92 227 -2 -25 -243 256 -215 -344 179 -230 -89 90 -140 344
6846 344 -183 103 191 -211 -5 -15 -379 -108 -17 -2 -60 -65 -87 260 -195 -148 60 -204 306 -62 -270 151 119
6869 119 11 300 -232 -20 25 -97 130 -135 -70 256 -141 354 -221 44 130 -174 196 268 -240 166 -76
6890 -76 89 -33 -184 -4 -9 -267 -143 -92 -52 130 -35 -43 -179 -172 -119 63 -169 201 -49 45 -66 -306 -49 204
6914 204 -181 158 22 -41 225 -245 173 -114 -186 108 -56 71 298 -117 -26 229 -131 314 -375 -103 118
6935 118 -318 -11 -178 -89 -17 114 -130 136 -26 228 180 -129 -293 93 -179 602 -239 53 -67 -57 -74 306
6957 306 -80 158 176 -112 155 -7 89 219 -144 232 -101 -55 277 -328 43 -74 -212 -41 -163 -135 104
6978 104 -134 -14 148 -164 227 -69 -113 82 98 -4 168 -88 -28 279 -226 171 -250 187 321 1 29
6999 29 67 -208 75 32 -60 160 -211 -65 278 -197 -1 -97 -232 259 -221 -64 228 36 200 60 -367 358
7021 358 -242 -123 90 -22 178 215 14 72 -155 -50 41 -139 50 75 -209 -95 -215 153 -19 -131 440
7042 440 222 -190 174 103 -99 239 13 141 88 -260 291 83 -302 15 -96 92 161 50 244 -195 -163
7063 -163 -17 -292 -67 133 -177 157 124 -149 -41 -67 -40 393 58 236 305 -215 83 -232 -114 -11 -174
7084 -174 -196 74 -275 94 -86 29 135 -131 99 172 201 58 200 -211 65 -76 -34 157 -143 -98 184 -178
7106 -178 354 -21 111 295 -150 -135 -148 -353 87 -106 -28 -76 -48 97 130 100 240 16 -245 153 -160 103
7128 103 -101 -153 -45 -100 -249 -105 -345 -301 290 -67 -96 229 -207 263 -261 98 300 -94 12 162 -183
7149 -183 62 83 -186 307 -14 -148 -12 -98 402 101 -297 -26 -122 -148 6 -161 -85 76 -248 318 -69 0
7171 0 157 -67 211 292 -187 93 -129 -18 208 -165 -17 -79 -185 27 135 0 179 -74 -121 70 -308 -10
7193 -10 94 -258 49 -287 36 206 -688 237 -29 -231 63 -69 15 317 -180 -39 -157 -368 316 -289 -133
7214 -133 61 -400 -45 -51 112 326 -56 160 253 -150 -98 424 30 255 126 118 152 -101 152 63 -140 198 98
7237 98 0 280 -221 -105 306 -416 102 -27 153 -129 79 -21 131 -155 151 -195 -81 208 88 -183 198
7258 198 10 -112 125 -126 39 212 37 69 -46 -143 289 -206 -51 213 78 46 -258 -147 196 -220 166
7279 166 41 -450 270 -23 -195 221 -127 -20 198 26 94 -7 194 -75 -313 67 -172 -45 153 -90
7299 -90 6 366 118 182 165 -26 321 62 -127 214 34 140 125 -47 161 -70 -87 215 -97 98 183 -185
7321 -185 138 -78 -347 337 -26 -39 88 -10 180 -134 -164 130 -142 -96 185 -16 151 -109 -375 310 -143
7342 -143 -132 133 -276 35 314 21 191 -138 -113 139 -176 168 76 16 69 147 -156 -25 -168 -43 -145 -257
7364 -257 21 26 0 33 39 -149 -8 -119 120 -36 -14 65 -199 54 91 -81 -50 319 -149 122 185 -251 85 -132
7388 -132 -113 -75 -294 204 -59 -32 123 -430 18 184 -208 31 -151 173 31 -233 -138 203 8 -268 261
7409 261 -172 342 54 113 1 -271 171 73 -439 -288 40 -336 66 -14 -131 48 18 215 75 67 158 58
7431 58 305 104 -350 -20 -46 -45 82 -74 -96 -22 -174 12 3 -192 352 -99 -128 207 -110 286 1 -466 266
7454 266 -53 154 111 -339 -10 514 -118 156 89 -218 427 -163 160 345 -91 86 23 -152 319 -233 -190
7475 -190 -79 121 103 181 139 319 44 -12 196 -63 -4 137 205 19 99 -197 55 -155 -47 206 32 84 -23
7498 -23 -112 214 16 183 341 234 136 105 -147 -2 8 -20 6 21 204 -31 105 176 48 -113 86 -332 22
7521 22 -26 35 317 -45 -63 207 -98 178 116 -291 21 81 -76 163 25 -54 134 -274 38 -1 -348 109 -105
7544 -105 -83 338 30 355 -109 -145 155 -81 -162 122 99 16 -62 -6 384 280 -191 153 -72 -2 122 -82 143
7567 143 -200 -292 131 -206 128 14 -319 148 224 -409 173 -162 56 -208 -92 121 171 -174 232 -20 -130
7588 -130 81 -235 448 41 -36 275 -106 17 62 -376 -95 -44 111 67 -160 -106 232 -150 264 34 -364 394
7610 394 -152 67 96 -110 -104 110 98 -63 18 -237 384 5 64 -203 -291 -66 -115 -64 379 65 -141 -144 -33 26
7634 26 68 -41 200 -325 -20 24 -303 298 -84 -200 140 -151 29 121 -345 137 -147 -170 364 -134 -61 101
7656 101 18 -65 50 5 86 55 27 283 -167 172 -21 8 18 136 212 220 -232 40 232 -269 220 95 47 118
7680 118 -112 -244 -120 -106 -126 -68 163 271 -165 7 74 -344 -44 -65 -54 179 -238 -21 75 -54 -143 67 -146
7703 -146 150 30 -385 138 187 -107 -115 -62 -83 -53 -189 164 72 15 53 -314 -72 -13 -136 264 -105 18 -83
7726 -83 -447 100 424 -277 131 -32 26 187 -318 -74 138 -96 -22 -10 -98 110 -240 -94 118 -294 128 -120
7748 -120 -89 245 -130 95 89 -70 -22 -25 -223 209 -160 67 177 138 75 186 -30 -79 -128 134 297 -140 -175 222
7772 222 -185 7 -75 -240 -4 -13 107 -7 -91 279 84 168 350 28 -22 21 -157 100 -156 80 276 -99
7794 -99 -54 -143 -297 106 -283 -19 178 -169 -54 490 -87 18 -52 25 229 52 -6 178 -138 58 300 -209
7816 -209 -83 11 -89 58 10 -94 -47 77 39 -44 -61 94 -105 -143 157 -135 147 -31 -223 135 52 -38 165
7839 165 -198 -18 -88 -230 -32 -189 -235 -115 -60 -83 115 27 198 -74 -166 -52 -37 -11 212 -140 -14 -74 -9
7862 -9 -16 -279 -177 -250 -54 91 -46 -310 278 130 10 224 -89 -97 -176 -186 213 -64 -68 195 -87 -233 7 8
7886 8 80 -1 -183 -57 7 -32 131 -173 72 -190 -107 62 -115 -131 159 -14 -79 21 -129 169 -136 96 241
7909 241 -226 -65 197 -300 -15 93 64 240 108 124 181 -184 236 -63 23 214 -59 51 153 -257 176
7930 176 -66 -42 -112 -164 69 -122 -148 134 -63 -23 155 -215 -86 210 -237 33 -88 -228 107 227 95 -103
7952 -103 79 -26 -33 -149 119 -95 -62 51 -192 -151 144 -125 257 95 -44 224 -170 45 -20 -177 -1 117
7974 117 -57 2 -193 120 17 -7 32 48 -180 184 -282 52 43 44 -134 -83 27 -77 -218 -206 310 -133 30
7997 30 76 20 77 -92 -30 47 -86 -278 322 -124 72 -213 -107 156 54 -76 97 -13 161 -15 -81 301
8019 301 -168 48 193 -153 254 -61 -175 226 56 -96 12 -206 58 -113 -173 96 -39 -21 166 -86 246
8040 246 -38 -254 99 -94 -83 2 -40 -79 117 -128 210 -215 -181 33 -21 87 43 -201 375 241 -129 60
8062 60 -2 90 -80 -103 245 -53 -210 133 -77 -44 -44 -30 109 77 -36 -10 111 65 261 -165 40 -2 -244 -20
8086 -20 -39 99 22 -29 4 226 -142 92 -59 -179 279 -256 259 162 -231 17 73 -2 44 122 97 151 -99 194
8110 194 29 98 240 85 141 89 -383 -60 -74 1 -34 132 180 210 -114 140 182 -57 300 -106 -81 196 68
8133 68 181 340 -219 85 -69 -283 -6 1 -39 316 -193 186 212 -187 -21 -193 -53 362 -111 244 -117 -253
8155 -253 171 -158 78 147 -31 95 327 -313 147 -65 58 222 -186 87 -200 -173 -15 -2 -204 113 -2
8176 -2 128 211 35 28 182 17 39 -404 94 192 -30 -6 7 -117 -170
8191a70
$$ Imaginary data points
##PAGE= N=2
##DATA TABLE= (X++(I..I)), XYDATA
0 0 0 0 0 0 0 0 0 0 0 0 0 -8 8 -8 8 -8 16 -16 16 -24 24 -32 40 -42 48 -58 69 -80 90 -104 117 -133 152 -171
34 -171 192 -216 242 -271 303 -336 373 -416 461 -511 560 -620 685 -755 830 -914 1007 -1110
52 -1110 1225 -1352 1497 -1658 1846 -2065 2319 -2622 2989 -3451 4042 -4831 5938 -7602 10359
67 10359 -15709 29669 -136716 -242894 232346 48456 -106989 182439 117755 -121853 82055
78 82055 217295 -50472 -100591 126723 -49852 -140596 127278 -15120 -199507 52355 62142
89 62142 -99747 -20144 60219 -23066 -81972 47278 62483 -114981 2078 114949 -63978
100 -63978 -18006 110512 4518 -6382 90059 44167 -65951 16852 94094 -101330 -84834
111 -84834 82987 -122315 -127590 118720 -50499 -140891 88345 57679 -56952 67072 115320
122 115320 -35031 -5643 140667 -12418 -76524 104006 -32294 -126666 74751 625 -116614
133 -116614 16477 23132 -62035 -25711 51774 10999 -69489 20328 49163 -47261 21466 50080
145 50080 -33804 4009 45970 33567 7916 1321 41991 -14792 -19971 69221 -46764 -89096
157 -89096 45717 -22697 -82193 14760 -2926 -60761 -3842 61311 -2093 -38371 69718 35039
169 35039 -33159 72067 17862 -58892 54565 19882 -54188 9812 1766 -32680 -9533 15552
181 15552 -6795 -48647 13093 32332 -35970 6738 15558 -25756 22274 13095 -5096 13766
193 13766 -10986 18252 17634 -17181 22005 -8663 -25481 31942 -13927 -35441 10045 -2890
205 -2890 -17695 -14398 11860 5274 -31450 31112 27337 -41383 31284 32587 -27301 29025 13511
218 13511 -26437 15974 12704 -9949 -15523 -2483 3993 -32175 3489 19280 -47400 -5979 22988
231 22988 -21094 7518 6849 -7304 14126 -1774 18595 19921 -14949 16654 4517 -12115 23969
244 23969 -7391 -18574 4062 -9579 -2007 -6171 517 7258 -33119 8992 32460 -29937 7288
257 7288 20657 -28776 9259 18403 -7121 -583 -5580 3738 -2006 2481 20673 -24801 -9687
270 -9687 28203 -23127 -1340 24717 -26193 -9687 10668 3452 7605 -9328 8412 7668 -12928
283 -12928 27602 10156 -18873 12997 -6915 -8140 14470 -11597 -11332 -12201 -8205 11347 -17842
296 -17842 745 16587 -31091 8339 31499 -13646 5537 10883 -3950 6145 4191 14868
308 14868 -5047 -15835 18536 -10590 -7661 26781 -24456 -15770 20725 -13976 -3761 8888
320 8888 -7928 -7295 -9528 16798 8690 -22309 14783 3064 -17576 25244 3220 -12850 9736
333 9736 -6912 2271 7020 -3483 4237 -16877 50 18614 -20202 4013 14723 -23455 4536
346 4536 15071 -2351 2717 -4606 8481 1772 -8187 21132 -8101 -18752 17986 -13897 -10421
359 -10421 16766 -18385 -12295 6243 -1567 1781 -5098 10543 5186 -14851 25211 12465 -18861
372 -18861 17482 2334 -11817 13564 -3950 -4538 -750 -7967 6625 -7887 -1072 11538 -20680
385 -20680 2631 14909 -19285 2803 6053 -12261 533 -1509 7376 280 -11328 18980 1376
398 1376 -8689 23947 -5492 -8697 17521 -8938 -5701 4436 -8361 -4168 -7083 5009 1282
411 1282 -17609 17296 9135 -16548 19216 5203 -12114 14024 -656 -4791 -1625 -9628 4140
424 4140 -7738 -5693 7365 -16763 3159 15547 -13322 5822 8267 -7521 6372 1251 4377
437 4377 -529 -11485 16116 184 -12984 19866 -3153 -8674 16957 -5170 -3863 6349 -5883
450 -5883 -4154 -9604 -338 -1800 -18433 9722 -438 -21544 18294 8051 -10479 15317 2710
463 2710 -490 10412 2392 6892 -5691 -5247 8559 -10560 1659 6188 -18753 2242 5962 -7881
477 -7881 6051 -3490 -2122 866 -8646 14488 249 -17221 12771 -2116 -7995 17479 -2008
490 -2008 -6949 2736 330 6510 -2268 995 -1802 -17967 12738 7422 -20424 9791 -523 -15713
504 -15713 17213 6419 -6928 2610 -304 8288 2495 724 6608 -11870 1735 9071 -13170
517 -13170 3450 -600 -14960 5184 -4292 -5375 3549 -9696 5404 1472 -10491 15643 4668
530 4668 -6366 11429 187 1300 8852 3054 3170 -9501 -403 8403 -11586 5124 314 -24661
544 -24661 10558 8317 -15171 6444 -2132 -10667 6497 4973 2386 -7969 -3267 10184 -5056
557 -5056 6335 9516 -14506 6941 9434 -7255 10566 -2105 -8981 5456 -5514 1960 380
570 380 -12764 4224 -1614 -5628 9838 -633 22 3021 129 10366 -3113 -1221 7981 -14767
584 -14767 602 8032 -17107 2458 2783 -15265 7137 5575 -5048 2976 2505 4829 -1823 2264
598 2264 10412 -10556 507 10490 -12960 4890 7375 -12033 7645 2207 -6714 7630 -2283
611 -2283 -1651 -472 -8268 3588 -4257 -7037 3635 -8383 -159 5412 -2694 8868 -1190 -1353
625 -1353 15415 -4058 1143 10132 -11902 2244 6170 -11153 1448 -732 -5480 2017 202 4171
639 4171 -3615 -725 12795 -7817 -1570 11085 -13182 447 7699 -13413 1529 1651 -7116 5551
653 5551 -668 -303 2260 -1309 8159 -2038 -3175 7767 -7280 297 6355 -8296 4365 96
667 96 -5387 10880 -3152 -1509 9358 -7404 1053 5085 -7056 1568 -3068 -5463 298 -4537
681 -4537 3349 -2991 -5858 10092 -4677 -760 15161 -8307 -1188 10549 -6624 3462 3720 -6157
695 -6157 1221 -2002 2011 2219 -4421 5162 -3872 -3070 11315 -5760 -2271 5822 -8823 2609 3157
710 3157 -6507 4222 -4851 -3840 7981 -4181 1325 2373 -5702 4260 127 90 3553 -6399 2592
725 2592 1488 -4310 9796 -3816 -5810 10854 -4566 -308 9675 -6075 -525 1817 -1897 3193
739 3193 -3843 43 -1253 -8239 6592 -1525 -6631 7163 -7308 -3734 9927 -4091 1078 2222
753 2222 -5323 5956 779 689 5256 -7254 1828 5346 -2897 5164 -3409 -4013 4835 -3716 3508
768 3508 1355 -9540 4836 -1350 -4304 8959 -6193 -4839 5776 -3656 1720 1307 -3079 1757
782 1757 -4584 3699 4539 -7228 5726 8 -6757 10054 -1041 -3749 6809 -5139 422 4611
796 4611 -1995 3415 -3531 -1566 5279 -5255 3154 2249 -8623 3891 -899 -3323 4934 -6343
810 -6343 -795 2886 -5484 5851 -632 -5720 6349 -3099 -400 6922 -4147 1204 1186 -1525 5226
825 5226 -3036 1587 3487 -7877 5639 2766 -7183 5979 -2313 -5209 5999 -3201 -991 805
839 805 -4362 3038 -2346 -256 4459 -7559 2360 4528 -6801 5010 -12 -4961 5459 -2493
853 -2493 622 3837 -4580 4531 998 -3172 6453 -3456 -526 5329 -5010 1915 983 -3985 3697
868 3697 -4306 -1073 3194 -7453 3335 2284 -7832 4925 -762 -4197 5191 -2833 98 1969
882 1969 -2506 4467 -1762 -111 6499 -5331 2886 5440 -6427 5103 1746 -5473 3927 -2694
896 -2694 -1346 2516 -5319 1871 -902 -3976 5952 -3401 -1254 4252 -5325 3299 2402 -4487 4030
911 4030 -3468 -1158 5488 -5762 1817 2342 -6612 5589 1182 -3248 4302 -3137 995 2908 -2872
926 -2872 4202 -2899 -2962 5930 -4960 1453 4631 -7595 2887 2548 -4583 3938 -2366 -2803 1473
941 1473 -4326 2808 -586 -5288 4211 -3446 -355 6353 -4049 2881 2819 -3308 6572 478 -1076
956 -1076 4629 -5272 1633 3483 -5151 2987 -1459 -4873 3342 -2328 461 619 -5897 2990 -1274
971 -1274 -1477 5989 -5838 -1203 5208 -4587 4617 3026 -5411 3374 584 1313 3891 -3750 1381
986 1381 -606 -3173 6309 -3355 -3008 3501 -5441 2229 3232 -5315 3071 -1250 -2160 5547 -2996 491
1002 491 2200 -5455 3161 228 -3064 3041 -3742 -574 1594 -3746 4275 -1274 -4043 6030 -3158
1017 -3158 189 6236 -5050 1591 3080 -2916 4640 -277 -1492 1584 -3218 3670 39 -4621 3784
1032 3784 -4269 -2841 5348 -5565 -727 1589 -5868 3482 539 -2497 3907 -3165 1417 4118 -2465
1047 -2465 4542 361 -2357 5019 -1726 1332 2458 -5426 3377 -747 -4210 5201 -4615 -3137 4351
1062 4351 -4727 1158 2300 -4529 2150 -397 -396 2919 -2787 2714 155 -3702 5906 -2301 -2763 5688
1078 5688 -4401 56 3752 -4701 2229 494 -2852 3319 -2050 500 2620 -3594 3761 -118 -2314
1093 -2314 5071 -2810 -119 3183 -5007 2882 64 -4935 3995 -3406 -3125 4185 -4381 31 1655
1108 1655 -3364 2865 -433 -104 3593 -2487 3977 1473 -3464 6560 -1001 -2508 6100 -3855 -804
1123 -804 4026 -4519 600 -523 -3486 1761 -2961 -336 666 -4730 3379 -62 -2989 4861 -3071
1138 -3071 -373 4941 -3039 3224 2209 -4071 4296 -1039 -1714 4030 -3444 -89 1226 -3282 2998
1153 2998 -1211 -1397 2237 -4246 2353 1900 -4519 4181 -1460 -3781 5978 -2575 -1170 3336 -3758
1168 -3758 1585 1333 -1529 2312 -3440 -166 1983 -4064 3497 -596 -4164 4865 -1517 -498 5194
1183 5194 -3354 1230 3007 -2254 4495 -897 -2267 2510 -3530 985 1089 -4469 1363 -2321 -1872
1198 -1872 3892 -3901 179 1601 -4779 4088 722 -3312 4188 -2378 -864 4400 -1628 1836 754
1213 754 -1380 3812 -1352 1311 2499 -5125 2175 2 -4466 4007 -2925 -3990 3090 -3433 669
1228 669 2143 -3199 2133 -990 -509 4265 -2629 604 1080 -3483 3798 -413 -2436 3463 -3522 842
1244 842 3801 -3410 2437 278 -3087 4244 -780 -1154 1895 -3544 1287 129 -2095 2908 -2996
1259 -2996 -491 3397 -3806 2506 1291 -5056 3622 -560 -2011 3463 -2894 -552 1486 -2238 2893
1274 2893 -438 -953 3675 -2416 2086 3022 -3557 2869 -252 -2573 3953 -2775 -1159 2189 -3849
1289 -3849 1755 791 -2707 3030 -1950 -748 2361 -2860 1706 112 -3084 2925 -2496 -903 3396
1304 3396 -3890 1480 2250 -2973 3899 479 -1566 3547 -1668 1048 1835 -2245 2273 -1165 -1546 3124
1320 3124 -3537 -423 1912 -4454 1957 -34 -3266 2869 -2213 -1025 2255 -3150 1441 896 -2132
1335 -2132 3082 -1138 -204 3444 -2086 2662 1541 -2574 3765 -1082 -1152 3204 -4041 448 1561 -3972
1351 -3972 1898 -551 -2183 2205 -2160 597 1603 -2656 2740 -772 -1241 3907 -2541 84 2620
1366 2620 -3484 2042 1239 -2511 2436 -1736 -991 2210 -2575 1780 314 -2773 2928 -1016 -369 3123
1382 3123 -3116 1481 1570 -2412 3178 -825 -1828 3093 -2522 297 1456 -3883 864 -619 -2009
1397 -2009 2222 -2533 -63 1195 -2465 3149 476 -1900 3777 -1875 379 3894 -2324 1544 998
1412 998 -2309 2793 -790 -716 1287 -3756 771 133 -3212 1805 -2513 -2198 2676 -2583 1011 1614
1428 1614 -2972 2917 634 -655 3823 -1928 236 2131 -2342 2465 -34 -1823 1963 -2170 334
1443 334 2069 -3037 1611 -514 -2318 3697 -1307 -878 1972 -3167 1176 1523 -1929 1871 -1023 -498
1459 -498 2597 -1928 1876 97 -3194 2891 -910 -1514 2396 -3371 -210 2057 -2081 2481 225
1474 225 -1257 3105 -777 1038 2536 -2526 1957 -251 -1775 2012 -2635 -1268 734 -3517 1312
1489 1312 132 -2729 2436 -1358 -806 3254 -1791 919 1147 -1848 2286 -90 42 2598 -2099 1716
1505 1716 1700 -1899 3236 -710 -2045 2767 -2434 -510 924 -3602 663 -804 -2207 1745 -1699
1520 -1699 230 1540 -1965 2634 761 -1591 2762 -1454 -441 2329 -3010 930 314 -2742 2455
1535 2455 -839 -713 2430 -1626 1129 1589 -1293 2146 -813 -745 1951 -2512 629 553 -2850 2202
1551 2202 -374 -1906 2489 -1376 -647 1713 -2377 988 -395 -1756 1724 -1771 -146 1658 -1705
1566 -1705 2088 1369 -1074 3448 -448 337 2913 -1971 606 350 -3044 1340 -1276 -2222 1113 -2512
1582 -2512 -71 773 -1894 1739 -763 -774 2076 -1813 789 1600 -2814 2187 151 -1584 2959 -1057
1598 -1057 -410 1883 -1317 1495 244 -1161 1548 -1821 76 1365 -2938 1158 70 -2069 2646
1613 2646 -959 -981 2420 -1978 1013 1088 -2080 1595 -1388 -1661 1641 -2047 176 670 -2629 2104
1629 2104 -176 -554 2755 -1669 641 2304 -1814 2227 343 -2076 2158 -1021 -623 1318 -2342
1644 -2342 380 -265 -1705 1724 -1703 -704 1371 -2818 1382 784 -2215 2236 -828 -881 2565 -1103
1660 -1103 486 1270 -1795 2110 -1 -790 1987 -2116 350 1295 -1869 1509 -558 -1833 2501 -1625
1676 -1625 248 1904 -2853 1162 366 -1743 2137 -1167 -759 1260 -1758 1327 100 -1892 1828
1691 1828 -1368 -171 2275 -2148 966 964 -2011 2422 177 -1022 2321 -1296 566 1707 -1449 1381
1707 1381 -675 -1671 1745 -1858 71 600 -3065 1182 -356 -1775 2195 -1760 -412 1887 -1550
1722 -1550 1570 902 -1494 2169 -308 135 1803 -1494 1100 385 -1614 1973 -1039 -847 1828 -2341
1738 -2341 421 1113 -2415 1225 -706 -1496 1772 -1545 324 833 -1843 1831 -252 -510 2196 -1612
1754 -1612 146 1814 -2093 1316 -164 -1969 1737 -1145 -670 1901 -1629 649 736 -1088 2427 -325
1770 -325 -244 1856 -1460 1012 526 -2331 1514 -1429 -1548 1584 -2191 -194 1103 -2360 1304 183
1786 183 -1018 1936 -784 403 1311 -1451 1835 238 -936 2396 -1281 370 2075 -1391 1410
1801 1410 689 -1799 1612 -1303 -1119 836 -2374 80 -156 -1972 1321 -722 -478 1796 -1020 1435
1817 1435 1528 -1329 2121 -360 -874 2033 -1495 -382 945 -2054 1040 -53 -1035 1604 -1027 688
1833 688 1514 -1517 1522 -5 -1575 1701 -1474 -926 1370 -2400 336 535 -1392 1485 -647 -488
1849 -488 1219 -1700 776 165 -2162 1298 -936 -766 1726 -1431 702 1461 -938 2401 1041 -553
1865 -553 1984 -1021 -133 818 -2331 253 -1200 -2102 814 -1436 -49 917 -1916 1574 768 -783
1881 -783 2258 -826 -600 1603 -1639 725 710 -1411 1524 -375 -140 1941 -1506 784 851 -1705 1926
1898 1926 -519 -1376 1068 -2215 -94 1053 -2039 1233 -56 -810 2349 -651 255 1145 -1449 1090
1914 1090 -44 -1698 1083 -2116 -722 857 -1756 1190 654 -1136 2369 -14 -144 2143 -1052
1929 -1052 535 731 -1428 1282 -1098 -1239 1057 -2011 56 480 -1940 1056 -521 -1163 1804 -1322
1945 -1322 -285 1087 -1645 1151 56 -944 1914 -548 357 1782 -1050 1389 436 -1301 1599
1960 1599 -968 -345 1184 -2255 247 140 -1680 1471 -814 -779 1607 -1260 640 1011 -1224 1470
1976 1470 -321 -652 1440 -1574 285 785 -1757 1231 -58 -1296 1495 -963 -77 1592 -1310 1112
1992 1112 156 -1083 1781 -938 -33 1347 -1421 1131 264 -1518 1533 -1262 -1105 1171 -1776 238
2008 238 157 -1789 1212 -752 -953 1408 -1278 743 1307 -1120 1717 230 -608 2106 -998 650
2024 650 1388 -1716 1141 -146 -1722 1596 -1618 -815 627 -1967 399 -240 -1367 1204 -819 -192
2040 -192 1320 -1286 1065 1060 -1177 1629 -371 -573 1173 -1645 372 892 -1822 1249 -369 -906 1379
2057 1379 -1238 204 804 -1331 1176 -37 -1178 1467 -1273 -120 1148 -1531 804 356 -1134
2072 -1134 1581 -745 -247 839 -1871 599 5 -1488 1053 -1258 -321 1802 -1126 988 1038 -702
2088 -702 1830 166 -280 1669 -1228 200 679 -1591 954 -705 -1405 865 -1583 128 1007 -1777
2104 -1777 1171 38 -913 1822 -725 76 1148 -1201 1247 538 -943 1649 -727 14 1461 -1101
2120 -1101 682 164 -1517 981 -947 -999 832 -1568 103 692 -1117 1390 -179 -675 1510 -1063
2136 -1063 447 939 -1541 1058 -225 -1056 1420 -1230 -89 567 -1459 1071 265 -947 1720 -771
2152 -771 -292 1730 -940 946 359 -1000 1371 -654 -270 1150 -1411 458 419 -1442 1098 -953
2168 -953 -1022 1024 -1382 324 535 -1335 1283 -114 -702 1856 -836 360 1271 -950 1255 -182
2184 -182 -923 1392 -907 -148 1051 -1436 692 -12 -1183 1374 -826 -501 1163 -1622 672 413
2200 413 -1347 1019 -585 -583 1478 -853 638 661 -1339 1337 -94 -666 1338 -1327 250 611 -1216
2217 -1216 1143 147 -732 1472 -647 113 963 -1474 624 -52 -1100 989 -1158 -622 851 -1822
2233 -1822 471 317 -1331 1117 -475 -566 1285 -959 783 536 -1208 1255 -573 -564 1559 -1025 541
2250 541 998 -1228 1369 -363 -842 1095 -1203 -237 601 -1795 518 -316 -1190 1100 -784 -119 958
2267 958 -1366 841 308 -734 1678 -562 -442 1047 -1183 404 402 -955 1418 -563 -379 1377 -985
2284 -985 386 433 -1304 1213 -363 -520 1033 -1101 58 703 -1541 1028 -241 -1021 1173 -943
2300 -943 194 972 -1317 718 -15 -682 1150 -651 -22 1059 -719 878 562 -786 1336 -368
2316 -368 -155 1437 -1109 555 526 -1238 818 -387 -610 801 -1544 191 534 -1211 826 -458
2332 -458 -657 1221 -1036 34 786 -1149 1143 339 -676 1516 -744 268 1055 -1224 609 347
2348 347 -1031 1341 -831 -2 951 -1103 499 148 -1193 1154 -429 -744 893 -1281 267 433
2364 433 -1223 916 -278 -495 1338 -733 414 607 -1117 1074 -205 -729 1160 -731 180 1012
2380 1012 -682 791 175 -768 1106 -665 65 907 -1282 447 -178 -1025 728 -883 -653 914 -1347
2397 -1347 425 516 -1023 958 -214 -425 1137 -964 309 491 -1315 746 71 -312 1239 -782
2413 -782 352 970 -633 728 -113 -838 991 -828 -443 428 -1196 537 -28 -611 1118 -390 -261
2430 -261 1061 -963 571 317 -1243 841 -465 -248 1035 -951 404 556 -1083 1191 -87 -123
2446 -123 1289 -613 402 559 -1087 784 -371 -1092 1022 -1039 87 411 -1100 579 56 -763
2462 -763 884 -552 -417 806 -1137 487 339 -533 1214 -211 -207 932 -504 767 591 -581 1096
2479 1096 -361 -560 867 -1288 -304 265 -1445 487 -441 -493 800 -735 31 623 -950 619 -76
2496 -76 -579 945 -786 96 616 -900 688 244 -957 905 -248 -75 778 -894 699 446 -813
2513 -813 1127 -625 -339 871 -586 354 422 -948 1036 -245 -539 957 -685 -255 466 -829 572
2530 572 -210 -653 843 -677 38 901 -914 948 278 -590 938 -698 64 883 -632 371 176
2547 176 -1015 949 -468 -383 697 -1012 203 90 -787 611 -464 -530 761 -1010 383 795 -924
2564 -924 773 -56 -541 1147 -517 245 705 -630 787 -187 -925 780 -787 106 1043 -988 499
2581 499 163 -533 601 -737 -141 559 -862 259 173 -384 813 -266 -493 556 -759 254 601
2598 601 -692 693 -38 -408 1161 -419 327 532 -761 747 192 -484 836 -601 77 540 -780
2615 -780 233 -150 -611 731 -573 -246 891 -854 594 256 -1068 784 -341 -260 441 -669 286
2632 286 347 -838 852 -164 -286 977 -698 249 626 -792 536 -334 -491 772 -896 -63 609
2649 609 -768 706 45 -329 745 -526 -148 563 -723 235 -195 -698 762 -277 -62 686 -765
2666 -765 565 294 -642 839 -257 -487 750 -835 126 188 -788 652 -193 -552 589 -710 -72 273
2684 273 -827 547 -197 -330 551 -537 -56 509 -559 713 158 -308 948 -64 -18 420 -717 540
2702 540 265 -447 680 -203 -121 688 -766 266 156 -856 650 -262 -260 616 -793 267 197 -902 517
2721 517 -155 -533 755 -504 -34 710 -563 497 -21 -569 622 -613 -184 560 -555 464 263
2738 263 -453 811 -303 50 649 -610 303 -197 -668 363 -383 -583 615 -892 -40 362 -521 586
2756 586 -99 -479 833 -415 257 496 -392 438 -407 -552 740 -220 -140 468 -762 361 78 -408 705
2775 705 -291 -508 367 -1043 213 47 -653 586 -261 -258 719 -459 362 343 -464 500 -323 -219 718 -485
2795 -485 236 251 -786 494 2 -438 715 -197 412 412 -617 301 164 -728 242 -564 -136 456 -533 250
2815 250 167 -433 977 -440 -169 656 -576 591 24 -440 504 -181 -142 575 -398 408 607 -325 876
2834 876 -25 -25 841 -564 -169 424 -852 262 -461 -411 559 -392 -149 574 -438 440 315 -300 729
2853 729 -379 -99 412 -520 -86 269 -469 707 -91 -145 748 -337 393 206 -372 499 -386 -312 414 -560
2873 -560 2 469 -800 327 -169 -437 506 -462 -9 479 -553 229 -208 -443 634 -436 -68 583
2891 583 -525 506 293 -272 458 -128 -152 482 -385 162 116 -514 610 72 -255 341 -461 139 91 -530
2911 -530 650 -333 -284 285 -271 91 572 -564 465 124 -370 525 -200 -15 373 -379 506 3 -455
2930 -455 223 -539 -76 340 -577 66 3 -633 508 -156 -324 371 -478 259 179 -646 545 -87 -435 585
2950 585 -412 -8 402 -421 473 81 -180 928 -359 159 588 -442 614 -57 -306 590 -429 -362 12
2969 12 -499 105 108 -405 460 -382 -201 378 -401 214 -29 -410 592 -297 -303 560 -365 222 605 -327 425
2990 425 -119 -219 192 -319 24 206 -429 262 -137 -296 360 -445 147 434 -438 488 -95 -494 403 -274
3010 -274 135 241 -377 60 212 -447 638 -131 -480 371 -441 303 438 -427 333 -190 -372 355 -376 5
3030 5 161 -366 245 -143 -197 657 -371 -114 323 -575 476 -182 -412 620 -396 54 435 -358 391 245
3050 245 -268 393 -208 281 455 -391 487 251 -215 491 -145 -203 487 -251 64 150 -808 407 -59 -309
3070 -309 317 -466 -139 19 -599 389 -53 -180 460 -357 94 243 -262 120 298 -439 351 -12 -294 614
3090 614 -271 380 65 -268 535 -194 -496 256 -371 397 60 -471 85 -167 -336 351 -592 48 87 -435
3110 -435 170 148 -131 464 -133 122 313 -551 226 -34 -249 352 -146 128 476 -315 486 387 -263 374 -227
3131 -227 -280 229 -555 100 -18 -368 331 -427 -470 646 -402 254 327 -480 380 -123 -184 640 -292 -181 505
3152 505 -505 186 -23 -121 533 -234 29 272 -452 391 -111 -226 359 -214 -280 340 -569 341 -113 -363
3172 -363 485 -343 -33 426 -335 186 255 -343 576 34 -315 237 -428 225 262 -431 545 -107 -197 253 -91
3193 -91 -36 32 -90 176 54 -209 431 -558 -41 354 -767 250 255 -229 399 -28 -154 438 -529 393 391 -385
3215 -385 461 -190 -5 251 -299 263 120 -461 343 242 -74 493 -351 295 298 -644 453 -282 -301 473 -161
3236 -161 -89 267 -341 189 -176 -243 439 -220 -60 164 -218 63 -163 -277 516 -233 41 525 -254 267 289
3257 289 -278 542 -7 -167 283 -231 -142 306 -337 516 -46 -206 171 -261 101 95 -500 309 195 -304 229
3278 229 -359 -41 468 -356 330 155 -223 473 -59 55 152 -473 219 -30 -415 411 -277 -181 252 -430 2
3299 2 297 -160 167 -340 -89 395 -307 88 240 -330 395 -14 -235 296 -208 -66 131 -547 -48 186 6
3320 6 281 -282 -105 200 -426 210 -184 46 304 -321 -207 203 -293 -103 47 -264 371 -131 -54 366 -276
3341 -276 444 194 -370 362 -232 -73 298 -345 39 181 -161 270 -72 -239 573 -98 -11 53 -403 93 58
3362 58 -83 296 -250 -187 251 -279 50 77 -232 173 -134 -167 457 -384 110 199 -303 324 -181 -253 310 -209
3384 -209 105 241 -370 64 -35 -467 251 -282 -124 93 -318 316 72 -189 276 -167 -22 343 -177 181
3404 181 204 -386 322 -131 -37 163 -470 -24 153 -385 129 -6 -167 318 -295 206 12 -255 289 38 -43
3425 -43 244 -87 94 -251 -238 102 -68 -178 262 58 -140 70 -377 22 117 -209 359 -134 -80 273 -206
3446 -206 288 423 -45 443 -84 -18 366 -172 -111 -163 -578 277 142 -183 405 -67 -105 -87 -49 -147 -101 -170 274
3469 274 -196 -252 549 -363 -24 6 -315 374 57 86 35 -353 168 94 -122 223 -323 -424 328 -140 -119 -65
3491 -65 -429 143 -253 47 406 -119 260 233 -94 259 -165 -88 92 18 175 -197 -110 368 -105 19 319 -235
3513 -235 7 230 -190 1 274 -223 153 -2 -145 181 -390 171 317 -86 156 13 -43 206 -227 96
3533 96 -41 -48 216 -201 -271 316 58 95 306 -152 375 -51 -239 85 -327 -173 154 -355 335 141 -153 174
3555 174 -153 160 107 -264 183 58 -381 126 26 -94 193 -40 40 215 -32 -82 -88 -118 187 -130 56 55 -147
3578 -147 281 66 -285 285 140 -297 199 -121 -2 -102 -341 142 -58 -100 10 -326 -96 355 -446 266
3598 266 124 -249 22 -173 -106 102 -260 263 -136 75 232 -150 93 118 -203 64 62 -195 158 -131 1
3619 1 84 -34 120 157 -235 25 -221 -97 -53 -25 186 -132 -158 3 -45 224 196 -118 19 191 -132 183 72
3642 72 -375 181 -166 5 32 -178 120 101 -112 112 -140 -123 171 -458 -38 -205 -5 267 -225 -20 62 -206
3664 -206 -118 -64 -304 182 81 -292 95 -103 74 -139 -236 197 -126 24 43 -166 -162 161 -464 -25 96 40
3686 40 158 -12 -64 -26 -14 25 -57 -252 238 -35 -35 -32 -233 180 -165 -384 3 -109 -29 -47 -185 140 159 -315
3710 -315 128 1 25 219 -278 138 -9 -146 128 -143 116 333 -124 -130 53 -87 -14 206 -311 41 -176
3731 -176 276 211 -104 23 110 -72 155 52 80 126 -57 -84 -132 -105 41 -113 -157 130 -212 154 199 -57 407
3754 407 -61 -76 32 -231 55 314 -170 52 -218 -394 111 -206 3 93 23 152 77 28 361 166 87 128
3776 128 -35 89 -118 -151 174 -128 -9 276 -42 185 99 -252 60 13 -67 254 -4 205 -110 58 339
3797 339 93 29 235 -178 -165 266 -159 -69 -1 -190 55 -43 49 17 -113 242 108 -189 62 103 -244 181 -113
3820 -113 -54 135 107 -1 -9 -320 126 -11 39 116 -335 -52 -134 -182 136 3 23 28 -203 -124 -136 -206 -125 -214 101
3845 101 304 -363 96 -57 4 119 -103 93 -138 -73 -21 -113 -236 57 43 -390 253 -65 -7 273 -36 269
3867 269 72 -104 341 89 187 -14 -502 -122 -84 4 157 -190 -61 90 -48 323 -44 -100 89 -315 86
3888 86 -12 -31 344 2 -56 -64 201 -75 284 -175 -60 36 -55 297 -57 -24 332 -76 93 169 -121 103 -28
3911 -28 -110 239 -293 -28 53 -65 277 67 -297 145 -13 185 66 90 -123 -14 -62 -96 32 -137 121 64
3933 64 53 -51 -171 -12 96 -151 -11 -236 49 173 191 -18 34 -185 -19 -19 -84 -127 -122 -155 169 -85 -59 -35
3957 -35 -160 -130 -50 90 16 -129 362 10 -8 -31 -122 395 -83 -250 221 -144 16 -80 -73 35 122 -66 128 -138
3981 -138 19 14 164 -150 160 3 -201 -121 -250 356 -46 -113 108 -54 81 128 186 93 -252 -133 -97 -199 105
4004 105 -117 61 146 -136 79 16 225 147 163 18 182 -65 -73 -90 122 -116 294 -130 -109 102 -72 36 -252
4027 -252 -146 96 62 95 -209 -101 33 -4 -86 85 -181 300 -296 0 42 87 -111 133 0 32 145 101 89
4050 89 103 -75 111 -51 -3 91 -70 -40 34 116 -99 109 162 64 -16 -108 149 -205 -45 23 -101 142 -71 -139
4074 -139 28 22 -92 216 -358 229 28 -36 184 2 -61 -185 256 -145 -77 -59 -150 9 -21 -133 -223 135 115
4097 115 -163 207 -232 -6 -62 -62 131 72 6 75 70 131 -24 -50 -23 52 -95 14 -147 -88 29 -157 -93 -107 -129
4122 -129 72 30 -9 19 -42 36 -88 -105 -82 34 234 109 -248 -182 -57 -192 69 -88 61 37 -66 298 12
4145 12 23 204 -59 -137 -17 52 -109 -159 -234 269 -242 93 59 -100 -56 286 -100 -164 -4 126 215 72 107 56
4169 56 116 -81 229 -36 -322 -237 -185 127 72 -144 -158 -167 14 -74 -56 -112 -99 -98 -51 -38 290 -133 -411 182 110 -37
4195 -37 54 23 189 -34 197 -30 -18 79 104 -191 -76 203 -149 -116 64 -88 172 -113 88 47 -8 79 117 -161
4219 -161 -7 44 71 184 -83 138 9 -84 -13 2 -124 -46 -260 -132 104 -13 77 34 -251 300 -194 -184 223
4242 223 -98 53 126 29 -137 85 155 174 -38 47 61 -229 121 -2 -265 168 98 313 28 -281 -3 -195
4264 -195 14 37 -117 -76 88 62 -222 59 -3 109 -3 183 10 117 97 317 210 201 28 115 -3 2 140
4287 140 78 -2 -114 -130 -82 238 -192 50 101 -168 -97 1 84 117 -99 20 98 108 68 -12 -106 17 -18 115 264
4312 264 -143 140 -19 -23 132 -96 -231 289 -132 249 -106 -163 129 341 -118 86 21 303 166 118 124 -177
4334 -177 54 -81 33 15 93 -249 -141 62 -18 192 -66 -147 -191 -14 70 0 -93 133 -60 -213 241 -24 103
4357 103 -15 -89 -93 104 -267 369 -14 -92 -168 -279 -19 91 -267 -77 -130 198 -38 112 158 -170 -123 195 -103
4380 -103 -109 177 75 133 3 -81 105 35 111 119 111 110 -52 156 71 -130 22 -185 -86 92 44 102 163 -199 -59 126
4406 126 -239 -26 -52 -145 -48 -51 -76 272 -2 77 251 26 -3 -27 110 169 -83 64 32 117 76 -65 -51 92 -10
4431 -10 -111 -11 -178 161 207 -239 59 32 47 28 46 78 121 -162 72 -36 -60 215 47 -17 6 -176 3 53
4455 53 -54 145 -225 -108 -33 -94 208 85 0 84 -281 -105 -10 -295 189 -145 -169 9 110 -100 -54 -162 -27
4478 -27 170 -14 170 -118 52 269 -44 130 87 -149 -63 37 17 272 -166 116 26 -219 -90 70 -106 70
4500 70 -183 -113 195 -137 106 111 9 252 -148 -97 70 -261 168 2 64 -119 97 11 158 -351 48 -20 -212
4523 -212 173 26 -52 110 -239 -166 172 -211 -64 -9 -143 383 -329 -20 198 -138 41 143 -184 72 -111
4544 -111 19 18 -250 44 351 -100 -84 78 -201 303 -185 175 67 36 180 25 -160 196 -26 41 48 -119
4566 -119 95 325 46 246 50 119 329 -81 54 112 3 151 -344 -122 -37 -232 61 -23 233 226 -112 -235
4588 -235 -108 -10 -185 -17 -39 341 62 -115 175 81 140 163 -210 -50 205 -164 249 -47 87 59 -140 -10
4610 -10 117 -240 451 87 -86 130 -130 348 20 -224 128 34 -35 115 -172 -107 107 -113 242 -102 -7 340
4632 340 129 -6 152 -101 30 -10 -159 290 -196 -140 215 -177 9 20 -167 118 -101 -73 -4 -243 236 92
4654 92 -117 64 -126 188 241 -246 81 97 139 398 48 -138 246 -208 -57 328 -293 -6 94 -317 -12
4675 -12 59 145 148 -92 43 -96 -166 2 -159 4 406 -205 44 157 17 74 86 47 291 392 71 66 -232 241
4699 241 135 11 227 -308 9 10 -192 7 -23 -17 275 -279 -14 -70 13 48 -90 -31 110 137 -21 184 -211
4722 -211 198 -51 29 201 254 -45 -73 -235 220 324 -445 87 -90 35 160 -130 36 115 -268 75 -3 -134
4744 -134 45 -335 203 229 -48 42 129 -15 -62 -106 -120 0 -135 145 121 -156 293 -151 -275 77 -405 -221
4766 -221 -110 -26 -26 -200 -38 51 -49 -158 192 -214 488 283 -128 209 -208 92 366 -303 166 26 -411
4787 -411 286 53 94 82 -66 96 -56 -173 90 -46 17 -70 -139 3 197 -94 188 -101 65 129 -227 29
4809 29 263 -102 100 -77 6 189 -434 -35 80 -9 140 86 95 482 -265 202 -146 -60 282 -96 -19 265 -113
4832 -113 -135 -67 92 46 134 -189 -44 -92 -33 286 -276 89 -73 -163 328 -130 -159 207 -213 91 207 -62 327
4855 327 169 4 86 27 -51 328 -99 28 185 19 158 -146 -16 247 -438 277 -135 -178 35 203 -47
4876 -47 -14 -325 153 154 -194 48 -70 76 189 23 174 9 -220 131 -25 -58 126 -167 -107 292 -421 63
4898 63 -112 -63 -124 -187 -231 -20 84 52 203 -118 106 -308 80 349 -372 91 83 -251 -31 -40 -47 280 -173 13
4922 13 38 -191 -83 42 -73 258 -264 126 -93 -174 54 -144 -288 -5 -1 206 67 -135 113 209 -199 181
4944 181 47 19 263 117 -114 -45 43 -13 -325 93 271 -179 199 128 -356 122 58 -55 143 -225 47 175
4966 175 -140 343 -117 26 88 -404 38 58 -74 297 -147 47 50 63 76 142 11 228 -44 -263 204 -65
4988 -65 195 178 -346 220 188 -367 106 -101 -18 -59 -331 254 0 -128 48 -64 -11 -57 -193 27 108 -144 203
5011 203 -120 -278 -53 -93 -61 160 -29 91 -3 -59 425 82 72 4 -372 86 79 -187 103 -271 -117 215 -29
5034 -29 215 138 -419 99 -175 -199 160 -125 148 225 -144 138 -116 -65 224 -183 -105 -168 -318 127 217 -104 232
5057 232 -240 53 246 -85 374 -175 -310 411 -31 -84 -152 -368 272 114 -14 -26 6 -216 97 -317 247
5078 247 115 11 72 80 -235 32 -127 -32 154 -115 205 104 92 174 -161 68 216 -124 243 -144 -151 292 -193
5101 -193 -122 188 -398 184 131 -351 57 24 15 42 -347 313 141 -300 98 -84 -47 143 -235 210 -18 -220
5123 -220 -73 124 -183 236 -184 80 258 24 48 191 -231 296 41 96 137 -224 117 -185 212 283 -43
5144 -43 112 253 -145 228 89 -79 274 1 -186 75 -147 -33 99 -15 170 -46 -205 181 -162 -55
5164 -55 -13 -105 139 41 -258 54 150 325 90 19 98 137 -272 274 162 -285 154 -311 -204 128 -117 154 -173
5187 -173 -126 179 -56 51 148 -72 -87 27 -35 264 -14 14 297 -14 308 -142 -80 261 -119 77 324 -307
5209 -307 -8 99 -49 -93 -202 276 -138 -181 -21 69 -172 283 -227 -70 291 -107 148 14 -108 321 107
5230 107 -59 167 -143 65 -7 -36 -12 76 -114 208 -154 134 183 -220 66 -154 -42 253 28 -26 -84 -72 229
5253 229 70 -284 46 -208 85 33 -195 160 103 -102 -39 -39 164 254 87 41 147 -261 206 -120 48 251
5275 251 -236 69 354 -206 242 -120 -136 148 -124 53 142 -300 326 76 -29 174 -88 -207 84 -182 -103
5296 -103 107 -26 137 -42 -183 117 -220 -192 39 -229 370 -82 -292 95 -92 -250 -167 -105 151 -40 -97
5317 -97 174 -134 28 -26 -28 228 -37 -59 -77 -257 26 11 -179 293 125 -350 378 -23 34 170 -414 137 -149
5340 -149 -59 430 -41 -36 -46 -88 63 28 -241 35 -97 -63 -30 -119 -162 204 -190 -91 -106 -20 210 -239 -96 63
5364 63 -210 291 -61 -258 416 -271 165 112 47 98 295 -129 163 -159 -104 213 0 38 -191 -218 320 -83
5386 -83 -393 27 89 183 43 -349 -14 11 -148 78 -207 -14 -62 -109 -36 194 -77 173 -180 31 243 -256
5408 -256 511 182 -214 187 -371 -2 239 -51 209 87 -92 337 -140 -172 51 -138 204 202 136 177 103 -257
5430 -257 329 -336 -33 -89 -305 50 -65 -53 109 101 -168 -60 -184 470 160 -164 150 -144 -97 74 -329 1
5452 1 225 -167 179 -56 -23 24 83 24 200 -96 -68 -299 -219 155 -77 120 70 -182 27 -242 -36 296 103
5475 103 162 107 -341 101 -102 -16 145 -360 -56 102 -156 215 299 -10 255 -82 -101 179 -264 -37 146 -160
5497 -160 -29 -213 -90 51 -178 103 -74 -34 324 78 -49 441 -233 134 -194 -176 41 -100 -313 365 -162
5518 -162 104 256 -223 205 -152 -50 -6 -163 39 49 -206 42 -195 -281 97 93 -177 178 -23 -39 358 -108
5540 -108 272 52 2 238 -123 286 217 -232 71 18 -162 71 -209 -3 77 -177 280 -212 64 275 -48
5561 -48 -73 9 -204 93 188 -284 -58 -302 125 47 -175 524 97 -181 244 -221 -102 180 -265 263 32 -213
5583 -213 289 -25 -169 226 -210 -129 95 -93 37 -122 -94 142 -255 164 107 -193 170 76 -200 234 -116
5604 -116 -23 80 -90 347 132 -25 155 -212 -31 261 -247 144 45 -112 -45 -78 -266 156 -239 181 369
5625 369 -172 174 123 -12 552 -144 -41 313 -176 181 297 -301 -62 -249 -209 191 -278 -23 253 -200 21
5646 21 -35 183 301 -393 78 8 -207 345 9 -119 67 -243 167 250 -194 259 170 -202 271 -416 -42 -41
5668 -41 -102 181 174 -155 460 -176 -60 603 -208 175 -318 -159 56 -467 38 289 -202 5 83 -105 204 -138
5690 -138 207 287 -213 86 33 30 181 -252 -89 228 -449 141 -15 -17 273 -34 -144 187 119 41 86 -152 126
5713 126 10 -122 -65 64 130 153 -300 -87 -85 -70 169 -39 115 -29 -184 -127 -43 -268 144 70 141 270 -132
5736 -132 -98 111 -146 414 -121 -119 149 -205 -12 128 -198 318 53 -51 186 -43 -67 -55 -351 133 239 -224
5758 -224 193 -113 -95 81 -470 -38 -116 -136 166 -60 -277 162 -121 -99 30 -309 -6 -189 -117 85 -307 325
5780 325 25 -115 43 58 39 201 -290 -81 326 -142 125 -217 83 277 -164 -20 127 -212 52 -91 -176
5801 -176 94 -2 147 -39 -374 66 -105 -78 -119 -126 -34 99 -158 -46 -236 -190 24 30 -90 126 -142 335 -4
5824 -4 -163 427 -153 -39 489 57 -171 125 -177 165 120 -56 106 -34 47 74 -286 385 115 -383 327 16
5846 16 -342 115 -285 167 104 164 85 -135 -184 210 -442 257 222 13 158 -134 -173 281 -127 68 141 -112 139
5869 139 81 -159 290 101 59 94 -123 92 -319 -146 392 -172 -169 66 -23 265 -43 -313 71 111 -43 310
5891 310 -261 79 -94 -208 259 -169 23 110 -209 -28 219 -171 147 -30 -163 291 -283 35 88 -225 -31
5912 -31 -85 -279 -97 -206 78 38 -128 105 -78 9 292 268 -397 114 -190 147 -87 -50 326 -183 144 236
5934 236 -116 -75 -22 -211 155 178 -165 231 -96 -77 390 101 274 -36 179 302 -249 17 30 -174 142 33
5956 33 -180 238 -52 288 165 90 190 -4 -276 161 -95 78 409 54 352 8 -199 173 -188 -247 77
5977 77 -80 168 58 -181 228 -126 -416 229 -139 206 66 -161 51 -30 -89 302 -187 -62 314 -147 213
5998 213 37 -49 135 -334 -83 -83 -240 -326 -139 -354 323 -48 -63 211 -425 91 163 -112 163 160 -10 61 -74
6021 -74 202 203 -199 221 104 -370 141 -304 -177 16 -525 -76 120 -125 243 -92 -8 59 146 22 146 -173
6043 -173 247 -266 -63 129 -284 179 166 -69 187 -84 103 23 -253 35 68 -195 -60 -114 -261 292 -71
6064 -71 -284 350 -172 130 -52 -133 382 -201 -68 136 -317 -36 -3 -23 186 -209 -71 243 -272 97 -158
6085 -158 -247 510 -219 -37 51 -307 -39 18 -164 76 -98 -128 109 -29 -224 282 -270 125 295 -115 233
6106 233 -68 184 300 -240 -29 -124 -211 253 -35 -115 76 16 227 -45 -11 377 -185 -138 318 -47 23 257
6128 257 -152 76 36 -76 277 -298 -31 200 5 38 -98 -206 227 -232 103 106 -303 -86 -16 2 192 -235
6150 -235 -182 58 -201 47 204 -126 58 -21 -22 299 3 -1 -127 -69 35 -195 29 147 -139 68 116 -166 339
6173 339 -191 -82 201 -180 103 109 -126 80 -65 -116 435 -129 165 313 -295 329 16 -25 16 48 -2 223
6195 223 -137 -41 -21 -330 -75 -231 60 215 -4 -5 -79 -161 141 -2 81 31 -163 52 112 -487 113 -257 -1
6218 -1 71 -287 -58 -32 -32 262 -32 102 365 -262 54 82 -88 74 -118 -151 317 -197 24 107 -79 209 79
6241 79 -88 268 -168 -70 138 -192 283 381 -147 197 92 -134 229 -242 86 160 41 -144 -194 -167 176 -100
6263 -100 21 90 -191 186 -34 -56 -14 -171 -61 124 51 118 13 -211 241 -124 4 286 -177 -39 -17 81
6285 81 13 31 -5 367 -97 65 255 -279 44 51 -279 17 5 187 174 -95 -144 98 -102 108 -93 -12 -38 -55
6309 -55 322 64 -79 297 86 -162 225 -429 84 -77 -167 156 -88 -35 343 -331 231 -159 -247 339 12
6330 12 -223 -9 -120 96 167 60 113 -46 -175 95 -123 -303 54 -242 196 -36 -164 205 -285 3 129
6351 129 -350 45 -54 -175 220 107 116 -28 -190 125 107 -67 194 57 -171 196 -28 -32 121 -218 79 -67
6373 -67 -202 372 -122 107 50 -53 174 -171 15 -46 -238 -355 170 -143 98 51 -170 -86 -188 36 188 -97
6395 -97 183 -47 -404 287 -145 -31 140 -180 1 122 -218 -69 -144 17 114 -208 43 195 -222 178 -14
6416 -14 19 39 -142 -263 60 -161 95 9 92 -123 200 -107 41 -298 208 121 -121 381 36 -221 -87 33
6438 33 185 90 -256 179 222 -92 260 10 92 -172 -186 38 84 -116 201 0 39 -161 -337 202 -143 29
6460 29 -36 -221 83 -56 -192 -122 8 31 142 -43 -107 200 -42 63 79 -237 13 18 -48 138 -101 95 122
6483 122 -135 -21 -148 48 53 -163 202 -59 -245 219 -310 -209 214 -218 77 425 -38 -13 -104 -179 224 41
6505 41 60 55 -331 429 -137 -143 169 -394 -24 97 -347 81 -188 -493 144 -205 -345 164 -317 20 147 -371
6527 -371 465 -241 -239 131 -71 -43 134 -173 -19 59 163 140 145 -97 373 -308 216 77 -338 140 -290 -1
6549 -1 15 -225 19 13 -212 225 -361 -257 375 -208 -207 27 4 71 -223 -150 306 -135 -50 148 -51 54 -72 -103
6573 -103 62 -85 3 -27 55 50 -131 -236 67 -177 -107 236 -173 251 134 -104 293 -246 7 78 -285 -99
6595 -99 194 -122 -125 3 -43 223 -302 102 150 -324 448 -103 65 26 -159 82 144 -119 29 12 -177 177 -465
6618 -465 0 7 -264 -16 -173 -218 122 64 -281 -63 -292 51 229 -77 215 -4 -126 88 45 178 5 -90
6640 -90 45 -49 -227 24 -113 -13 60 -454 227 29 127 252 -300 75 222 -345 204 -61 -259 142 -114
6661 -114 85 165 136 197 272 -283 289 104 -273 210 -115 35 24 -192 33 309 -122 220 126 76 149 -322 85
6684 85 -55 -257 317 -157 144 56 -239 -111 -11 -347 387 24 -168 164 -161 -27 94 81 413 75 -40
6705 -40 -6 -157 160 96 -280 343 132 1 77 -377 221 206 -196 70 -58 -39 325 19 -304 34 -245 21
6727 21 -108 -232 374 -181 -24 453 -301 -81 48 70 123 -363 25 121 -299 -23 -294 -316 293 -55 9 94
6749 94 -80 -3 253 6 213 -46 -72 18 -108 -104 -150 -164 279 -288 -65 473 -298 -5 -23 -62 254 -57 -301
6772 -301 36 -40 -70 123 -307 15 55 164 315 27 -178 -4 -309 10 -58 -136 242 -11 86 158 -443 -136
6794 -136 155 -396 169 178 -72 10 -409 193 341 -141 7 81 62 227 -211 27 253 -251 29 82 -209 335
6816 335 -185 -40 252 -359 -58 137 -227 263 182 -119 102 19 24 326 -249 95 -237 46 186 -16 367
6837 367 149 -427 105 162 -46 263 -139 -94 267 -253 -10 153 -324 465 -465 61 -4 -163 185 -63 -100
6858 -100 322 52 -182 219 -72 91 45 -158 128 -5 -185 197 -495 295 343 -331 -42 -256 -87 96 30
6879 30 297 58 -206 179 9 -128 160 -115 259 234 -184 185 52 -310 216 -156 84 179 71 -29 -99
6900 -99 -333 273 29 -150 48 -212 -55 286 -79 204 68 -169 100 -102 -173 -186 -29 199 98 -187 360
6921 360 -175 -3 184 -25 192 115 85 76 -215 -102 -86 -279 113 66 -177 280 -181 -151 -6 -153 233 84
6943 84 -201 -2 -119 -15 -103 -112 -19 116 -161 380 -50 -169 164 -179 63 140 -36 -22 -225 -118 21 -199
6965 -199 48 60 -172 1 24 -32 207 -143 -22 205 -3 -21 31 -50 185 64 -20 236 72 -40 282 -79
6987 -79 300 -102 128 237 -184 59 43 -133 285 -104 77 -159 -429 -128 -122 -179 99 -298 -1 245 -3 -94
7009 -94 60 -80 44 23 -344 5 -35 187 461 85 -35 -10 -173 100 -89 0 103 185 74 42 -34 192 79
7032 79 1 17 -206 123 -48 -103 -6 -141 -208 14 -57 -71 -3 -224 39 163 -77 -218 -4 56 -84 -65 51 96
7056 96 -198 156 -159 -28 235 -196 108 -82 -124 307 -106 -159 194 0 -24 121 -248 148 -302 32 360
7077 360 -244 -185 228 -267 57 73 -351 -23 -49 12 392 -326 66 -98 61 98 -167 -87 7 -93 -65 165 -132
7100 -132 139 -93 219 88 -228 -194 -22 9 17 -167 72 181 -1 185 -50 -83 300 -179 124 200 -123 102
7122 102 243 -206 149 74 -263 290 -70 24 -115 -123 -35 235 -131 174 30 -64 -97 -203 90 58 -151 140 -185
7145 -185 -143 47 62 -155 113 -214 337 28 -197 201 -124 -7 36 -164 195 140 19 -83 -156 -174 141 -301
7167 -301 3 55 -163 167 -16 239 356 20 -191 155 -119 230 127 160 104 -177 19 45 -296 165 96 -30
7189 -30 176 47 -159 -40 -305 261 41 -258 234 62 -156 262 -184 158 106 -31 234 93 -220 -13 -123
7210 -123 15 -21 -98 108 -13 26 23 -98 122 89 -233 109 -84 -66 356 -123 41 -129 -316 239 171 -96 153
7233 153 -104 -117 86 -160 154 45 0 130 317 98 86 -234 574 33 -214 68 7 185 200 -337 -88 72
7255 72 -241 358 -21 -214 207 -88 248 27 -184 271 -135 -27 402 -122 -12 -41 -31 104 -100 110 158
7276 158 -178 132 406 -87 22 -116 180 117 -215 -109 144 -238 166 -36 -10 127 -141 -51 181 -91 178
7297 178 81 -19 396 -76 -84 414 -184 -106 132 -435 279 -16 -120 85 -242 9 -82 43 82 174 -270 447
7319 447 19 -106 26 -190 178 -326 -62 -56 -169 126 156 -288 32 -85 -89 153 50 -26 323 -236 -149 -67 -87
7342 -87 137 -30 -192 -26 143 80 -14 -192 77 -69 62 197 -529 124 118 -33 66 14 101 97 51 -57 -34 -376
7366 -376 -58 -106 20 190 -255 -74 17 -211 103 -89 -36 105 -131 -261 160 -203 62 -44 -188 122 87
7387 87 -180 199 10 143 297 -112 232 38 -16 78 67 17 96 353 19 -43 -213 147 -32 -19 -11 -86 109 -67
7411 -67 6 5 -30 -62 48 -330 -59 86 -233 147 -228 -98 78 -18 -75 41 -86 106 -11 124 161 -14 -121
7434 -121 85 -165 -23 -114 -174 180 -16 100 269 -134 -139 -28 -27 172 -193 -6 232 -378 -66 74 -155 142
7456 142 -142 51 18 -71 -161 288 -232 160 -112 -131 245 -227 -265 81 -25 317 66 -261 325 -133 255 -75
7478 -75 -309 -48 -250 -16 58 44 -199 31 -290 -85 56 -253 236 -384 60 44 -229 169 -2 11 67 -40
7500 -40 15 23 -46 193 66 -309 299 -29 53 61 -191 -141 49 -216 130 54 -166 50 -8 -25 358 -80 92 -37
7524 -37 -223 356 193 -17 280 126 -55 82 -234 88 -22 63 162 202 96 -193 -174 -30 -7 -16 46 -42 70
7547 70 213 -139 402 -196 -47 260 -111 -1 -28 -52 87 -220 -282 174 -173 -30 179 87 -17 19 12 146 137
7570 137 114 258 -113 -30 144 -161 341 -195 126 284 -444 -9 100 -137 -87 35 -59 129 64 89 243 -40
7592 -40 76 -9 49 179 8 -151 146 -242 161 -132 38 553 260 -96 -49 -171 -135 201 -25 85 -153 -141
7614 -141 -104 -15 -23 -2 -245 -71 71 -98 170 -84 -25 -19 -328 136 -172 -219 48 -86 -76 187 -259 35 174
7637 174 -225 174 -4 -21 9 52 -16 159 -86 105 -168 57 123 62 98 63 -175 89 -255 -130 28 -70 95
7660 95 88 -24 -62 -54 -55 170 -49 32 -30 -298 332 286 -74 188 -253 29 97 -2 212 72 -156 164 -159 54
7684 54 167 -96 -179 237 -102 89 -250 76 166 -70 91 388 244 77 -165 -46 201 72 -130 7 26
7705 26 80 -123 -22 197 -79 191 140 -285 -40 -145 -307 175 44 -62 179 -205 45 -26 -63 198 2 -136
7727 -136 -56 -268 229 74 -107 249 34 -125 125 -297 -39 75 -290 348 49 -212 155 -220 -100 16
7747 16 -408 -17 55 -201 -76 -175 90 157 -315 -42 68 -374 94 -101 -251 -44 -161 95 -95 63 425
7768 425 -36 -50 304 -323 34 218 74 34 -230 72 -34 62 -130 42 -34 60 112 -101 203 -209 74 209
7790 209 -132 298 -40 -122 110 -186 -89 220 -47 253 -77 -61 184 24 -189 12 -215 -383 132 -186 110
7811 110 -193 -66 280 -92 85 105 -30 125 -124 33 383 -283 -208 382 90 255 11 -52 193 19 -91
7832 -91 261 170 297 140 -149 -108 -56 42 143 -213 -102 -41 -56 1 221 -173 123 7 53 -24 -11 154 98 -15
7856 -15 194 15 202 -61 -140 113 126 -86 136 -257 -77 -1 19 108 51 -220 -8 269 -123 -87 -205 334 55
7879 55 -163 185 -120 -140 22 -202 352 60 -307 70 -84 46 438 -193 -106 182 -48 -46 197 -84 35 -67
7901 -67 -50 247 -95 263 91 -223 347 58 -152 -21 -155 73 124 -248 70 -276 -164 102 -213 106 -57
7922 -57 167 83 -202 -64 -86 -138 -3 255 -287 183 -172 -25 68 20 -37 -14 -227 202 -50 -36 87 -33 40
7945 40 308 -202 94 153 -310 160 159 -196 -65 -107 -75 243 -80 352 34 -68 135 -150 -43 -73 -249 302
7967 302 -33 -120 177 -103 328 78 -128 64 -126 7 217 -206 -8 -324 -87 -74 33 -151 84 -41 -307
7988 -307 145 -373 241 421 -30 136 -264 -212 94 -131 28 -103 -338 102 -240 -47 226 -26 -55 108 -228
8009 -228 120 30 -275 213 -211 -1 266 108 147 163 51 64 -275 -21 210 -242 120 21 -181 454 -161 -185
8031 -185 170 -61 -47 -185 -23 47 52 -209 229 -175 -128 -180 5 -57 -42 -26 317 -12 201 123 -283 210 -3
8054 -3 81 185 139 -35 -245 -7 150 -240 -3 197 6 -78 -27 -91 -74 227 -199 128 -55 48 97 -86 -110
8077 -110 -2 -268 148 -97 57 143 -131 94 -73 -97 -89 36 -277 223 -191 31 143 -1 -126 0 -186
8098 -186 41 108 196 164 -44 -104 -140 205 -319 -236 -12 -135 -84 90 226 -245 70 -2 115 261 30 -63 -38
8121 -38 -107 93 -224 -31 -70 -53 49 155 -105 -8 53 -39 49 -162 -4 270 -164 80 2 -239 173 -91 4
8144 4 143 -160 -176 -108 -4 62 -77 20 208 115 217 12 -89 228 -116 -46 207 62 -133 -37 -141 -78 168
8167 168 -117 234 -184 -179 19 -260 110 -91 -77 329 -147 -80 297 -196 147 -100 -7 32 -167 118 25 -214
8189 -214 0 16
8191A6
##END NTUPLES=NMR FID
##END=
