##TITLE=1H_48-2021
 CDCl3, 8 sc, 
 5.07.2021
##JCAMPDX= 6.0         $$ Bruker NMR JCAMP-DX V2.0
##DATA TYPE= NMR FID
##DATA CLASS= NTUPLES
##ORIGIN= UXNMR, Bruker Analytische Messtechnik GmbH
##OWNER= root
$$ XWIN-NMR		Version 3.5
$$ Mon Jul  5 10:41:48 2021 Russian Standard Time (UT+4h)  she@DPX200
##.OBSERVE FREQUENCY= 200.131506
##.OBSERVE NUCLEUS= ^1H
##.DELAY= (6, 6)
##.ACQUISITION MODE= SIMULTANEOUS
##.ACQUISITION SCHEME= undefined
##.AVERAGES= 8
##.DIGITISER RES= 18
##SPECTROMETER/DATA SYSTEM= spect
##.PULSE SEQUENCE= zg30
##.SOLVENT NAME= CDCl3
##.SHIFT REFERENCE= (INTERNAL, CDCl3, 0, 15.7039)
##AUDIT TRAIL= $$ (NUMBER, WHEN, WHO, WHERE, WHAT)
$$ ##TITLE= Audit trail, XWIN-NMR		Version 3.5
$$ ##JCAMPDX= 5.01
$$ ##ORIGIN= Bruker BioSpin GmbH
$$ ##OWNER= she
$$ F:/spectra/data/she/nmr/H-F/1/audita.txt
$$ ##AUDIT TRAIL=  $$ (NUMBER, WHEN, WHO, WHERE, WHAT)
(   1,<2021-07-05 10:40:45.71 +0400>,<she>,<DPX200>,
      <created by zg, POWCHK disabled, PULCHK disabled
       configuration hash MD5:
       00 E9 B6 7A A2 85 ED C7 34 08 36 98 17 FE 4E 26
       data hash MD5: 16K
       32 EA 9A 4F D4 E6 56 04 DA 2B EF 3D EB 3A AC E7>)
$$ ##END=
$$ 
$$ hash MD5
$$ 0D 9A 62 C3 01 CD F6 AA ED AB AF 99 BA 38 0D 76
##$RELAX= 
##$RELAX= 
##$RELAX= 
##$RELAX= 
##$RELAX= 
##$RELAX= 
$$ Bruker specific parameters
$$ --------------------------
##$DU= <F:/spectra>
##$EXPNO= 1
##$NAME= <H-F>
##$PROCNO= 1
##$TYPE= <nmr>
##$USER= <she>
##$AMP= (0..31)
100 100 100 100 100 100 100 100 100 100 100 100 100 100 100 100 100 100 
100 100 100 100 100 100 100 100 100 100 100 100 100 100 
##$AQSEQ= 0
##$AQ_mod= 1
##$AUNM= <au_zg>
##$AUTOPOS= <>
##$BF1= 200.13
##$BF2= 200.13
##$BF3= 200.13
##$BF4= 200.13
##$BF5= 200.13
##$BF6= 200.13
##$BF7= 200.13
##$BF8= 200.13
##$BYTORDA= 1
##$CFDGTYP= 0
##$CFRGTYP= 5
##$CHEMSTR= <none>
##$CNST= (0..31)
1 1 145 1 1 1 1 1 1 1 1 1 1 1 1 1 1 1 1 1 1 1 1 1 1 1 1 1 1 1 1 1 
##$CPDPRG= <>
##$CPDPRG1= <>
##$CPDPRG2= <>
##$CPDPRG3= <>
##$CPDPRG4= <mlev>
##$CPDPRG5= <mlev>
##$CPDPRG6= <mlev>
##$CPDPRG7= <mlev>
##$CPDPRG8= <mlev>
##$CPDPRGB= <>
##$CPDPRGT= <>
##$D= (0..31)
0 1.2 0 0 0 0 0 0 0 0.06 0 0.03 0 0 0 0 0.0002 0 0 0 0 0 0 0 0 0 0 0 0 
0 0 0 
##$DATE= 1625467245
##$DBL= (0..7)
120 120 120 120 120 120 120 120 
##$DBP= (0..7)
150 150 150 150 150 150 150 150 
##$DBP07= 0
##$DBPNAM0= <>
##$DBPNAM1= <>
##$DBPNAM2= <>
##$DBPNAM3= <>
##$DBPNAM4= <>
##$DBPNAM5= <>
##$DBPNAM6= <>
##$DBPNAM7= <>
##$DBPOAL= (0..7)
0.5 0.5 0.5 0.5 0.5 0.5 0.5 0.5 
##$DBPOFFS= (0..7)
0 0 0 0 0 0 0 0 
##$DE= 6
##$DECBNUC= <off>
##$DECIM= 32
##$DECNUC= <off>
##$DECSTAT= 4
##$DIGMOD= 1
##$DIGTYP= 9
##$DL= (0..7)
0 120 120 120 120 120 120 120 
##$DP= (0..7)
150 150 150 150 150 150 150 150 
##$DP07= 0
##$DPNAME0= <>
##$DPNAME1= <>
##$DPNAME2= <>
##$DPNAME3= <>
##$DPNAME4= <>
##$DPNAME5= <>
##$DPNAME6= <>
##$DPNAME7= <>
##$DPOAL= (0..7)
0.5 0.5 0.5 0.5 0.5 0.5 0.5 0.5 
##$DPOFFS= (0..7)
0 0 0 0 0 0 0 0 
##$DQDMODE= 0
##$DR= 18
##$DS= 0
##$DSLIST= <SSSSSSSSSSSSSSS>
$$ [...]
##$SUBNAM2= <"">
##$SUBNAM3= <"">
##$SUBNAM4= <"">
##$SUBNAM5= <"">
##$SUBNAM6= <"">
##$SUBNAM7= <"">
##$SUBNAM8= <"">
##$SUBNAM9= <"">
##$SW= 20.0188882624521
##$SWIBOX= (0..15)
0 0 2 0 0 0 0 0 0 0 0 0 0 0 0 0 
##$SW_h= 4006.41025641026
##$TD= 16384
##$TD0= 1
##$TE= 0
##$TE2= 300
##$TE3= 300
##$TEG= 300
##$TL= (0..7)
0 120 120 120 120 120 120 120 
##$TP= (0..7)
150 150 150 150 150 150 150 150 
##$TP07= 0
##$TPNAME0= <>
##$TPNAME1= <>
##$TPNAME2= <>
##$TPNAME3= <>
##$TPNAME4= <>
##$TPNAME5= <>
##$TPNAME6= <>
##$TPNAME7= <>
##$TPOAL= (0..7)
0.5 0.5 0.5 0.5 0.5 0.5 0.5 0.5 
##$TPOFFS= (0..7)
0 0 0 0 0 0 0 0 
##$TUNHIN= 0
##$TUNHOUT= 0
##$TUNXOUT= 0
##$USERA1= <user>
##$USERA2= <user>
##$USERA3= <user>
##$USERA4= <user>
##$USERA5= <user>
##$V9= 5
##$VALIST= <valist>
##$VCLIST= <CCCCCCCCCCCCCCC>
##$VD= 0
##$VDLIST= <DDDDDDDDDDDDDDD>
##$VPLIST= <PPPPPPPPPPPPPPP>
##$VTLIST= <TTTTTTTTTTTTTTT>
##$WBST= 1024
##$WBSW= 4
##$XGAIN= (0..3)
0 0 0 0 
##$XL= 0
##$YL= 0
##$YMAX_a= 305465
##$YMIN_a= -432208
##$ZGOPTNS= <>
##$ZL1= 120
##$ZL2= 120
##$ZL3= 120
##$ZL4= 120
##$ABSF1= 10
##$ABSF2= 0
##$ABSG= 5
##$ABSL= 3
##$ALPHA= 0
##$AQORDER= 0
##$ASSFAC= 0
##$ASSFACI= 0
##$ASSFACX= 0
##$ASSWID= 0
##$AUNMP= <proc_1d>
##$AZFE= 0.1
##$AZFW= 0.1
##$BCFW= 1
##$BC_mod= 2
##$BYTORDP= 1
##$COROFFS= 0
##$CY= 11.3945322036743
##$DATMOD= 1
##$DC= 2
##$DFILT= <>
##$DTYPP= 0
##$F1P= 15.9154993809931
##$F2P= -4.1035820241983
##$FCOR= 0.5
##$FTSIZE= 0
##$FT_mod= 4
##$GAMMA= 1
##$GB= 0.15
##$INTBC= 1
##$INTSCL= 1
##$ISEN= 128
##$LB= 0.24
##$LEV0= 0
##$LPBIN= 0
##$MAXI= 10000
##$MC2= 0
##$MEAN= 0
##$ME_mod= 0
##$MI= 1.114404
##$NCOEF= 0
##$NC_proc= 0
##$NLEV= 6
##$NOISF1= 3.799351
##$NOISF2= 2.8
##$NSP= 1
##$NTH_PI= 0
##$NZP= 0
##$OFFSET= 15.70392
##$PC= 1
##$PHC0= -11914.16
##$PHC1= 10.60099
##$PH_mod= 1
##$PKNL= yes
##$PPARMOD= 0
##$PSCAL= 0
##$PSIGN= 0
##$REVERSE= no
##$SF= 200.130013532006
##$SI= 16384
##$SIGF1= 3
##$SIGF2= 2
##$SINO= 400
##$SIOLD= 16384
##$SREGLST= <1H.CDCl3>
##$SSB= 0
##$STSI= 0
##$STSR= 0
##$SW_p= 3612.71676300578
##$SYMM= 0
##$S_DEV= 0
##$TDeff= 0
##$TDoff= 0
##$TI= <>
##$TILT= no
##$TM1= 0
##$TM2= 0
##$TOPLEV= 0
##$USERP1= <user>
##$USERP2= <user>
##$USERP3= <user>
##$USERP4= <user>
##$USERP5= <user>
##$WDW= 1
##$XDIM= 8192
##$YMAX_p= 0
##$YMIN_p= 0
$$ End of Bruker specific parameters
$$ ---------------------------------
##NTUPLES= NMR FID
##VAR_NAME=  TIME,          FID/REAL,        FID/IMAG
##SYMBOL=    X,             R,               I
##VAR_TYPE=  INDEPENDENT,   DEPENDENT,       DEPENDENT
##VAR_FORM=  AFFN,          ASDF,            ASDF
##VAR_DIM=   8192,          8192,            8192
##UNITS=     SECONDS,       ARBITRARY UNITS, ARBITRARY UNITS
##FACTOR=    0.0002496,     1,               1
##FIRST=     0,             0,               0
##LAST=      2.0444736,     0,               0
##MIN=       0,             -432208,         0
##MAX=       2.0444736,     305465,          0
$$ Real data points
##PAGE= N=1
##DATA TABLE= (X++(R..R)), XYDATA
$$ [...]
2099A128k762J783P24k413K644l77l028K474M08j997J574K34j573O94K435j751
$$ 1128 -1634 149 873 -1540 1104 727 -2301 173 581 -1416 158 392 -1181 -487 1948 197
2115A97j153L164k541j635M759j961k448M035k833j452L516j594j851K952p52
$$ 197 -956 2208 -333 -1968 2791 830 -1618 2417 -416 -1868 1648 54 -1797 1155 403
2130D03j746J878Q41k613N51J977k773J652K051l867J062K127l537J740J926k722
$$ 403 -1343 535 1376 -1237 -686 1291 -1482 170 2221 -1646 -584 1543 -1994 -254 1672 -1050
2146a050Q42J042j210L30M71j88m82J129J60j628J552n77j721J669n68n76J545
$$ -1050 -208 834 -376 -46 425 237 -245 884 1044 -584 968 391 -1330 339 -229 -805 740
2163G40j719L81R44j969J423P03j584J632j9j153J281l02j014M11J177j294l03
$$ 740 -979 -598 346 -1623 -200 503 -1081 551 532 -621 660 358 -656 -245 932 -362 -665
2180f65K159j803j256L010k216p35L944l003q81L863k838j096L266j821j152K354
$$ -665 1494 -309 -1565 1445 -771 -1506 2438 -565 -1446 2417 -421 -1517 1749 -72 -1224 1130
2196A130k37k236J693N71l129K408J612m100K505K187m790K527J947m053K234
$$ 1130 893 -1343 350 921 -2208 200 1812 -2288 217 2404 -2386 141 2088 -1965 269
2211B69J999l512J586J559k858j61K564j766j245L348j425k434L792j639k252
$$ 269 2268 -1244 342 1901 -957 -1118 1446 -320 -1565 1783 358 -2076 1716 77 -2175
2226b175M111j645j634L217j577j233J602m52o95N98K02l86o0J29p37K56J006
$$ -2175 1936 291 -1343 1874 297 -936 666 214 -481 117 319 -67 -127 2 -735 -479 527
2243E27j342J265K58j325J724j016j130K278j538o63K856k206o99J762j530m29
$$ 527 -815 450 708 -617 1107 91 -1039 1239 -299 -962 1894 -312 -1011 751 -779 -1208
2259a208J484k78j177J714L24k510J777J332l402K229J818l662K032J206l723
$$ -1208 276 -2 -1179 535 859 -1651 126 1458 -1944 285 2103 -1559 473 1679 -2044
2274b044K149J205l047J732J253k281M85J636j712o17K507j619j050L690k373
$$ -2044 105 1310 -1737 -5 1248 -1033 -548 1088 -624 -1241 1266 -353 -1403 2287 -86
2289h6j857L944k574j505M222k272j489L055j398j259J977k9j667J160J309k068
$$ -86 -1943 2001 -573 -2078 2144 -128 -1617 1438 40 -1219 758 729 -938 222 1531 -537
2305e37R61J464k885R93J397k487J654N64k504J364P8j251J533k51p41J077n54
$$ -537 424 1888 -997 -4 1393 -1094 560 1124 -1380 -16 62 -1189 344 93 -648 429 -125
2322a25j79L59J26q61L77J204j119J28J364k415N58J943k325J171J174k590J260
$$ -125 -304 55 181 -680 -303 901 -218 -90 1274 -1141 -583 1360 -965 206 1380 -1210 50
2339E0Q89j849J021O27j450M52R10o85r22J100o65j193K605q32j406K151j343
$$ 50 939 -910 111 738 -712 -260 650 -35 -957 143 -522 -1715 890 58 -1348 803 -540
2356e40r49K982j562n45J625j253J20J474j095p82N57J52j045J638J49k808J510
$$ -540 -1489 1493 -69 -614 1011 -242 -122 1352 257 -525 32 184 -861 777 926 -1882 -372
2373c72R33k513K357J078l430J757J165k073J674M50j744N93J063k96k73L68p39
$$ -372 561 -1952 405 1483 -1947 -190 975 -1098 576 1026 -718 -125 938 642 369 737 -2
2390br66J694K7q55J348j572n45K014j318K43Q57k249R95Q69q41L63k1j260L78
$$ -2 -968 726 753 -102 1246 -326 -871 1143 -175 68 925 -1324 -329 540 -301 62 41 -1219 -841
2409h41J150K31p10J95l60q79K167J22j374J393j109p02K272r68r66Q65j320K75
$$ -841 309 540 -170 25 -335 -1214 953 1075 -299 1094 -15 -717 1555 587 -379 486 -834 -559
2427e59J517n44r85k79M65o08J083J032k029Q4J195j396J213J107k082M85M05
$$ -559 958 414 -571 -850 -385 -993 90 1122 -907 -823 372 -1024 189 1296 -786 -301 104
2444A04n71J346j94j479J68J92O85N62j11q19j018J161J63l40J451j877r85K166
$$ 104 -467 879 685 -794 -626 -434 251 813 702 -117 -1135 26 189 -151 1300 -577 -1562 604
2462F04q19n8R42k035K2J413L35K86o01n63k11P10J394n67l62m0j312J359N46
$$ 604 -215 -273 669 -1366 -1344 69 404 690 89 -474 -685 25 1419 852 490 450 -862 497 1043
2481A043j296O10p81r60K212k46p72K81j339L11J321K10j41o60m91L09K75J232
$$ 1043 -253 357 -424 -1384 828 582 -190 91 -1248 -937 384 594 453 -207 -698 -389 -114 1118
2499A118q72p91N03n71J384P36j964L02L7o48K032j3j760K44j50l6P82L53p84
$$ 1118 246 -545 -42 -613 771 1507 -457 -155 -118 -766 1266 1253 -507 -263 -413 -449 333 686 -98
2518i8j149J044J30l97J095j262j036J732r0P8R78j592l09J049L2N85n1q20l15
$$ -98 -1247 -203 -73 -470 625 -637 -1673 59 -31 47 1025 -567 -876 173 205 790 739 -81 -396
2537c96K0J230o72k17K63j476Q05J242j144M01k44j286J443N14j82R9r86K46L46
$$ -396 -376 854 182 -35 228 -1248 -443 799 -345 56 -188 -1474 -31 483 301 400 -586 -340 6
2556FJ99M20q05k53N91k42P49k83p28J80k04R73L04r33K11n33p42J829m27q88
$$ 6 205 625 -180 -433 158 -84 665 382 -346 -166 -370 603 907 -26 185 -348 -1090 739 312 -576
2576e76Q51q67j99J231l35l12k40L06j05J93J131j312n53J457j020N43J320j787
$$ -576 275 -592 -791 440 105 -207 -447 -141 -246 -53 1078 -234 -787 670 -350 193 1513 -274
2594b74k11J037j020P30N30j114l78P13P1k82M86K5j731J388J131j695Q62P7j772
$$ -274 -485 552 -468 262 792 -322 -700 13 84 -198 288 313 -1418 -30 1101 -594 268 345 -1427
2613a427J248P72r48N52k34l63J48N42p9o52O08O2o36J054j28j061R43n82k97
$$ -1427 -179 593 -355 197 -37 -400 -252 290 211 -441 167 229 -407 647 519 -542 401 -181 -478
2632d78Q86k20l04P0m55N78k87N3O39j177P06P45q50M16r9m51J71M17M65j144
$$ -478 408 188 -116 -46 -501 77 -210 -157 482 -695 11 756 -94 322 223 -228 -57 360 825 -319
2652c19P5Q42j382O52J118j761N93R57j497Q88N37j344M48O83o34R6N97l56j100
$$ -319 -244 598 -784 -132 986 -775 -182 775 -722 166 703 -641 -193 490 -144 -48 549 193 -907
2671i07J186j86j098J866n57j440J927l82j451J709j07j461J418K73j260M71O69
$$ -907 279 93 -1005 861 304 -1136 791 409 -1042 667 560 -901 517 790 -470 1 670
2688F70j039l07J610r39p48J694j162p00J568r87m47J445o20k26M70m03Lj46M76
$$ 670 -369 -676 934 -5 -753 941 -221 -921 647 -340 -787 658 38 -188 282 -121 -118 -264 212
2707B12l59nO88p93j39O38o06J90K84k82L53j98%K11p17O79L42j101Q85j53q18
$$ 212 -147 -152 536 -257 -396 242 -364 -174 110 -172 181 -17 -17 194 -523 156 498 -603 282 129 -689
2728f89P11j17m07L38K41j80j32O03l26p78J387m60r50J809o09j285J731p78q78
$$ -689 22 -95 -502 -164 77 -103 -235 368 42 -736 651 191 -759 1050 441 -844 887 109 -769
2747g69J561o16r07J020L12j188N05O78j104q8J750j832K39J830k192K60J587
$$ -769 792 176 -731 289 601 -587 -82 596 -508 -596 1154 -678 -439 1391 -801 -541 1046
2764A046j576O4J316r57m14P66j20l94M83K00q43O23M74j219Q28L21j351J094
$$ 1046 -530 -466 850 -107 -521 245 125 -269 214 414 -429 194 668 -551 277 598 -753 341
2782C41K54j024P79m19m54O21k61J2K93j06k49N6j8J21j6M54m60K56K94p33L54
$$ 341 595 -429 350 -69 -523 98 -163 -151 142 36 -213 -157 -175 -54 -70 384 -76 180 474 -259 95
2803I5K56j015J002k58o94J122o23m16R44p19j32P38j43o28N50M42r42Q6P48r47
$$ 95 351 -664 338 80 -614 508 -115 -531 413 -306 -438 300 157 -471 79 521 -421 -335 413 -534
2823e34M31J060j586M67R41j490O45J100j377K34Q99p67O9M88l99m57P67K4j307
$$ -534 -103 957 -629 -162 779 -711 -66 1034 -343 -109 790 23 92 580 181 -276 491 515 -792
2842g92J316k25j425J299k5j229J533k31j035J144l03n37O17k1k16K01M28o23
$$ -792 524 299 -1126 173 148 -1081 452 221 -814 330 27 -510 107 86 -130 71 499 -124
2860a24k22J007q12j46J005r33J06O37j186N49M55o48M38J98n21K07K0k22p9K12
$$ -124 -346 661 -151 -297 708 -225 -119 518 -668 -119 336 -312 126 324 -197 10 30 -192 -271 -59
2880e9o1j02M38m53j46N74n21nR90o87j69R84j081K27O20q21J67N05n02q0L48
$$ -59 -120 -222 216 -237 -383 191 -330 -335 655 -32 -201 783 -298 -71 549 -272 -105 400 -102 -182 166
2901A66j74o31N69J21p52R31J32j190J238M6j137J241k54o76P61m8m74M40k02
$$ 166 -8 -639 -70 51 -701 230 362 -828 410 456 -681 560 306 -370 391 343 -131 309 107
2920A07k91N5N54l47j81O49o56j91R09j042M29N87j171N43L94q46O15M6n64M09
$$ 107 -184 -129 425 78 -103 546 -110 -301 608 -434 -5 582 -589 -46 348 -498 117 163 -401 8
2940HK66j75j73J30p2k06O82p9o64Q47m49n60J068o05n19Q71n58q1O77n38k38
$$ 8 274 99 -74 56 -16 -222 460 381 -283 564 115 -445 623 18 -501 370 -188 -269 408 -130 -368
2961c68K17j90J48L57P2o04P8N43n83M94M45j177N98N7m83O52k27o52R54m56K1
$$ -368 -151 -341 -193 164 236 -368 -290 253 -330 164 609 -568 30 87 -396 256 29 -623 331 -125 -104
2982a04N18m83j88K31N7k5j43M64o64k16J052o71j86Q70j129J72J127q58R8L77
$$ -104 414 -69 -257 -26 31 6 -137 327 -337 -553 499 -172 -358 512 -617 -445 682 -176 -78 299
3002B99r05N19L09n6K3o7q2l74N96O8o98M86k13m05J000m97n88P22k32j92P43
$$ 299 -606 -87 222 166 189 122 40 -334 262 330 -368 118 -95 -500 500 3 -585 137 -95 -287 456
3023D56k30l47J4K68l0n3J73k08l17M88l67J47L86o96L09K79o26Q62l61n59P64
$$ 456 226 -121 -107 161 131 78 251 43 -274 214 -153 -6 380 -316 -7 272 -354 508 147 -412 352
3044C52m24o6N55l59k32r5K67K9MJ01l63k51P68l59L9J79p38O03L50o54M63K37
$$ 352 -72 -138 417 58 -174 -269 -2 27 31 132 -231 -482 286 -73 -34 145 -593 10 360 -294 169 406
3066D06j006N49K85n02K96L27n19j59N34k2p79P88k97n99J235n0r20P65m63l69
$$ 406 -600 -51 234 -268 28 355 -164 -323 211 189 -590 198 -99 -698 537 487 -433 332 -131 -500
3086e00Q14l50l9K4j70r5K77L07l54l00O19l07J78O51q95r3O78o19M30K17m31
$$ -500 314 -36 -75 -51 -221 -316 -39 268 -86 -386 233 -74 104 755 -140 -233 445 -174 256 473 42
3107D2p4o0nP2k35L28q9j11N71n53o6K12j87J78k3J35K67q60M50K81p27R32j48
$$ 42 -32 -92 -97 -25 -260 68 -21 -132 439 -114 -180 32 -155 23 0 135 402 -458 -8 273 -454 478 330
3130C30p96P66k64k23N57k26m47J59L61j67j15J60n65r8J098p67k57R59p73l91
$$ 330 -466 300 36 -187 370 144 -303 -144 217 50 -65 95 -470 -568 530 -237 -494 465 -308 -699
3150f99J239q30j58R34o24p6L47L04p98K37O81p63m3R53j018J24O20q63K34M15
$$ -699 540 -290 -448 486 -138 -214 133 437 -361 -124 557 -206 -249 704 -314 -190 430 -433 -199 216
3170B16l81k5M48k33m33L57J53l61K83L93q21K30O14p88N03K68n47J52L09k50
$$ 216 -165 -190 258 25 -408 -51 102 -259 24 417 -404 -174 440 -348 155 423 -124 28 337 87
3190H7j30J80Q6l82j18Q74o61j35O18p90J63N48l64o3J99m7l47J77L08m35l2P98
$$ 87 -43 137 223 -159 -277 597 -64 -199 419 -371 -208 340 -24 -87 112 65 -282 -105 203 -232 -264 534
3212E34p74R6R73r16j81Q92n78r7O27n03k96M23J03p77L59M84r82N04P17j138
$$ 534 -240 -144 829 -87 -268 624 46 -51 576 73 -223 200 303 -474 -115 369 -613 -109 608 -530
3232e30L82O08j016N10N64p25J59L25n43r3P11k61m46O15L1r09J136k25j113J209
$$ -530 -148 460 -556 -46 518 -207 -48 277 -266 -359 352 91 -355 260 291 -618 518 293 -820 389
3252C89j96n65P13j53m68O8J67m7k13M49k04m50O71k4l91L38k27p4M32NK35m33
$$ 389 193 -372 341 188 -280 -212 -45 -92 -305 144 -60 -510 161 137 -254 84 -143 -217 215 220 455 22
3274B2n7K73k80R3M18o77K50j6l64M36J13p13L76L48j93j28L59k52o23O53L61
$$ 22 -35 238 -42 51 469 -208 42 26 -338 98 211 -502 -126 222 29 -99 260 8 -615 38 399
3295C99r73Q86L06j252J048k8p35L74L29l98K8O33n22k08M21k75m83J215o52p63
$$ 399 -574 312 618 -634 414 386 -349 25 354 -44 -16 617 95 -113 308 33 -450 765 113 -650
3315f50Q61l35o03J137k97p20Q55l77k35N94j48m94K23N87l72j17O11q61J00P95
$$ -650 211 -124 -727 410 113 -607 248 -129 -364 230 82 -412 -189 398 26 -91 520 -341 -241 554
3335E54o30K2N24p00J07R7k33J33j95K76N4j78L96k70j79M10n59J94M31j74L7
$$ 554 -76 -54 470 -230 -123 -26 -259 -126 -321 -45 9 -169 227 -43 -222 188 -371 -177 254 80 117
3356A17k20R3J67k07N39k67n10P01k10n83P18l80k80M44J80m98J6K96m38k16R80
$$ 117 -103 -10 157 -50 489 222 -288 413 203 -380 338 -42 -322 122 302 -196 -180 116 -322 -538 442
3377D42o08m68J133n28n16J047m06m42Q04l48k56N25l81M4L3K35l31N8K95n60
$$ 442 -166 -634 499 -29 -545 502 96 -346 458 110 -146 379 -2 42 75 310 -21 37 332 -228
3397b28J12L75o05L25L18o85M75K21n43L36k6l60J87k4J25O9j35K5l51K84K69
$$ -228 -116 259 -346 -21 297 -388 87 308 -235 101 75 -285 -98 -122 3 72 -63 -38 -389 -105 164
3418A64m56P36m28j06M58m60j24L95l15j3J98l12J99J25j59L5j24L49l82L59m9
$$ 164 -292 444 16 -90 368 -92 -216 179 -136 -149 49 -263 -64 61 -98 -63 -187 162 -220 139 90
3439I0l60J72K68m88O11l25k19Q09p22O6M45m51o4K93j00j12K95n2k67j73M60
$$ 90 -270 -98 170 -318 293 -32 -251 558 -164 -98 347 -104 -168 125 25 -87 208 156 -111 -284 176
3460A76o03M30N90p26q2N12p75O48J65o00K68K32m05K56j26j21P1M28p1l49K69
$$ 176 -427 3 593 -133 -215 297 -478 170 335 -265 3 235 -170 86 -40 -161 -90 338 267 -82 187
3481A87O9n85M83ln36Q35p11L9L68l71L8M15l68K93%L1l52J01J77q4j8J8p7K40
$$ 187 256 -329 154 151 -385 450 -261 -222 146 -225 -187 228 -140 153 153 184 -168 -67 110 26 8 26 -51 189
3505A89M7m56M45k01k98N11j45l58M44l27L9J12n0m3J52J0j11j52K85j80j2M18
$$ 189 236 -220 225 24 -274 237 92 -266 178 -149 -110 2 -48 -91 61 71 -40 -192 93 -87 -99 319
3527C19o07J06N33o67L44K28p66N93L60n24Q8k0j9n0J58J48l98L76q8m46N57K6
$$ 319 -288 -182 351 -316 28 256 -510 83 443 -81 7 -13 -32 -82 76 224 -174 202 114 -332 225 251
3549B51p52P76k64k37N65m14oL58l06J66q9j09Q6j95J67M9j22K79l60K62J84m54
$$ 251 -501 275 11 -226 339 -75 -81 277 -29 137 48 -61 25 -170 -3 46 -76 203 -157 105 289 -165
3571a65J15M52p57N18P8l76M07k87j22K01l8j27k0J48l0l08J75K54l08K94l18
$$ -165 -50 402 -355 163 241 -135 272 -15 -137 64 26 -101 -121 27 -3 -311 -136 118 -190 104 -214
3592b14J51L10m63L02N9l78K64Ml85P10m22j59M30m24K47j97J89j42K6L88m46
$$ -214 -63 247 -216 86 145 -233 31 35 -350 360 -62 -221 209 -215 32 -165 24 -118 -92 296 -150
3613a50m2M41m28k02O74m58j6M53m04k29N54j52j60Q4K28j06k42M07m09J83K73
$$ -150 -192 249 -179 -381 293 -165 -181 272 -132 -361 193 41 -119 -35 193 87 -155 252 -157 26 299
3634B99o62N40L73q31K99K02m65L60m0k00K0J54j15j79J90L66o48O80q1n48L29
$$ 299 -363 177 550 -281 18 220 -245 115 75 -125 -105 49 -66 -245 -55 311 -337 343 262 -286 43
3655D3J49j52m4Q2j68K91l07K26k93J56K34l37K33J50m05J88p9k04J18j5M0P1
$$ 43 192 40 -4 78 -90 201 -106 120 -173 -17 217 -120 113 263 -142 46 -33 -237 -119 -134 -94 -23
3677b3j87K98k52N2M44n73J41N53p23N81P7n70K48J18k16J17k5Ml19K71K47n75
$$ -23 -210 88 -164 -112 332 -241 -100 453 -270 311 388 -182 66 184 -32 85 60 64 -255 16 263 -312
3699c12L52R3p28N40L93r09N78Q6m79N43Q4k15KN1J30n02O29n7p94Q00j89n18
$$ -312 40 133 -595 -55 338 -571 7 93 -386 157 241 26 28 79 209 -293 336 279 -515 285 96 -422
3721d22Q07l27m30N96k81J63j13k4k74J94J60J31n42O65l97k21O53n19j06O09
$$ -422 385 58 -372 224 -57 106 -7 -31 -305 -111 49 180 -362 303 -94 -315 338 -181 -287 322
3741C22k41L1Q0J5n6k78J83K98m95N93k73m15L92q7j71M75m59q5K14m1J17l62
$$ 322 81 112 192 207 151 -127 56 354 -141 452 179 -236 156 69 -102 373 -86 -171 43 2 119 -243
3763b43K78p8l03O69j00n01N52j99m73Q72l85l48L08K2l9L5L11l97m43P18k70
$$ -243 35 -43 -346 323 223 -278 274 75 -398 474 89 -259 49 71 32 67 378 -19 -462 256 -14
3784a4l29R38q63l89J072o57M7M10n00J04m6M24j89j42L65m00N8P88n71k43O45
$$ -14 -343 595 -268 -657 415 -242 -195 215 -285 -181 -227 197 8 -134 231 -169 -111 677 106 -137 508
3805E08o92J14L86m12J25K7j43j7jL23m08j00M00l62K10L71m87LK86k84M92j67
$$ 508 -184 -70 316 -96 29 56 -87 -104 -105 218 -190 -290 110 -252 -42 329 -158 -155 131 -153 339 172
3827A72k80J21j23J62J77j64L2j84j91N96k39o1O7k73J56J93r2L9l47P0j5l9N96
$$ 172 -108 13 -110 52 229 65 97 -87 -278 318 79 18 85 -188 -32 161 69 108 -239 -169 -184 -223 373
3850C73n48q4N75n44K35K66l46j45M35k5j88K09j77k14K7N04n34K71J39r43M39
$$ 373 -175 -259 316 -228 7 273 -73 -218 217 192 4 213 36 -178 -151 353 -181 90 229 -714 -275
3871b75M34m44L03K2n25N12J15k00K3j76K08k06K49L02n40J74J03k88N56p0o28
$$ -275 159 -285 18 40 -485 27 142 -58 -35 -211 -3 -209 40 342 -198 -24 79 -209 347 277 -351
3892c51N31l55J33K07j17o1j61J85K52k68K8p1l52M00Kq0K44k77J84k3m4M57l60
$$ -351 180 -175 -42 165 48 -13 -174 11 263 -5 23 -48 -400 0 2 -78 166 -111 73 50 6 463 103
3915A03j82M99n57L37J76m72J19k7k25M52p5k28R0k00K12r3K35j13l68K49L10
$$ 103 -79 420 -137 200 376 -96 23 -4 -229 223 148 -80 10 -190 22 -71 164 51 -317 -68 242
3936B42m65M81j6n93N41j43j5R9Kj20j22J49K20m37J93J0m42Q47l33k84M52k88
$$ 242 -223 258 242 -351 190 47 32 131 133 13 -109 40 260 -177 16 26 -416 431 98 -186 266 -22
3958b2m2K33j75o9K0j93L11K6q4J6k76K63j25Q9K99l91L9L84l88PK02n32M88l59
$$ -22 -64 169 -6 -75 -55 -248 63 89 5 21 -255 8 -117 -28 271 -120 -81 303 -85 -78 124 -408 80 -279
3982b79J20L25m84L02J76j90J50j62Q7P8k02J12L2k22K54m09M71J67o35M07J07
$$ -279 -159 166 -318 -16 160 -30 120 -42 45 123 -79 33 65 -157 97 -312 159 326 -309 98 205
4003B05n91L25l2o6N45o75L72Qn5N6l80L73R6l45M26k03k79N32l59j52M33m04
$$ 205 -386 -61 -93 -159 386 -289 83 91 36 92 -288 85 181 -164 262 59 -220 312 -47 -199 234 -170
4025a70O8K50k68J20q9K40j10o9J00k47p5L52m37N9L98l86K32Q0l57M01M3l63
$$ -170 -102 148 -120 0 -89 151 41 -28 72 -175 -250 102 -335 -276 122 -264 -32 48 -309 92 135 -228
4047b28K68n3M0j12R1n7j37J02K83l98J53O6k48M74l69p7M74m18K78nl39M06k73
$$ -228 40 -13 27 -85 6 -51 -188 -86 197 -201 -48 18 -230 244 -125 -202 272 -146 132 127 -212 194 -79
4070g9k2K17o7q8M6r0J47j0o4J05j58Q0J9q9L21k45k73L58j72N7J86l75J11J46
$$ -79 -101 116 49 -39 7 -83 64 54 -10 95 -63 17 36 -53 268 23 -250 108 -64 -7 179 -196 -85 61
4094F1j31K03j59j4m9J78J69m96K79K59m64J90Q9k40L25n7l08J87j02n1J51K5
$$ 61 -70 133 -26 -40 -89 89 258 -238 41 300 -164 26 115 -125 200 143 -165 22 -80 -131 20 45
4116D5j50lP7J19l86L92K17m75M41k03k80K52r7p3K16q1P3l1m0L8j78J36J35m08
$$ 45 -105 -108 -31 88 -298 94 311 -164 277 74 -206 46 -51 -124 92 11 84 53 13 51 -127 9 144 -264
4140b64L73m3m04N40m01P0J36r6J66L0l32L48j86N7Q4k70M42j68k18K31n6j15
$$ -264 109 66 -338 202 -199 -129 7 -89 77 107 -225 123 -63 -6 78 -192 250 82 -136 95 39 -76
4162g6R3l7O8j65L68rn09M18O5m91L90j26l51P40k36j43n3L5R7rP9Rk93K67J35
$$ -76 17 -20 48 -117 251 242 -267 151 216 -275 115 -11 -362 378 142 -1 -54 -19 78 69 148 157 -136 131 266
4187B66n65N92r6l65N22k59k67L71j73j30M7J25J2k26L57j53l64P22m69k64N80
$$ 266 -299 293 197 -168 354 95 -172 199 26 -104 -57 68 80 -146 211 58 -306 416 -53 -317 263
4208B63m26l3M57l07j84L12l11M11j39N3p8k20M09k31j95O25n63J4M91n10J17
$$ 263 -163 -196 261 -46 -230 82 -229 182 43 96 18 -202 207 -24 -219 406 -157 -143 348 -162 -45
4229d5J07j24n6mJ37k2k29L54k40j86P51l68j82J37j75q9L75j19K9j55J06m5k36
$$ -45 62 -62 -118 -122 15 -7 -236 118 -122 -308 443 75 -107 30 -145 -234 141 22 51 -104 2 -43 -279
4252b79M67j48n15O40l09J7M42m77p6M39j94PJ76k00O4k73N76l84k4N27n09j77
$$ -279 188 40 -475 165 -144 -127 315 -162 -238 201 7 14 190 -10 54 -219 357 -27 -51 476 -33 -210
4274b10P09o41M0N14p23K93J72j41j60K02q0j44J68K29n71J97M82o45L40K81n20
$$ -210 499 -142 -102 412 -311 -18 154 13 -147 55 -25 -169 -1 228 -343 -146 336 -309 31 312 -208
4295b08J27K14M6k51K69rl88K38K38k51O9N6l95K22L73o56M58q7k80J85O0J64
$$ -208 -81 133 179 -72 197 188 -200 38 276 25 94 150 -245 -23 350 -306 152 65 -215 -30 30 194
4317A94l49j56M70k80M6M32p68K40K73r7J42j20k23L03o6R8j36r4J68m29N77L6
$$ 194 -155 -311 159 -121 -75 357 -411 -171 102 5 147 27 -196 107 41 139 3 -91 77 -352 225 261
4339B61m49K43K06o08N37ok83J41j38P0K57j29O9m45M49N5m38M83j45n53N63r2
$$ 261 -188 55 261 -347 190 184 -99 42 -96 -26 231 102 171 -274 175 230 -208 275 130 -423 140 48
4361D8k58M80k05m37M45l0R7l44K42m6m75N95J04m48N75l59k80L90p4r5J30k50
$$ 48 -210 270 65 -372 73 43 140 -204 38 -8 -483 112 216 -232 343 -16 -296 94 20 -75 55 -195
4383a95K03N1m8K38m77J64J84k71J87M6l09K51m9J17k48K0J01m9n0M56m32K55
$$ -195 8 59 11 249 -228 -64 120 -151 36 82 -227 24 -25 92 -156 -136 -35 -84 -134 322 -110 145
4405A45M4n43M66J11m28J74k0p0L20j03K8l26QL69k20K57j41n97P80m31k0M04
$$ 145 189 -354 112 223 -205 -31 -51 -121 199 96 124 -202 -194 175 -45 212 71 -526 254 -177 -197 207
4427B07k28k30M27j77L9J02L5k46p1K36q7j66L29l17j7L13k97J22K65m17J68J90
$$ 207 -21 -251 176 -1 38 140 175 -71 -142 94 7 -159 170 -147 -164 149 -148 -26 239 -178 -10 180
4449A80k93K33j31j65J77K2K31k22n4N2j0M2J07l83L20l9k05L27l50K58K19n27
$$ 180 -113 120 -11 -176 1 23 254 32 -22 30 20 62 169 -214 106 67 -138 189 -161 97 316 -211
4471b11M26j48l98M00p8l3R4J1K3j30K5J60j72J53K5l66K94o4j96N21l84n9J71
$$ -211 215 67 -331 69 -9 -42 52 63 86 -44 -19 141 -31 122 147 -219 75 11 -185 336 -48 -107 64
4494F4l42J26K75k80J06M6k61J07K60J3k93N2L65m35K29J57m38K46R4k64L02p8
$$ 64 -278 -152 123 -157 -51 -5 -266 -159 101 114 -179 -127 238 -197 32 189 -249 -3 91 -173 129 51
4516E1k00K13j47J6J39j33J07j72J47J80m07L85l39K4L91l03j21L79m73N01j02
$$ 51 -149 64 -83 -67 72 -61 46 -126 21 201 -206 179 -160 -136 255 -48 -169 210 -263 238 136
4537A36q3J77k25o0L45k84J63o7j89J61k5k31L28j81J13j08p0M27l47j12L97k36
$$ 136 53 230 5 -55 290 6 169 102 -87 74 49 -182 146 -35 78 -30 -100 327 -20 -132 265 29
4559B9j19K15j92J56k9j05N8J19J5o7l31L24q4j89M38l04J42J62k97rJ23k34L39
$$ 29 -90 125 -67 89 60 -45 13 132 147 80 -251 73 -11 -200 238 -66 76 238 -59 -68 55 -179 160
4582A60k52R8m5j71K78k13J16R3l89K80J52j83K22r7j10K19j30N9M4k64K48k30
$$ 160 -92 6 -39 -210 68 -145 -29 64 -325 -45 107 -76 146 49 -61 158 28 87 131 -133 115 -115
4604a15l3L47k54Kql11M10k52J46J97l05P5J58k35J82J3j51M14l81J43Oj68M19
$$ -115 -148 199 -55 -53 -61 -372 38 -214 -68 129 -176 -101 57 -178 4 17 -134 280 -101 42 48 -120 299
4627B99k37l00M03j26j51K26k67J77P4k33K00j37L4Pn2K08j41j80L43k75J90L
$$ 299 62 -238 165 39 -112 114 -153 24 98 -135 65 -72 -38 -31 -83 125 -16 -196 147 -128 62 65
4649F5k34K06j05L1K02k60J19K08l74M35j73k51N48m70r3J51k60K82m5o0K28k86
$$ 65 -169 37 -68 -37 165 -95 24 232 -142 293 120 -131 417 -53 -146 5 -255 27 -18 -78 150 -136
4671a36J12J28k72K48j02k77N95k76k56M18l68J09R8m7J40j52K53l8k55L13m11
$$ -136 -24 104 -168 80 -22 -299 296 20 -236 182 -186 -77 21 -26 114 -38 215 177 -78 235 -176
4692a76J32K49l31J48K4j93J77M4k79K93j40m7Q5n6L17k24K7J96l17N0L79m65
$$ -176 -44 205 -126 22 46 -147 30 74 -205 88 -52 -99 -14 -70 247 23 50 246 -71 -21 358 -107
4714a07J67J45k85O7Q0r9k3j4J57k26j45M79l79K30J88m40L49p6k54J04j7J54
$$ -107 60 205 -80 -13 67 -32 -55 -69 88 -138 -283 196 -183 47 235 -205 144 68 -186 -82 -99 55
4736E5j6r9R4j0j64M27n89L65J03k33J80J77l17n0J25j07J77k68K74j35p4K43
$$ 55 39 -60 34 24 -140 287 -302 63 166 -67 113 290 -27 -77 48 -59 118 -150 124 -11 -85 158
4758A58l58J73L05p19L18J81k55L03M1k72K02q1q3J72r7o9k18M33K7m55M05n2
$$ 158 -200 -27 278 -441 -123 58 -197 106 147 -125 77 -4 -87 85 -12 -81 -299 134 161 -294 111 59
4780E9m17N38n8k69K64j49m3J01m8J12j98J22Q6k55K67jk66L61k74N4P1J19k11
$$ 59 -358 180 122 -147 117 -32 -75 26 -22 90 -108 14 100 -155 112 111 -155 206 -68 -14 57 176 -35
4803c5R0k40L65k93p0M61m51K09R6l93L30j40r9J24O2J2jP7r8l23M37Q4m70L58
$$ -35 55 -185 180 -113 -183 278 -173 36 132 -261 69 -71 -170 -46 16 28 27 104 6 -317 120 204 -266 92
4827I2J23m63M54j2n49N40j38j76L10k9j77j64M57k68l32M80l47k44P09l18j41
$$ 92 215 -248 206 194 -355 185 47 -129 181 152 -25 -189 268 0 -332 148 -199 -443 266 -52 -193
4848a93M15m69J0N02l42M5J68k06N7j12L37l11k88O12j69j43L32l83J88K55m58
$$ -193 222 -247 -237 265 -77 -32 136 -70 -13 -125 212 -99 -387 225 56 -87 245 -138 50 305 -153
4869a53K37o5k47K00k08K71Q9l26M47k90j46M20k37o3J93j53k5J66M1j54N1J30
$$ -153 84 19 -228 -28 -236 35 124 -202 245 -45 -191 229 -8 -71 122 -31 -56 110 151 -3 48 178
4891A78l26n7P53m92m08O37j98k00L25k27M5R3l6j48Q0K94k67k48O73p02K52J33
$$ 178 -148 -205 548 56 -352 285 87 -113 212 -15 30 123 87 -61 19 313 46 -202 471 -231 21 154
4913A54k55j41N46o35K67L29l97R2J6J61k83J43J71k49Q7M02n93L87j61l59L16
$$ 154 -101 -242 304 -331 -64 265 -132 -40 -24 137 -146 -3 168 -81 6 408 -185 202 41 -318 -2
4934bQ1l10M49l70K09R3k43J73j40J0K65l59KK41l30K26R9m1L4k33J40L9l25N18
$$ -2 79 -231 218 -152 57 150 -93 80 -60 -50 215 -144 -142 99 -231 -5 94 53 87 -146 -6 33 -292 226
4958B26q3l93N85m84p0L98m68K08K38j63k4O9n3N6k63M46m39K01J12l92L53K03
$$ 226 143 -250 335 -149 -219 179 -289 -81 157 -6 -30 39 -14 42 -221 225 -214 -13 99 -293 60 263
4980B63m66K66K03m79L47j59K4O2l1j7k48K83Lk38J71R4k93L19k03j69N16m34
$$ 263 -203 63 266 -213 134 -25 -1 61 30 13 -235 48 51 -187 -16 78 -215 104 -99 -268 248 -186
5002a86P0K97k18p4L1R3K42j02k52L50l84K58n0n8K93l05j22L25n12N31j99j86
$$ -186 -116 181 -37 -111 -80 13 255 153 -99 251 -133 125 75 17 310 5 -117 208 -304 227 28 -158
5024a58L78l88j7K84k34J41n5o4K43j56L8J2n3K6n4K32r6k71J60J84l81L86M1
$$ -158 220 -168 -185 99 -135 6 -49 -113 130 -26 12 24 -29 -3 -57 175 79 -192 -32 152 -229 157 198
5047A98o28N61j04k31L58l43K08p1j3M4j89J38J03l40M76j30k99L71j28NL41n52
$$ 198 -430 131 27 -204 154 -189 19 -52 -65 -21 -210 -72 31 -309 167 37 -262 109 -19 -14 327 -225
5069b25K84R0j44J29l7j22J54l02J19J38l71L54k06K31J49l58O2N3j91K75k59
$$ -225 59 149 5 134 97 -25 129 -173 -54 84 -287 67 -139 92 241 -117 -55 -2 -193 82 -177
5090a77L4L12j79q3K21m20K63Q1O2K7k27J53J20k38L34m17K10k9j94J26J43k53
$$ -177 -143 169 -10 -93 128 -292 -29 52 114 141 -86 67 187 -51 283 -134 76 47 -147 -21 122 -131
5112a31lJ76k44L71k07K3Mq5R2m4Q9k6k23K51Lj84K73k29p5K90k79P4J59j96J22
$$ -131 -134 42 -202 169 -38 -15 -11 -96 -4 -48 41 15 -208 43 46 -138 135 -94 -169 121 -158 -84 75 -121 1
5137AQ7k64M2J35J4p4l26N91m10O4L38l06J27J76m16M38j87j21K52k38K41j33
$$ 1 88 -176 -134 1 15 -59 -385 206 -204 -140 198 -108 19 195 -221 217 30 -91 161 -77 164 31
5159C1j41M33m13pK28l92J82K46m27M19Ol15K44j54R9k4j24M09k12j87L38n01
$$ 31 -110 323 -90 -97 131 -261 -79 167 -260 159 165 -150 94 -60 39 15 -109 300 88 -99 239 -262
5181b62K71J86l61L71j50m06M07j22J08J35m08K85J8k02K60k11J71q8r8J60N2
$$ -262 9 195 -166 205 55 -351 56 -66 42 177 -231 54 72 -130 130 -81 90 2 -96 64 116
5202A16j55J23k05J08J1j19L46k05l7J30l32K06K66o51N53k66k4J35M4n3l3k04
$$ 116 -39 84 -121 -13 -2 -121 225 20 -17 113 -219 -13 253 -398 155 -111 -135 0 44 -9 -42 -246
5224b46M85m11K7M24l82J74K50n31K24J52l69L04j22j95K35j2J39o9j75K68l70
$$ -246 239 -172 -145 279 -103 71 321 -210 14 166 -203 101 -21 -216 19 7 146 77 -98 170 -200
5245b00L89Q5l81J77J21m89M68k81j23L14j59J10k1J0l0j07L01p9l12M25k73m5
$$ -200 189 274 -107 70 191 -298 170 -111 -234 80 -79 31 10 20 -10 -117 184 105 -207 218 -55 -100
5267a00J73nj64L96n47L51j63o1J83q0P8j1m7J95l1k23J59j57K07L3k32Q1j30
$$ -100 73 68 -96 300 -247 104 -59 -120 63 -17 61 50 3 198 167 -56 103 -54 153 186 -46 35 -95
5290i5J6J93l83K24J35l14L73m8l71M61k36j85M13k96K15j29J10j30j16L17j28
$$ -95 -79 114 -269 -45 90 -224 149 101 -270 191 -45 -230 183 -113 102 -27 83 -47 -163 154 26
5311B6j45L91l11k88N46k79j51M47l58M8J34m6k1r7J56r9o1K42j34j86M14l88
$$ 26 -119 272 -39 -327 219 -60 -211 236 -122 -74 60 14 -7 -104 52 -47 -108 134 0 -186 228 -160
5333a60K6L72m77L22O5l60K70m5j05J61k02M01l17o5N17m26l3K49l13J24K67l96
$$ -160 -134 238 -239 83 148 -212 58 13 -92 69 -133 268 -49 -114 403 -23 -56 193 -120 4 271 -125
5355a25J69j77K40N7j16J39r3j19L34k87n9L15m10J31O2o1k9L1j05L4P6K44m01
$$ -125 44 -133 107 164 48 187 94 -25 309 22 -37 278 -132 -1 61 0 -29 2 -103 -69 7 251 -150
5378a50n7N02l73m3M40m58P4L35j45j41M5k33L04j92J53l5q5L53n13K11K02l92
$$ -150 -207 295 -78 -121 319 -139 -65 270 125 -16 29 -204 100 -92 61 26 -59 294 -219 -8 194 -198
5400a98L18J94o42N12j42k45M22l43n9J23J4N2lp2L97p16M62K00n87K84Nj15J72
$$ -198 120 314 -328 184 42 -203 219 -124 -183 -60 -46 6 3 -69 328 -388 74 274 -313 -29 -24 -139 33
5423C3JpJ58j90J49j79j43L93l97L22q0p5J10P4l88J76R0J3N8n3J00m01K7L21
$$ 33 34 27 185 -5 144 -35 -178 215 -182 140 60 -15 95 169 -219 -43 47 60 118 65 165 -236 -209 112
5447A12l84L49K16m78L78j76l08N20k71j03K06q2J34j62J63N3n51L70K21m49K84
$$ 112 -272 77 293 -185 193 17 -291 229 -42 -145 61 -21 113 -49 114 167 -384 -14 207 -242 42
5468D2j93j53M61l82J28K41o4j12K5j80L42j85M6m8jO2l7k7J12n5J75q0k44K43
$$ 42 -151 -304 157 -225 -97 144 80 -32 -7 -187 155 -30 16 -32 -33 29 -8 -35 77 22 197 117 -127 116
5492A16n8j53J33j30nL76m14l6J51j19J98l0QL0p5k3LM8K30m55K68r1n10O52j4
$$ 116 58 -95 38 -92 -97 279 -135 -171 -20 -139 59 29 37 67 -8 -31 -28 20 250 -205 63 -28 -538 114 100
5517A00k23N00n11J04k8j1K37j07n8M9j62K69j10j94M14k34k20N67o01J85L35
$$ 100 -123 377 -134 -30 -58 -69 168 61 3 52 -110 159 49 -145 269 35 -185 382 -219 -34 301
5538C01m77L83l8k23P7j11R7J27l45L05o3j78L49n07L09r1j82J39K42j61K39j26
$$ 301 -176 207 169 -54 23 -88 9 136 -209 96 33 -145 204 -303 6 -85 -267 -128 114 -47 192 66
5560F6k29L07r4j94K64j34J39R1J9k03j99K94j53j14M48l52J05P4l91J83K0j59
$$ 66 -163 144 50 -144 120 -14 125 216 235 32 -167 127 -26 -140 308 -44 61 135 -256 -73 -53 -212
5582b12K13j6k25L77k39J5N4k5K26j98J03m6l02L63L5l13M08j74q2J59j37J38
$$ -212 1 -15 -240 137 -102 -87 -33 -58 168 -30 73 27 -275 88 123 -190 218 44 -38 121 -16 122
5604A22N0j49J03j74j44M27j43KNj20K02k66l7K16l36L64k08l8K72p4j52J18j27
$$ 122 172 23 126 -48 -192 235 92 94 99 -21 181 -85 -122 94 -242 122 -86 -124 148 74 -78 40 -87
5627h7J60j28l9J93j62m7N4m0K65o1k60M08k62o4K97m25L35P0l73K58j04M3Q0
$$ -87 73 -55 -94 99 -63 -110 -56 -96 169 108 -152 256 -6 -70 227 -198 137 207 -166 92 -12 31 111
5650A11k90K75n7j03J48p3L4R9k48J10m1j08J77j38j4K53l36K42o3k1P7o9m4J31
$$ 111 -179 96 39 -64 84 11 45 144 -104 6 -35 -143 34 -104 -118 135 -201 41 -22 -43 34 -35 -79 52
5674E2l1J25m7k09R9j73K84J04m48M54j85l25N36l53k2K25j11J22J21l90L51j59
$$ 52 21 146 99 -110 -11 -184 100 204 -244 210 25 -300 236 -117 -139 86 -25 97 218 -172 179 20
5696B0j08L32m76K24M7l08N29k59m6J59j60R3P0j91K1L7r7K91k35K34l5n86N97
$$ 20 -88 244 -232 -8 39 -269 260 1 -45 114 -46 47 117 -74 -53 -16 -113 178 -57 177 142 -444 153
5719A53l32l5M57j77m0K03l67K18j59q4M38m96K44j19K1K00j96M3L62n24K19K82
$$ 153 -179 -214 243 66 26 229 -138 80 -79 -163 275 -221 23 -96 -75 125 -71 -28 334 -190 29 311
5741C11m22O8k9k23L50j93P7J26l57L86j08m9J62r9j2O1j55K01j97P7K47m07K35
$$ 311 -111 -43 -72 -295 55 -138 -61 65 -292 94 -14 -63 99 0 -12 49 -106 95 -102 -25 222 -185 50
5764E0R6k70L32l12n6M32l01K3N8RM6n5o5J29k89J7K38l22O20l84m30N35j56k58
$$ 50 146 -124 208 -104 -160 272 -29 -6 52 61 107 52 -13 116 -173 -156 82 -240 380 -4 -434 101 -55 -313
5788c13M13j01oJ14q8O6m2J58j97p2O3J8p2L51m29K7M02l25L5L6j37J36K16l46
$$ -313 100 -1 -7 107 19 85 43 201 4 -68 -5 13 -59 292 -137 -110 292 -33 2 38 -99 37 253 -93
5812i3Q2k9K2j9j0l2LM7K11l52J18L8l18O09m69O9J43j59K79j59j33K65k89J76
$$ -93 -11 -40 -18 -37 -47 -79 -76 -29 182 -170 -52 -14 -332 277 -192 -123 20 -139 140 -19 -152 113 -176 0
5836@R7m25L12K6j28J3K31j01J1l10N22k48n8K71k56NN18n72nK67m34J63K49q6
$$ 0 97 -328 -16 10 -118 -105 126 25 36 -274 248 0 -58 213 -43 -38 480 -92 -97 170 -264 -101 148 62
5860F2k38K06N9j97J48K39m79J92K39n64N25Pl60K03J78k72J82o7j24r8J39M6
$$ 62 -176 30 89 -108 40 279 -200 -8 231 -333 192 199 -161 42 220 -52 130 63 -61 -159 -20 26
5882B6pj2O8j93M78k98k51M78l53l5K08k26J55K22l70K39j31Q9J65l01J8Kq4L35
$$ 26 19 7 75 -118 360 62 -189 289 -64 -99 109 -117 38 260 -110 129 -2 87 252 -49 -31 -29 -113 222
5906B22k07RJ9k02L29k07k48M88m38O4J41l50M08J2j64J60p8n0K11n4k7l9q8J07
$$ 222 15 24 43 -159 170 -37 -285 203 -235 -171 -30 -380 28 40 -124 36 -42 -92 119 65 38 -1 -89 18
5930A8j37J67P4l46K61Pm63O57k55j25L59j05q2r4o7j22L17n6j9j89L63j53l96
$$ 18 -119 48 122 -224 37 44 -419 238 -17 -142 217 112 30 -64 -131 -253 64 8 -11 -200 163 10 -386
5953c86O02k50m3L35l44Q5J02l58K73J00m2N8j19J52j45r1K34o4Mj4k97J87O3
$$ -386 216 -34 -77 258 -86 -1 101 -257 16 116 74 132 13 165 20 -71 163 99 103 89 -208 -21 42
5976D2k14J47J4J08j01r0K18K08n26L68j77k63K84l18L55k8j54K57l47L62q6q1
$$ 42 -172 -25 -11 97 -4 -94 124 332 -194 174 -3 -266 18 -300 55 27 -127 130 -217 145 59 -22
5998b2J83j39k78N75l01k70M95l81JK37q2P6l8j49K98k76J68k3k02L51m04N2K63
$$ -22 161 22 -256 319 18 -252 243 -138 -137 100 18 94 56 -93 205 -71 97 74 -128 223 -181 -129 134
6021A34m53L63L4o02O97j90p1J31k93Q3L82k54J50k02R9J94k98J22R3j96qj8J26
$$ 134 -319 44 78 -524 173 -17 -88 43 -250 -167 215 -39 111 -91 8 202 -96 26 119 -77 -85 -103 23
6044B3J54m03M07j63k53L88p6k99M06k87MK33j71N9J48k57K61j78J69j74k57M74
$$ 23 177 -226 181 18 -235 153 77 -222 184 -103 -99 134 -37 22 170 -87 174 -4 165 -9 -266 208
6066B08k66n9M60o43K60J76l46K32N0j78K18j56m5R2o8P4r6P7K64n47M40Rn56
$$ 208 -58 -117 343 -300 -40 136 -210 22 72 -106 112 -44 -89 3 -65 9 -87 -10 254 -293 147 156 -400
6089d00N09K2k46K62p9p1J04k13K34n0k37M16k66J73j28j07J79k44k37N88l55
$$ -400 109 131 -115 147 68 -3 101 -112 122 72 -165 251 -15 158 30 -77 102 -142 -379 209 -146
6110a46M0Q3j93L07M7l44L28k35J86J05k42k2Q7JJ50j68j13J48m4R6k04r5L69
$$ -146 -106 -23 -216 91 138 -206 122 -113 73 178 -64 -86 1 2 152 -16 -129 19 -25 71 -133 -228 141
6133A41l85L13R1l53L82k7l22L14k9j96K6r5K65n0l2k0Rr9J35k74L70r0k20K18
$$ 141 -244 69 160 -193 189 162 -160 154 125 -71 -45 -140 125 75 43 23 32 -67 68 -206 164 74 -146 72
6157G2j27j17K88j01o2K47k28j5rK23rm07L79p5j75K25k52J07J48k31P1J35k67
$$ 72 -55 -172 116 15 -47 200 -28 -43 -52 171 162 -245 134 59 -116 109 -143 -36 112 -119 -48 87 -180
6180a80L74j46j32K03k10n5K91k6Q7m60M11J51m38K37j58m3K15j76P9J38l43K36
$$ -180 194 48 -84 119 -91 -146 145 119 206 -254 157 308 -130 107 -51 -94 121 -55 24 162 -181 55
6202E5k8j48K43l05O8K44k02L00n8k34J13j71N7K26m08M29j44l26N20k10o4K92
$$ 55 27 -121 122 -183 -115 129 -73 227 169 -65 48 -123 -66 160 -248 181 37 -289 231 21 -43 249
6224B49l87K31J42l30K88N2j71K5j30K83l83N0J69k10l3M79m21J36K16m92J85
$$ 249 -138 93 235 -95 193 245 74 99 -31 252 -131 -81 88 -122 -155 324 -97 39 255 -237 -52
6245e2N9k3j07N5O7K07m23K61j64JL60n29J42K50k33J53n8L3Q5k42K17j59J8L27
$$ -52 7 -16 -123 -68 -1 206 -217 44 -120 -119 241 -288 -146 104 -129 24 -34 -1 84 -158 59 -100 -82 245
6269B45m09J95K01m73J81J27l10L15j10j86K24n8J10j31r7L88l61L4K18j74L9
$$ 245 -164 31 232 -241 -60 67 -243 72 -38 -224 0 -58 52 -79 -176 212 -149 -115 103 -71 -32
6290c2J85l53J50Q8j74J00p0Q0N3j56J67k8O5J04l96L01Q6l73K98N3k49K04j99
$$ -32 153 -200 -50 38 -136 -36 -106 -26 27 -129 38 10 75 179 -217 84 170 -203 95 148 -101 103 -96
6313i6J43J11k55K31j27n7L22k91L1J94m67K64P2k50K37k04M0K08o9L7m8J01n2
$$ -96 47 158 -97 134 7 -50 272 -19 12 206 -261 3 75 -175 62 -142 -102 106 37 74 26 127 75
6336G5k81L73%l61K53Rk45M14l20j02L54k18PQk4r8L9J2L46m49L49j55k07K87
$$ 75 -206 167 167 -194 59 68 -177 237 -83 -185 169 -49 -42 -34 -58 -156 -117 -105 241 -208 141 -14 -221 66
6360F6j13l9J00j77L13j40Mp3P0N4j79Q3J87k55Q2K77m84J30J50k49K01J9l6K45
$$ 66 -47 -86 14 -163 150 10 14 -59 11 65 -114 -31 156 -99 -17 260 -224 -94 56 -193 8 27 -9 236
6384B36m24J10L5j7Q1J9j87J97n3j09J01k80L34N7k76K28j28K09p2l39L12K5j90
$$ 236 -188 -78 -43 -60 21 40 -147 50 -3 -112 -11 -291 43 100 -176 52 -76 133 61 -278 34 59 -131
6407a31L45l29R1K93k51j13Nl2O9J01J64j35k95M14l25J63J70l27K5L37m15J52
$$ -131 214 -115 -24 269 18 -95 -90 -122 -53 48 212 77 -218 196 -129 34 204 -123 -98 239 -176 -24
6429b4K43m35L79L7k56J91j24J21k30j19M10m52J54K72l23K57kk02K07j74k2L02
$$ -24 219 -216 163 200 -56 135 11 132 -98 -217 193 -259 -105 167 -156 101 99 -103 104 -70 -92 210
6451B10k99J90l8k24K69k65P5L49m00J93jj42j5O8Q3R4l13J56J06k21K26j21k8
$$ 210 -89 101 63 -161 108 -157 -82 267 -133 60 59 -83 -98 -30 53 147 -166 -10 96 -125 101 -20 -48
6474d8J99l06M6L67m01J86p7K6J68k44J15l2q4J51k19R3J41l14M23j04k69L06
$$ -48 151 -155 -109 258 -143 43 -34 -8 160 -84 31 -1 -85 66 -153 -60 81 -233 190 86 -183 123
6496A23q8j72L86l06m5J72k23K37j25j18K36l00K21M6j50K61Jj73R9j70m3K16
$$ 123 35 -137 249 -57 -102 70 -153 84 -41 -159 77 -223 -2 44 -106 155 156 -17 82 -88 -131 85
6518H5j17J26j81n1K67l87K24J46k81K03Q5k19J85k31J12k8j03J74R3l03L48m68
$$ 85 -32 94 -87 -138 129 -258 -34 112 -169 34 119 -100 85 -146 -34 -62 -165 9 102 -201 147 -321
6540c21M95L8l00K50k11l39N15l10J13J08k99J84j24J90Q7k73L12J03l53M30m83
$$ -321 174 212 -88 162 -49 -388 127 -183 -70 38 -261 -77 -201 -11 76 -197 115 218 -135 295 -188
6561a88J1L00j38j31K37j54K5n6K06J39m70L40l38j13M23j7j92J43k5l7K36l14
$$ -188 -177 123 -15 -146 91 -63 -38 -94 112 251 -219 121 -217 -330 93 76 -116 27 2 -35 201 -113
6583a13J97l0k09K68p4J7j2j71J67m6J23m5l38K31m6k16N34k43J22O4k44n3K53
$$ -113 84 54 -155 113 39 56 44 -127 40 -6 117 72 -266 -35 -81 -297 237 -6 116 180 -64 -117 136
6606A36k99K73m7l08K60l5j11J98p3J04k5k76L23k56K84o0k08K74k44j75L25k3
$$ 136 -163 110 63 -245 15 -20 -131 67 -6 98 73 -203 120 -136 148 88 -120 154 -90 -265 60 37
6628C7j62K39k57L9J13r0J46j51J82l3K6n6j03j19K93k53J67O1j01r7J93k37L47
$$ 37 -125 114 -143 -104 9 -81 65 -86 96 63 89 33 -70 -189 104 -149 18 79 -22 -119 74 -163 184
6651A84l76J38Q6j83J66n6J4J68k39Q3J44k64K33j23N5J55k05L7J72k82J41J66
$$ 184 -192 -54 32 -151 15 -41 -27 141 -98 -15 129 -135 98 -25 30 185 -20 17 189 -93 48 214
6673B14m65K93o6m0J16o5l3N7jJ34k96J39J24j34K62k37r4J72J6r5L37n54K51
$$ 214 -251 42 -24 -64 52 -13 -46 11 10 144 -152 -13 111 -23 239 2 -92 80 96 1 338 -216 35
6696C5o1k94J94Q1K22j66r8J86j66l0L42k62K6R7l02M41j32k30J19O8k15M8J32
$$ 35 -26 -320 -126 -45 177 11 -87 99 -67 -97 245 -17 9 106 -196 245 113 -117 2 70 -145 -97 35
6719C5M3k8j98K65k30Q3L82m23K50k41j88L94j47p1K57l32L41k63%R3L5r4J69
$$ 35 78 50 -148 117 -113 -30 352 -71 179 -62 -250 144 -3 -74 183 -149 192 -71 -71 22 57 -37 132
6742A32j07K7k21o0K27l5r2K77k64J37J20l49L05j68j4J09l59K66J37n6L48l48
$$ 132 25 52 -169 -229 -2 -37 -129 148 -116 21 141 -208 97 -71 -85 24 -335 -69 68 12 360 12
6764A2rKq2R8q5p1L37k88J39P9j74J88O9k79J75j28r5L24j14p6M8j04J06j31J35
$$ 12 3 5 -77 21 -64 -135 202 -86 53 132 -42 146 215 -64 111 -17 -112 212 98 22 70 -34 72 -59 76
6789G6k6k22L34j42j20K53q6k66K28q1j38J98k26L92k47oJ14p2K72k98j6J49j61
$$ 76 50 -172 162 20 -100 153 67 -199 29 -52 -190 8 -218 174 -73 -79 35 -37 235 -63 -79 70 -91
6812i1o3K71j29j20O5r3J00j2K2J08j47R6k1l2K30j05j92J67r6J1Q9k08L17k25
$$ -91 -154 117 -12 -132 -67 -160 -60 -72 -50 58 -89 7 -14 -46 184 79 -113 54 -42 -31 58 -150 167 -58
6836e8l7J63j60O1o2o1K89r4j31K03j84P4J47l99M22k48K02J03l19k4K90l30K76
$$ -58 -95 68 -92 -31 -93 -154 135 41 -90 113 -71 3 150 -249 173 -75 127 230 -89 -113 177 -153 123
6859A23m1j33J04j18J69j07n0O3R9n8l8j58J95k7l55M44j45j5L22m58J43K16l43
$$ 123 82 -51 53 -65 104 -3 -53 10 109 51 13 -145 50 23 -332 112 -33 -48 274 -184 -41 175 -168
6882a68K76Kr1p3l6L00j06r1J70k32q9L78n44J69K99l33K29j07j05K32j20J04
$$ -168 108 110 19 -54 -90 210 104 13 183 -49 -138 240 -304 -135 164 -169 60 -47 -152 80 -40 64
6904F4r6J73m8j13q7R6m8L0R5k77M06j1m44L93k38Q2K9rj29K69k19K95k10J20
$$ 64 -32 141 93 -20 -107 -11 -59 -29 66 -211 195 184 -260 133 -105 -23 6 -3 -132 137 -82 213 3 123
6928A23N8j91M4j08rJ59j54J36M8j37m0N9J25J24l69O7J66k21L01r6j85K55l23
$$ 123 181 -10 34 -74 -83 76 -78 58 106 -31 -71 -12 113 237 -132 -65 101 -120 181 85 -100 155 -168
6951a68K96j36k0K03k78J25K44m28K13R7l16J26O4j50K31n9k21K05k7j24J93q6
$$ -168 128 -8 -28 175 -103 22 266 -162 51 148 -168 -42 22 -128 103 44 -177 28 1 -123 70 -16
6973a6J41j97J8J45k53L97l93J11L31k28k19N17m44J2J11n6L7k5J55J2k64K16
$$ -16 125 -72 -54 91 -162 235 -158 -47 284 56 -163 354 -90 -78 33 -23 14 -11 144 156 -108 108
6995A08j60k35N17l39J0J24n7r2p1J1K75j54n3J70Mp4O8j48J22l9oM3j42K01j54
$$ 108 -52 -287 230 -109 -99 25 -32 -124 -195 -184 91 -63 -116 54 58 -16 52 -96 26 -13 -19 24 -118 83 -71
7020g1l1J74L5j04P6j99L23k44n9K38j63j84M23k62J00j17Q6J7n5P9qj80K71j03
$$ -71 -102 72 107 3 79 -120 203 -41 -100 138 -25 -209 214 -48 52 -65 21 38 -17 62 54 -126 145 42
7044D2j24J66l10J47J75k90J00J91j58J02j31J25r5M1M8j25Q4Q7n4j13J45j65
$$ 42 -82 84 -226 -79 96 -194 -94 97 -61 41 -90 35 -60 -19 29 -96 -12 75 21 -92 53 -112
7066a12J38R6n5o1J7k1Q0j70J63p3O8JN3j20J05k58K75K5j30J34k21Q3J70l70
$$ -112 26 122 67 6 23 2 82 -88 75 2 70 71 124 4 109 -149 126 151 21 155 -66 17 187 -183
7090a83J54K1j2J59k38M2J06j59j88L29j70O4R5J6Lj69J22O0k6J63k71R6kk27
$$ -183 -29 -8 -20 139 -99 -57 49 -110 -298 31 -139 -75 20 36 39 -130 -8 52 26 189 -82 14 12 -215
7114b15L21k8k58K22j63J41J21o1j41J03j62N6Nj9K0p8O1J92k48K49k15n1L56
$$ -215 106 78 -180 42 -121 20 141 80 -61 42 -120 -64 -59 -78 -58 -136 -75 117 -131 118 -97 -148 208
7137B08k56k0K06l56K97j51J10j7l55J74J54KO8j17n1P4j12k0J60m0J57k59q1
$$ 208 -48 -68 138 -218 79 -72 38 21 -334 -160 -6 -4 64 -53 -104 -30 -142 -162 -2 -42 115 -144 -225
7160b25K50l6q3L32l65J21j06L0Q6n8R4L7j18O6o7m9J69k41J78k2q5M8M3q5L8
$$ -225 25 -11 -94 238 -127 -6 -112 -82 4 -54 40 77 -41 25 -42 -91 78 -163 15 -7 -92 -44 -1 -86 -48
7185d8J51o2N2jl1j61k6K47k01K17j21k53K57l9M1J86k63j72L38k97K86o7l5M9
$$ -48 103 41 93 92 61 -100 -126 121 -80 137 16 -237 20 -19 22 208 -55 -227 111 -186 100 33 -2 47
7209D7j14p3J65kj7o0M3K79n06K01N5j42K30l7k45L23l59J78L34k75OK10k08K1
$$ 47 -67 -140 25 23 6 -54 -11 268 -238 -37 18 -124 106 69 -176 147 -212 -34 300 25 31 241 33 54
7233E4j08j3L3j50Q4qLL70l88n5K17j68K73j93K8J63j59J4m1j54M01k52j9K03
$$ 54 -54 -67 -34 -184 -100 -108 -105 265 -123 -178 39 -129 144 -49 -21 142 -17 -3 -44 -198 203 -49 -68 135
7257A35k00Q2q9j29J79l4m6L35k11r1J9J08l3J89l12K5P7%K9p7M9j04J70j52J17
$$ 135 -65 17 -72 -201 -22 -56 -102 233 22 -69 -50 58 25 214 -98 -73 4 4 33 -44 5 -99 71 -81 36
7282C6j27K75l60J74K05l15J42Oj95K73k20R6P7k16L07j65J85o4j82L11l52J71
$$ 36 -91 184 -176 -2 203 -112 30 36 -159 114 -106 -10 67 -149 158 -7 178 114 -68 243 -109 62
7304F2J27j97KK53l91L26n3j79L9O5L2k1o0K0J44j99L4k64Q7L06Jk01J49m33N78
$$ 62 189 -8 -6 247 -144 182 129 -50 -11 54 86 65 5 25 169 -30 4 -260 -173 133 134 -67 82 -351 227
7329B27l23O7Rj08J65R1k29L72l89PK84k82J22J2j43K23o8O4M1j82J07K1j47P9
$$ 227 -96 -29 -20 -128 37 128 -101 271 -118 -111 173 -109 13 25 -118 105 37 101 142 -40 67 88 -59 20
7353B0N0j2L9k22K87j09j23J21j46J7J37k26J88p8j64L62k75o0L41l13L14r8j33
$$ 20 70 58 97 -125 162 53 -70 51 -95 -78 59 -167 21 -57 -221 141 -134 -194 147 -166 148 50 -83
7376h3J9RO1Q2k01J88j00j63L78l69J70J98j62J48j42k01K65j19K4O5j28O2J30
$$ -83 -64 -55 6 88 -113 75 -25 -188 190 -179 -9 189 27 175 33 -168 97 -22 2 67 -61 1 131
7399A31k79J50l6K14o4p4l5nJ1J47k12j20J63k55L15J00l43K14J22m9q0j86M6
$$ 131 -148 2 -34 180 116 42 7 2 13 160 -52 -172 -9 -264 51 151 -192 22 144 95 15 -171 -125
7422a25J54k74J47R1l7J52j47J51l4j93J82j10j38L96j73q2p4J08O1k68J65N7
$$ -125 29 -245 -98 -7 -44 108 -39 112 78 -115 67 -43 -181 215 42 -40 -114 -6 55 -213 -48 9
7444Ij56k1K43l22K82r7j43M06l32n2J57J3K36k4k75J39j09j7n3J6J49j94P1K04
$$ 9 -147 -168 75 -247 35 -62 -205 201 -131 -183 -26 -13 223 199 -76 63 -46 -63 -116 -100 49 -145 -74 130
7468A30r2j10J6k4K95j79k09K67j35M6j6P2J10o1j03K00k49K38n3l67L09q3k15
$$ 130 38 -72 -56 -80 215 36 -173 94 -41 5 -11 61 171 110 7 207 -42 196 143 -224 85 2 -213
7491b13J51o8J63M1p8J33k08l7J07K5j51L68l51k9K26j97K80k7j63J44mP3j33
$$ -213 -62 -130 33 74 -4 129 -79 -116 -9 16 -135 233 -118 -147 79 -118 162 135 -28 116 112 185 52
7514E2j09J09k74J94K19l30K66l5k3q6R0j35J09J00N7j52l6L3l18L45j6j0P9j23
$$ 52 -57 52 -222 -28 191 -139 127 92 69 -17 73 -62 47 147 204 52 16 49 -269 76 60 50 129 6
7538Fl9J41J8j51N6j13Q7m3j50M91k05j25K31j52j35J25oP4p3j91J54j58L10k71
$$ 6 -33 108 126 -25 31 -82 5 -38 -188 303 98 -27 204 52 -83 42 36 110 37 -154 0 -158 152 -119
7562a19N8J86k34J44J2j33P0r5R6O6j52J47J43k39J15P8k97K83n4j79K02j83L7
$$ -119 -61 125 -109 35 47 -86 -16 -111 -15 51 -101 46 189 -50 65 143 -154 129 75 -104 98 -85 -48
7585d8K05j52J76l16N9J13K5j58N2l8J11j86O1J85j81Q5m7r6K92k75K25j1m3J26
$$ -48 157 5 181 -135 -76 37 62 -96 -44 -82 29 -157 -96 89 -92 -7 -54 -150 142 -133 92 81 38 164
7609A64j53j10K08l8o2pp0K32N0k77J57L0j84K15k31OR7l2J6p8J32N9k29J06K29
$$ 164 11 -99 109 71 9 2 -68 164 214 -63 94 124 -60 155 -76 -70 27 -5 11 -67 65 124 -105 1 230
7634B30n39M08O8j05j81kK27J32m36J63m3K00ql09K03P0k03L25j02j61Q6o3J33
$$ 230 -309 99 167 62 -119 -121 106 238 -198 -35 -78 122 114 -195 8 78 -125 200 98 -63 23 -40 93
7657I3j03L7O9K3n1K8k71K97n2k31L59q3r6K33l48K01q3k70K90j61J68J36j24
$$ 93 -10 27 96 119 68 96 -175 122 70 -161 198 115 19 252 -96 105 22 -248 42 -119 49 185 61
7680F1j16P8p5Q6q1j61L42k15K3K32l19J91j02q0J29j66K07j19J43j79K30j98
$$ 61 -55 23 -52 34 -47 -208 134 -81 -58 174 -145 46 -56 -136 -7 -173 34 -85 58 -121 109 -89
7702h9J47q3mN6q2J6k6L8J65l04J42rm7K80j40K3J69k94r3L63m22K57j04K57j95
$$ -89 58 -25 -29 27 -55 -39 -65 -27 138 -166 -24 -33 -80 200 60 83 252 -42 -135 228 -194 63 -41 216 21
7727B1j27K36O4k23J18j10L3K69k72q1Q5j72J2Q1Q6j1j04Nj9P0K01m04J49L78
$$ 21 -106 130 194 -29 89 -21 12 281 9 -72 13 -159 -147 -66 20 9 -95 -90 -109 -39 162 -242 -93 285
7751B85k32J15o4j52K03j01k81J52j05L25r4j00K57k15q3J76j1O9k35P0J95l79
$$ 285 53 168 104 -48 155 54 -227 -75 -180 145 51 -49 208 -7 -90 86 75 144 -91 -21 174 -205
7773b05J01P8j12N8J36j11n4K57l15K20n0j33L48l0j56o9R3p8j72L08q0j54J05
$$ -205 -104 -26 -138 -80 56 -55 -109 148 -167 53 3 -130 218 188 32 -37 56 -22 -194 114 34 -120 -15
7796a5p6j14K93j87j7L00k71J06O4j83R1j84J79P2o6J04l5J21n2j76j9K30l74
$$ -15 -91 -205 88 -99 -116 184 -87 19 83 -100 -9 -193 -14 58 -8 96 61 182 130 -46 -65 165 -209
7819b09L31j03j63K13J31j79p1R7J48j66l5M8j94J25P3Rl4k57Q2K61k35J31J44
$$ -209 122 19 -144 69 200 21 -50 47 195 29 -6 42 -152 -27 46 55 21 -236 -154 107 -128 3 147
7842A47k66MJ32q7K05j57J57p9r2J26j40P5J45j73j7m8L3N4j63j99M00r8N9N1
$$ 147 -119 -115 17 -70 135 -22 135 56 -36 90 -50 25 170 -3 -20 -68 -35 19 -144 -343 57 -41 18 69
7866F9j36L02k25NK9p8r8K26j30K2q1kJ89k66J35J29k10J90r5m1K10j48o9J97
$$ 69 -67 235 10 15 44 -34 -132 94 -36 -14 -95 -97 92 -174 -39 90 -120 70 -25 -66 144 -4 -73 124
7890A24k61J15J43q5N1l8J49j44k52K22M6j4p8j50J95K18k63J57rk48J28J31l8
$$ 124 -137 -22 121 36 87 49 198 54 -198 24 70 56 -22 -172 23 241 -22 135 126 -122 6 137 99
7913I9j09P8j46r3J68O8k32N7J84j11L0Nj6M2p7j16J43l2J58j39R3m7K9k28J75
$$ 99 -10 68 -78 -171 -3 65 -167 -110 74 -37 -7 -2 -18 24 -53 -169 -26 -58 100 -39 54 7 36 -192 -17
7938a7JJ20j32j96M29j40k40L31j30Nk8q0O1J18O9j61k0PJ65j09q7J7j18J02j05
$$ -17 -16 104 -28 -224 205 65 -175 156 26 31 3 -77 -16 102 171 10 -10 -3 162 53 -34 -17 -135 -33 -138
7963a38K79l10r7L12j9rJ91j89j3n1q6N9Q1j5k5J0n4j4K7J79j36m0N7j45J81j35
$$ -138 141 -169 -266 46 27 18 209 20 7 -44 -130 -71 10 -5 -30 -20 -74 -88 -61 118 -18 -58 -1 -146 35 -100
7989a00n7J94o4oJ8O0j33J75j36m3P3n2K79l11N6j11J45R8k43N1J11r0N3L4j15
$$ -100 -157 37 -27 -33 -15 45 -88 87 -49 -92 -19 -71 208 -103 -47 -158 -13 85 -158 -107 4 -86 -33 1 -114
8014a14J81J34k51J7p3K73j21j75P3L8Q6j13j89K18J4j77K27J3k17L57k97M0J10
$$ -114 67 201 -50 -33 -106 167 46 -129 -56 -18 68 -45 -234 -16 -2 -179 48 61 -156 201 -96 -56 54
8037E4J4K3j00L8K6j38k2J25r3J10l3M8J32k70K53j53j20K61j74rJ45q0j11Q4
$$ 54 68 91 -9 29 55 -83 -105 20 -73 37 4 52 184 -86 167 14 -106 155 -19 -28 117 37 -74 10
8061A0r0J95k07JR2p4J96k39r9L96k61J6J49j51o4L40l03M6N3k1nj58K26K89k61
$$ 10 -80 115 -92 -91 1 -73 123 -116 -215 181 -80 -64 85 -66 -130 210 -93 -47 6 -15 -20 -178 48 337 76
8086G6L4k4q9L5R7j51LMM0o5n8K18k16j46J57J9R3r4j29K52r4J0k7r6K00k05O0
$$ 76 110 86 -3 32 129 -22 -19 -15 25 -40 -98 120 -96 -242 -85 -66 27 -67 -196 56 -38 -28 -55 -151 49 -156 -96
8113i6Q5J47J2k38L7R2N2j58O4J1n0J41j80m1J56q4J39j41q0K11k01L21k39n5
$$ -96 -11 136 148 -90 -53 39 91 -67 -3 8 -42 99 -81 -122 34 -50 89 -52 -132 79 -122 199 -40 -95
8137i5P0k8l2Q7o6j6M3N5N2j24J45P8j42M4Qk14J25k74L03J93k69J62k40m8J84
$$ -95 -25 -53 -85 2 -64 -80 -37 18 70 -54 91 169 27 71 79 -135 -10 -284 19 212 -57 105 -135 -183 1
8162Al3R0p1j69kK10j19R0k7j09K71k63O2K1j4J48j57j01L3j16R7J8Q8J75kj15
$$ 1 -32 58 -13 -182 -184 26 -93 -3 -30 -139 132 -131 -69 -48 -62 86 -71 -172 -139 -255 -158 -140 -52 123 121 6
8188Fo3q9Q9
$$ 6 -57 -146 -57
8191e7
$$ Imaginary data points
##PAGE= N=2
##DATA TABLE= (X++(I..I)), XYDATA
0@%%%%%%%%%%%qJ6j6J6k3L1l2M0m8N6p2Q8j04J20j36J57j83K09k38K74l12L53
$$ 0 0 0 0 0 0 0 0 0 0 0 0 -8 8 -8 8 -15 16 -16 24 -24 32 -40 48 -56 64 -72 85 -98 111 -127 147 -165 188
33A88m01M52n06N67o35P09p88Q75r75J082j193J317j455J605j769J949k146K363
$$ 188 -213 239 -267 300 -335 374 -414 461 -514 568 -625 692 -763 842 -927 1022 -1124 1239
51A239k603K870l169L505l886M319m820N408o104O945p986R312j1066J3494j7071
$$ 1239 -1364 1506 -1663 1842 -2044 2275 -2545 2863 -3241 3704 -4282 5030 -6036 7458 -9613
66i613K2843l3592N9764k26074k45536O50637k14830k52698M37469j26201l90148
$$ -9613 13230 -20362 39402 -186672 -432208 218429 3599 -249099 188370 62169 -327979
77c27979L29888J40469k73260R3443Q9080k60267J16183K62884j17399p9394P289
$$ -327979 1909 142378 -130882 -37439 51641 -208626 -92443 170441 53042 -26352 -19063
88a9063m3667J15209n540k1065J31402j81845j35231K84517J3107j67000R2253
$$ -19063 -62730 52479 46939 25874 157276 -24569 -159800 124717 137824 -29176 63077
99F3077n1284j48439J58665Q5873j62294K5657M7477j47099J21717J71495j67624
$$ 63077 11793 -136646 22019 107892 -54402 -28745 18732 -128367 -6650 164845 -2779
110b779l3568K4944j05801J79673P6606k08369R6527M1300k16277J48549J74157
$$ -2779 -36347 -11403 -117204 62469 139075 -69294 27233 68533 -147744 805 174962
121A74962k36584p0586J60214p2219j2527J79975j22043j53233J57153m421n2676
$$ 174962 -61622 -132208 28006 -44213 -56740 123235 1192 -152041 5112 691 -51985
132e1985J42906o1293j02325N2088j2197R2020M3176j80005N7228J16879j56330
$$ -51985 90921 29628 -72697 -20609 -32806 59214 102390 -77615 -20387 96492 -59838
143e9838N5049J84425j97944j13589K42771m3138j41107K27127p3229k87599K37150
$$ -59838 -4789 179636 -18308 -131897 110874 67736 -73371 153756 80527 -207072 30078
154C0078R5743k58773J42485R3318k56149O0765J72308j11579l6666O4769o1730
$$ 30078 125821 -132952 9533 102851 -153298 -92533 79775 -31804 -68470 -3701 -65431
165f5431P562J13917l0167m8356L9980n4714J1876J06618n4504j6555L2863r9192
$$ -65431 -57869 56048 25881 -22475 17505 -37209 -25333 81285 26781 10226 43089 -56103
177e6103N0652R6974j05346o070O1841o6460Q453P0854l4472m6818J1145l162
$$ -56103 -5451 91523 -13823 -19893 41948 -24512 -16059 54795 20323 -26495 -15350 -18512
189a8512J2077N4966l3896m8553L9551m1536q397R4308o2021l5033Q2277o7151
$$ -18512 -6435 48531 14635 -33918 5633 -35903 -44300 50008 -12013 -47046 35231 -31920
201c1920l385J08194p7970n7056Q7736q883l7866O2376K58q5954K1568M3713m6100
$$ -31920 -35305 72889 -5081 -62137 25599 16716 -21150 41226 41484 -44470 -22902 20811 -25289
214b5289L4743K0902q3089L7083L4533n3612M9756K927n6825O0039J1270l7249
$$ -25289 9454 30356 -52733 -15650 18883 -34729 15027 17954 -38871 21168 32438 -4811
226d811M4931j0218n8554L3688M3603m2328m597M3167o0266k4736P3845m1470
$$ -4811 40120 29902 -28652 5036 48639 6311 1714 44881 -15385 -40121 33724 -7746
238g746k4470O4523m7527j6622O0731l4544j9086K6392j8099l97K1491K79j3913
$$ -7746 -32216 32307 -15220 -31842 28889 -5655 -24741 1651 -16448 -16845 4646 4925 -8988
251h988m075N31j4253K3171J6220k9486K3319O587l1578L6601j658k8077L4970
$$ -8988 -13063 -12532 -26785 -3614 12606 -16880 6439 13026 -18552 18049 16391 -11686 23284
264B3284q513j1671K5735j8685j4825L330m772L808q34O795o459j3388J3439j3174
$$ 23284 14771 3100 28835 10150 -4675 -1345 -6117 -2309 -3143 3652 -2807 -16195 -2756 -15930
278a5930k70K4077j9457J1791J8493k7328J3933J242k3253K0465j617o713J4236
$$ -15930 -16200 7877 -11580 211 18704 -8624 5309 6551 -16702 3763 2146 -4567 9669
291I669j0046l721l330k285R068o567J4277O583j6363J7290p648j6013K2119j1890
$$ 9669 -377 -4098 -7428 -9713 -645 -7212 7065 13648 -2715 14575 6927 -9086 13033 1143
305A143k156J7856j7395J384p85j4545R557m339M042J1254r433J0355l779j0675
$$ 1143 -1013 16843 -552 832 47 -14498 -4941 -9280 -5238 6016 -3417 6938 3159 -7516
319g516J4341r452M515J4687j4989P950l086j7067J1706q478p25J3360j0998Q610
$$ -7516 6825 -2627 1888 16575 1586 9536 6450 -10617 1089 -7389 -8114 5246 -5752 2858
333B858l37j2072J2484q764K336J5602j0564Q776j39j5502R188r508j506J1644
$$ 2858 2521 -9551 2933 -5831 -3495 12107 1543 10319 10180 -5322 3866 -5642 -7148 4496
347D496j1205Q737j231j2883J1827r895R9J6331j0231J0389M747j4036Q778p392
$$ 4496 -6709 2028 797 -12086 -259 -10154 -10055 6276 -3955 6434 11181 -2855 5923 -1469
361a469m069J0453q496O908j696j1101Q009j3033L11J4581j2651J3383P497j5208
$$ -1469 -5538 4915 -3581 3327 1631 -9470 -1461 -14494 -14183 398 -12253 1130 8627 -6581
375f581J3324l719p544J4189m086L486L555o410K796j2832J421O942j3553J6037
$$ -6581 6743 3024 -4520 9669 5583 9069 12624 6214 9010 -3822 -2401 4541 -9012 7025
389G025J794j6118J7455j0832j1798J9670j0334l30J2564r689k48m226n325J019
$$ 7025 8819 -7299 10156 -676 -12474 7196 -3138 -3468 9096 -593 -841 -5067 -10392 -9373
403i373m615J1090k031l490J5349j6064l92J8590j5844J2016J3869j4967J5459
$$ -9373 -13988 -2898 -4929 -8419 6930 -9134 -9526 9064 -6780 5236 19105 4138 19597
416A9597k134j6837J1923o366n441Q712k059j456p848l304j796o126J3285o830
$$ 19597 17463 626 12549 6183 742 9454 7395 5939 -1909 -5213 -7009 -13135 150 -6680
430f680m173K2200j9548l881K3954k6193K310K1658k0922J2446J3112k8030K070
$$ -6680 -10853 11347 -8201 -12082 11872 -14321 -12011 9647 -11275 1171 14283 -13747 -11677
443a1677J3902j2135j769K1498k070k1107K0418K116k5134L0839n727l1843M3664
$$ -11677 2225 -9910 -11679 9819 7749 -13358 7060 9176 -15958 14881 9154 -22689 20975
456B0975n616l5654L6500j1772l4134L2833L900j7721K2477M1l1486J9191K7615
$$ 20975 15359 -20295 16205 4433 -29701 3132 7032 -10689 11788 11829 -19657 -466 27149
469B7149l6312P968M0085m6740M27M8528m6197q176L3605m2845O548M1128l4708
$$ 27149 -9163 -1195 38890 -7850 -7423 41105 -5092 -13268 20337 -22508 -15960 25168 -9540
482i540j4395K2263j4875j1128K6271O037j9207R809O23r329K9414j2624k3980
$$ -9540 -23935 -1672 -16547 -27675 -1404 4633 -14574 -4765 -4142 -13471 15943 3319 -20661
495b0661L5846j1669j2373M1384k4677k0181K8489k3271M312M3886k5888k6736
$$ -20661 15185 3516 -8857 32527 7850 -12331 16158 -7113 -2801 41085 15197 -11539
507a1539K6493k739k0879K5434K263l7134J9530O877k9077L8357j1321o1859M8998
$$ -11539 14954 12215 -8664 16770 19033 -18101 1429 8306 -20771 17586 6265 -55594 -6596
520f596J7070m1920M5616l60n5221L5298J8009k9073L2974J1883n4318J5502M8156
$$ -6596 10474 -31446 14170 13810 -41411 -6113 11896 -17177 15797 27680 -26638 -11136 37020
533C7020l9231r689L2560m4709M447M8098l9297J1472K2717p2575K9180O3938
$$ 37020 -2211 -11900 20660 -24049 -19602 28496 -10801 671 23388 -49187 -20007 43931
545D3931n7323P479M3221o3389J689P2255m5010l2327O9110m2245n2601J08282
$$ 43931 -13392 -5913 37308 -26081 -24392 47863 2853 -29474 39636 -2609 -55210 53072
557E3072p410j05032O5676K0384p3712O5007L2270p4102J1525K0293k9513K4551
$$ 53072 45662 -59370 6306 26690 -47022 17985 50255 -23847 -12322 7971 -21542 3009
569C009K3748l9258j6850K3604L996K934J31k3743J0643N241j6242N4224M592
$$ 3009 26757 -12501 -29351 -5747 -1751 1183 1314 -22429 -11786 -6545 -22787 31437 36029
582C6029p2210L1463K8482l5234M2514Q490n8425K4417J7274l4623L0301J5283
$$ 36029 -36181 -4718 23764 -11470 31044 39534 -18891 5526 22800 -11823 18478 33761
594C3761o1480K829M6710k5737M634K5503o6592O302O7264n2017P799O4084q5890
$$ 33761 -27719 -24890 21820 -3917 717 26220 -40372 -34070 33194 -18823 -11024 53060 -32830
607c2830k3666R1826k6960l3174M5518l0350l1029N8885N663m2006K4516n396
$$ -32830 -56496 35330 8370 -24804 20714 -9636 -40665 18220 23883 -18123 6393 997
619I97l6829N2393K1384l9870J2751k3891j5768O6803k6969l8874O1738l8771
$$ 997 -35832 16561 37945 -1925 10826 -13065 -28833 37970 11001 -27873 33865 -4906
631d906n2609Q8766M780q0897M1731K5876o4608M9979N7039r3146j579P3402o5018
$$ -4906 -57515 31251 36031 -44866 -3135 22741 -41867 8112 65151 -27995 -29574 43828 -21190
644b1190p64Q6006n7403m6841M9405r115q408K3149k2229j3688J4640m79Q344
$$ -21190 -21954 64052 6649 -40192 9213 98 -8310 14839 -7390 -21078 -6438 -6917 1427
657A427J2487k4037j5767K2256J829Q871K4168m3700j6408M8753k0843q750M3012
$$ 1427 13914 -10123 -25890 -3634 -1805 7066 31234 -12466 -28874 19879 -964 -9714 33298
670C3298l5158k1867L8651q011k35J5844l4607m165L9420j0240j4956K7056k4574
$$ 33298 -1860 -23727 14924 6913 6678 22522 -12085 -16250 23170 12930 -2026 25030 456
683D56l5287M7107K744l7431M1706j6303n4956O1732J2560n8792L7426J4040m7757
$$ 456 -34831 12276 15020 -22411 19295 2992 -51964 9768 22328 -36464 962 15002 -32755
696c2755L0338L2642l4258k348J4899k4819J3794L4658l2775j0132K4316l1821
$$ -32755 -2417 30225 -4033 -6381 8518 -16301 -2507 32151 -624 -10756 13560 -18261
708a8261Q240L6812l7517N37K6051l5962J6636L5689m3315q994L5072j5890r141
$$ -18261 -10021 26791 -10726 -10189 15862 -20100 -3464 32225 -11090 -20084 14988 -902 -10043
721a0043L2394j3050l2389K3909M080k1117K9650l248l2445K6221K997j9258K1819
$$ -10043 22351 9301 -23088 821 4901 -16216 13434 10186 -22259 3962 6959 -12299 9520
734I520o984j3972J9123n350l371J3683j3389j4379J3092O170j0580Q919M366
$$ 9520 2536 -11436 7687 2337 -1034 12649 -740 -15119 -2027 4143 -6437 2482 6848
747F848k2503R805J2903j9354J6196P849k5472K0321J0406k2214J2373J85j6064
$$ 6848 -15655 -5850 7053 -12301 3895 11744 -13728 6593 16999 -5215 7158 7343 -8721
760h721J4524N662j1656L076J846j3552R59J5761j1642l622J8184j4767k229J8516
$$ -8721 5803 11465 -191 2885 4731 -8821 -7862 7899 -3743 -7365 10819 -3948 -6177 12339
774A2339k0777J612J9032j9912N216J5823j9986l18J1994j1740l092J4421k267
$$ 12339 -8438 -6826 12206 -7706 -2490 13333 -6653 -6971 5023 -6717 -9809 4612 2345
787B345j0613J4502R02k0205J6193O899j9385J6778M828j8483J0199n79r825P214
$$ 2345 -8268 6234 7136 -13069 3124 10023 -9362 7416 12244 -6239 3960 3381 -6444 770
801G70j943j637K741j961O04p64L5k539N12Q415m961K772Q165j7108K309J1537
$$ 770 -1173 -2810 -69 -2030 -1426 -2190 -2155 -4694 -4182 4233 -728 2044 10209 -6899 -4590 6947
817F947j2772O341O781j2799L003K859k325J490l146K359J101J253O301m360k610
$$ 6947 -5825 516 7297 -5502 -2499 360 -1965 -475 -3621 -1262 -161 1092 7393 3033 423
832D23j439k280R769l081l248P258j3253j775J2798r896m00P158n824J766M261
$$ 423 -1016 -3296 6473 3392 144 7402 -5851 -7626 5172 -4724 -5124 2034 -3790 -2024 2237
847B237J218l452n231P180K70j413R416p129n834K510l977N776L48m433O123o740
$$ 2237 3455 3 -5228 1952 2222 809 10225 3096 -2738 -228 -4205 1571 1919 -2514 3609 -3131
863c131k11R849p701j433M131k464M584J407N5l830q810P236J084l783Q443n993
$$ -3131 -3342 6507 -1194 -2627 1504 -960 3624 5031 5086 1256 -7554 -318 766 -3017 5426 -567
879e67n506N427k335K900k02l845O729k502J181O604r527j818K850k261N191r24
$$ -567 -6073 -646 -2981 -81 -283 -4128 2601 99 1280 7884 -1643 -3461 -611 -2872 2319 1395
895A395j591j458p132N586J677m682P378k647k347P046k980J780Rm777P328n21
$$ 1395 -196 -1654 -8786 -3200 -1523 -6205 1173 -1474 -3821 3225 245 2025 2034 -2743 4585 4064
911D064p68N575q291k830L208k057K761l03R4m36n578O980r54o787Q791m196l105
$$ 4064 3296 8871 580 -2250 958 -1099 1662 1359 1453 1017 -4561 2419 1465 -5322 3469 -727 -3832
928c832J0050o727l750L713n809J904L444K84M72l041K474j617j06P871n685J898
$$ -3832 6218 -509 -4259 -546 -6355 -4451 -1007 -723 -251 -3292 -818 -2435 -2541 5330 -355 1543
944A543Q379r973L437N006j1287M333K749n607N046j224m296q29k57J442k876
$$ 1543 9922 -51 3386 8392 -2895 1438 4187 -1420 3626 2402 -1894 -2723 -2980 -1538 -4414
959d414M673L853p795N212J017o953P379k530k956Q735n841j345M142p126J535
$$ -4414 259 4112 -3683 1529 2546 -4407 2972 442 -2514 6221 380 -965 3177 -3949 -2414
974b414O55k081N549j124k194Q88r10Q77l080L711L289o163N441j651o888R427
$$ -2414 -1759 -3840 1709 585 -1609 -721 -1631 -754 -3834 -123 3166 -2997 2444 793 -6095 3332
990C332o681n049J5003p164m673J2532p099m401Q596k531k229P845J013j1416
$$ 3332 -3349 -8398 6605 -559 -5232 7300 201 -4200 4396 1865 -364 7481 8494 -2922
1004b922N989P144j9232N510J4368k0764N345J3578k0475N521J0628j7845O503
$$ -2922 3067 10211 -9021 -3511 10857 -9907 -4562 9016 -11459 -5938 4690 -13155 -6652
1017f652J4791j2262j987J3722o175j0542J3921N30j2096J4809k238j3721J8106
$$ -6652 8139 -4123 -6110 7612 1437 -9105 4816 5346 -6750 8059 5821 -7900 10206
1030A0206n730j5797J8832k161j1040J3458k491p600N919k541m619P224J652j0415
$$ 10206 4476 -11321 7511 5350 -5690 7768 5277 -2323 3596 1055 -3564 3660 5312 -5103
1044e103L961Q096j3848J192R757j2307N458O856j1318J0046J735j4783J1022
$$ -5103 -1142 6954 -6894 -5702 4055 -8252 -2794 4062 -7256 2790 4525 -10258 764
1057G64M465p385O279n18m612L281k152m462N117K064j0806M530J1010j4450J344
$$ 764 5229 -2156 4123 3605 -1007 2274 122 -4340 777 2841 -7965 -3435 7575 -6875 -5531
1072e531J0224j6365J0464J2693k0610J2196J1604k6981R885J8606k0791R1J7220
$$ -5531 4693 -11672 -1208 11485 -9125 3071 14675 -12306 -2421 16185 -4606 -4515 12705
1085A2705j4867m953K0786j4725j4023K7776j1010k0155L5420p009l0400K6636
$$ 12705 -2162 -7115 13671 -1054 -15077 12699 1689 -18466 16954 9945 -20455 6181
1097F181m24k1909K3011K9k0513J4856L682j7911J1040J0326j9452L469J7586
$$ 6181 5757 -16152 6859 6888 -13625 1231 4913 -12998 -1958 8368 -11084 -7615 9971
1110I971j2279K203J0733j9045P683J3543j8916J2070J1102k5344O082J2842j4735
$$ 9971 -2308 -105 10628 -8417 -734 12809 -6107 5963 17065 -8279 -2197 10645 -4090
1123d090L430P149j3376K045J3257j0564n680J4581j0353r272K1779l858j0199
$$ -4090 -660 6489 -6887 -4842 8415 -2149 -7829 6752 -3601 -12873 8906 5048 -5151
1136e151J1883j1287k206J6045j2588m14J2499j4663n43J3300p784l182O548o943
$$ -5151 6732 -4555 -6761 9284 -3304 -3718 8781 -5882 -6425 6875 -909 -4091 2457 -4486
1150d486l38J5743p160j2123J5461p313j3076K4349m893j7383J8721j0234j1338
$$ -4486 -4824 10919 3759 -8364 7097 -216 -13292 11057 6164 -11219 7502 -2732 -14070
1163a4070K6941j1450j8386K5350l454j8500K2675M095k6971J2367J4661k3973
$$ -14070 12871 1421 -16965 8385 4931 -13569 9106 13201 -13770 -1403 13258 -10715
1175a0715J2905J8707l5008M923K6363k8436J818K5700k3530m654K0504j0777
$$ -10715 2190 20897 -14111 -9188 17175 -11261 -9443 16257 -7273 -11927 8577 -2200
1187b200l302J1897j0083m774J5564l046q538J2193o701j2080J7004l251q199
$$ -2200 -5502 6395 -3688 -8462 7102 4056 -4482 7711 1010 -11070 5934 2683 -5516
1200e516J6120j2451r219K1497q738r949J5838o233p631J2603m9q161L779j563
$$ -5516 10604 -1847 -11066 10431 1693 -8256 7582 1349 -6282 6321 6272 -1889 1890 327
1214C27o786R814L249j2791P491J111j3516J3387R26j3628J5683k305j3640J8680
$$ 327 -6459 3355 6604 -6187 1304 2415 -11101 2286 3212 -10416 5267 2962 -10678 8002
1228H002j019j6744J2112L536j1465P359P316j2342R1Q281j1977L102J3112j4902
$$ 8002 6983 -9761 2351 5887 -5578 1781 9097 -3245 -3154 5127 -6850 -3748 9364 -5538
1242e538J659J3215j5692L787J1356j6033N653J0336j4437M850R991j4811j978
$$ -5538 -3879 9336 -6356 -2569 8787 -7246 -1593 8743 -5694 -844 9147 -5664 -7642
1255g642J3254p367o851J4581m746j1390J6203m440j2475J8072m102j0867J7268
$$ -7642 5612 -1755 -8606 5975 1229 -10161 6042 1602 -10873 7199 3097 -7770 9498
1268I498n498j1150J2631l396p405R880j613q525P022L644j1626M200P989j2865
$$ 9498 4000 -7150 5481 2085 -5320 4560 2947 -5578 1444 5088 -6538 -2338 5651 -7214
1282g214M725J2071j3208J798P753j1540M730O242p379L022O45m246L196l81k003
$$ -7214 -2489 9582 -3626 -1828 5925 -5615 -885 5357 -2022 1000 1645 -2601 595 214 -1789
1297a789J572L4k011L303M717p302r97P592r032K101J2305j1509k382Q574j0451
$$ -1789 -217 -183 -2194 1109 5826 -1476 -2473 5119 -3913 -1812 10493 -1016 -3398 5176 -5275
1312e275K163Q683q089j505M987k180O63M031k445n774N293K816l793Q302l609
$$ -5275 -3112 5571 -2518 -4023 964 -1216 -553 3478 1033 -4741 552 3368 -425 7877 4268
1327D268j1680R576J29o763R822l804r180P028J537l252J474j076k676P74O006
$$ 4268 -7412 2164 2293 -4470 5352 1548 -7632 -604 933 -2319 -845 -1921 -4597 -3823 2183
1342B183L78l498N81m494J702O405l726L237l48r839Q092M179p485N364J47p482
$$ 2183 2561 -937 -356 -4850 -3148 3257 -469 2768 2420 -7419 673 4852 -2633 2731 2878 -4604
1358d604N900N928l194m529J028r46l001Q535J370j0379J303m02j880O856k126
$$ -4604 1296 7224 4030 -499 529 -417 -3418 5117 6487 -3892 -2589 -2991 -4871 1985 -141
1373a41k760N40l462O382L912n849M71J25j603N154L786k111o867J17L960l148
$$ -141 -2901 -2361 -5823 559 4471 -1378 -907 -782 -2385 2769 6555 4444 -2423 -2306 1654 -1494
1389a494N084K110j0102J560L968k023L630k028l206J295l71N207J321o461q21
$$ -1494 3590 5700 -4402 -2842 1126 -897 2733 705 -2501 -1206 -1577 3630 4951 -1510 -2331
1404b331j24J026L985R48j095o592L62O790l073J542L060q489J751O615k131n87
$$ -2331 -2455 -1429 2556 3504 2409 -4183 -3821 2969 -104 1438 4498 -3991 -2240 4375 2244 1657
1420A657k416l072J353J893L952k331o312P32K9K541L478k505J87k593M71P710
$$ 1657 -759 -3831 -2478 -585 3367 1036 -5276 -4544 -4515 -1974 1504 -1001 -814 -3407 -2936 4774
1436D774k817k187L352m302J961O193k595k668k609k90J858O2L560k712o008K742
$$ 4774 1957 -230 3122 -1180 781 6974 4379 1711 -898 -1188 670 732 4292 1580 -4428 -1686
1452a686N69N05J748l030r9q36R14N527m593l190L245l560L063N705l826k115
$$ -1686 -1117 -612 1136 -1894 -1993 -2829 -1915 3612 -981 -4171 -926 -4486 -1423 4282 456 -1659
1468a659ON06K316O13K191k763k041M264j187L44P10n729K199J838k514M305k951
$$ -1659 -1653 -1147 1169 1782 3973 1210 -831 3433 2246 2590 3300 -2429 -230 1608 -906 3399 448
1485D48n860M177l9n83M166j033l245J81M443j108k738N086l355l988Q286k334
$$ 448 -5412 -1235 -1274 -1857 2309 1276 -1969 -1788 2655 1547 -1191 3895 540 -3448 4838 2504
1501B504m636M321m457j687N714j153j245j64j353l39P11K555j236j413K063k299
$$ 2504 -2132 2189 -2268 -3955 1759 606 -639 -803 -2156 -2495 -1784 771 -465 -1878 185 -2114
1517b114J769K805n327J622K066l218M453P35l411J921j768K49L396j290L80o21
$$ -2114 -345 2460 -2867 -1245 821 -2397 2056 2791 -620 1301 -467 -218 3178 1888 2268 1647
1533A647j236J438j345o47l28n40N77k374K610Q94o806L823K257n217O447J109
$$ 1647 411 1849 504 -143 -471 -1011 -434 -2808 -198 696 -6110 -2287 -30 -5247 1200 2309
1549B309o052N279J7m602M936J618m080P44L849l449k211N177m531k265Q334n822
$$ 2309 -3743 1536 1553 -3049 1887 3505 -575 169 4018 569 -1642 3535 -996 -3261 5073 -749
1565g49j607R095q504l019R745n710k552P642l790l836N544j282o113N845K546
$$ -749 -2356 6739 -1765 -4784 4961 -749 -3301 4341 551 -3285 2259 977 -5136 709 3255
1580C255q890N916N831j1051M057O089r765M590N014p373L400L164o546P18L554
$$ 3255 -5635 281 6112 -4939 -882 5207 -4558 32 5046 -2327 1073 4237 -2309 -1591 1963
1595A963k715k089L730n90l228K959j092k021M401k714o73N926l958o53L520m448
$$ 1963 -752 -2841 889 299 -2929 30 -1062 -3083 1318 -1396 -2069 3857 -101 -754 2766 -1682
1611a682K904J448m597M239M84n136J874J949l045k22L131j793r18M307m433j861
$$ -1682 1222 2670 -1927 2312 2796 -2340 -466 1483 -1562 -1784 1347 -446 -1364 2943 -1490 -3351
1627c351P339n852k594R920o557l251Q306o450j728P928n543k081Q433l447n954
$$ -3351 3988 -1864 -4458 5462 -1095 -4346 3960 -2490 -4218 3710 -1833 -3914 4519 1072 -4882
1642d882Q382K83r142P807L621j0746P957K908j3164Q774M116j3360Q041O189
$$ -4882 3500 3783 -5359 2448 6069 -4677 3280 6188 -6976 1798 5914 -7446 595 6784
1656F784j2342L515P023q437m0P955o164k042R942n889n681J1022n216o904J1205
$$ 6784 -5558 -2043 4980 -3457 -3497 4458 -1706 -3748 6194 305 -5376 5646 430 -6474 4731
1671D731l043n641P036l181k963M831k385j519L640m64j818J695N90k581J238
$$ 4731 1688 -3953 3083 -98 -3061 1770 -615 -2134 1506 1042 -776 919 1509 -1072 166
1686A66L46j847M147k077m273O236l137m942P634k465l714P041l763k527O447
$$ 166 512 -1335 2812 735 -3538 2698 -439 -5381 2253 -212 -3926 3115 -648 -3175 3272
1701C272l471l244N725k88m465M197J324o452L434K484p359O016L048j0076P100
$$ 3272 -199 -3443 2282 1994 -2471 1726 3050 -3402 32 2516 -4843 1173 4221 -5855 1245
1716A245L516j0816O342M216r008N327M069p953K348N163p761J20Q360o744k826
$$ 1245 4761 -6055 287 4503 -4505 822 4891 -3062 -714 4449 -3312 -3192 5168 -1576 -4402
1731d402R899o338m615J0401o093l618J0734n915l747R334m870m720P398j563
$$ -4402 5497 -841 -5456 4945 -1148 -4766 5968 53 -3694 5640 770 -3950 3448 1885
1745A885n258N234R47o392L887K246p605M551L791p694M603L677p166L395J866
$$ 1885 -3373 1861 2808 -3584 303 2549 -5056 -505 3286 -4408 195 3872 -3294 101 1967
1760A967m468M205O23l097K300k6k615J194J615k765K15L029l178P67L208n817
$$ 1967 -2501 1704 2327 -770 1530 1504 -1111 83 1698 -1067 -852 2177 -1001 -234 2974 -2843
1776b843J202M917n944K704L323o568K137K351m746K971J477m306K068K854l546
$$ -2843 -1641 3276 -2668 36 3359 -3209 -1072 1279 -3467 -496 981 -3325 -1257 1597 -1949
1791a949K46M101m256o82P171l882k441P535o458l492R447m653l686P549m387
$$ -1949 -1703 2398 -1858 -2540 4631 749 -1692 5843 -615 -4107 5340 687 -2999 4550 163
1806A63m313O137n67m810L032J141m390L602M036o456Q76L478n369L916L458n584
$$ 163 -4150 1987 1420 -3390 -358 783 -3607 -5 4031 -2425 -1549 1929 -3440 476 3934 -1650
1822a650K037O42l613L927O70l686J922K59j185K061J241l530r70L217j890N75
$$ -1650 387 1029 -2584 1343 2013 -1673 249 508 -677 1384 2625 -905 -1875 1342 -548 27
1838B7M269n592j760M849l925J096M251n286j75L441j843J099J744k526j192K734
$$ 27 4296 -1296 -3056 1793 -2132 -1036 3215 -2071 -2246 1195 -648 451 2195 -331 -1523 1211
1854A211J346j236J285j601m230L965J489k969K526k790l546M613k16j389K100
$$ 1211 2557 1321 2606 1005 -3225 740 2229 -740 1786 -1004 -4550 63 -153 -1542 558
1869E58l301m28L426N43p27m99j366p00L012K512k712Q4J03l635M040L303n189
$$ 558 -2743 -3171 255 798 71 -428 -1794 -2494 518 3030 318 402 505 -3130 910 4213 -976
1886i76J738M37l618M335J778m039m72K67p08J361K582j922m182J415N05k95M034
$$ -976 762 1199 -2419 1916 3694 -345 -817 -550 -1258 103 2685 763 -3419 -2004 -1499 -1794 2240
1903B240j931l536K291l25J633K640l431p89J268m6L082K11l329j423K62J824
$$ 2240 309 -3227 -936 -1261 372 3012 -419 -1208 60 14 3096 3307 -22 -1445 -1183 641
1919F41P14R04j835m277K398K614j663K105j586l634L552J635l83P69l111q80
$$ 641 1355 2259 424 -3853 -1455 1159 -504 1601 15 -3619 -67 1568 1185 1954 -1157 -2037
1935b037J841J629J439j448k225j031R19K934l99q05l79k993K405L221l106J42
$$ -2037 -196 1433 2872 1424 -801 -1832 -913 2021 1622 817 438 -2555 -150 3071 -35 107
1951A07r80l025L689K123j768j147k019k29K094K153M86k577o28Q13P61L439j448
$$ 107 -873 -3898 -209 1914 146 -1001 -3020 -3249 -1155 998 1484 -1093 -1721 -908 -147 3292 1844
1968A844k530J226j202K016K985l555k069O45o97K042J740k152k302p58J819P24
$$ 1844 -686 540 -662 1354 4339 784 -1285 -640 -1337 705 2445 293 -2009 -2767 -948 -224
1984b24O01Q02l713K18K915q65J535p28k953J495J090J070J428k998j254P79P13
$$ -224 377 1179 -2534 -2316 599 -266 1269 541 -2412 -917 173 1243 2671 -327 -1581 -802 -89
2001h9K471l05j701j025l20K293L31j175L3k481Q46K627j094j20j371k206K807
$$ -89 2382 2077 376 -649 -969 1324 1655 480 513 -1968 -1122 1505 411 291 -1080 -3286 -479
2018d79J181mJ173k816m23K020L18P51o39r65p09O36K512j957j774J532k458Q70
$$ -479 702 698 1871 -945 -1368 652 970 1721 1082 117 -592 44 2556 599 -1175 357 -2101 -1231
2036a231L833k879j026R27k212J488K528j147j014K44J81o6J328M23k923Q61J503
$$ -1231 2602 -277 -1303 -376 -2588 -1100 1428 281 -733 -489 -308 -374 954 1377 -1546 -685 818
2053H18j465K866m02l972K246O00j135K795r46k486Q17M11K6P5K87j382j412K585
$$ 818 -647 2219 1817 -2155 91 691 -444 2351 1405 -1081 -264 147 173 248 535 -847 -2259 326
2071C26J08j899J304j461m68K577l86M39qj750J329M13K3J349j759k70J077o75
$$ 326 434 -1465 -161 -1622 -2090 487 101 540 532 -1218 111 524 547 1896 137 -133 944 269
2089B69J58J81r39n32J17J492k49p04P16k157R19K462k424J064J320l507J767
$$ 269 427 608 -331 -863 -746 746 497 -207 509 -1648 -729 1733 -691 373 1693 -1814 -47
2106d7J678k488N99J208j795L98K287j322k100K754n08k781M207p4m426L645l57
$$ -47 1631 -857 -258 950 -845 -447 1840 518 -1582 1172 664 -2117 2090 2016 -2410 1235 878
2123H78l456L711j73l111K514K12k257J208J522k382j64L028j672n76L017k878
$$ 878 -2578 1133 960 -2151 363 575 -1682 -474 1048 -1334 -1498 1530 -142 -718 2299 -579
2139e79o43L451k782p4L103k785n33K094j662k28O65m45k43Q80K40j394P09Q52
$$ -579 -1222 2229 -553 -627 2476 -309 -842 1252 -410 -638 27 -418 -661 219 459 -935 -226 626
2157F26j998J371Q04j451J457r69p80J585j490K29J657j835Q49Q92j719R18L31
$$ 626 -1372 -1 803 -648 809 -160 -940 645 -845 -616 1041 -794 55 947 -772 146 477
2174D77r86N78R95m82j054J554o43k106K683n66k524L631j283k773M126j315k659
$$ 477 -509 69 1064 582 -472 1082 439 -1667 1016 450 -2074 1557 274 -2499 1627 312 -2347
2191b347L682l36k421K381M51k628J456J452k903P68K909l744K05L753m553L04
$$ -2347 1335 999 -1422 959 1410 -1218 238 1690 -1213 -445 2464 -1280 -1075 2678 -1875 -1571
2207a571M093l848L02L400l469P8K921k384q69K925q90k402K769L8l564K769O30
$$ -1571 2522 -1326 -1024 2376 -1093 -1015 1906 -478 -1347 1578 688 -1714 1055 1093 -2471 298 928
2224I28l476L283M59l487L208k03k368K070O2r08O95L11n39j02M69p15m11J312
$$ 928 -2548 735 1194 -2293 915 712 -1656 414 476 -432 263 574 35 -67 402 -313 -724 588
2242E88j170J57J201j889R79L74j733K085p0j943K839r92j801K287p95j096J597
$$ 588 -582 -425 776 -1113 -134 240 -1493 592 522 -1421 1418 426 -1375 912 117 -979 618
2259F18J3j625J170O15j902M52K332k664K07L238l460N25K748l839Q42L048l168
$$ 618 631 -994 176 791 -1111 -659 1673 -991 -784 2454 -1006 -481 2267 -1572 -730 2318 -850
2276h50L20K208k416l26K017j244j349K443l42k346L136n05l078L804l39l019
$$ -850 -530 1678 -738 -1064 953 -291 -1640 803 461 -1885 1251 746 -2332 1472 1133 -1886
2292a886L672m37l002K974l43k550K232N36k197P05J461j800k15K178k140l58
$$ -1886 1786 1349 -1653 1321 978 -1572 660 1196 -1001 -296 1165 -635 -850 1328 -812 -1170
2308a170K766j947r7J751k436N57J228j727Q63P18j447R00J00n40M42L44n09p9
$$ -1170 1596 -351 -448 1303 -1133 -576 652 -1075 -212 506 -941 -41 59 -481 -39 305 -204 -283
2326b83J370p10q65J692j415o54K545j745p22K211k661K71J857j989K37J444j301
$$ -283 1087 377 -488 1204 -211 -865 1680 -65 -787 1424 -1237 -966 891 -1098 -861 583 -718
2343g18l8J227k08j200R62L99j299K062K65k710J685P4k114K960p54j633J665
$$ -718 -756 471 263 -937 25 424 -875 1187 1452 -1258 427 501 -1613 1347 593 -1040 625
2360F25m62r15J718o97j346J264K99p92N33P56k375M17K427k325Q15J874l220
$$ 625 163 -752 966 269 -1077 187 486 -306 227 983 -1392 -975 1452 -873 -58 1816 -1404
2377a404N72K417k096N52J263j846L24J553m97q97K04q7p48J196K08j282P82o23
$$ -1404 -832 1585 -511 41 1304 -542 -218 1335 838 -59 145 58 -690 506 714 -568 214 -409
2395d09j326K263n28j051J548j476J70J802r74j91M52o88K75J074J19j011j81
$$ -409 -1735 528 0 -1051 497 -979 -809 993 19 -172 280 -408 -133 941 1060 49 -132
2412a32L46q44J148R91k293N67M94j423K125k76j929J298k97n89J547j55j589
$$ -132 214 -630 518 1509 -784 -217 277 -1146 979 703 -1226 72 -225 -814 733 578 -1011
2429a011mP27k5R3J113j449r81K183p39Q6J468j947j82J685n83M80l8j718M20
$$ -1011 -1015 -288 -313 -220 893 -556 -1537 646 -93 -7 1461 -486 -668 1017 434 914 876 -842 -422
2448d22O50J70M81o31j159l69J177Q65j074Q74p11j368K564O6j217P93r89m71
$$ -422 228 398 879 248 -911 -1280 -103 762 -312 562 -149 -1517 1047 1113 -104 689 -300 -771
2466g71K040k84m65l22p46R7N01R85o17q49K78n53P49J108j787N8M77j017J761
$$ -771 1269 985 520 198 -548 -451 50 1035 418 -431 -153 -706 43 1151 -636 -578 -101 -1118 643
2485F43O6j533L21m12J27J499k8o19n84j20O01O12N36r19q25Q62j84N94O40k098
$$ 643 709 -824 -503 -915 -788 711 683 64 -520 -640 -39 573 1109 190 -635 227 43 637 1277 -821
2505h21J05Q84q09J266J50k071L03O07J42O67K0q42p84J060P65o77O32o43j161
$$ -821 -716 168 -641 625 775 -1296 -993 -386 -244 423 443 -399 -1183 -123 642 -35 597 -46 -1207
2524a207J598M90j022Q21j035q31J706N0k66K41q87j71M67Q92n42q71O64o71K98
$$ -1207 391 881 -141 680 -355 -1186 520 570 304 545 -342 -513 -46 846 304 -567 97 -574 -276
2543b76J406j424k81N35r80J074J077j025j50m47K84P80k1L79j004m64R94j85
$$ -276 1130 -294 -575 -40 -1020 54 1131 106 -44 -491 -207 573 552 931 -73 -537 457 272
2561B72O2q7p50J42J74K27N96j417R2N08p35J476J71j335P32j88l01J087k35q81
$$ 272 334 247 -503 -361 -187 40 636 -781 -689 -181 -916 560 731 -604 128 -60 -361 726 491 -390
2581c90P8L11L13j80N03o57j145J695l89m36J714j779r58J870o94k32R49r94k95
$$ -390 -312 -1 312 132 635 -22 -1167 528 139 -297 1417 -362 -1320 550 -144 -376 573 -421 -716
2600g16P63K40p93K86K33r73O16J737j843jJ138j575Q34J249j277N6L66o64K19
$$ -716 47 287 -506 -220 13 -960 -344 1393 -450 -451 687 -888 -54 1195 -82 -26 340 -324 -105
2619a05N18k74o36J60O93o68N80L32j491P65L75o76J039j70p23L66k44L45j36
$$ -105 413 139 -497 -337 356 -312 268 600 -891 -126 249 -427 612 442 -281 85 -159 186 50
2638E0k79O67o03k47J019p14k01N25m35J70M67K01n56m21R65q92K4J246j414k67
$$ 50 -229 438 -165 -412 607 -107 -308 217 -218 -48 419 620 64 -357 608 -284 -260 986 -428 -695
2658f95J644j432M8J330j474J09J000m07m43P12j44q31P21O94j508J004M28j876
$$ -695 949 -483 -435 895 -579 -470 530 123 -320 392 248 -583 138 832 -676 328 756 -1120
2676a120J174P74k054J176P51j559Q44N51j196J67J087p57o76J701l16j507J748
$$ -1120 54 828 -1226 -50 701 -858 -14 537 -659 -492 595 -162 -838 863 547 -960 788
2693G88o09j434J863l47j147J288n03m40P29k08k01L79J73j1n59O70k95o66J025
$$ 788 179 -1255 608 261 -886 402 -101 -541 188 -20 -221 158 331 320 -239 431 136 -530 495
2712D95n32k19N44l63J07L9n23N73m29J97O87r44M35N01j060M11N43n96J01L42
$$ 495 -37 -256 288 -75 32 71 -452 121 -308 -111 576 -368 67 568 -492 -81 462 -134 -33 309
2732C09j27l79M61J97j233J116L20j623J446L43j750J494j0j416J535K8j471J040
$$ 309 182 -197 264 461 -772 344 664 -959 487 830 -920 574 564 -852 683 711 -760 280
2750B80K50j075J4J172j066n66J893j142r19K066r97j149K217q20q51J746r11
$$ 280 530 -545 -531 641 -425 -991 902 -240 -1159 907 -90 -1239 978 158 -693 1053 142
2767A42p67J057j67o56L53O07p82J2P69j235K77J032j275N21Q59j424P00L35j117
$$ 142 -625 432 265 -391 -38 569 -213 -201 568 -667 -390 642 -633 -112 747 -677 23 358 -759
2786g59P99J70m36K76K8n1j10o3K44m70N74qk21N31o65J22N21q15M41N53j235
$$ -759 40 210 -226 50 78 27 -83 -146 98 -372 202 194 -27 504 -161 -39 482 -333 108 661 -574
2807e74P35J01j008Q95k0p75P73l0k86M0M80m85O7P75m47m40J328j074o38J587
$$ -574 161 262 -746 149 129 -646 127 97 -189 -149 331 -154 -87 688 241 -199 1129 55 -583 1004
2827A004r87n96J638j260l49J295j062n26J070j30r06P82P11j339N36Q10j540
$$ 1004 17 -579 1059 -201 -550 745 -317 -843 227 97 -809 -27 684 -655 -119 691 -849
2844h49O48R42j557R68N27j495Q39K43o29M81L32n06j14N54l53l34P86n39m15
$$ -849 -201 741 -816 152 679 -816 23 266 -363 118 450 -56 -170 384 31 -303 483 -56 -471
2863d71J131m42q16J024r86r2J109q64Q9P81p71K08K33j84j30J89J90j73K68o1
$$ -471 660 218 -598 426 -560 -652 457 -407 -318 463 -308 -100 133 -51 -181 8 198 25 293 232
2883B32o04L71Q7o51J147o40n53J195q13k60J105q17k42Q11m44k93N96j69l78
$$ 232 -372 -1 86 -565 582 -58 -611 584 -229 -489 616 -201 -443 368 -76 -369 227 58 -320
2902c20K29L68p21N80M43j125N00Q33j294R22L01j249R47J28q31N65P7o14J40
$$ -320 -91 277 -444 136 579 -546 -46 787 -507 415 716 -533 414 542 -289 276 353 -261 -121
2921a21L66k11l30N29m32l55R54l12o34J114p76k56J215j084J70P94q73K59N40
$$ -121 245 34 -296 233 -199 -554 400 88 -546 568 -208 -464 751 -333 -163 631 -242 17 557
2940E57m75k39J72K7l35M90K45q16L80K83j081J096j23p53P33Pn12P04n01m55
$$ 557 82 -157 15 42 -293 197 442 -374 6 289 -792 304 181 -572 161 168 -344 360 -141 -596
2960e96P30l28J0L93j03n17O0N87l08O2M94p56J10P43q66L94J39r44P21L34n76
$$ -596 134 -194 -184 209 106 -411 -351 236 -72 -10 484 -272 -162 581 -285 109 248 -696 25 359 -217
2981b17M40j72p50N59J49P2l24N28n55n1Q77m94k31O41n60l76J319p06n16N89
$$ -217 223 51 -699 -140 9 81 -243 285 -270 -321 556 62 -169 472 -88 -464 855 149 -367 222
3001B22l85k0P52l74j06j19l8pJ06M54p45K39L35n17O01q8r57P30J88n85O50l12
$$ 222 -163 -183 569 195 89 -30 -68 -75 31 485 -260 -21 314 -203 398 310 -647 83 271 -314 336 24
3023B4m69K74M3L37j51J10k7l06L99j81k20M11m97m1O61o69N63p6q16L67L12k22
$$ 24 -445 -171 -128 209 58 168 141 -165 234 53 -167 244 -253 -294 367 -302 261 185 -631 -264 48 -174
3045a74N28k26m91m0N58P2k98L3J03k40O25r4p17M74l96J13O08m93R5K46o30L43
$$ -174 354 128 -363 -403 155 227 -71 -38 65 -175 450 356 -361 113 -283 -170 438 -55 40 286 -344 -1
3067aM32m21j87M16l56j03N56J61r89L04N85q45O46L34r66L52K91o34Q12P1n70
$$ -1 431 10 -177 239 -117 -220 336 497 -492 -188 397 -448 198 532 -434 -82 209 -425 387 458 -112
3088a12J15J32k0p0O3J08m76N41M4o17Q41o65k30P17l29j80M63n58J1J48J52Q8
$$ -112 3 135 115 45 108 216 -260 281 325 -292 549 -116 -346 371 42 -138 325 -233 -222 -74 78 166
3110A66l03k1J60l25O32j93n00M78k02J06J52L2J41p58L71N07o86L53L44r35M56
$$ 166 -137 -158 2 -323 309 116 -384 94 -108 -2 150 182 323 -435 -64 443 -243 110 454 -481 -25
3131b5L24o15L61m5l88K33L18j22k89L21k32k27J099l51q07R11l09p00R93j83
$$ -25 299 -316 45 0 -388 -155 163 41 -248 73 -159 -386 713 362 -445 466 157 -543 450 267
3151B67q08Q94j20n22N03J65n62j16Q27n16m30J032p11m33J076p68j82P52n39
$$ 267 -541 353 233 -289 214 379 -183 -299 528 12 -418 614 -97 -530 546 -222 -404 348 -191
3170a91q6N68l18k46J86L26k51M5M04l59m72J103o04p5O45q08K5M40l85j11L6
$$ -191 -277 291 -27 -273 -87 239 -12 33 437 78 -394 709 105 30 675 -133 -108 332 -53 -164 -128
3191a28K17k46k53P92o35l17P10l11j28N81j31m67N52k00l4j80N21m48l87R28
$$ -128 89 -157 -410 382 -253 -570 140 -171 -299 282 151 -316 236 36 2 -178 343 -105 -492 436
3211D36k97m75Q89p44l55J170m23o44Q46l88l93L13K92p95J51P37o34k26J173
$$ 436 139 -336 553 -191 -546 624 201 -443 403 15 -378 -65 227 -568 -417 320 -314 -540 633
3230F33r54j73J064j037K23J008r56J01M94m40m5L36l4o55N59L69q22N5O41j185
$$ 633 -321 -494 570 -467 -244 764 -192 -91 403 -37 -82 254 220 -435 124 493 -329 -274 367 -818
3250h18N81N40o97M80J39o02J14N02J07n70L95l6n83L90L95m59J08K75m54L93
$$ -818 -237 303 -394 86 225 -377 -263 239 346 -224 171 135 -448 -58 337 -122 -14 261 -193 200
3270B00K93m88n6j65L02k58M12J06o60J3O81o39R4N03q71O9Q37m14k29O03k57
$$ 200 493 5 -51 -216 86 -172 240 346 -314 -301 380 -259 -165 338 -533 -464 373 -41 -270 333 76
3291G6l40K34Q96j126J73P38j043N66N08q14r4N82o83J64L89k90m59M12P9n64
$$ 76 -264 -30 866 -260 -87 651 -392 174 682 -132 -226 356 -327 -163 226 -64 -523 -111 -32 -596
3311e96P16N2r10O89K81q65J154k66r48Q81K22p81N99J40n29M7L93l08l66P61
$$ -596 120 172 -738 -49 232 -633 521 255 -693 188 410 -371 228 368 -161 -114 279 -29 -395 366
3331C66l24m87Q72m53n18R43o43l7M60m23J38J10n0p6j82L83kl42K80m1jL89k42
$$ 366 42 -445 427 -26 -544 399 -244 -281 179 -244 -106 4 -46 -122 -304 79 77 -265 15 -26 -27 362 120
3354A20j25J88j50L20m26J81J05l97K03J57n04K88K86p80N45J58l45k7L66k78
$$ 120 -5 183 33 353 -73 108 213 -184 19 176 -328 -40 246 -534 11 169 -176 -203 163 -115
3374a15j15O04l8q64Q18J25r77R15j56o54P07j29m22N79q7k60j14M62k90l1L15
$$ -115 -230 374 336 -528 290 415 -562 353 197 -457 250 121 -301 278 191 -69 -183 279 -11 -42 273
3395B73l54l68P08m83p6O85n16m6P60q27J83J59j81L47k50J35l28J35K38n70M84
$$ 273 -81 -449 259 -224 -300 385 -131 -177 583 -244 -61 98 -83 264 14 149 -179 -44 194 -376 108
3416A08K02m61K25L0o30M84m0l55P72l45k85O67o40pL07j86K68k76M87l97L7K88
$$ 108 310 -151 74 104 -526 -42 -82 -437 335 -10 -295 372 -268 -275 32 -154 114 -162 325 -72 -35 253
3438B53l81K17J87m60M05J01o93N32r2l91P02m25j58O34m53l0J03l7j30l4L30
$$ 253 -128 89 276 -184 221 322 -371 161 69 -322 380 -45 -203 431 -22 -52 51 14 -116 -150 180
3459A80k10o3L87n51r7Q43n93O7O63r65L33L46n39K35J47k76K4K22k14l5j34M30
$$ 180 -30 -93 294 -257 -354 489 -104 -37 626 -339 -6 340 -199 36 183 -93 -69 153 -61 -96 -230 200
3481B00n94K96L31o38O78j06m07O97n17j58M36k70r3L11m32K88j83L6R0mJ89m22
$$ 200 -394 -98 233 -405 273 167 -240 457 -60 -218 218 -52 -145 166 -266 22 -161 -125 -35 -39 150 -272
3503b72K69L46m94M0N53p76L96J32n39M17k10k85M45N4p7Lm6j3J6J20r1j57N06
$$ -272 -3 343 -151 -111 442 -334 62 194 -345 72 -138 -423 22 76 -1 2 -44 -57 -41 79 -12 -169 337
3526C37k49j62L62l21j64M98m55J07L75n83J51Q8m7Q6K9J68k76l7L29l73J61J90
$$ 337 88 -74 288 -33 -197 301 -154 -47 328 -255 -104 -16 -63 23 52 220 -56 -93 236 -137 24 214
3548B14n94M96J76n53K95J32n86N79p6l6J60l9l0k64J47J73k53L35j47l00L35
$$ 214 -380 116 292 -261 34 166 -420 159 83 47 207 168 138 -126 21 194 -59 276 129 -171 164
3569A64k68l51P20n21R4M71l68J39P1l73K61k14O7J27j22J29j21L1P8k39L18J65
$$ 164 -104 -455 265 -256 -162 309 -59 80 151 -222 39 -175 -108 19 -103 26 -95 -64 14 -225 93 258
3591B58n24L76J6l70N00m06J76L30m16J84j06k37N44m53nJ30k1l3q9L00j35l80
$$ 258 -266 110 126 -244 256 -150 26 356 -60 124 18 -219 325 -128 -133 -3 -24 -57 -146 154 19 -361
3613c61M41J01m05P44m64m47Q52k09k65L12k27n3R1R0j8m42O08m45j05N94p00
$$ -361 80 181 -224 520 56 -391 461 252 -13 299 72 19 110 200 182 -260 348 -97 -202 392 -308
3634c08P3N93q85M57L77m54RN01m11n9M2M3k2P7K23n24K87M60o65L1N26m57J93
$$ -308 -235 358 -527 -70 307 -147 -138 363 -48 -107 -65 -22 -44 33 256 -268 19 479 -186 -155 371 -86 107
3657A07J26l16J00J3j20J4l12N51l19j2K53l91J7L38k40K21P7r5J62j6j12j5q2
$$ 107 233 -83 17 30 -90 -76 -388 163 -156 -168 85 -306 -289 49 -191 30 107 12 174 158 46 31 -51
3680e1K91l80k2N88p01K77P3k19j1L33k01j13J08k2k04O6L97n96L03M06o64K64
$$ -51 240 -140 -162 426 -275 2 75 -144 -155 178 -23 -136 -28 -50 -254 -188 209 -387 -84 322 -342 -78
3702g8O29r01L38L57m90J45L36l07p2M3L17l25J88J57p32N67J09o10L03J45m72
$$ -78 551 -350 -12 345 -145 0 336 29 -43 0 317 -8 180 337 -395 172 281 -329 -26 119 -353
3723c53K86J38k36K49j25K1j62L21R0n70N74M5n16L91J10m88K38K6j13K95l2k25
$$ -353 -67 71 -165 84 -41 -20 -182 139 229 -341 233 278 -238 153 263 -225 13 39 -74 221 189 -36
3745c6l33K76L29m41L04P3m50J85K74m75L17j20j02J77j73K42k91oM18m11M88
$$ -36 -369 -93 236 -205 99 172 -278 -93 181 -294 23 -97 -199 -22 -195 47 -244 -250 168 -243 245
3766B45N8o33M88J35o72Q40k47m71K93k6k02p7L17j68l63O03K0o22P37k26n67
$$ 245 303 -330 158 293 -379 461 214 -257 36 10 -192 -269 48 -120 -483 120 140 -482 255 29 -538
3787e38Q24k33m15O58k06l52K70K60mm02M66l52l01Q60l68n36N28j59l09P21k22
$$ -538 286 53 -362 296 90 -262 8 268 264 -138 328 -24 -325 535 167 -369 159 0 -309 412 190
3808A90k99K52k46j1J21J7kl18L83m3j73N26n53k22Q68l96j3K51m01R8j53K71
$$ 190 -109 143 -103 -114 7 24 22 -296 87 44 -129 397 -156 -378 490 94 81 332 -69 29 -124 147
3830A47P8j89O2j14l85O93m84lK01j10O0N6J29k19j43K73J61j75L99l86m65P70
$$ 147 225 36 98 -16 -401 292 -192 -195 6 -104 -44 12 141 -78 -221 52 213 38 437 51 -414 356
3852C56j72l15N84n26k12M86j76p5K91k60j36k0O99o85j69N32n82J2Q68p75m2
$$ 356 184 -131 453 -73 -285 201 25 -50 241 -19 -155 -175 524 -161 -330 202 -380 -368 500 -275 -317
3873c17N48n97L48L42k99q6K3K27J19j75J54m78n9N09m97L39J29o68M94q6k03
$$ -317 231 -366 -18 324 25 -61 -38 189 308 133 287 -191 -250 259 -238 101 230 -438 56 -30 -233
3894b33M63k15q4J4n0J78K6m7j16j43L73J88m86J10l8j12K55L4r8K03m89N32m9
$$ -233 230 15 -69 -55 -105 73 99 52 -64 -207 166 354 -132 -22 -60 -172 83 117 19 222 -267 265 216
3917B16m51M95m57j23N36k86K1J31j93n8QK85l7l11L15m03R8N56n12K22J92o16
$$ 216 -235 260 -197 -320 216 -70 -49 82 -111 -169 -161 124 87 -224 91 -312 -214 342 -170 52 244 -372
3939c72L71K79o37L12M2k2j10J42K2k22J86J00m31M98j9n26L67K55l92L49j19
$$ -372 -1 278 -359 -47 -5 -27 -137 5 27 -195 -9 91 -340 158 139 -387 -20 235 -157 192 73
3960G3k63M12l92K60n2M9j70L1L07J52o21N75l58j49L60k70j80N54n28K15L1j96
$$ 73 -190 222 -170 90 38 87 -83 -52 255 407 -214 361 3 -146 214 -56 -236 318 -210 5 36 -160
3982a60M81m36p7L02k80J66q7n3J87j42J88j75Q2J72j83k68O82l71m7M12p92L68
$$ -160 321 -115 -192 110 -170 -4 -91 -144 43 -99 89 -86 -4 168 -15 -283 399 28 -19 393 -399 -31
4004c1J70k58J19j18N8J80j54J78l19K3J61j02RO6k60N94l81m09O44j78j85L18
$$ -31 139 -119 0 -118 -60 120 -34 144 -175 -152 9 -93 -84 -18 -278 316 -65 -474 170 -8 -193 125
4026A25k02j77L56j43J04r0j64K84m25L78J17l29M47m64j42N08m53M5L84l31K21
$$ 125 -77 -254 102 -41 63 -27 -191 93 -332 46 163 -166 281 -183 -325 183 -270 -225 159 -172 49
4047D9N3j42J30k35K29k33q0L63k78O3M61o30L86j74j16M60l75J35K57o54L34
$$ 49 102 -40 90 -145 84 -149 -229 134 -144 -81 380 -250 136 -38 -154 306 -69 66 323 -331 3
4068CO7k35K87l9k33K39o8r9L48l08K55j54j44L04m77K89J11m56N13j32j55M64
$$ 3 70 -165 122 83 -150 89 21 -78 270 -38 217 63 -81 223 -254 35 146 -310 203 71 -84 380
4090C80n76M1L92l69J57J03o3k5k1J64k75q4L86l69j8K89j93M7K52m30K03J14
$$ 380 -196 -155 237 -132 25 128 65 40 19 183 -92 -176 210 -159 -177 112 -81 -34 218 -212 -9 105
4112A05k44K42j19o7O6j65J97j10Q6O7k83K40J15m74L59R9k02K02j32R2j28k15
$$ 105 -139 103 -16 -83 -17 -182 15 -95 -9 58 -225 15 130 -344 15 114 -88 114 -18 74 -54 -269
4134b69L37l10J31R3k17J94Q5l23K15P9k02L23k22J44Rk20M27l96J34K95n30J57
$$ -269 68 -242 -111 -18 -235 -41 44 -279 -64 15 -187 136 -86 58 67 -153 274 -122 12 307 -223 -66
4156f6J63l99N24o2k45J22n9J11j7m1K50k88l8M22p40N40j29l82L68K13l23R6
$$ -66 97 -302 222 160 -85 37 -22 89 72 31 281 -7 -45 377 -363 177 48 -334 34 247 -76 20
4178B0J20k61J16N8J16n51M71R3j95L9M6k84L38r6k68K26L7j99L73k37J5k6J42
$$ 20 140 -121 -5 53 169 -382 89 182 -13 26 72 -212 126 30 -238 -12 25 -174 199 -38 -23 -49 93
4201I3k39qK52O2l78L83k9l46M51k31l78L84j41L6K22j20m6k76L43P7n48P62l14
$$ 93 -146 -154 98 160 -218 165 136 -210 241 10 -368 16 -125 -89 133 13 -33 -309 34 111 -437 325 11
4224A1m41N72o3m44O04l04j91K24J36k73k01M89K14n61N70Jn91L33r1j14K96j38
$$ 11 -430 142 79 -365 239 -65 -256 -32 104 -169 -370 119 333 -228 342 343 -248 85 -6 -120 176 38
4246C8r5J24j16P2j32J21J08n43O35j16k09L69l22k32O03j21j75R9K5q6j25K70
$$ 38 -57 67 -49 23 -109 12 120 -423 212 96 -113 256 -66 -298 305 184 9 108 133 47 -78 192
4268A92j17k89M96j72l76O82n27k77N62k75r7N31k44k10J55K30k50pK75n28J99
$$ 192 75 -214 282 110 -266 416 -111 -388 174 -101 -198 333 89 -121 34 264 14 7 282 -246 -47
4289d7N34o14l9O64o51J11L88l36J00j1n2k04l4M03k56l06P29o35M5L96m84L7
$$ -47 487 -127 -166 498 -153 -42 346 10 110 99 47 -157 -191 212 -44 -350 379 -256 -211 185 -299 -262
4311b62L55l69K19J27j46J69J3J2n3k17M58m44j81O42l48L6Q2o5NK3l6K7p6K01
$$ -262 93 -276 -57 70 -76 93 106 118 65 -152 306 -138 -319 323 -25 11 93 28 33 56 20 47 -29 172
4335A72j81o3M44l02j59M27n89K91K63n05K44k05J93m8K4O1k46J04M28l95L4K92
$$ 172 -9 -72 372 70 -89 338 -251 40 303 -202 42 -163 30 -18 6 67 -179 -75 353 -42 -8 284
4357B84p91M76K39l93K70J10l97J44R8j39J4J28J2l75J89M82n85K65J60n60N99
$$ 284 -507 -31 208 -185 85 195 -202 -58 40 -99 -85 43 55 -320 -131 351 -234 31 191 -369 230
4378B30j43k94L32k28J36R2o3q1k44K08L12n04M15n4m48L57j28j8J23j48L2N5
$$ 230 87 -207 125 -103 33 125 62 -19 -263 -55 257 -247 168 114 -334 23 -105 -123 0 -148 -116 -61
4400f1p9L65k73j44L78n16J68L43l67K75O9k17J24O3K2j83K4K1j40K01N6l51L42
$$ -61 -140 225 -48 -192 186 -330 -162 181 -186 89 158 -59 65 128 150 -33 -9 12 -128 73 129 -222 120
4423A20J52m37K89n7l04L87Lj59O1k9q8Q5m4L24m07K34j35k08N40k13l13N93n81
$$ 120 272 -165 124 67 -237 150 153 -6 55 26 -62 23 -21 303 -104 130 -5 -213 327 114 -199 394 -187
4446a87K48K84m73K77j29j94L15k06M6J37l60K69j4k2J12m63J69J88KK15k67k7
$$ -187 61 345 -128 149 20 -174 141 -65 -19 118 -242 27 13 -9 103 -360 -191 -3 -1 214 -53 -80
4468h0L20l07J79Q2l47J78Nk41L57m8k46K95l81J16J20j01K47l33R9J46l24M12
$$ -80 240 -67 112 194 -153 25 30 -211 146 98 -148 147 -234 -118 2 -99 148 -185 -86 60 -264 148
4490A48L0m31L76j15k54L04j87J46nn6O2P4l9j6j09K18kk22L93l10K0K99n70K35
$$ 148 178 -253 123 8 -246 58 -129 17 12 -44 18 92 53 37 -72 146 144 -78 315 5 25 324 -246 -11
4514a1k5j12K24j07j56L12L1j54j8M9J88k77R6K24k88J81J4l36M09k82o1L82k10
$$ -11 -36 -148 76 -31 -187 125 156 2 -16 33 221 -56 40 264 -24 157 171 -165 244 -38 -99 283 73
4537G3j28N0p4K06q0j37J60j16O2N0j57N6j13J59J36k98L32l01k32N45l82m0M54
$$ 73 -55 -5 -79 127 47 -90 70 -46 16 66 -91 -35 -148 11 147 -151 181 -120 -352 193 -189 -229 225
4560B25k92k8J77j21J17M0q6l6j3K05k76j61M72m09J39J91m74L52J64l49K7L41
$$ 225 -67 -95 82 -39 78 118 32 -4 -17 188 -88 -249 223 -186 -47 144 -330 22 186 -163 -136 205
4582B05l22K41j62J71o2j66J96j54P3J68m08L08J35k67J55Q9k72K17l52L15J7
$$ 205 -117 124 -38 133 71 -95 101 -53 20 188 -220 88 223 -44 111 200 -72 145 -207 108 125
4603A25k42L08j98j91M58m00Q6K83m21L54j73k00M18l09J98j08K2J02j31q0L49
$$ 125 -117 191 -7 -198 260 -140 -54 229 -192 162 -11 -211 207 -102 96 -12 10 112 -19 -99 250
4624B50l04J57J02n53M25kk72J23Qr2K8J12p8N4k6K28l52J04J92n38M57Lk0Q6
$$ 250 -54 103 205 -348 77 75 -197 -74 -66 -158 -130 -18 -96 -42 -68 160 -192 -88 104 -434 23 26 6 92
4648I2j93l8K37j38K83l45l7L21k94J19K28m46L35l2k42P2J8r3J26j23K79l41
$$ 92 -101 -139 98 -40 243 -102 -139 182 -112 7 235 -211 124 92 -150 -78 -60 -153 -27 -150 129 -212
4670b12J11K74l58K15K7l33M94j78p8K25n2k02J86j28rp6N8K44k91K8N2k56M77
$$ -212 -101 173 -185 30 57 -276 218 40 -38 187 135 -67 119 -9 -18 -94 -36 208 -83 -55 -3 -259 218
4693B18j98o2R3j53Q0K58l60J37r3J3L15j61k6j15j45M37j04k30M46n89J03M40
$$ 218 20 -42 51 -102 -22 236 -124 13 -80 -67 248 87 61 -54 -199 238 134 -96 350 -239 -136 304
4715C04n93K34Q9j70J24L4n4q0K0K27L2m41L21j37OL06k43L9J16j23J30j90J66
$$ 304 -289 -55 34 -136 -12 22 -32 -112 -92 135 167 -274 47 -90 -84 222 -21 18 134 11 141 -49 117
4738A17p2k19N24m72rK09k66j02N06n22L31O9k49QO6M8ll76Q07n24k04N19n03
$$ 117 45 -174 350 -122 -131 78 -188 -290 216 -306 25 94 -155 -147 -81 -33 -36 -412 395 -129 -333 186 -317
4761c17J57M28l09p0L05l95J64J52m8j30N3J6n4K7M21m34o4O33p69K26J98m49
$$ -317 -160 268 -41 -111 194 -201 -37 115 67 -63 -10 6 -48 -21 400 -34 -98 535 -234 -8 190 -259
4783b59L32J6m4N6k46L38j38n7J66k82R1K81l57L12n0l81L18k4j25P5j27Q0j11
$$ -259 73 89 45 101 -145 193 55 -2 164 -118 -27 254 -103 209 159 -222 96 72 -53 22 -105 -25 -136
4806a36l3K73l53K46L98n64J25K69m48J81P2j05L9j44J41q5M7L47m61k3N10m68
$$ -136 -169 104 -249 -3 395 -169 -44 225 -223 -42 30 -75 -36 -180 -39 -124 -77 270 -191 -214 296 -172
4828a72m3K43k62J37L82l25M1QR4k74J58J30l20K93J50m80M15Mo77O06k6j83L02
$$ -172 -215 28 -234 -97 285 -40 1 9 103 -171 -13 117 -203 90 240 -240 175 179 -498 108 82 -101 201
4851B01k14m0J11J3K1j29N0Q7l15K90R4k94L61k86n9L46l18ML15j71p7N3J08J80
$$ 201 -13 -53 58 71 92 -37 13 100 -215 75 169 -125 236 -50 -109 237 -81 -77 238 67 -10 43 151 331
4875C31l90J65r9k26K14J47l25M03k44P2J78j29J08l01N6J16l90M91J3o95O65
$$ 331 -59 106 7 -219 -5 142 -183 220 -24 48 226 97 205 -96 -40 76 -314 177 190 -505 160
4896A60j03j17K10n6k28K27N7k47OJ42n4l03L37p5k76K96J8k55M92l52MJ98j96
$$ 160 57 -60 150 94 -134 93 150 -97 -91 51 -3 -306 31 -44 -320 -24 -6 -261 231 -121 -117 81 -115
4919a15J94J33k32J83l87K49J10l58M34k14j96L92l42J63q1k71L42j53n7L62k09
$$ -115 79 212 -20 163 -224 25 135 -223 211 -3 -199 193 -149 14 -67 -338 4 -149 -206 156 -53
4940e3p2L40m55L85j32J4K8j51j5J86n4J75k55L4J72l89K38K18l50L51j16k76
$$ -53 -125 215 -240 145 13 27 55 -96 -111 75 21 196 -59 -25 147 -242 -4 214 -136 215 99 -177
4962a77M35l38j58M67k25q6j22J35K13j49J60p4m18O06k60j37M00n56L25L15m79
$$ -177 258 -80 -238 229 4 -82 -204 -69 144 -5 155 81 -337 269 9 -128 272 -284 41 356 -123
4983a23J95J44j93P1j14k3M9P6l2k37k3L87n00L95J34l17J20P1l58L40k11J71
$$ -123 72 216 23 94 -20 -43 6 82 50 -187 -210 177 -323 72 206 -111 9 80 -278 62 -149 22
5005B2Q9k97L76n8k32J51k13K27Pj97K00k29P7K43k99K57J02m89K85J69l98M45
$$ 22 111 -186 190 132 -100 51 -162 65 72 -125 75 -154 -77 166 -133 124 226 -263 22 191 -207 238
5027B38j52j90K27j89J53o1k0J71k44K5J72l03N47l91P1K30n36N0M53n00K66J68
$$ 238 86 -104 123 -66 87 26 6 177 -67 -42 130 -173 374 -17 54 284 -252 -202 251 -249 17 185
5049A85k65K45L8k49J6k2K21j65Q5J22k76K39R4m46K95K17o10N15k43k5J81o0
$$ 185 -80 165 203 -46 -30 -52 169 4 89 211 -65 174 268 -178 117 334 -276 239 -4 -29 152 92
5071I2j56J13j15J29j74J76N0k33J90P1k05K50k67k2J86n7K02j39j64K74j41k33
$$ 92 -64 49 -66 63 -111 65 115 -118 72 143 -62 188 -79 -101 85 28 230 91 -73 201 60 -173
5093a73L11l17N7K58k31M0Q2k29K03j79J50r2m6M62l14j78K87k03J60J45o00N83
$$ -173 138 -179 -122 136 -95 -55 27 -202 1 -178 -28 -120 -166 296 -18 -196 91 -112 48 193 -407 176
5115A76k82N4J36k95J73J3O1N9j85J36pl01L03K1k64L11k27M7J75k59R3J31j99
$$ 176 -106 -52 84 -211 -38 -25 36 95 -90 46 39 -262 41 62 -202 109 -118 -71 104 -155 -62 69 -130
5138a30P4j3L4P9k77M91j79l16L45m1j20L27l10jJ91o7pr5j32J99k04K90j48k35
$$ -130 -56 -69 -35 44 -233 258 79 -237 108 67 -53 274 -36 -37 154 87 80 -15 -147 52 -152 138 -10 -245
$$ [...]
8191a55
##END NTUPLES=NMR FID
##END=
