##TITLE=1H_47-2025 Bay
 200.13MHz, CDCl3,
 8 sc
 
 23.4.2025
##JCAMPDX= 6.0         $$ Bruker NMR JCAMP-DX V2.0
##DATA TYPE= NMR FID
##DATA CLASS= NTUPLES
##ORIGIN= UXNMR, Bruker Analytische Messtechnik GmbH
##OWNER= pz
$$ XWIN-NMR		Version 3.5
$$ Wed Apr 23 13:55:21 2025 Russian Standard Time (UT+4h)  she@DPX200
##.OBSERVE FREQUENCY= 200.1313
##.OBSERVE NUCLEUS= ^1H
##.DELAY= (6, 6)
##.ACQUISITION MODE= SIMULTANEOUS
##.ACQUISITION SCHEME= undefined
##.AVERAGES= 8
##.DIGITISER RES= 18
##SPECTROMETER/DATA SYSTEM= spect
##.PULSE SEQUENCE= zg30
##.SOLVENT NAME= CDCl3
##.SHIFT REFERENCE= (INTERNAL, CDCl3, 0, 14.3821)
##AUDIT TRAIL= $$ (NUMBER, WHEN, WHO, WHERE, WHAT)
$$ ##TITLE= Audit trail, XWIN-NMR		Version 3.5
$$ ##JCAMPDX= 5.01
$$ ##ORIGIN= Bruker BioSpin GmbH
$$ ##OWNER= she
$$ F:/spectra/data/she/nmr/H-C/1/audita.txt
$$ ##AUDIT TRAIL=  $$ (NUMBER, WHEN, WHO, WHERE, WHAT)
(   1,<2025-04-23 13:53:56.35 +0400>,<she>,<DPX200>,
      <created by zg, POWCHK disabled, PULCHK disabled
       configuration hash MD5:
       00 E9 B6 7A A2 85 ED C7 34 08 36 98 17 FE 4E 26
       data hash MD5: 16K
       D7 F3 67 6D 26 E2 9D 97 2A 22 E5 0A 17 08 E5 51>)
$$ ##END=
$$ 
$$ hash MD5
$$ 3B 9D 51 5F 36 B1 21 9D 3C B7 C7 DC 64 DA B1 65
##$RELAX= 
##$RELAX= 
##$RELAX= 
##$RELAX= 
##$RELAX= 
##$RELAX= 
$$ Bruker specific parameters
$$ --------------------------
##$DU= <F:/spectra>
##$EXPNO= 1
##$NAME= <H-C>
##$PROCNO= 1
##$TYPE= <nmr>
##$USER= <she>
##$AMP= (0..31)
100 100 100 100 100 100 100 100 100 100 100 100 100 100 100 100 100 100 
100 100 100 100 100 100 100 100 100 100 100 100 100 100 
##$AQSEQ= 0
##$AQ_mod= 1
##$AUNM= <au_zg>
##$AUTOPOS= <>
##$BF1= 200.13
##$BF2= 200.13
##$BF3= 200.13
##$BF4= 200.13
##$BF5= 200.13
##$BF6= 200.13
##$BF7= 200.13
##$BF8= 200.13
##$BYTORDA= 1
##$CFDGTYP= 0
##$CFRGTYP= 5
##$CHEMSTR= <none>
##$CNST= (0..31)
1 1 145 1 1 1 1 1 1 1 1 1 1 1 1 1 1 1 1 1 1 1 1 1 1 1 1 1 1 1 1 1 
##$CPDPRG= <>
##$CPDPRG1= <>
##$CPDPRG2= <>
##$CPDPRG3= <>
##$CPDPRG4= <mlev>
##$CPDPRG5= <mlev>
##$CPDPRG6= <mlev>
##$CPDPRG7= <mlev>
##$CPDPRG8= <mlev>
##$CPDPRGB= <>
##$CPDPRGT= <>
##$D= (0..31)
0 0.7 0 0 0 0 0 0 0 0 0 0.03 0 0 0 0 0 0 0 0 0 0 0 0 0 0 0 0 0 0 0 0 
##$DATE= 1745402035
##$DBL= (0..7)
120 120 120 120 120 120 120 120 
##$DBP= (0..7)
150 150 150 150 150 150 150 150 
##$DBP07= 0
##$DBPNAM0= <>
##$DBPNAM1= <>
##$DBPNAM2= <>
##$DBPNAM3= <>
##$DBPNAM4= <>
##$DBPNAM5= <>
##$DBPNAM6= <>
##$DBPNAM7= <>
##$DBPOAL= (0..7)
0.5 0.5 0.5 0.5 0.5 0.5 0.5 0.5 
##$DBPOFFS= (0..7)
0 0 0 0 0 0 0 0 
##$DE= 6
##$DECBNUC= <off>
##$DECIM= 32
##$DECNUC= <off>
##$DECSTAT= 4
##$DIGMOD= 1
##$DIGTYP= 9
##$DL= (0..7)
0 120 120 120 120 120 120 120 
##$DP= (0..7)
150 150 150 150 150 150 150 150 
##$DP07= 0
##$DPNAME0= <>
##$DPNAME1= <>
##$DPNAME2= <>
##$DPNAME3= <>
##$DPNAME4= <>
##$DPNAME5= <>
##$DPNAME6= <>
##$DPNAME7= <>
##$DPOAL= (0..7)
0.5 0.5 0.5 0.5 0.5 0.5 0.5 0.5 
##$DPOFFS= (0..7)
0 0 0 0 0 0 0 0 
##$DQDMODE= 0
##$DR= 18
##$DS= 0
##$DSLIST= <SSSSSSSSSSSSSSS>
$$ [...]
##$SUBNAM0= <"">
##$SUBNAM1= <"">
##$SUBNAM2= <"">
##$SUBNAM3= <"">
##$SUBNAM4= <"">
##$SUBNAM5= <"">
##$SUBNAM6= <"">
##$SUBNAM7= <"">
##$SUBNAM8= <"">
##$SUBNAM9= <"">
##$SW= 18.0517328524113
##$SWIBOX= (0..15)
0 0 2 0 0 0 0 0 0 0 0 0 0 0 0 0 
##$SW_h= 3612.71676300578
##$TD= 16384
##$TD0= 1
##$TE= 0
##$TE2= 300
##$TE3= 300
##$TEG= 300
##$TL= (0..7)
0 120 120 120 120 120 120 120 
##$TP= (0..7)
150 150 150 150 150 150 150 150 
##$TP07= 0
##$TPNAME0= <>
##$TPNAME1= <>
##$TPNAME2= <>
##$TPNAME3= <>
##$TPNAME4= <>
##$TPNAME5= <>
##$TPNAME6= <>
##$TPNAME7= <>
##$TPOAL= (0..7)
0.5 0.5 0.5 0.5 0.5 0.5 0.5 0.5 
##$TPOFFS= (0..7)
0 0 0 0 0 0 0 0 
##$TUNHIN= 0
##$TUNHOUT= 0
##$TUNXOUT= 0
##$USERA1= <user>
##$USERA2= <user>
##$USERA3= <user>
##$USERA4= <user>
##$USERA5= <user>
##$V9= 5
##$VALIST= <valist>
##$VCLIST= <CCCCCCCCCCCCCCC>
##$VD= 0
##$VDLIST= <DDDDDDDDDDDDDDD>
##$VPLIST= <PPPPPPPPPPPPPPP>
##$VTLIST= <TTTTTTTTTTTTTTT>
##$WBST= 1024
##$WBSW= 4
##$XGAIN= (0..3)
0 0 0 0 
##$XL= 0
##$YL= 0
##$YMAX_a= 483479
##$YMIN_a= -491865
##$ZGOPTNS= <>
##$ZL1= 120
##$ZL2= 120
##$ZL3= 120
##$ZL4= 120
##$ABSF1= 10
##$ABSF2= 0
##$ABSG= 5
##$ABSL= 3
##$ALPHA= 0
##$AQORDER= 0
##$ASSFAC= 0
##$ASSFACI= 0
##$ASSFACX= 0
##$ASSWID= 0
##$AUNMP= <proc_1d>
##$AZFE= 0.1
##$AZFW= 0.1
##$BCFW= 1
##$BC_mod= 2
##$BYTORDP= 1
##$COROFFS= 0
##$CY= -3
##$DATMOD= 1
##$DC= 2
##$DFILT= <>
##$DTYPP= 0
##$F1P= 0
##$F2P= 0
##$FCOR= 0.5
##$FTSIZE= 0
##$FT_mod= 4
##$GAMMA= 1
##$GB= 0.15
##$INTBC= 1
##$INTSCL= 1
##$ISEN= 128
##$LB= 0.25
##$LEV0= 0
##$LPBIN= 0
##$MAXI= 10000
##$MC2= 0
##$MEAN= 0
##$ME_mod= 0
##$MI= 1.114404
##$NCOEF= 0
##$NC_proc= 0
##$NLEV= 6
##$NOISF1= 3.799351
##$NOISF2= 2.8
##$NSP= 1
##$NTH_PI= 0
##$NZP= 0
##$OFFSET= 14.38212
##$PC= 1
##$PHC0= -990.7643
##$PHC1= 11.3922
##$PH_mod= 1
##$PKNL= yes
##$PPARMOD= 0
##$PSCAL= 0
##$PSIGN= 0
##$REVERSE= no
##$SF= 200.129724274929
##$SI= 16384
##$SIGF1= 3
##$SIGF2= 2
##$SINO= 400
##$SIOLD= 16384
##$SREGLST= <1H.CDCl3>
##$SSB= 0
##$STSI= 0
##$STSR= 0
##$SW_p= 3205.1282051282
##$SYMM= 0
##$S_DEV= 0
##$TDeff= 0
##$TDoff= 0
##$TI= <>
##$TILT= no
##$TM1= 0
##$TM2= 0
##$TOPLEV= 0
##$USERP1= <user>
##$USERP2= <user>
##$USERP3= <user>
##$USERP4= <user>
##$USERP5= <user>
##$WDW= 1
##$XDIM= 8192
##$YMAX_p= 0
##$YMIN_p= 0
$$ End of Bruker specific parameters
$$ ---------------------------------
##NTUPLES= NMR FID
##VAR_NAME=  TIME,          FID/REAL,        FID/IMAG
##SYMBOL=    X,             R,               I
##VAR_TYPE=  INDEPENDENT,   DEPENDENT,       DEPENDENT
##VAR_FORM=  AFFN,          ASDF,            ASDF
##VAR_DIM=   8192,          8192,            8192
##UNITS=     SECONDS,       ARBITRARY UNITS, ARBITRARY UNITS
##FACTOR=    0.0002768,     1,               1
##FIRST=     0,             0,               0
##LAST=      2.2672688,     0,               0
##MIN=       0,             -491865,         0
##MAX=       2.2672688,     483479,          0
$$ Real data points
##PAGE= N=1
##DATA TABLE= (X++(R..R)), XYDATA
$$ [...]
1261a163L126q38r95J78k651Q61M174j855j464J792k832o63M798k76l307L62M54
1278b99n21J140J602j517k308J309P87n64K352j029l916K681J860k564J774R99
1294A786l584J88K743o7r93j18k58p70R10J730j584o99J226j812O18L187k570
1311f7j597K613j216p63K594o74j991P03Q38n31J10J014j175j655K438L81k407
1328a385K073M04l186J966J879k428M16R58j285K19J020k88o28J10M89q56N14
1345hJ248j958m8K038j991j66K538k106q65K487r91j116J690k70j215M61J113
1362H41q29r03J688k72j993K016N11k519J701Q77k377J220J020j779O21Q09r17
1379b85r1P70j06p89M53Q94j474K25J751j995j61K150j812n04K241j450q31J838
$$ y = [-1163, 1963, 1125, 130, 308, -2343, -1482, 2692, 837, -627, 1165, -1667, -2330, 2468, 2192, -1115, -753, -299, -820, 320, 1922, 405, -1903, -594, 193, -371, 1981, 952, -2964, -283, 1577, -987, 787, 1786, -1798, -1610, 1133, 1066, 73, -45, -303, -1073, -163, 1567, -17, -716, 510, -1302, -684, 2503, -67, -1664, 949, -267, -1030, 1564, 890, -1101, -398, 440, -91, 19, 1033, -142, -1797, 641, 1022, -1385, 688, 1092, -2094, -128, 1751, -677, -261, 697, -588, -369, 651, 363, -265, -155, 334, -522, -8, 1240, -718, -766, 1272, -719, -885, 1653, -453, -1318, 1169, 178, -938, 752, 482, -733, -272, 841, 12, -891, 797, 525, -1468, 548, 1059, -1460, 241, 1118, -1259, -39, 981, -798, -177, 632, -285, -376, 394, 288, -501, -48, 846, -628, -403, 1348, -647, -808, 1342, -470, -974, 1267, -183, -1014, 824]
1397H24p07q47J004K23r33mJ245o84j145J892l00k087K264M07k609J695P54k217
1415a225J253J011j641J49Q86l58n25O83M36j431L31J553j396k33J758j838l71
1432i58K164j340m00J516j476m74J756m03q47M68K82r62J34J829r09j846K015
1449E49j8j858K386J68k824J348J129j550J011O13j723k60J331M19q90K81L31
1466D43j743P37K268j642n85J209j775L97K438j534q66J103j202m0K040r7j927
1483g76l06J316l30k07J944j391k546K399R50j465J575o00k656J757J566j027
1499B03K67j62j713K04K325M32j935k42O06j402J614K320k756j100J438j080J150
1516A69K401k545j775J501J05K47J449l92k647o16K853N80j314Q44j563j757L038
$$ y = [824, 117, -730, 274, 497, -436, -440, 805, 121, -1024, 868, 568, -1519, 745, 1152, -1457, 238, 992, -1225, 28, 1039, -602, -453, 433, 75, -450, 233, 669, -762, -431, 1122, -274, -507, 1251, -587, -958, 1206, -134, -534, 982, -494, -968, 788, 385, -462, 6, 288, -674, -540, 1289, 380, -1466, 549, 531, -1327, 1059, 1227, -1597, -249, 880, -670, 341, 954, -769, -1029, 302, 721, -169, 112, 443, -1300, -563, 1705, 63, -522, 687, -1088, -691, 1747, 213, -653, 450, -752, -792, 1248, 1151, -776, -1082, 234, -96, -303, 1641, 250, -2296, 103, 1053, -412, 1163, 563, -2093, -336, 1230, 203, 470, 308, -1405, -1201, 1124, 1556, -379, -621, -15, -1417, 197, 2517, -239, -1339, 99, -981, 169, 2570, 25, -1750, -249, -144, 103, 1552, 1160, -1487, -2103, 750, 1330, 16, 860, -703, -2460, 578]
1533E78J178j619N99j585j704L256J641k109o88Rr41P16K723Kl607k06J777n29
1551e09J750J172l910p96K636l60Q09J642l272k136K578K120n75p10l85j764j11
1568a821L427O02k266l89j370J67L863k69k734M75q90p98L673J344l342j753J114
1585i67R28O44J603j177l769J013K792n92J068nm506L97M415m08j006L29k171
1602a412j132K903K503j565k411j82r0J276K963j441l025N97k63P45L638j328
1618A776m123P66J196L40K021j11l196j318K212J860k04J68j838k948K823L264
1634B688k001k55r9l378J592M374j030k512l36o38M18K767J182k889k254J512
1650h59O71R41K080k573l265K110J328K54J658k058l209J523K226M16J94j243
$$ y = [578, 1756, 137, 736, -849, -2553, 703, 2344, 235, -453, -444, -1385, -669, 2054, 2056, -1551, -1757, 20, -509, 1241, 2413, -1497, -2293, 343, -17, 792, 2434, -838, -2974, -396, 1724, 1149, 439, 54, -1710, -1821, 1606, 2208, -58, -447, -1817, -1650, 2213, 1944, -790, -315, -1205, -2003, 1670, 3014, -328, -2081, -967, -39, 605, 2208, 1031, -2738, -1725, 1067, 475, 1543, 1538, -2968, -2571, 1844, 1436, 430, 759, -1412, -2544, 359, 2862, 1297, -1114, -1296, -1386, -110, 2853, 1412, -1613, -1016, -1279, -534, 3104, 1776, -2347, -1581, -385, -45, 1976, 1865, -1331, -2649, -437, 1423, 1219, 1387, -451, -3399, -576, 2688, 687, 432, 333, -3045, -1453, 2921, 1891, -621, -957, -1595, -1177, 1590, 2772, -117, -2371, -859, -188, 753, 2833, 260, -3005, -895, 433, 687, 2345, 287, -2922, -1399, 827, 1243, 1437, 194]
1666A94k224j06L099J323j828o26r03j386L323K295l152r32N29j731K116L322
1682C313k405k929P20J056L70J355M17l177j535L038R63l08P47k582j809L146
1698C80J229j000M57j678j898K084K317m19j625r46l03O68K365J79k448k80O4
1715h54m22L120Q24m069k94J963q12J039J778k144k410J136K139Jl71j90k078
1732a644o0L147k32j370Q81j942j004L539P74k263m08p6k18J206J184o70j739
1749h95l23P50P45J309q56k557J132J194j133J749N78l331o7K449n5k57K26j238
1767e80p80J232J456q48o73L16j585O17K945j307k041J386n03o44K159J40j830
1784e40k65M10M05O73J02r73r97J080O26p19J097l66k421J418J777j449K38M23
$$ y = [194, -2030, -2136, 963, 2286, 458, -168, -1071, -2457, 866, 3161, 9, -923, -394, -2125, -9, 3313, 908, -2021, -1301, -245, 125, 1480, 1897, -1280, -2815, 223, 1186, 878, 1625, -957, -2766, 380, 1609, 609, 1066, -612, -2510, -426, 1891, 1472, -153, -1099, -1402, -734, 1631, 1810, -638, -918, -854, -1276, 1844, 2668, -1401, -1695, 268, -544, 495, 2273, 129, -2281, -1145, 994, 995, 624, 434, -1644, -1704, 1443, 1211, -159, 722, -1220, -2224, 1315, 2089, -174, -582, -658, -876, 330, 1514, 844, -895, -1218, -468, 277, 1586, 730, -1827, -695, 499, -634, 1115, 1693, -1638, -1705, 744, 689, 432, 658, -580, -1360, -128, 1328, 480, -193, 123, -1462, -845, 2100, 793, -1248, 138, -365, -1009, 1150, 1290, -540, -805, -395, 10, 683, 785, -188, -1185, -105, 521, -198, 899, 533, -1888, -470, 1307, -142, 96, 519]
1802E19j531L60J376j54m64j43m37k06J053Q69j518m84J301j060q4K139j369j485
1820a318J534j61n22J245l56j248M97O85k21j85N54n42j114J504O66j687O90N40
1838E61j637R49J140j280P2L62o76M63N71l80l96J20K93l74L02P28j256k64J458
1857G56r30l64J572j159r18J624l02q15Q67m1q78L48P33l76o49Q78J9j242J094
1876B17O31j552O30P35j323O20O23r69K04M67m55OL57l5m52K33M93p15lJ068j024
1897b44l41J411r73m60J392q18o25J105l14n73N49J91n41m4O02j47q00R60P9j223
1917h14J058M79j510Q83N71j338O26N76q56R1M64k17k56K05M15o61m0Q48p27j48
1937c51J019q85k91J237p76m08J059o67m97R84j95m55J84K48l42j76P45j91r78
$$ y = [519, -1012, -652, 724, 570, 106, -37, -474, -680, 373, 1242, -276, -760, 541, -519, -603, 1536, 167, -1318, 216, 55, -467, 778, 422, -826, -329, 356, 135, -50, 504, -38, -1152, 352, 1018, -669, 21, 561, -1076, -127, 1013, -267, -195, 167, -509, -46, 525, 145, -251, -131, 162, -212, 90, 818, -438, -702, 756, -174, -538, 1034, -125, -1043, 581, 279, -536, 331, 290, -588, -240, 493, 117, -532, 346, 365, -877, 217, 848, -704, -74, 661, -662, -42, 581, -388, -184, 283, -172, -166, 191, 156, -296, -63, 430, -285, -288, 780, -244, -585, 826, -147, -607, 785, -33, -658, 447, 133, -440, 109, 300, -241, -285, 317, 170, -630, 330, 409, -814, 244, 723, -787, 96, 667, -671, -45, 531, -325, -234, 230, 13, -243, -38, 377, -284, -324, 524, -203, -351, 668, -217, -508, 729, -47, -455, 604, -63, -560, 424, 229, -226, -42, 206, -136, -312, 433, 242, -736]
1956g36R61K43j264J179K69j511P88P11j005L73N25p77j57N64J79l47j43L94o53
1975d07N0J090q02l22Q62r28N3J292r12m80P84m47j55Q91j65o84j91O15j8k71
1995a45P43n24j124J203M61j025P78j00j344R75Q46p32O7k4m77N9P48M14r38l54
2015d93N10l85L98J092j350o04J024n72M27J072j167q67Q09K54Q3K81k54q90j79
2034h11J210L95q45K05m58q70J684N13j299L77l46q67J456P68j004n83OJ18M21
2053G0P76j18j391l05J167j31M29N74j950l83J665j96J38M74j378o41J140Q88
2071H28j13o92m97k63K67J544j3j419j1k60p3J992q1k004J75K47p0J283K53j402
2091c09q49N33R34L54J53o26j609N12J856l16k09J0j880K82K243j32p35m08q60
$$ y = [-736, 225, 468, -796, 383, 652, -859, -71, 640, -365, 8, 533, -244, -401, 163, 342, -5, -148, 246, -407, -357, 733, -69, -391, 471, -457, -404, 888, -24, -504, 280, -167, -322, 569, 404, -280, -471, 144, 126, -145, 598, 74, -1050, 153, 614, -411, 367, 267, -1077, -102, 744, 12, 79, 55, -422, -363, 385, 799, -139, -493, 17, -368, 30, 1122, -228, -832, 192, -380, 47, 1119, -48, -915, -106, 148, 231, 512, 258, -632, -811, 399, 794, -51, 154, -304, -1174, 510, 1023, -276, 101, -245, -1112, 344, 1112, 108, -475, -469, -351, 70, 846, 728, -663, -968, 199, 68, 497, 1071, -879, -1262, 403, 207, 345, 819, -559, -1200, -60, 828, 715, 23, -474, -737, -470, 1074, 1061, -358, -369, -629, -702, 1290, 1209, -795, -620, -373, -443, 840, 1093, -309, -1158, -625, 309, 663, 816, 190, -1419, -907, 949, 633, 424, 434, -1446, -1164, 1079, 947, 212, -196, -1056]
2110a056J61J431P98p94j336j57N12P50J228r73j827O24M85K15J543q78k234N29
2128i79J058M55N46o53j372m58J305J332m55p07o18r87J370J944j202r24L8j026
2146a333R99K012p14j453m85J95Q43R59O8j393j242R69J047K96N48j633j552J658
2164b11R74k17N21j247j569J179J549O1n88r96n91M05J503P02j472p95J07k97
2182i82J732J153k122j065Q88j4R62R32j292j362J19J053R86k8p52j272k47J703
2200C92N88n91Q0j410p56K290P78j088l21p12l30J389R03m58j162o57L90Q02J148
2219A275l15k002N1R98j43R55M70k202n79J524N04L33k76j244m03P18J127J37
2237I28o91n75p06L49J973k44j490K52m12k04J793J49j372l78j57N46J104N4j009
$$ y = [-1056, -895, 536, 1334, 540, -796, -953, -441, 309, 1537, 564, -1263, -639, -154, 61, 1604, 726, -1508, -979, 79, 534, 1080, 427, -945, -1403, -98, 1234, 779, 72, -546, -1533, -163, 1781, 579, -345, -307, -1333, -334, 1678, 964, -489, -974, -779, 64, 1023, 1091, -302, -1544, -575, 472, 768, 1316, -317, -1869, -211, 763, 546, 1067, -180, -1749, -570, 979, 1040, 452, -544, -1135, -730, 773, 1475, 3, -792, -685, -982, 750, 1903, -219, -1284, -396, -410, 552, 1484, 192, -1170, -1051, 2, 988, 960, 208, -1064, -1311, 392, 980, 389, 469, -941, -1697, 593, 1371, 283, -38, -750, -1080, 309, 1212, 754, -408, -1065, -675, 127, 1275, 960, -1042, -991, 7, -136, 819, 1289, -913, -1492, 32, 536, 869, 593, -651, -1054, -336, 791, 928, 237, -338, -1044, -695, 1278, 1034, -456, -204, -616, -820, 973, 1122, -250, -628, -785, -239, 865, 919, -90]
2256i0p80L67P25N1O12m41j884O56J670n21k6j3j363K92J284M7j66n16o82J86
2276e92R10Q08q67r26M96k31J89J426p32j442N62K29J54Q93n98r52K26K92L91
2295B36L21k12p96n10J057P48p96M0J1j103Q45J138q37j83%p75O88R16m72n96
2315b80m8J14L8M09O06r79p62J080J7l24P62n54q51Q22K31j73M24o14m81M09L05
2336A51J36k29j04j56k63P58L46r43K23J82o88P92N18j010N4L75m72L22N26m52
2356F6m42P6N42k09j13N36o63m39J115j82n73O15l74m67P50m2k28J45k45q1K15
2377BJ75Km04J63J37l76N26J20q17M27L82p72N68L12r06K74N28m29l5L28j52l52
2399b99P7O06m62l02P94m21m62R30l34m76O22k23l25M90j10k05J67qr8l3J47O3
$$ y = [-90, -870, -503, 222, 273, 885, 444, -1440, -784, 886, 365, 339, 326, -1037, -745, 539, 586, 420, -96, -778, -592, 318, 1126, 259, -667, -171, -402, -213, 1213, 481, -961, -399, -170, -16, 877, 279, -673, -447, -155, 236, 557, 345, -451, -961, 96, 844, 48, 88, 99, -1004, -159, 979, 142, -41, -41, -816, -128, 788, 316, -280, -328, -214, -176, 233, 839, -140, -902, 178, 195, -129, 633, 79, -772, 50, 281, 108, 532, -82, -563, -154, 151, 287, 58, -46, -202, -465, 293, 639, -304, -81, 101, -587, 205, 723, -287, -233, 142, -330, -8, 518, 66, -376, -300, 242, 33, -80, 456, -207, -646, 469, 287, -286, 329, -45, -512, 238, 196, -32, 113, -132, -213, 2, 177, 179, -225, -62, 75, -301, 225, 345, -472, -45, 337, -435, 133, 445, -461, -187, 341, -88, -123, 205, 53, -299, -222, 384, -78, -380, 414, -7, -469, 461, 127, -349, 273, 50, -275, 215, 105, -100, 67, 59, -39, -72, 75, 138]
2421A38l91L15K22o40M21K31p24N50K31p39L60L96o72K07L71k70j61J62J70l26
2441a49o4N72m92j96P88m90l49P99l33m94O66k43k09L65r2j48M0O5J36l58K57
2462G1J17n39L56K46o10M52J57p04N22K76o05K04K78m62J66J68j9j66P6K35m08
2483a89J7O44o00k29P85n18k87Q62m61l61N17j05j81K31J4k23j14L56P5m39K90
2504H4J05o25N03L76p42L54R5o00N14K41n03J83p4j41K13J97L1m42m6N38l69Q6
2526b2O15q20k39P97l16j10N33n63l76O16P3j27K5j31j29j28O18J18p43K76Q8
2547E5m46O88L11r48J28J95k89N70J48n52j67J00K58J38K9j75m82QQ18k82p3L50
2569C82q97j5J123l34k98K82n84k02Q07K41l34m88O7Q9P5O44j55r63K92L57k91
$$ y = [138, -253, 62, 284, -356, 65, 296, -428, 122, 353, -386, -26, 370, -302, -95, 276, 6, -155, 7, 177, -149, -213, 359, -133, -329, 459, -31, -380, 419, 86, -408, 258, 15, -194, 171, 79, -69, -29, 36, 172, -186, 71, 188, -351, 5, 251, -359, 93, 250, -454, 68, 344, -261, -57, 221, -241, -75, 93, 74, -92, -16, 219, -189, -172, 472, -128, -357, 428, -90, -377, 485, 24, -337, 180, 75, -106, 125, 139, -84, -198, 158, 233, -206, 84, 189, -436, 67, 443, -299, 55, 150, -450, 64, 305, -198, -15, -89, -230, -17, 180, 211, -231, -277, 261, -108, -22, 593, -227, -466, 331, 15, -95, 438, -125, -501, 115, 188, 61, 86, -45, -174, -302, 316, 434, -309, -33, 55, -391, 297, 608, -340, -212, -17, -306, 264, 412, -140, -307, -207, 51, 189, 218, 43, -439, -431, 387, 105, 32, 382, -515, -530, 593, 259, -39, 243, -341, -543, 264, 505, 171, -317, -250, -161, -86, 558, 403, -560, -268, 89, -202]
2590b02Q04j41j076K24N04j2K40o0o17k20M57N00n3l23k10m31M27R63n64l98J52
2611c6o04L37J145m48o70L7o8J81O42j5n70n52M00L53R8L80n26r91O94O32l05
2632A14L63l94r03M90P40K2j22n23l39K05N72M89o02m89N0j99O93Q23r88o38M28
2653b08j32L93Q24p24p81J75L23M80K34k91p50k42Q97K93k69J34o50o58J143O16
2673H07o46j27l24m33O91O99k39m96m56O3M75N40J09j024k72N57o7N09N17j271
2693c88m90P96K25L20R5q44l88M35N29K74l35l46n57J45J224J6r17J53l58k94
2713g05J178L86r44l04r6J27Q84R3n37n86j5M79K94L30j68j181O8J052k1J4L8
2734C86j035K2Q48J36N8k95p54M1P45N31l62n58p8j43K51J075l21j077J33K07
$$ y = [-202, 602, 461, -615, -391, 113, 101, 341, 281, -336, -556, -99, 401, 348, 25, -185, -616, -189, 774, 210, -188, -36, -640, -303, 842, 394, -276, -239, -307, -126, 516, 501, -69, -621, -221, 132, 230, 610, 84, -907, -213, 419, 114, 477, 83, -820, -330, 410, 432, 310, -213, -552, -347, 225, 714, 112, -377, -327, -526, 167, 990, 2, -636, -208, -340, 53, 877, 153, -628, -453, -130, 350, 584, 293, -457, -699, 198, 491, 222, 356, -294, -952, 191, 807, 161, 34, -290, -723, -32, 667, 428, -68, -524, -461, 14, 554, 663, -361, -633, -76, -143, 366, 883, -388, -878, -82, 143, 463, 558, -286, -674, -239, 290, 564, 229, -117, -674, -529, 695, 711, -206, -53, -411, -705, 473, 859, -85, -389, -485, -358, 526, 619, 82, -504, -519, -40, 254, 584, 416, -765, -697, 355, 334, 348, 386, -649, -627, 221, 357, 415, 120, -634, -593, 152, 683, 321, -237, -315, -458, -207, 868, 547, -530, -397, -190]
2754a90L1Q96l11r16O1K07L18L69Kp35m29N01P51l21j18J0q26L40R81k82k63j25
2776d9n66M37P10j45l98k67k02L51M61K59o03n83M50J22J01O41n88q26N79J84
2796F8L5M90n24o93M30L35R4m2j73l20k45O48N44n83k12P4m57N55O68o70k61J03
2818a36k83M37N20l67l99j27L15J46P8K18o16l84O67J63j91L05n28m40P77N6j12
2839I9J75m29k91M45K85j5l18j01L7j54M94K86p75K8L14l76M14L94p07j7K58j31
2861h5K12J15k36k42%L76j7k10K96l75j95O38q3m06M23l43k19N99m6k82J26j19
2883g3p8K39J06j16l43K01J55k69L36R0o40K57L87n04L22J75m87N6L65j38q6J19
2905G4j00j10qL90k23k67M05k22k03N64k60l24M85k33k19M32n9k74J61m2j4OJ29
$$ y = [-190, -159, 737, 426, -490, -429, -222, 96, 465, 467, -268, -697, -196, 555, 234, 116, 126, -700, -360, 621, 339, 76, -49, -615, -178, 532, 387, -11, -278, -480, -129, 332, 591, -12, -595, -145, -23, 78, 719, 131, -695, -116, 68, 103, 593, 69, -624, -194, 141, 235, 193, 20, -300, -545, 103, 647, 64, -148, -74, -531, 24, 692, 22, -239, -136, -419, 18, 538, 171, -228, -355, -40, 106, 184, 402, -214, -598, 69, 232, 41, 346, -182, -622, 155, 211, 99, 274, -155, -446, -1, 284, 269, -49, -150, -113, -267, 227, 513, -262, -234, 80, -296, 118, 512, -195, -212, 46, -85, 127, 242, 6, -236, -236, 140, 123, -87, 209, -166, -361, 277, 194, -212, 211, -132, -351, 248, 202, -80, 46, -73, -151, 88, 194, 78, -265, -64, 91, -178, 158, 248, -392, -135, 252, -252, 70, 245, -242, -186, 179, 41, -45, 74, -26, -136, -144, 246, 23, -244, 161, -61, -264, 300, 40, -284, 201, -32, -251, 181, 122, -152, 9, -33, -47, -41, 88]
2928H8M9l22J78K72m10K01J69m95K75J99m52K73J65m16J77J86j25j07Q7J37j76
2949d7m4L42k70j64N02l72k46N49k58k67M24j6k89K58q2r3OL9O9j39J10J64l69
2972a93K06J30l67K66J45m98M00J10m25K59O6k83J34J35r0j31J24J20k53j4M49
2993B90l21k00N57l95j36N30l70j77L60m3j32R0j5m7j64K27R5k77K04J7l43L73
3015A23J28m49K18J4k97L70Q6l38J30N1j50J04J06L4k79M9K34j78j6L84n53r6
3037c25O33k92r2L63m27j24L96J3r9nq8m0k9L00L1m22J44J28k72L98J49p03K94
3060f9J35k19L85lm38P1K3K35%%j32l01J49N01k62j22K04n57J46O75k69k41J59
3083G0k97P2L80J11l72k03Q0J19P4L24k21n90L46K58j90M09j97o88L10L49K7O8
$$ y = [88, 137, -185, -7, 265, -145, 56, 225, -270, 5, 204, -248, 25, 190, -226, -49, 137, 12, -95, -8, 129, -47, -91, 251, -19, -183, 319, -53, -299, 250, -8, -275, 149, 133, -156, 102, 20, -73, -67, -28, 41, -98, 12, 176, -193, 13, 143, -224, 42, 187, -311, 89, 199, -226, 33, 99, -184, -50, 85, -5, -136, -12, 108, -145, -159, 290, -31, -231, 326, -69, -205, 325, -45, -222, 138, 95, -37, 53, 38, -9, -173, 54, 149, -128, 76, 93, -250, 123, 251, -198, 20, 34, -263, 107, 193, -145, -15, 36, -114, -10, 96, 130, -149, -100, 134, -44, -60, 324, -229, -325, 308, 16, -76, 287, -140, -264, 132, 145, 46, 41, -47, -87, -116, 184, 215, -207, -63, 65, -207, 191, 340, -363, -69, 66, -153, 232, 229, -209, -138, -115, 120, 120, 120, -12, -313, -164, 337, 75, -47, 157, -400, -254, 421, 152, -89, 70, -227, -155, 225, 336, -36, -239, -159, -40, 34, 358, 137, -453, -107, 151, -39, 370, 173, -515, -205, 144, 171, 239]
3105B39j81l94R8L48K61j78l18q4j53M39N03m37l60J45l02L17O22m46m33J68o0
3126b06L10L63k41l98k29L05L92r6J23m74n50O46M74k47L2l69m35N21M57r2j73
3147A13m59q3L62L85J98n88m10J72J49M59L09p31m44M02R5M59K31q02l75L27K63
3168C2M21j2m93m01l0P95K26m36j31l40j47Q03L63n02k55k78J0P12K58m59m34
3189b98k22L44L87L43j78q40j42O78J29J81l8q17o1O03K11J68k59p01m4N92L89
3210D25Om62m09qK84P43oq56r7rK39Q04j91p49j60J63K15O33j09p09l82L69N83
3233C17L3j05k49o68K28R15o4k32k78o09L80P99j9k72l73l22K89O04K06l91n68
3254c79o1L71K88L94m38p39K74K90K01M56n39p04K00M06L55J5l74m10j06O16M12
$$ y = [239, 58, -336, -238, 110, 371, 193, -125, -209, -362, 77, 580, 143, -217, -72, -374, -57, 565, 119, -314, -146, -206, 104, 467, 226, -172, -401, -96, 296, 200, 323, -151, -701, -55, 419, 172, 204, -165, -600, -79, 378, 286, 113, -346, -429, -67, 318, 516, -72, -482, -310, -161, 298, 607, -124, -568, -166, -71, 388, 619, -183, -558, -231, 32, 453, 441, -52, -453, -483, 312, 538, 102, -29, -369, -516, 287, 650, 148, -107, -385, -375, 337, 595, 136, -298, -520, -176, 211, 554, 376, -464, -606, 72, 201, 382, 344, -473, -534, 69, 280, 448, 189, -512, -556, 36, 425, 431, -31, -440, -448, -164, 579, 573, -283, -380, -389, -150, 654, 463, -286, -446, -283, -68, 565, 456, -253, -635, -266, 317, 350, 245, -4, -672, -444, 471, 407, 175, -103, -712, -332, 467, 448, 176, -197, -519, -230, 374, 580, 189, -379, -440, -69, 219, 613, 175, -564, -290, 0, 201, 657, 118, -586, -386, 20, 375, 390, 16, -394, -500, 116, 528]
3275E28k46m50j05k34M94O38m50l17j28j56N00M24k42m61j51O3M68K10k6n14l58
3296e13L89L65L7J10o00l96N80L48p1M5n53l16M68M13M6k62l10j05J22M21L27
3317E45o69k14J47k9M50K63n95k49J34J47L33P3m75j37j0L63K36j28j37l65q8
3338d05N91J69k81ol28q2N73P1k59m5k37k5M26J65j38l62j01K29P2K11J0n20K0
3361b52K52j5K13Nn36O3L31j8J76j19l13p5K30L21m0l39R1j22k2M05p3k88R3r9
3385a31l8L90k4l34L5m1J60J31k9r0k48J08K54j00J2L6l69K69J81k20J01L2l59
3408b74J77K79j15k1r3q5R1L4J48o4k58K60o2m4K71k23j58K01m3n4K10j26j59
3431a08J12L0N4j7p3L1j68J36J45j74L4J21l93K17K73l86J61O4j79J24J30j23
$$ y = [528, 282, -168, -273, -507, -13, 625, 175, -142, -270, -426, 74, 498, 256, -205, -356, -293, 175, 385, 359, -155, -513, -124, 241, 278, 388, -212, -608, -28, 320, 249, 294, -259, -575, -107, 306, 352, 90, -220, -325, -203, 218, 545, -124, -338, -191, -220, 230, 493, -102, -351, -217, -70, 263, 336, -139, -276, -286, 77, 313, 185, 48, -317, -405, 186, 355, 74, 68, -260, -342, 231, 302, 43, -2, -239, -264, 162, 327, 189, -173, -274, -45, 27, 238, 248, -272, -252, 0, -15, 198, 203, -333, -270, 61, 43, 219, 100, -213, -288, -58, 263, 223, -116, -25, -147, -169, 236, 163, -125, -32, -131, -169, 221, 197, -137, -102, -143, 17, 148, 119, 29, -219, -111, 143, 43, 55, 91, -278, -9, 172, -48, 53, 85, -274, -97, 182, 67, 46, -47, -132, -41, -7, 141, 77, -181, 79, 17, -27, 244, 21, -137, 64, 21, -33, 177, 51, -108, 4, 34, 88, 71, -2, 29, -139, -3, 142, -32, 2, 123, -270, -53, 220, -166, -5, 59, -120, 4, 134, 11]
3453A1jj03J25q2l6J65j53p9L04j01k11L10j70q8K20j8j52J22q0l3O3oP8j29K6
3478a8J24k08J36J06k01Q0M1j65J31N1j51Q2Q5j50Q3Kl0L3j09Q4l7l2J77j27r3
3503a06K10j23l9J80r2j07J75j09l9J18r6N4k6MJ13j72P2O7k48J52J52k90J25
3526b5J43k36J63N9j50L0j6K3J7j5L4p1o2J62n0r9J59j69j2K69r9o7J15j55m0
3551i2K24q6j3r1J2P9p0J39J3k25M4J69j68J49k8l03J38J45o9P4o8o3O8j1J04
3576G1Pj19M6r4L5K74j50j83J10j70O1L27j49k23J76r0M8J99k8j54j11R7Q2jP3
3601A34r8k73J80K19j21M3o9k90K14J74ln6j18p7J38R4J25k19j83Q0P6J08J85
3624B63k51k35J69L5Q1K02l12j70J84K0J18J34k35j98m9L31K15k32j52j7j42L49
$$ y = [11, 10, -93, 32, -50, -86, 79, -74, -153, 151, 50, -161, 149, -21, -109, 111, 93, -59, 63, -17, -50, 13, 7, 85, -44, -18, 106, -102, 34, 140, -61, 19, 60, -105, 26, 77, -74, 8, 93, -57, 26, 28, -2, 31, -78, 6, -31, -63, 114, -13, -106, 104, -19, -58, 122, 30, -77, 98, -11, -50, 68, -28, 26, 0, 4, 117, -55, 17, 84, -164, -12, 140, -150, -25, 118, -118, 45, 104, -46, -16, -32, -9, 8, -7, 27, -44, -106, 56, 6, -93, 66, -103, -115, 154, 55, -12, 103, -52, -92, 132, 46, 33, -58, -46, 33, -37, 102, 115, -110, -66, 103, -65, 84, 56, -247, -109, 36, -33, 41, -27, -90, -22, -33, 71, 78, -41, 5, -89, -54, 220, 70, -113, -3, -173, -112, 215, 66, -157, 19, -71, -23, 176, 148, -6, -117, -20, 62, 61, 134, 36, -237, -57, 162, 41, 84, 15, -275, -61, 113, 110, 54, -64, -141, -3, 91, 216, -3, -186, -106, -30, 78, 263, 12, -223, -54, -19, 62, 264, -48, -218, -34, -14, 104, 238, 3, -195, -244, 87, 302, 70, -82, -99, -241, 108]
3646A08K30k75j22m8p9K60K36k38j26k06J96J90O5k9k58k04K45J70J3J8l35j03
3668b92K89J67L4p8l14j19L20J74l5j00k33M2L7L03J04m02n5Q4PL54m8l58j09
3691b28J00J36K40j8k85j85J7L26J53j87q2k66k5M64P3j07j41k94M0N18Oj50j82
3714g7k42J96K85J10j52l31r8K76J16K22j85l82K9K58O3K38j37n54L6L16K05Q1
3736B73k47k18j18K49L21Ql42j46q8K73M10j78k68j17p4K73L35j31l09j84J6L47
3758H5J73o9k71k68K25K70P3k6k35l76K98L65l1m1k26k75K04L05J21j62l48q9
3780b98J84K85K33l13l31O4P1K50J80l19k97J33R0K05J72k54l58N7J72K89mk00
3802A1j84j32L65K72k33j11j36j95M11K43k30p3k24n0L44J98j64k14j46J27J35
$$ y = [108, 338, 63, -59, -107, -186, 74, 310, 72, -54, -260, -64, 126, 191, 162, -96, -300, -55, 115, 128, 146, -189, -292, -3, 164, 198, 120, -194, -313, 7, 181, 146, 46, -187, -145, -108, 195, 299, -103, -158, -74, -67, 287, 239, -119, -228, -128, 8, 248, 230, -55, -240, -223, 103, 256, 69, -13, -279, -304, 160, 233, 126, -15, -309, -269, 249, 255, 105, -77, -319, -123, 162, 272, 120, -211, -309, -33, 83, 305, 120, -262, -233, 25, 88, 326, 189, -365, -329, -13, 192, 273, 26, -192, -310, -61, 260, 268, -74, -220, -308, -35, 375, 197, -71, -188, -262, 11, 346, 215, -94, -278, -262, 85, 258, 189, -82, -350, -125, 145, 218, 192, -43, -419, -121, 244, 213, 172, -54, -329, -125, 180, 301, 139, -209, -298, -114, 171, 404, 91, -240, -176, -105, 145, 325, 6, -291, -158, -68, 137, 309, 55, -303, -246, -74, 215, 211, 11, -173, -305, 60, 332, 99, -12, -148, -343, 68, 311, 81, 8, -216, -266, 78, 276, 112, -102, -248, -121, 14]
3823A4K00L4l90k28L02J17R7J6l66j21K92J21J10%l21j24J70K10M9j75j25k7j9
3846a64L29J04l02r6joL60j5k76k5p2J58J63L4j92j80L9K39Q5l6l6l90J11L33
3870A64p8Nl3k90j7M05mj27m7j44M9J72J04p4k17l8J41QK41r7l26K14O7p4J37
3895A41l2k13n2J81J20j7q5j39k5J7K98j13j06L0j36R7K69j77r4Np6O1J79n8m9
3920B6j07O1K8J2N7o4j97J18J32p7J56j45j88K29R4j22P5j23j12Q0Q5N9lj08p
3945d1l5R6J74k28k9J00j04M9J63j67k3L5j8P9k7j4j4r4J11N8j22Q2o8j10K42
3970I5l5j50J34m4o1J23j1k8mJ0q8P2KN1j15J3J39j32L0Q3j33pJ34j42l6K04j76
3997g2O9P1o3n8N1j3m1l1J03N9j05J10k0j41J51rj34J79n5p8L0J5m7K1j1j0K7
$$ y = [14, 214, 248, -142, -370, -68, 49, 146, 162, -204, -325, -33, 88, 198, 198, -123, -247, -77, 133, 182, 7, -118, -145, -164, 165, 269, -33, -129, -130, -136, 224, 209, -67, -92, -164, -6, 157, 191, -1, -181, -142, 97, 182, 146, 110, -280, -169, 164, 86, 91, 58, -232, -249, 156, 152, 25, -22, -166, -117, 55, 159, 85, -132, -170, -29, -21, 220, 123, -203, 11, 78, 4, 141, 109, -104, -156, 25, 145, 128, 43, -96, -121, -104, 194, 81, -25, 5, -131, -34, 235, 58, -36, -31, -107, -46, 133, 75, 26, -81, -20, 8, 20, 77, 13, -184, -66, 66, -11, 145, 0, -188, 41, 135, 13, 88, -35, -147, -67, 18, 77, 74, -34, -41, -76, 20, 194, -34, -63, 37, -67, -18, 145, -22, -45, -10, -28, 51, 24, 10, -4, -98, 13, 71, -51, 31, -37, -147, 95, 60, -90, 44, 0, -61, 62, 51, 23, 19, 29, -59, 13, 15, 66, -49, -36, 103, -29, 1, 84, -49, -56, 78, -64, -100, 104, -72, -3, 68, 5, -53, -2, -15, -56, -87, 16, 75, -30, 80, 60, -81, 70, 61, -73, 106, 51, -27, 3, 18, -29, -8, -19, -29, -2]
4024bmQo9%J16n0j9J36j86O2P5j03QM9n8NR0p0M5j85J77M9j59Q2L5j21J24n0j07
4053a22K12o1j35J55l6m6J31r5m6L4L7N4j27P4O4j55L7P1p8PJ25j88O4P7j00R1
4079D4m1p1O7K8N7o8n9L4N7q0J73q4j94J44Q0q4Q9o5j33J33m9OO3n8m9L1J2J56
4107A39j23p5Q6o9N4J76k03k8N5j31J16J53j79J0Km4O9R2l9o8j16J42P8o8R5j91
4133f7q3J80O7q4Q5k03q0K39M8k6q0q9J4O8R3Q1k42n2J22m8J07J73l02q1J56J7
4159A3P7O9k18l0l1J45J05r3o9n2p4K92L7k38O8j93j0L71k8j47lj27L3J52M6K1
4185A16k36q8J93O9J21p0k55n0K52K4P6ol39LK23Q0J8j18j45k7J10J43J13k61
4209e4no8J00K34o9k79L6k1O3L25q4k82k1k8K18J21j15q5k31J59K20J8p9o8k82
$$ y = [-2, -6, 2, -67, -67, 49, -1, -20, 116, -70, -8, 67, -36, -28, 21, -37, -32, 58, -12, 33, -152, 25, 74, -85, -3, 32, -89, 35, -15, -122, 90, 29, -106, 49, 13, -33, 98, 3, -43, -9, 28, 82, -45, 29, 93, -62, -25, 46, -32, -25, 100, -88, -24, 53, -47, 44, 3, -68, -1, 27, 84, 16, -43, -9, 48, -32, 141, 57, -137, 7, 87, 3, 92, 27, -106, 27, -22, -16, 47, -11, -60, -29, -17, 139, 16, -59, 27, -42, 12, 188, -15, -43, 12, -119, -3, 150, -29, -19, -17, -61, 8, 100, 61, -7, -123, 19, 97, 29, 124, -67, -150, 30, 97, 13, 98, -105, -185, 54, 102, 76, -4, -93, -79, -11, 82, 163, -79, -131, -9, -57, 50, 223, -79, -160, -4, 13, 90, 159, -59, -89, -120, 25, 130, 37, -32, -84, -158, 134, 171, -67, 1, -192, -202, 169, 141, -6, -9, -136, -103, 49, 95, 116, -120, -208, -15, 54, 175, 105, -150, -200, 52, 76, 152, 146, -193, -190, 33, 113, 131, 13, -132, -159, -49, 94, 207, -54, -59, -127, -27, 207, 138, -141, -105, -126, -63, 262, 178, -104, -125, -153, 65, 186, 71, -14, -245, -86, 134, 152, 73, 5, -277]
4234b77J20L72j26Rk07j96J89L41q3n7j20j58J32J48J83k36k81J64O1Q0K38k34
4256F2k93R5J47J17J21k75j99J10P3K30pj89j20n7J95K82j66j43m0j44K87K16
4278C02j79j30j02o3K42J72j58j76j40J11J52P6O0k49j71K47J08QN7l15j07K18
4300c7J74k8O3l48p0K63J11O5j98j20l2N5K59P9k74o7P3p3L07O3l36Jk7M2K27
4325A72mj47k43O0K05J55r4q0j79p0K98R1j22K8k67PL34Jj29m2j63J03J51P8j8
4350A25k40l9J54k8J71J8l57P2J95q4J52kl72J54J11N2R5j69j15MKL39j00j97
4374e9L3l1LK51j28j14J4j28J10K52j23j23J5q3K12K1l6j48q6J31R1Pon4k24J55
4400d8J89j33N8j2j78N9J64j7q4p8M2K5N0J20j76j52J70r2J42J47k07j47J57m3
$$ y = [-277, -157, 215, 89, 98, -109, -305, -116, 225, 142, 85, -35, -193, -61, 87, 270, 34, -247, -83, -22, 58, 296, 62, -231, -136, 11, 128, 249, -26, -225, -115, -42, 188, 181, -8, -128, -185, 10, 292, 126, -17, -57, -201, 86, 302, 123, -7, -109, -172, 70, 242, 84, -92, -232, -121, 31, 107, 167, -82, -253, -6, 102, 110, 167, -148, -255, -37, 137, 109, 172, -176, -246, 17, 128, 193, -5, -125, -157, -102, 157, 236, -38, -105, -32, -105, 202, 265, -71, -70, -97, -55, 172, 168, 21, -222, -162, 43, 198, 104, 24, -155, -225, 73, 164, 42, 70, -197, -190, 144, 145, 16, -26, -189, -86, 65, 143, 125, -115, -154, 0, -28, 143, 161, -196, -124, 71, -13, 139, 137, -235, -81, 30, 82, 177, 8, -107, -103, -101, 238, 138, -59, -26, -57, -54, 197, 69, -45, -31, -159, -49, 203, 80, -43, -28, -111, 101, 122, 86, -62, -148, -17, 74, 81, 75, 21, -203, -48, 141, 8, 66, 54, -124, -65, 99, 82, -2, -80, -38, -13, 37, 157, -19, -171, -1, -93, 49, 196, -11, -158, -1, -44]
4424d4O9J42k24n7L9O2M9k5k1p3o3J65J81k20N3mk21K63P7j78Kj2n3J34J1m2l1
4451b1n6Q2M7j2R4j88r7K10q5K2J24j66k5J29q3O6O1r8m4RM4P3j00k1J1p0J89
4478I5m7j75J44j6r5J70Lj47P6K3m6Kj6N2m5qK8%ON5j00m4J84j34J0J15r7o7R6
4507B2Qnjp3M0o0J00J1j29J02Q3j62J32M5j86J02J8j00J18r1JN7J1o5M3m1O4o8
4535b4M9qj1k2J02j54L6J38j51pN0j0k8L1k7L3nJ4Lq9R1M5j81K19n6j48J78mj10
4564d6L5O7r5P6K8o7qJ2L0m2QM3p4J6R4r7j6R7j40O5J00j28kL4n1P9k1o7O7o8
4594g1J6M4q5J40Jj21J31Qj17J19k2j33J37k2j4M0o4J3NK7O9r3j18J94r7K4O6
4621G7j18j2L9j1J4R6r8j5M9l3N2k9p6M1j6K2mJ2M7k2j19J09P1j50J32j32M2M9
$$ y = [-44, 25, 167, -57, -114, -75, -13, 36, 11, -10, -83, -146, 19, 200, -20, 33, 29, -192, 71, 148, -30, -28, -40, -93, 41, 52, 10, -21, -77, 5, 52, 40, 134, -54, -151, 59, -26, -4, 120, -46, -71, 58, -25, 41, 102, 4, -40, -31, 13, 86, -14, -35, -24, -94, 95, 48, -127, 17, 1, -94, 76, 79, -68, 8, 31, -15, -13, -29, 23, -22, -30, -2, -2, 4, 59, -41, -85, 99, -35, -25, 90, -7, -74, 22, 30, 25, 24, -49, -9, -69, 31, 42, -87, 15, 98, -64, 68, 113, -73, 29, 47, -53, 65, -26, -25, 32, 43, -22, 21, -20, 44, -24, 25, 17, 6, -16, 86, -68, -32, 106, -45, -52, -2, -12, -40, -9, -36, -3, -8, 6, 9, -80, 11, 56, -125, 94, 38, -110, 68, 64, -46, -11, 56, -39, 37, 65, -2, -10, 2, 32, -10, -2, 41, -33, -17, 77, -20, -36, 61, -79, -14, 86, -42, -44, -10, -61, 18, -3, -70, -3, -71, -55, -11, -96, 44, 45, -76, 55, 63, -54, 65, 43, -90, 47, 25, 11, 51, -13, 0, 5, 32, 101, 8, -110, 84, -13, 11, 77, -41, -53, -14, -25, -11, 85, -13, -28, 21, -12, 40, 11, -65, -24, -40, -18, -22, -10, 37, 15, -104, 5, 76, -74, 58, -74, -32, 17]
4649A7l4K3k8k2N3J2J4qr7k5J70o3m8J09j68N8Q7o9P5oj35L6N8M7J3j41K2j1k3
4678h4J23oj43J09m2j1Q9J7j17K0ll2P3Q0q0m1lL1Q9j6q0p7L7K05j31L4M0j68
4706h7O1J13m6J4l1o5L9N8np1q1O7k7RJ76m6k11J27NL0O0p2q8jR0J0O9j60L9k2
4736d6J6J61j57m2P4k08J70K03j05j24K8n8J33N6n7j03nm0J58k3Q0j34j25J04
4760d4J10o9M3n9j19J51N2o2J44j94j21J43J12L1r3r4P4j08J23J48k05k2k2L1
4784e0J31P1k26j0N9J2J14L1p8j00o8J17J14j05nq3j1Q4P0o1k4j02p2K47J1n2
4810A4np9k5J02M5M0j64n2Q0N2R7p7j49L7K6J7J36jj76j9J14M1L3l4j22j2j2J46
4838E3N5j19j30K8P5J66o9j40N7r3M7J58L5j56m2oP8J04o5k8j14K0J52l2J3k8
$$ y = [17, -17, 6, -22, -44, 9, 21, 35, 27, -70, -95, 75, 12, -36, 73, -95, -37, 50, -19, 56, 50, -85, -49, 9, 56, 69, -72, -50, -61, -84, 39, 33, -110, -1, -43, -54, 35, 52, -65, -45, -48, -80, -7, 73, -7, -48, -51, -20, 69, 53, -27, -104, -67, 138, 7, 41, 81, -87, -26, 87, 41, 55, 24, -41, -2, 56, 51, -20, -101, -34, -61, -52, 124, 78, -133, -6, -1, 29, 89, 17, -71, -72, 18, 28, 97, -63, -24, -46, -30, 131, -26, -68, 6, -202, -32, 171, 66, -58, -30, -88, 45, 101, 44, -59, -64, -104, 54, 31, 111, -23, -148, -44, 66, -3, 40, -19, -138, 13, 65, 3, 147, -47, -168, -25, 87, 118, 25, -69, 5, -103, 20, 168, -37, -59, -81, -50, 81, 152, -74, -84, -25, -13, 101, 132, 54, -46, -114, 3, 117, 12, 7, -76, -87, -3, 67, 6, -18, -120, -192, 55, 66, 14, 9, -70, -95, 7, 52, 92, -72, -124, -44, 8, 105, 28, -121, -84, -58, -41, 95, 94, -82, -101, 13, 54, 87, 53, -69, -81, -93, 53, 108, -11, -141, -113, -38, 128, 59, -81, -24, -117, -70, 88, 123, -33, -75, -81, -3, 101, 36, 8, -106, -86, 66, 34, 47, 19]
4864A9k12J32J70l3m7J7j30L9K9O6k1j05rM6M9O6l5n3j8k8J4J42j09j30J10NJ5
4891a1J16j51o3N4j2J67m4o5k4j07J11J29j57J09mj51J03M9rK0p6j7K9N0n0m8
4917e2m0P4J3L0M5j26J2K7K6J8J37k31m9J07k5M4N5n8p3K2J2R1l5m6J4j09J33
4944A6N0j07N1k6m3J26nk9q8O2L1J2l4j7Ml3N5l6lL0p0J9J19q4o2J10j34k5Q9
4973b2L5m5M8m5m2N2O1K0n9l0J1j5R3l3r3N7L9o8N9Ql7PoQN2j4m3k6MJ8qK8J3
5006B7n8j05J96j31M1L3rm6J07Ol2k7m9M6lL7m1j1n0J31j17Q2M5j00L1L7p3R5
5034F2m9m4qL5no4R5mq0N4Q7q5n3J17j17R1L4j02L1K1j0l2M7km2lL2j0n0k2P2
5065do4P0O5p1k3P7j01R3r1J4Q2j23J25p6L3j%KK7m6o9J00K7p3M8n3j3J03n4m3
$$ y = [19, -193, -61, 109, 76, 29, 46, -84, -45, -16, 50, 29, -76, -85, -39, 10, 76, 41, -12, -30, -58, -44, 98, -11, -141, -31, -26, -11, 105, -46, -109, -55, -67, 100, 56, -9, -33, -140, -29, 100, -57, 52, 48, -103, 0, 49, 40, 60, -16, -33, -4, 46, -4, -52, -92, -18, -5, 25, 70, -56, -44, -17, 9, 27, 164, -67, -116, -9, -34, 10, 65, 7, -66, -44, -32, 59, 24, -22, -8, -117, 16, 66, -41, 10, -16, -59, 67, 62, 33, -55, 7, 38, 50, 16, -1, 3, -30, 25, -11, -14, 16, -54, -35, 84, 0, -62, 48, -86, -111, -22, 13, -32, 16, -29, -71, -19, 42, 62, 3, -27, -16, -31, 62, 29, -64, -7, 32, -36, 23, 31, -6, 1, -5, 3, 55, 41, -2, -28, -24, -6, -14, 14, 27, -31, -136, 60, -71, -30, 3, -6, -52, 55, 61, 29, 2, -47, -1, -4, 33, -8, -19, -69, 62, -55, 27, 72, -28, 3, 40, -33, 62, 13, -31, -39, -4, -9, -73, 22, 18, -62, -8, 79, -6, -59, 58, -59, 32, 66, -36, -5, 16, 6, -26, 21, 19, -23, -26, 6, -4, -54, -76, -4, -68, 2, 67, -4, -27, 50, -51, 42, -49, -35, 47, -76, 49, -27, 6, 5, 5, 7, 34, -12, -81, 19, 46, -27, 21, -32, -45, 58, 4, -39]
5095c9J0M0m8Q9j10J04p2L5Rp6L1O3j21P4M8p5O0K6j11J05l7kM8n1J3j3O2o2K8
5124B8o4K4PkQ9r2l0O4rj1O0q6l4M6K1M5m5Qpm9J9L4r4O0N9o9P1l9l2L5n4rJ15
5157E9o4j1J4k7N0mo8N0M3r7J02l3m9N8jj8M7Jk9mo4K6M8M2l5m3l1J2N8n0M7j01
5189g2M5j4M7kN4r9j9K6L4N4q4J8j6j2J59n0q5M4j2J5N7k8j04K8m3M3P9r0Lo1
5219h5PJ21K3oj05n3Q1k2K1R1j8j36O1N6r1O1M6j28N3oL9Pr2J4L2j9J57q8n8M5
5249HK4L4J2q0o1L3j7N8J12j11k0l3O6M7j0n6n4KR2J5n8L0l8o9R8Q5j06M1j22
5278g8J5M2J25l1p7j13P9L5N8l6k2p8Q4L1K6K9j64N4O0j9L6oq4k3mJ55k3p2n7
5307e8J2KO3N6j54J6lm7J08J72j94k1mKJ01J0j6j46L4J09K4m4K2j32j3J86rl0
$$ y = [-39, -29, 11, -37, 52, -58, 46, -26, 9, 18, -58, -27, 36, -85, -11, 37, -38, 22, 48, -63, 42, 5, 3, 51, 0, 13, 0, 62, 0, 28, -36, -12, -5, -7, 82, -10, -40, 24, 15, 4, 64, -22, -56, -10, 11, 56, 11, 19, 12, -37, -18, 16, -78, -18, 41, -28, 43, 4, -28, 7, -47, -56, 59, -5, -16, -2, -29, 21, 17, -51, -1, 42, -55, 47, 14, -35, 23, 22, 4, 51, 52, 23, 19, -45, -19, 29, 71, 36, -7, -38, -26, 32, -18, 29, -72, -27, -41, 6, 4, 58, -41, -60, -34, 0, 54, -30, -12, -28, -40, 119, 69, -16, 28, 16, 31, 88, 60, -44, -16, -59, -16, 63, -27, -24, -85, -78, 43, 66, 60, -45, -98, -17, -39, -18, 73, 55, -81, -20, 36, -55, 6, 52, -76, -23, -29, 10, 17, -75, -61, -29, -48, 109, 21, -37, 8, 32, 66, 78, -2, -63, -30, -47, 11, 123, 12, -8, -41, 25, 72, 62, 6, -48, -46, 46, 61, 3, 33, -5, -74, 24, 109, 3, 44, -78, -63, -21, 104, 73, -4, -117, -38, -3, 55, 19, -3, -81, 3, 34, 60, 89, -75, -21, 39, 20, 56, 50, -34, -57, -61, 94, 71, -1, -58, -46, -44, 19, 75, -79, -63, -66, -113, -5, 167, -27, -48, -52, -50, 51, 61, 45, -101, -67, 42, 66, 22, 44, -88, -101, 85, 76, 46]
5335D6N5k06O5J03j4j7m6n4O3k0O9l9o8k6L6K3J10m7r9J2Pj6J40k9j24K1NJ22
5363G2k6k7l5l0K0R4l7m0po6K7J58p2j9ln8M7M2m0J6j2o2Q8j5M6n5p4N4J00q5
5393AL6o5l4L0M2Jk7jk5J5K0LN6q4L3m9Q5L3m8m6Kl5M6O1l8l4K6PM9kp8K2q2J92
5427A12m0q1P5m6j09J79ro7Mk9n3L9M9k9qk8l6J28n2K0l5k5P2n4K9K6l7k4K4n1
5457e6M3Q7j00p0J18m2R3q2p0O2l5O8J8q4R3q7%R3j2j17M5O6o1L9l5k1O2p2P1
5486A4KK0%m7l0N7oL5n3l3N9K3p6K1J6p2N3R1p2Nl3%N5n8O6l9j1O4Rn2M4j8n6
5519b2M6m9N6K2k6q6m0Q0L0N5j15J12j00J4P3l3l7K7p0K4O7m5L7qp6M0J5J3Ln7
5549e0Q1pl7Q5j4p3j8j4j2R0m9k1J17j13M2Qo7J9K8k6L2m7R6n6m2KK2n4J4J10
$$ y = [46, 101, -105, -40, 63, 49, 32, -14, -68, -5, -25, 44, 5, -63, -89, -53, -30, 80, 33, -66, -54, -47, -63, 77, 48, -76, -55, -50, 72, 46, 19, -16, -46, -26, 68, 31, -9, -16, -82, -55, 103, 31, 12, 9, -49, -2, 40, 0, 16, 4, -58, 30, 15, 61, 6, -68, -14, 86, 1, 37, -28, -62, -32, 10, 11, -16, -17, -42, -27, -7, -4, 52, -32, 1, -48, 37, 70, 22, -24, -22, -57, -11, 50, 12, -22, 4, 11, 60, 58, -20, 2, -80, 112, 72, -9, 66, 20, -89, 90, 81, 14, 18, -11, -64, -25, 24, -5, -13, -41, -77, 51, -1, 19, -16, -41, 31, -23, 6, 32, -5, -29, -5, -56, -13, 74, -26, -96, 22, -20, 73, -9, -79, -17, -52, 16, 34, -50, 43, -44, -44, 49, 37, -80, -35, 31, -30, 9, -26, -47, 15, -57, 14, 16, 36, 36, -11, -41, 16, 10, 45, -8, -41, 18, 41, -35, -14, 2, -70, -17, 74, 2, 7, -26, -26, 29, -29, 37, -2, -13, 51, 60, 8, 52, 34, -22, 24, -25, 31, 53, 27, -59, -99, -19, 11, 66, -49, 63, -37, -23, 50, 17, -20, 7, -63, -39, 28, -17, 20, 12, -64, -24, -9, 4, 7, -50, 31, 24, -13, 72, 58, -15, -33, -47, -59, 31, -18, -39, 78, -35, 7, 15, -52, -33, -5, -31, 1, -46, 50, -6, -48, -46, -24, -78, -64, 46]
5579D6q9N6M3j47J26l2m4R9o7J3K1n4N7J5m2K3m0nR4m8m1O9n1n9M1k0L9J6o0O1
5609B0l2RN6j19O5K7n3M3O1p8m3M4kL4j3j8K1J2l8N1j8l0ko0J81j20qM1m5jJ3
5640bO6q3M2k5o1Q5o8M8L8n0nJ2L2o0M5o4Q5o7l6Q0m1O5Mq4K3R3n4j3J5j5J5L5
5672E5n0Kj8N2J5n0K0k3q2J18K5r9P0r4Q8K7m9n8L8K2k3qk0O3Ml9N3j08O3kp4
5703h2P9J4j3K6k1J0p4P3M5j4o9N8m6l4J03q2K2O3l6lJ5l8J8l9L0K5j3O6j05n
5733b7M6Pl8L3L2j47J02j5k8J2J2k7L6J8J8l8k8OK4j5J2N%j9N6J1n1L8q6P3m4
5764b2N7k9l2J6L3k8Kj0rJ3%M1K6n9LK8r3M8P7j11J3l8l2J20pJ4r4J1Q1Pn8M4
5796A2m3k1O7k3mJ07j67N7J11q3P4q0r4Q2P5ro5mK7l6j8N8%p4J9lJ0L5km4rL7
$$ y = [46, -43, 13, 56, -91, 35, 3, -41, 58, -9, 4, 25, -29, 28, 43, 1, 24, -16, -21, 73, 25, -16, 53, 2, -57, -16, -36, 3, 19, -41, 20, -12, -3, 53, -66, -1, 26, -27, 16, 77, -1, -44, 0, -2, 32, 19, 1, 22, 34, -4, 47, 29, -1, -3, -63, 118, -2, -10, 31, -14, -15, -2, 64, -19, 23, -2, -63, 22, -46, 2, 40, -10, -15, -3, 29, -31, 14, -50, 35, -32, -68, 12, -29, 36, 40, -44, -21, 72, 18, 5, 20, 5, 20, 55, 5, 7, -11, 41, 56, 6, 26, 3, -79, 39, 64, -35, 35, -59, 29, 56, 7, -51, -13, 9, -14, -22, -42, 21, 25, -14, 39, -69, -6, -8, -82, -3, 11, -2, 24, 3, 13, -61, 12, 57, 43, -26, 32, -14, -48, 55, -27, -5, 58, 22, 19, 34, -4, 14, -25, 5, 30, 17, 83, -22, -27, 19, 26, -12, 21, 53, -94, 8, -7, -35, -23, -11, -38, -2, 16, 34, -4, -32, -26, -2, -17, -5, 0, 0, -19, 37, 48, -3, 35, -51, 22, -22, 35, 6, -26, -10, 23, -5, -3, -13, -22, -9, -9, 32, 58, -1, 2, 30, -63, -15, 62, -49, -36, -74, -106, 14, 7, 21, -73, -62, 19, 26, -32, 12, -31, -52, 15, -8, -12, 95, -72, -15, 96, 13, 87, 7, -87, -5, 70, 61, -4, -8, 19, -17, -35, 23, 23, -51, -32, -35, -25, 10, 8, -36, -45, -8]
5828hJ8L9k2l9J9j7O9J4q6np8M7J10k7j8Qmj2L0Pm4%qN8m8kJ01j36N1k1k8M3J3
5861B4j11L1J07k8K8j17K6j8L8mJ2j4JL6JoJ3r6J00p8j4J46m5m5MK2jrJ6p9LP8
5893B1j2J4jk9j4NQLL5k4l2N4kJ1j0j1p9M3Q1m8L7o6rJ5O7l1j4k7K2m4J0P1m2
5926Bk7M0K9l7J3QK5q6qN9K0l4m6j5O8M3j07k0O1n9N0OkJ9n9%OL5K1m3KN9l3m2
5960e2R7r4L5J1P1l0k0o3J8RJ5lL4J7m1jrPl4K8L7n6M8Jl0M7n9J5N7n4j0rM6q
5994B0Om2N4o3J0M2l1k3m4P5j6Q0n8J7pp3N8N9k3l0qk9MJ1J4L1p2OR7m7K6Qj32
6027h0R0k8j7QM9l6J2K7%p1nO0k8o1R5m9LP7j09P9M2l2n4N4N5j01L4k0K3l6K9
6058A0J6m5lNm2K6M1L1k0Loo0N3j1QJm3L4k7Q6p9lO3n0J9N2r7M8pk7Q0n9k1O7
$$ y = [-8, 10, 49, 27, -12, 7, -10, 59, 73, -13, -18, -96, -49, 61, 34, 16, 24, 20, 8, 38, 45, 1, 1, -7, 51, 3, 1, 102, -34, 17, -4, -32, 11, 24, -87, -56, 51, 23, 51, -66, -40, -58, -20, -24, -12, -26, -25, 11, 12, 6, 19, -77, 23, -55, -69, 77, 32, -13, -9, 13, 12, 3, 19, -60, -57, 21, 9, 23, 22, -7, -21, -16, -8, -5, 30, 6, -26, 28, 26, 37, 27, 16, -63, -20, 61, 13, 50, -16, -25, -10, 57, 26, 12, -15, 7, -37, -27, 44, 2, -25, 15, 44, 7, 20, 28, 53, -33, -41, 18, 38, 4, -42, -57, 11, 54, -53, -73, -12, -71, -21, -15, -17, 2, -57, -57, -51, -16, 5, -38, -36, 23, -10, -52, 45, -49, -14, -3, 68, 38, 18, -45, -27, -18, -3, -6, 28, 45, 4, 3, -6, 1, -33, -5, 32, -24, 24, 25, -5, 42, -17, -2, 55, 1, -9, -18, 28, 20, 26, -16, 38, -25, -15, 27, -4, -27, -71, 4, -12, 68, 10, 27, 20, -53, 5, 64, 41, 11, 3, -26, -22, -11, 3, 34, -38, -32, 65, 18, 44, 52, -80, 10, -18, -35, -27, 22, -14, -2, 25, 25, -46, -51, 9, -19, -80, 15, -34, -31, 46, -63, 16, 58, 26, -28, 26, 81, -20, 14, -6, 17, -19, 10, 26, -19, -22, -17, -59, -33, 8, 39, 19, 22, 16, -44, 9, -2, 6, 7, -36, -2, -29, 57, -22, -25, 38, -12, 7, 59, -38, 10, 3, -24, 56, -3, -24, 43]
6092D3r8N7O2j0K8j37J9P2Pn9J05q0n1LK1NL0m5L2%j6L5k9N9m9Lo5J00o5K6K1
6123B4j08Q3L7pm8L6mn2P0l8K7n7L3qO0o8K3Nm9M7j0K5j3Qj3Po3Q7j6o0M2l8K7
6156a1N9l5j08N2j1M5n7O9l6J5j0N2k4l2L7l3j9O1nqk8J8KOj1k8P1k1m4J1K3J8
6188A8j4l6OM9Oj4KjKm4J0k3M0nk4L4pl4Q4r9N5K5r2J8J5L7Nl3mO3p5JN1j2j4
6223a0M1m4L3N3j06N4j7K8m4M6K0l3l3N4l5m2K8k1O0O2r1l5K8om3R9p9qK1k0J65
6254A25j10pkk0RK6j16Q9M4j03N8J3l3N1K0n7L7Ro9K8K0q2O6L1No0L3j7m5N2J3
6285Hl5nj3K4K4P4r3K3jo7N7oL8m3NJ6Rj1j4lqN9J9o8J2mL1m1K6n2k9R3p6K6j1
6320c6K9J9k7j8J3RM5o9k7J20n1k4N2m3M0k5n7N7k4o3Q9l2N8m0jk1J03j19P8J6
$$ y = [43, -55, 2, 64, 54, 82, -55, -36, 36, 43, -16, 89, 9, -42, -39, -18, -13, 17, -28, 4, 4, -12, 23, -6, 53, 4, 7, -58, 42, -23, 3, 24, -84, -1, 36, 29, -19, 17, 13, -39, 31, -7, 20, -37, -4, -12, 48, -20, 3, 8, -41, 6, -4, 21, 8, 16, 3, 10, -53, 34, 18, -42, 0, -38, -11, 48, 13, -95, -43, -54, -9, -66, 3, -33, -18, -28, 24, 0, -32, 5, -28, -47, 14, 9, 1, -27, -9, -7, -1, -12, -40, 31, 10, -34, -23, 0, 18, 4, -32, -26, 23, 29, 15, 17, 16, 18, -26, -16, -39, 1, -4, -28, 6, -1, -35, 49, -50, 5, 30, -62, -44, -29, 8, 13, -20, -24, 39, -36, -35, 16, 4, -10, 31, -13, 20, 73, -33, 21, 4, 32, -12, 34, 54, 21, -12, 42, 7, -35, -7, -28, 32, 94, 3, -32, -4, -10, -53, 46, -33, -41, -20, -40, 125, 15, 8, 6, -14, -5, 21, -95, -6, 38, -65, -7, 6, -27, 24, 44, -13, 24, 33, -36, -8, 12, -70, -4, 27, 32, -28, 5, -12, -57, -5, 8, -27, -32, -45, -21, 3, 77, -16, 7, 6, -61, -4, -10, 28, -15, -10, 6, 15, 4, -10, -13, -21, 38, 57, -11, 1, -3, 28, -13, 13, -39, -68, 25, -51, -25, -36, -7, 12, -15, -33, -20, -11, 34, -35, -62, 58, 7, -17, 35, -8, 32, 7, -50, 7, -17, -80, 9, -23, 35, -5, -6, -27, 76, -43, 35, 51]
6350E1j27J2O0QL4L9j19O4k9J2m8J42p7l3Ok0K9j7qk2L3N1l4Ll3n2J8N1l7M2m6
6381d7M1o1Q4jpn5K2l9O6M9m3m6M2mM8kr7M9j3j3O6l2l3J6mo2Q5mp5N2KK2K6l2
6415@m0M1l2O3K1n3j1k2j1N7p0Q7l3k8Q8nj16J09n8J1J2J4o5M2r6R5p2R0j6l0
6445b8J1k4O2j9Om6LJ05r2Q3p4k2nL2K7J2m7m8M1M4O9l9n1j9J6l6L5L5j6rq8Q1
6477amJ2j4m8N7L9l2j0K4o7O9ll6l4R7o5M5k3l6M3k8rj8K5L5l2o5P0j9rK8%o6
6510g5P8M5k5j7MrK2l0L1Qn3k8N9j1J7k2kj6J0J9M7l6P8j37L0N0n8J9Mj5n8M2
6542b9M6j6Om5K5l8M6J3p7Q6j9k2N4J7j7k3mrK0k7J8q4L5N0Qml3K5MK8Kq5N2N0
6576E3m9J3n6N9K9o3mJ3L0Lm4m5O9rMj1k2L8J9k8M1k9l8N5o7L7K4JL3o4j4L5M7
$$ y = [51, -76, -64, -4, 4, 38, 77, -42, 22, -7, 5, -43, 99, 22, -11, -5, -25, 4, -13, -21, -43, -10, 41, 7, 10, -23, -75, -57, -6, -43, -1, -47, -6, -67, 17, 16, 9, -46, -24, -63, 3, 52, 9, -37, 5, 1, 49, 47, -50, -1, -14, -27, 39, 7, -26, -10, -14, -76, 9, 5, -70, -18, -16, 6, 32, 0, -40, 1, -31, 32, 53, 0, -11, -33, -44, 13, -57, 30, -3, -31, 57, 52, -64, 45, -13, -2, 10, 24, -41, 1, -95, 0, -72, 18, 2, -28, -17, -41, 21, 2, 8, -38, -35, 70, -22, 61, -13, -35, -40, -8, 19, 31, -16, -64, -23, 21, 90, 51, 0, -19, -3, -39, -4, 31, 15, 6, -82, -1, -5, 7, -7, -55, 2, 41, 9, -1, 23, -44, 25, 22, -14, -48, 49, -16, 29, 6, -30, 13, -15, -24, -42, -17, 18, -14, -79, -9, -28, -37, -9, -9, -75, 3, 48, 23, 6, 10, 1, 23, -7, 24, 32, -21, -49, 10, -1, 16, -6, -8, -24, -14, 5, 52, 16, 94, -43, -13, 37, -21, -2, 2, -13, -71, -29, 17, 1, 7, -38, -13, -51, -5, 8, -69, 17, -2, -24, 30, 47, 30, 7, 3, -6, 14, -13, 5, -79, -44, 6, 14, 10, -23, 2, 6, 34, 36, -49, 3, 53, 4, 17, -39, 20, 49, -14, -18, -5, 25, 28, -16, -61, 8, -1, 3, -8, -30, 8, 27, -1, 40, 11, -27, 28, -39, -2, 22, 23, 56, -8, -22, 13, 60]
6609F0j23L9O2p6L7j9QRK1ROJ9p8L5m9K8mj8O6k8oP7o8O3k8q3J6L1L5l2oJ0m5
6642c2J0M5j3J9n2O0k0PMj5J5l4n7Q0Nj06R1L5m7K1k6MJ5MMm7J4k0P6m2k8qK4
6675a4Pk3R2Nj13J6M1pQO7j14L3Pl9jN6n6J7J2KK3n9P3n5L8j2l8j7P2mj5Ql2M
6709a8%j7oJ7j8R8o1k1M9l6KO1p7k4P8j4oj8m8M2%M1ko5k1J8P3M1ko5O9o6K9k1
6743A2o7O3Lj8M3j2o6N5jJ6l6J0kn5R4n0Km3J1P4n6J9L1n2N5j4L5n5p3R8j3m4
6775c6K1L4m1R8p8LL8p2N1j7j1J0Ql2K9Kl7P5l9k6K2k1mJJM1L8l8m3K8j5L6Ql3
6809AL7l9l1MK3K6P2r9Ll9L6O1j9n6k9L0qP2k4mJ7m8l8P4J2k6l9J7J9L8J1m8l8
6842c2K0O2k3j1m6nQR5m3n3Rj5N3K3M3m3o2j9J3P6l2n7QPj8M6L9o5L6p5K1J02
$$ y = [60, -63, -24, 38, -38, -1, -20, -12, -3, 18, 27, 33, 52, -26, 9, -40, -12, -16, -34, 32, 4, -2, 75, 7, 70, 42, -41, -25, 6, 41, 9, 3, 13, -32, -22, 23, 10, 29, -23, 37, 17, 24, 28, 13, 28, -6, -63, 17, 22, -84, 7, 42, -5, 16, -10, -6, 9, 13, 17, -30, -16, -36, 40, -2, -30, -38, -14, -7, -30, 62, 67, -46, -30, 11, 4, 12, 79, -35, -2, 5, -34, -35, 21, -35, -18, -6, -4, 19, -40, 33, -22, 16, 4, -34, -51, 21, 17, 2, 10, -22, -18, -18, -35, -41, -24, -42, 56, -5, -26, 23, -13, -11, 50, -27, -51, 27, 13, 7, -11, -59, -17, -17, 24, 22, -43, -64, -46, 27, 68, 66, 1, 70, 4, 33, 12, -55, 8, 11, -7, 36, 24, -42, 13, 12, 28, -8, 2, 0, -55, 39, -11, -9, -52, -41, 33, -23, -4, 27, -25, 30, 16, 51, -4, -77, 21, 8, -36, -15, 19, -22, 76, -2, 1, 39, -33, 18, 1, -10, 0, 8, -24, 5, 7, -30, 45, 6, -20, 2, -19, -23, -22, -21, 20, 58, 20, -23, 5, -10, 26, 34, 1, 38, -1, -32, -28, -5, 21, 93, -6, -3, -42, -6, 55, 36, -20, -49, -19, -27, 45, 21, 17, 34, -14, -52, 22, 34, 8, -31, -14, 5, 43, 54, 6, -32, -12, 50, 27, 16, -30, -35, -27, 68, 25, -28, -19, -34, 19, 42, 85, 42, -20, -39, -26, 50, 18, -39, -31, -24, -42, 4, 43, -22, 14, -61, -40, 62]
6874F2j49L6L7q5J42l8j5k5JJ4K3k8M5l5Ln3P2k9P6m3m0L1N6k1l2J2j5M2m3M0
6904D1m7n3OQ3lJ8o0LJ4l2K3M7k4k2K2j1M3M2j14KkM2k8L4L7l3r6K6P1m6K2jm6
6937d2L5Qm0N7n2Q8p0jP0n2l5RL6nJ2k8k5L5oM7J2n7l4P2rn1N0J6k4j8KrLn7L9
6972b4m4O9J6p3K6J0n4M4O5m5j8K8j3J7j9KLj7K8N5j1o2J1Jj3M1l8K5mm7K1JJ1
7005hJ1Jm0O2m0J1m3qK2N7KL2m6l8N1pJ1k2o3J0QL5K5j6Qj6K0K0m3j5N0l0KM2
7039D5j04O9n4oN5k3J02n7j1kMn3M0q8N1jj4K5M2k2m7L4J2L9l1Jk6R8q6NJ0J4
7071B1n4J4Q1Jp3J7Nk6N1m7L6Ln6K1J3JM2p8J9l5L6j9n1P8J5opnj3J6l1j6kO0
7105A1O0q2o5J31K9j01P4k0r6L5R1l3n0K1rQl2O5r6P9j6L6Nl6n4P0m0O1j9l5O
$$ y = [62, -87, -51, -14, -99, 43, 5, -10, -35, -34, -20, 3, -25, 20, -15, -12, -65, 7, -22, 54, 11, -29, 2, 58, 37, 5, 17, 2, 44, 1, 41, -6, -59, -53, 30, 27, 45, -15, -12, 2, -30, -7, 40, 16, -6, 16, 5, 48, 90, -24, -22, -24, 18, -10, 24, 61, 28, -68, -42, 29, -17, 5, 4, -42, -7, 1, -39, 18, -34, 54, -16, -17, 53, 1, -34, -25, 11, 6, 18, -10, -35, 0, -6, 41, 53, -4, -38, 34, 25, -26, 24, 40, 16, -2, 0, -9, -6, -63, -24, -68, 1, 17, -56, -30, -20, -74, -30, 35, -10, -28, 0, -13, 4, -15, -13, -10, -27, 1, 56, 45, -17, -6, -5, -18, 23, -15, 10, 6, -41, -20, -19, -8, 3, 4, -36, 26, -14, -3, -46, -54, -32, 25, 27, 59, 13, -25, 26, 19, 30, 8, -55, -45, -37, -2, 23, 7, 15, -1, 19, 39, -4, -19, 31, 1, 3, 45, -59, 10, -44, -50, 5, -18, 84, 27, 16, 14, 18, -35, 5, -83, -32, -33, -47, -22, 20, -2, -49, -15, -3, 36, 5, 6, -20, 78, -8, -3, 7, 21, -33, -19, 62, 63, -10, 7, 12, -14, 37, -10, 26, 29, -27, -6, 7, 8, 50, -28, -9, -44, -8, -27, -78, 0, 15, 9, 2, -3, -16, 0, -31, -47, -49, 11, 71, -11, -76, 55, 84, -17, 57, 37, -59, -24, 67, 34, -16, 5, -4, 4, -28, 37, -59, 20, 4, 40, 45, 9, -45, 25, -15, 46, 27, -8, -2]
7136bL1l0m7M5j0Q4j14M1o1R5n7QK4n9N6k4M5l8QL5Ko6KO7l8k9K0k9P7l6O3n3
7168A0jL7o2M7l0nj4kOJ6l3K4P0k8l1q0L0K8j5K4K8pk1pj5K8K7J6n0r%j0L5l6
7202c0kP0l4K8k2L4k3Jl2j0L4K5k6m4nL2m0P3k6pl0kJ1P0m6K3j3J6k3%J3p2O9
7235A2M9q1m4N5rL2j2J3Ok1l0M6m2N9Rr9R5l3J5l6o1N6K9j6M1Oln1j6N4m8K3K3
7268B1p7O5n2M4J5k5RK4M6n5o8K0M5K4n7%M3K5o4M4k3n3NR7K2n8L8k7o3K4J2J
7300Bk6K9J2m5R6q1lL4k8PL5l9K0l8P0m1Q0j08OJ3n7Q1k6M9o6jN3m0MrK6j9J3
7333CpL8j6o8P3k2J1l1L9j7k0k0M3nK8p4K6l2P4j2j2k1J3JJ3J8j4P5p9N0p1K1
7365Ej3mQ4j0o2o5Q8J4m4L2ojj9Rj2QL2M2r7k1N2j3J5K0n7j6N8Kk3pK5j0K1p6
$$ y = [-2, 29, -1, -48, -3, -13, 71, -43, -2, -63, 32, -25, -17, 7, -52, 4, -20, 25, -13, -5, 30, 32, -34, -32, 35, -3, -32, -12, -41, 36, 0, 63, 10, 9, 46, -16, 31, 1, -4, -18, -20, -14, 2, -31, -7, 63, 35, 4, -76, -46, -18, -33, -9, 19, 12, -9, -16, -31, -3, 24, 40, -10, -19, -19, -29, 6, -30, -32, 38, 4, 32, 10, 44, 21, 22, -10, -20, 14, 39, 13, -31, -36, -4, -44, 29, 3, -4, -34, -36, -25, 45, -1, 22, 9, 25, 2, 2, 15, -57, 12, 61, -20, -64, -9, -18, 14, 2, 15, 21, 0, -30, 16, -26, 33, 42, -57, 38, 5, 20, -16, -77, -21, 8, -8, 33, 39, 36, -15, -31, 23, -25, -2, 21, -56, 9, -43, 1, 16, -9, 0, 24, 70, 15, -53, -33, 12, 36, -21, -21, 22, 47, -17, 27, 4, -49, -44, 53, 75, 17, 55, 28, -35, -11, 1, 2, -24, 5, 17, -28, 68, -13, -16, 18, -10, -3, 32, -7, 13, -25, 45, 4, 84, -24, -18, -5, -62, 19, -7, 42, -24, -25, 28, -12, -8, -17, 9, -10, 3, -4, 34, 18, -50, 23, 1, 12, -19, 20, 3, -17, -37, 6, 1, 29, -45, -19, -51, 23, 11, -1, -22, -9, -8, 5, 23, 9, 84, 5, 55, -16, 5, -8, -12, 72, 62, 0, -65, 23, 37, -7, 25, 19, 18, -1, 8, -4, 4, 36, 78, -19, -40, 12, -1, 14, 34, -23, -39, 19, 21, -2, -9, 16, 6, 27, -49]
7399d9L2K9o5M1K1L5n9j2J9M9l6KO2o4j1mJ1K2L2Mr0L9M7k6j3n4%J8J2N1l9K9
7431C3p1M4jJ4o0M2%Jm5Q0m2m4M1j7K7J0j5M9ol7rL0j3Pq8J6N7j8K9l8K6lL7N
7465D1l8m4M2L5m2k4J1j8PN1K5l5jq7R5pn4J09m5l0pN1k1Jnj9J1j0M4j8l2mK2
7498DL8n5L3l0N6l4l5O2n4lJ6jL5k9l8l0R0k5Rl8L6j9JJ7PL3o9K5nML2n7qR4m1
7533B1O8o7l6N0p0j3O8K4m9Ql1lJ9mO9q6M1l9K4Rk4K6pQk1O1m8j2n6R0j3k1m1
7566e5L0J8l0O4r1K9O9l8On9M1K6Mj7LL8p5O5j3k9N6lp9M9l2kJK9o7N2J4l6J4
7599a8j4K7J3o0N6j8pM6p5N3j5NM8o5k7L8nrJ3m0J0O9n3M7J4kl1J3j3NL3K0o7
7632i%l7K5O5m1j1J1j1K8l0N0n8r%J7J6m2j3R7pq6N3k2j9M8LKl6O2l9j9j5M4n8
$$ y = [-49, -17, 12, -53, -12, 9, 44, -15, -27, -8, 41, 5, 7, 69, 5, -6, -10, 1, 23, 55, 59, -31, 8, 55, 29, 16, -38, -38, -20, -8, 43, 4, 33, -38, 6, 5, 19, -41, 1, 1, 2, -43, 37, -5, -49, -8, -25, 2, 12, -3, 46, 40, 3, -6, 24, 11, 18, -70, -54, 3, -15, 14, -24, 2, -1, 36, 41, 3, -41, 1, 36, -6, -30, -19, -37, -30, 21, 46, 11, 10, -77, 18, 11, -43, 66, 21, -9, -16, 35, 14, 15, 10, -9, 2, -8, 36, 18, -14, -18, 4, 42, -13, 20, -10, 46, 12, -23, 39, -15, -18, -2, -3, 32, 3, -35, -65, 25, 0, 9, -29, 7, -12, -11, 6, 13, 46, -23, 2, -3, 1, 33, -24, -32, 62, 21, 89, 22, -14, 36, -34, -47, 21, 45, -4, 4, -27, -30, -11, -15, 54, -32, 9, -30, -6, 3, -21, 5, -2, 6, -15, 46, -2, -14, -70, 20, 7, -14, -55, -25, -7, -37, 27, -64, -35, 34, -4, 2, -57, -16, 10, 14, -3, 0, 38, -37, 28, 15, -14, 42, 39, -40, 9, -23, -25, -24, 5, -62, -10, 4, -32, -18, -32, -5, 8, -52, 4, -14, -21, 25, -50, 3, -12, -7, 41, -24, -51, -13, -18, -27, -14, -54, -44, 25, -28, 19, 33, 31, 0, 13, 0, 5, 38, 58, -9, -9, -46, -21, 44, 3, -8, 3, -8, 20, -10, 40, -18, -27, -27, -10, 6, -36, -49, 48, 41, -45, 8, -14, -33, 15, 18, 20, -16, 46, 7, -12, -27, 17, -41]
7666d1%Nj0M7L1k7j7O8k1rN2j28pM3j0O4r3Q6k6k2k1K3Oj7K0K7j5K5j1m9j5L9
7698cM4l1l3J6k6L4n2M6l7L1M3nj6n1Q0n7m7J05p1P2n0L1n2L8%k6J2M2m3n0O5
7729In7JN2k3pL3o6L7j0K3KK2pJLl3P5o5k5PJ0j5J2N1MMp2J0L2PJ7n2k1L8ok8
7765c7N5j1k9K7K3q6%L3K6m6K1j5NN2k1K2J0J3n5%p0P7j8K3m8K5L7Pj5k3O3o2
7797a7%K6O1p7LL0Mm3L7pk2o1N3q1R4j6lOLj1n7N8nM5l6NKK7Pq5O2K5o7N1Om2
7833b5L3k6Nn3N2LKN4p5M5r0K5R3rm2LM4m2nL8n1J5oL6k7k3J0k2J3l3N2Rok8J9
7868a2K0m7N0pl1KJ8L6k6k6j9P9k6n6O6J2p3L5k1L9J0j7JJ2m3N2j9m6K0O8p6P2
7900D7q4J6lj9K2l5R2m0Qk2K1m1O5o8PM1j4J2J5j7M8q7N0Qj7k8L6K2j4o2L0l2
$$ y = [-41, -41, -36, -46, 1, 32, 5, -12, 56, 35, 26, 78, -50, -57, -14, -24, 40, -53, 33, 7, -15, -36, -13, -7, -24, -4, 23, 8, 33, 22, -27, -42, -3, 41, 10, -23, -7, -33, 1, -51, -5, -42, -11, 32, 27, 11, -40, 40, -17, -64, 41, -30, 42, -8, 23, -29, 9, 9, -17, -5, 37, -6, -56, 9, -48, -47, 5, -18, -25, 8, -58, -21, -31, -8, -6, 16, 9, 10, 13, -20, 55, -10, -35, -28, -18, -33, -21, 30, 34, 38, -34, -24, 8, 15, 32, -20, -41, -3, -9, -37, 18, 7, -22, 5, 28, -58, -58, -25, 1, -45, -24, -39, -34, 18, -3, 19, 29, 42, -13, -13, -83, -6, -24, -1, -49, -24, 13, 20, 5, -18, 45, -17, -17, 9, 70, -7, -4, 26, 30, -13, 24, 17, -5, -66, -13, -94, 0, -16, -19, -13, -10, -21, -78, -20, -25, 20, -16, -11, -9, 18, 25, -60, 2, 27, -40, 11, 17, -25, 8, -18, -13, -66, -14, -11, -9, 45, -30, 15, -75, -50, 43, 34, -8, -5, 39, -3, -8, 30, -21, -6, -12, 24, -3, -26, -16, -38, -25, -58, -6, 3, -3, -31, -12, 8, -39, 11, 4, -27, -25, -7, 29, 3, -23, -42, 37, 11, -45, 21, 33, -40, -5, -26, 13, 23, 6, 7, 19, -24, 28, 9, -37, -17, 51, -25, 47, -37, -21, -24, -43, -21, -56, 36, -4, 4, -18, 3, -38, 27, -41, -34, 7, -7, 5, 20, 3, 51, -36, 14, 22, 5, -23, 13, 35, 21, -41, -11, -43]
7932d3J3L5j0K5l8M1q7O7KM6o3mO5m3l6J3j0K4j1J8N8m6pnPl6O3n5L8j4K8m8m
7965a7K3l1K2P2p2rM0j6j7O0j18K6N4q8L4L0m5M6L5p5Q8j28R7M3m8k8J6j6kK8
7995Dl8qJ9N3k5j6N7o8jN1K2o1J4m1J1L5Kpk9o4P9N0m8L2n7%J1KJ8k3j5K0K3M4
8029D6m5N6o2j6k9M6pmrM3L9Kk1p0K1k9J09q3Pl0O2p9O7K0M0r4M3l0jQn3J15p1
8062iL7K3l3ML2p8j2PL1J7J3j8Mrl1J8%JK1m2oJ16j36j2O2j6R2l8o8L3K5j2k3
8095gn1L9O2j3n2j8L3K2om8J5J3lL6p9R1j1l8L8k0k0K0J6k9nnJ0k1K2L4k0k0N
8128a0%M7k8n3J3J28r5l6Q0m0j1k6L5rM9k2o5j9N7Mj8M6r0J05n5M2j0j2j9M8j1
8159B5Ll7K6rn6M1K3NJ0q6j1P0p3J15Qq8J6M9n2JnM4J3p0M8rn4J8QP0m0O1
$$ y = [-43, -30, 5, -5, 20, -18, 23, -64, 3, 5, 51, -12, -16, 49, 6, -30, -17, -27, -3, -14, 4, 62, 16, 9, 4, 11, -25, 38, -17, 21, 7, 35, -13, -17, 6, -25, -3, 69, -3, -12, 28, 12, -5, 55, -63, -37, 17, -71, -37, -7, -52, -6, 29, -46, 42, -86, 11, 54, 6, -22, -6, -22, -24, 4, -34, -42, -23, 30, 5, -11, 46, -22, -23, 28, 50, -11, 3, -38, -27, 8, 10, 3, -26, -90, -11, 39, -9, 23, -34, -34, -23, -21, -3, -26, -41, -21, 2, 46, 1, 57, -5, -21, -50, -4, -11, -15, -24, 19, 58, 60, 39, -31, -10, -39, 70, -13, -6, -36, 26, -53, 14, 34, 74, -20, 23, -7, -8, 0, -53, 62, -9, 28, 51, 18, 22, 54, -24, -36, -29, 2, 19, 32, 14, 18, 9, -22, -4, -4, -3, 18, -24, -30, 86, -50, -62, 0, -16, 76, 38, -30, 3, 28, 16, -7, -58, -19, 43, 30, -22, -40, -7, 15, 9, -39, -24, -11, -14, 22, -57, 34, 23, -15, 23, 3, -17, 3, 19, -10, -15, -20, -10, -31, -9, 25, 5, -15, -10, -10, 37, 9, -44, -31, 97, 2, -34, 46, 6, -5, -31, 4, -5, 44, 22, -43, -62, -5, -1, -19, 27, -63, 42, -13, 29, 19, 7, -12, 36, 25, 28, -9, 17, 8, -48, -7, 16, 21, 31, -55, -66, 4, -69, 46, 54, -34, -18, 31, -21, -20, -25, 19, 32, -38, 10, 1, -53, -35, -27, 43, 3, 64]
8191F4
$$ Imaginary data points
##PAGE= N=2
##DATA TABLE= (X++(I..I)), XYDATA
0@%%%%%%%%%Qj6J6k4L2l2M0n6P2q8J04j20J44j71J98k36K76l18L72m30M93n64
31c00O44p33Q31r42J062j193J336j495J671j862K068k294K544k815L110l432L784
48A984m172M599n065N579o149O781p490Q287r187J0219j1414J2815j4483J6509
62H813j9037K2292k6654L2829m2309N8815r5395L12325j58883n84661O42873J07240
74B58248n28002J78318M69578m30937k79191M17214J20757l20744R8482J35343
84A19066k21439l1743K63003k2782j73788J5981Q3571o4636k4626J62210L1231
95A36048k88392j6932L35900n6371k91126K14864J69536l92926l3192N11954j12573
106A76790m79241K59754K86228l85126o644M23545k19623l35553L03241J39780
$$ y = [0, 0, 0, 0, 0, 0, 0, 0, 0, 0, 8, -8, 8, -16, 16, -16, 24, -32, 40, -48, 56, -64, 80, -91, 107, -129, 147, -171, 201, -229, 264, -300, 344, -389, 442, -500, 562, -631, 705, -790, 881, -981, 1087, -1207, 1337, -1478, 1632, -1800, 1984, -2188, 2411, -2654, 2925, -3224, 3557, -3933, 4354, -4833, 5386, -6028, 6787, -7696, 8813, -10224, 12068, -14586, 18243, -24066, 34749, -60646, 251679, 92796, -491865, 151008, 258248, -269754, -91436, 378142, -52795, -331986, 85228, 205985, -114759, -16277, 119066, -102373, -134116, 128887, 106105, -67683, -51702, 31869, -32767, -57393, 104817, 136048, -152344, -169276, 166624, 110253, -180873, 33991, 203527, -189399, -222591, 289363, 176790, -302451, -42697, 243531, -141595, -148239, 275306, 55683, -279870, 23371, 163151]
116A63151k49737Q2847J37161k42078k7607K73625o6028j75326J47242R311j99124
127a46563J24372J95189j56806j36965J05762O1991n3978q906O8014p678j35040
138i0608J313J88283R31j80253K9251J16234j01590l2069J81359m6874k00713
149a34736J07628J12562j35547N2442J16778j97621m9445K39500m9452j69201
159a07092J55054M4458k35702P1573K52611j49109j80588J83175M0028j76871
169a02463R5679J37243j53435q1467J21415K7433n3476J7163J3261m8518j6182
180d3347N9364L4255m5295l4845K2699P798k0575L8919M3258r1344n5578J26872
192D2181J5385j23722P5169P7388j63824q452J95566n6016j55151J06920O8934
$$ y = [163151, -86586, -3739, 133422, -108656, -136263, 137362, 71334, -103992, 43250, 52561, -146563, -22191, 172998, 16192, -120773, -15011, 46980, -6998, -15904, 52110, 44432, -90608, -89295, 98988, 99919, -80334, -51083, 65151, -36439, -68508, 112851, 65977, -134736, -27108, 85454, -50093, 2349, 119127, -78494, -127939, 111561, 62109, -107092, 47962, 92420, -143282, -71709, 180902, 31793, -148795, 34380, 74408, -102463, -6784, 130459, -22976, -104443, 16972, 44405, -9071, 8092, 21353, -27165, -43347, 16017, 50272, 4977, -29868, -7169, 629, -19946, 18973, 62231, -29113, -84691, 42181, 57566, -66156, 9013, 86401, -77423, -85875, 109691, 53675, -101476, 5444, 74378]
203G4378j43881K5795J55333r8685j19122J28860L4427j11643N8686O4285j10437
214d2004j7045J02272j3330n9123L3349J7179n2577O814O5514j4627n7359J4033
226a6904L2047j3215j2335K3347J1584m8727j5802P3334O21p3261L6088M0179
238C6956p2099O612Q4641m2248o7992O1109K9873p0530K1087O9778o9354m6322
250e8489R3000j432p7967N1359L5065p7172O388P1660k9512m8086L9132J9739
262B3685m6144Q497M8012l0427l5117L7603J1558k8540O923J7510j1921j7945
274a6306J2187K5329j9681k3089L1080L897l5359J9482K8939l3580j7616L8133
286A3416M013l9344J6564L5487m1495j7261N6268j3304m6961L9711J8890m8136
$$ y = [74378, -69503, -43708, 111625, 12940, -106182, 22678, 57105, -54538, 4148, 68433, -42004, -59049, 43223, 29893, -29230, 4119, 21298, -31279, -24465, 41049, 26422, -30937, -16904, 15143, 1928, -10407, 12940, 24524, -24203, -40005, 33329, 33950, -39311, -3223, 36956, -35143, -28531, 56110, 13862, -54130, 6979, 36852, -33678, -12591, 57187, -12167, -58489, 34511, 33079, -44888, 6471, 41536, -35636, -29248, 42412, 12900, -35186, 3946, 23685, -22459, -13962, 34050, 3623, -31494, 6109, 17667, -10873, -3950, 13560, 1639, -16306, -4119, 21210, 1529, -21560, 9520, 13417, -21942, -2460, 26479, -7101, -24717, 13416, 17429, -21915, -5351, 30136, -11359, -28620, 27648, 14344, -32617, 7094, 25984, -22152]
298b2152Q947M0260k5573k7193L4085J1427l9116R165L5798l0016j8541L8558
310A5649m201k9418J7946J4514j8825o190J6930L819j9723K263K1252j3723j4663
323a4370K1126K887j9868M569J5954p469j5836J3972J4566k5158k772L0938j6244
336B295k2128K9856L925k9885J1114K1960j9313j3714K4808L585k9167J1993K4658
349A9987k7695q132L1695j1021k0802K0374O532j8962J526J5904m791j4860R939
362c06J0934j6408p32J6598r030j0316J0145M966o434n045P607M213j4951M332
376d427J8796j6030j1191K0779k150j6223J2154J0296j7011p142K0126J205k0530
389a1348J1514J2487k4527K736K5446j4829j3252J6253j529j1183R746Q898j1594
$$ y = [-22152, -13205, 27055, 1482, -25711, 8374, 19801, -19315, -10150, 25648, -4368, -22909, 15649, 11448, -17970, -24, 14490, -4335, -10525, 6405, 10224, -9499, -7236, 14016, 293, -14370, 6756, 9643, -10225, -5656, 10298, 2829, -13007, 965, 15531, -9627, -12399, 18539, 2295, -19833, 10023, 13948, -15937, -4823, 17137, -2176, -15890, 8918, 12503, -16664, -4671, 19987, -7708, -15840, 15855, 4834, -15968, 4406, 10938, -8024, -6498, 9406, 4615, -10245, -306, 10628, -5780, -6512, 10086, 1056, -9260, 885, 5851, -583, -5628, 1979, 6192, -8759, -4427, 14369, -1661, -12852, 7927, 5777, -10446, 1708, 12004, -5007, -12149, 7977, 9182, -11348, 166, 12653, -11874, -9138, 16308, 1479, -11773, 4480, 2951, -8232, 1514, 10412, -1182]
402a182r075J1688M741j0007O051M604j4215N47J1819K35l859n294R71M368n584
417d192O101J0095j7092q024J7895J139r080O609J631j4022k56J9990j131j8078
431h415Q153L716j6452J5224J6412k4047o653J6668o313l289J5982k526k0843
444a2383P48J9674m40j0068O568l979j2786J1091J2545m125p356r554L323J3123
458F381k718j364L401j4375m623J9143N905j0249m102j549m995Q591J7284j1320
472E410j8779J2699J874j2359K3391Q499l7013k791K9026l290r979J0971l723
485C936k0186N395K4375m96j5213l721l251N345J4924l978p417K71j2504K980
499i540K4836j523j8718l879R34N970J2161o82j2094m888J117J74J3437J4487
$$ y = [-1182, -10257, 1431, 6172, -3835, 2216, 6820, -7395, -6848, 4971, 5206, 1347, -3947, -2976, 1392, -4192, 1909, 12004, -5088, -13112, 4783, 5922, -3158, 3451, 5082, -8940, -9196, 10794, 9663, -8415, -262, 3454, -12998, 2226, 18638, -5409, -12062, 4606, -1707, -4996, 10986, 8460, -12383, -11635, 8039, 7599, -2469, 4099, 120, -12666, -1575, 10970, 6845, -511, -10065, -6742, 6381, 3663, 2299, 5700, -8675, -13298, 5845, 11750, 1501, -2601, -4150, -9145, -554, 16730, 5410, -13369, -670, 1204, -11155, 12236, 20735, -16278, -19069, 9957, 6667, -3312, 7659, 3936, -16250, -10855, 13520, 13024, -2189, -5910, -9161, -3816, 11108, 7130, -287, -16, -12520, -9540, 15296, 13773, -4945, -8824, -7890, -1920, 10241, 9559, -2535, -7423, -6306, -6132, 7305, 21792]
513B1792k4564k3076K6616J2746j8491J1228P385k9909k625K9224N492j2740p571
526d493o065J865J5343N448j1412k016k547j3469J8012K7251k3829k4345J6272
539c985O138l694J2081n53j6653o971O248J5265R936j3878k1116N953J8948l889
553C830l140J2863j6562k3165K5468K2142j5813q354k948p044J3585J2461r062
566D261m173j530j3752N669L1015k994l6213L189K3049j1516L50K2135j6198k4613
580b1321J2688J6593L875l376j5759o393J3076O224k140N073m480k1574K587L0365
594A5438Q64k1497j85q2l460J6237N230j2489k037p096m526K4774J0860k7323
608e292j1316J7952J018q037J7015L525l0451k697K6295J734o103j59j3298q53
$$ y = [21792, -2772, -25848, 768, 13514, -4977, 6251, 13636, -16273, -18898, 10326, 15818, 3078, -4493, -10558, -8693, 6650, 12098, 686, -1330, -3877, -17346, 666, 27917, 4088, -20257, -3985, 2153, -1541, 10540, 9987, -6666, -13637, -7389, 7876, 17812, 3934, -17182, -11229, 7719, 3830, 690, 13553, -3009, -26174, -706, 21436, 5623, -2731, -5679, -12723, 862, 13323, 4261, 88, -1442, -15194, -9525, 21490, 18496, -17717, -14528, 8521, -2995, -2645, 19490, 3292, -21321, -8633, 7960, 11835, 8459, -7300, -13693, -617, 5607, 3467, 8540, 4060, -17514, -14927, 15438, 16302, -5195, -5380, -5462, -8922, 7315, 12545, 56, -1981, -9077, -13603, 11171, 22031, -5292, -16608, 1344, 2362, -5675, 11340, 14865, -15586, -18283, 8012, 9746, 3643, 3484, -9814, -10667]
622a0667J5725M88j322K871j4933r430K0646J4799j5111j1320O163k544m98J6469
636A1336q95j6571j625R82N650J6498q182k0113P472P841o249R156Q813j8255
650d142j3264J6413J1844p839m36j907j2698P373J4768o536k177M42j4456M897
664g718K1215n200j4153L138O80m160R427R344j1718j1055O632L992K294P103
678I821r528j1141R357L194k120R298n195j5820O038J2062j920k130J67p381l028
693h326J1878N031q585n98j095p344J0871J0248j3153m148O059n861K822J1972
707I771n919j0856L088M499q13L899K376j0383l630J0656L94l022N389o930p803
722i284J0822M007n753K163k346o410N578P009l219m371O31j231q50P455J512
$$ y = [-10667, 5058, 5546, 4224, 7095, -7838, -17268, 3378, 18177, 3066, -8254, -2091, -4635, -5133, 11336, 10441, -6130, -7755, -6773, -1123, 15375, 7193, -12920, -5448, 2393, -3856, 5300, 14113, -4142, -17406, -993, 10851, 3012, 2576, 669, -12029, -4656, 10112, 3576, 1399, 1841, -12615, -7718, 13497, 8297, -5856, -2718, -2038, -6198, 3229, 12573, 855, -10200, -3568, 424, 2718, 9821, 293, -10848, -1491, 1703, -417, 8881, 3686, -12134, -6096, 5966, 4046, 1916, 2083, -5298, -8326, 3552, 8583, -2, -600, -1695, -9039, 1832, 12080, -1073, -5221, 838, -5023, -2201, 9771, 3852, -7004, -3916, 583, -230, 3669, 6045, -4338, -7968, 2688, 3082, 60, 5449, -1481, -9284, 1538, 5545, -208, 1955, -391, -6801, -1223, 5786, 2567, -1804, -1173, -2404, -3254, 4201, 5713]
737E713r064N37L356l646O022L689j0308m00O055l608J875N614o217o049N640
752g91M516l902J08L252o658j743J0040j783n852M935k732m451P958J578o520
767b045J102J173k252J780L400j770m320J268K502j251K151M7n090K695K297l808
783b121M258J403p841K374N663m233p46L782k574l623L758L568m685j143M804
798B644m025j969P353k586n351N383j79m002M017J134l716P4J830l4r22O35N01
815G87k172J005J480k156J651M51l758L227J683m649K751K147m784J528L347k982
831d44r90K661k39k742J450K917l842r89N156l179k904N749j760m007M544J5l354
848a958K209J063j857q7J325k1j701J249J219k822J288J711l238J612J567l409
$$ y = [5713, -3351, -2814, 542, -3104, 2918, 6607, -3701, -4101, 1954, -1654, 221, 5835, -382, -6431, -791, 3725, -177, -69, 3183, -3475, -5218, 4822, 3039, -2813, 2122, -610, -5061, 2897, 4475, -2045, -943, 230, -2022, -242, 3158, 1388, -2932, -1664, 838, -413, 1738, 1785, -3305, -610, 1687, -2121, 2137, 3540, -4301, -1927, 3736, -497, -1243, 2539, -35, -3658, 100, 3668, -1017, -2160, 2644, -1381, -3350, 4003, 1417, -3934, 1449, 1270, -2732, 1285, 2419, -1297, -1223, 607, 573, -349, 286, 787, -1385, -380, 1100, -1056, 595, 1046, -2712, 515, 2198, -2451, 300, 2447, -2337, -809, 2538, -444, -1434, 1227, 988, -1754, -304, 2613, -1229, -2218, 2938, -241, -3145, 2604, 844, -3163, 1381, 1396, -1958, 251, 1314, -543, -630, 695, 674, -1027, 222, 1441, -1381, -93, 1618, -1620, -8, 1559, -1850]
864a850J830J602l350J775J520k794Q67J672j400p34J409M99k254P13K997l578
880a076r43M951l304k342N341j952l659M114K36k995J588J373j862q68K477K69
896A348k947J844J349l665K112K507m040Q02K149k959J426J754k575L47P85j034
912g97R60R30q76j513R09J737k065N43K858m367r82N647k394k536M097k257l010
929c116M184R59k856J65J014j451k18L760o62m603K505J830l642L384K243n910
945b414L61L430j648R46J101k943p38J655J068J06j23r93k547J756M079k635j353
962h92K399l932n1O413k127l593K033j585o89M678J99m221q50J995m37N12M099
979C951l014o459M869L745m061K592J030o690J131N558p00r03p45l022K08L893
$$ y = [-1850, -20, 1582, -1768, 7, 1527, -1267, -400, 1272, -128, -862, 547, 1046, -1208, -495, 2502, -1076, -2019, 2932, -372, -2714, 2627, 675, -2984, 1130, 1366, -1629, -41, 1332, -530, -1398, 1079, 1348, -1599, 245, 1594, -2071, 41, 2548, -1492, -690, 1459, -1500, -74, 1680, -895, -548, 237, -797, 163, 1093, 217, -1296, -387, 1350, -715, -172, 2686, -1681, -2663, 2984, 590, -1946, 2151, -106, -3116, 1068, 2027, -829, -664, 350, -1101, -1319, 2441, 1779, -2824, -319, 1511, -2131, 1253, 3496, -2414, -2053, 1377, -271, 675, 1776, -1167, -1905, -250, 818, 924, 801, -192, -2739, -983, 3096, 461, -892, 1507, -2425, -2476, 3937, 1810, -1783, 250, -1335, -2024, 2654, 2853, -1368, -2218, -223, -660, -148, 3951, 937, -5522, -653, 3092, -969, 1623, 2653, -4037, -2906, 2652, 1952, 1049, 304, -2718, -2510, 1383]
995A383J724k700j449Kk195L223N528m874m190L036j024J216N134l576m306J620
1011a448J64J587M231k275o449M12N570j23j665L332m010o522P187N823n195q59
1027b40k56m030L813N344k391k673j215j861J955O055K99p499j576M378p21J812
1043A194M229o167m833M153K098K287J621o773l288N364K012n73J977k197o909
1058e805J209R519K34o716O44r95k776P236L440o295j812o76j146O958L806p155
1074c30m457K922J799M36M055n56q946r85Q033J298p57m94o436l78O713M75r0
1091B302N79o821k746Q325M712m638l709N05j719J295P567r06p843k36R34J404
1107i95P003j860q883J185L464q50M106K301p480n152N742N717j520j345j663
$$ y = [1383, 3107, 407, -1042, -1040, -3235, -12, 5516, 642, -3548, -512, -1536, -320, 4814, 1238, -3068, -1448, -1284, 303, 4534, 2259, -4190, -3778, 1792, 1669, 4, 3336, -674, -7196, -9, 5814, 619, -240, -496, -4526, -713, 4631, 2240, -433, -1648, -3509, -1554, 4501, 4800, -2699, -4275, 103, -618, 1194, 5423, -744, -5577, -1424, 674, 2961, 4582, -2191, -5479, -115, 1897, 1324, 3301, 1104, -5805, -4596, 4923, 5157, -1559, -915, -1910, -4686, 2550, 5990, -305, -2117, -2793, -3939, 3019, 6825, -330, -4787, -1865, -66, 370, 4425, 3869, -5077, -6062, 1971, 3269, 2512, 2018, -4418, -4796, 1917, 2392, 2302, 2881, -3940, -6686, 1639, 6351, 1713, -1996, -1491, -3210, -1915, 5652, 4746, -3097, -3333, -2399, -995, 6008, 4148, -4735, -3550, -86, -936, 3170, 5471, -2009, -7161, -1419, 4298, 2778, 1433, -230]
1122b30n208K658P243j261k115j335n762K816R080j878n473n3j433j34N939L119
1138E973n613n093K000K395K288L608m892o481L995K792m76M404k798q592K544
1153c946O735L9j067r37m117j475N961M066l814k631q38k427N187N733n476l705
1169b712J488j884K882O081l502n937N33K036J597K943l48n991k159N320J838
1184B185o90J691m590m682O394L550k844N48k309m300L987N254j655l271p73r05
1200b410M03M856J671n924j860K423m25L334K585o029k281L268l2J790K694m371
1216c08m107K872L507l54m90k76l740o49N879P46l326N72k310j728O184J236m583
1233h75K44j25j822L081L314k550m039Q21K150J5J690J02m500J44L139q50J801
$$ y = [-230, -5438, -2780, 4463, 3202, 1087, -248, -6010, -3194, 5886, 4008, -1465, -1518, -2951, -3085, 2854, 5973, 360, -4733, -2733, -338, 1950, 5558, 666, -5815, -1820, 972, 496, 4900, 2102, -6490, -3946, 2789, 2828, 1761, 824, -3293, -4768, 1193, 5259, 1445, -1186, -2024, -4451, 736, 6469, 993, -2712, -1224, -3108, -226, 5855, 2353, -3584, -3051, -1015, 582, 3525, 3177, -2814, -4973, 347, 2185, 1495, 3186, -1404, -6086, 308, 3858, 1014, 1562, -747, -5047, -1060, 4194, 2539, -732, -1505, -2410, -2007, 2849, 4520, -1404, -3264, -841, -1266, 2068, 4653, -1376, -3657, -389, -421, 1369, 4063, -308, -4415, -1543, 1964, 1610, 1120, 844, -2896, -3545, 2334, 3080, -246, 326, -1984, -3712, 2472, 3708, -875, -631, -756, -2578, 503, 3817, 1267, -2772, -1951, 199, 214, 1904, 2006, -2494, -2350, 789, -61, 1740]
1250A740P93n416q1M776n59j066J120j992k021K258L094j292k364M70q82J97M031
1267B806j400l340K014p07j304M331R2m424M38J749k85O64Q77j453k117J362J871
1284A174j021P91k38l467J974L203k851J8J858k955k32L334k42j772r0K91k94
1301e19O52J300j253j535J660o20m15K806j751k684K821J51j766K225q3k476Q45
1318f42J448m72m21O71n09j567J901J195k704P77J694k964Q57K768k361p26J825
1335G70j078k60J228l49o97L1O20l31r6J142j246q63K262j026j283K545j143j886
1353a660K477j30j818J485L47j518M67J193o38j134J301N07k037J146J515k614
1369a111O72J964k401L48J722j733o9J329q75l79Q32Ro87J35R42r16n11J786j042
$$ y = [1740, 2533, -2883, -2964, 1812, 1253, 187, 1307, -685, -2706, -448, 2646, 1354, -1010, -540, -1422, -1225, 2806, 1406, -1934, 80, -627, -1931, 2400, 2492, -1932, -1494, 255, -30, 634, 1511, 58, -2059, -697, 1174, 153, 944, 706, -2761, -787, 2416, -435, -417, 1441, -1514, -1746, 1588, 1346, -426, -516, -225, -519, 133, 1433, 180, -1355, 305, -315, -730, 2076, 325, -2359, 462, 613, -1153, 1072, 989, -1487, -642, 806, 334, -87, 584, 75, -1492, 409, 1604, -1100, -323, 1371, -1593, -736, 2032, -329, -1055, 770, -308, -568, 660, 311, -386, -355, 265, -66, -162, 980, -266, -1129, 1133, 107, -1176, 1369, 226, -1660, 817, 687, -1131, 354, 701, -817, -350, 843, 205, -929, 372, 879, -1158, -12, 1503, -1111, -439, 1525, -876, -528, 1194, -539, -608, 721, -154, -533, 299, 308, -379, -244, 698, -218, -729, 1057, 15]
1388A5j126K267q69j587K362o66j682J935o9j430R56M57r90k8R64j64j374J277
1406B48O72k132J208J479k624P43J816k206L51J729j705l75J335l04o42M15M64
1423D72j019j90J745q55j153J857q94j151K289o24j424J591o54r79J775o7j451
1440g32N61N22o82j26J438m51k111J508J241k206J283J241k969O89K229j688J29
1457a24J046j600l51J604M20j174k32O71r02k3K307j279j695J648o39m63K458
1474A672j204j881J575k13n42J826k26k084l1J576J31q17J132o58k423J986K025
1491A844k158M07L96k485J502K407j651n78M18j186L78K069K53k296o08J470n17
1508c35M28K080k450j967K394J8j63K015k147k269K217J144o44O70n26k065j26
$$ y = [15, -1111, 1156, 287, -1300, 1062, 396, -1286, 649, 580, -850, 106, 563, -427, -455, 509, 345, -1029, 248, 920, -1212, -4, 1475, -1149, -406, 1410, -796, -445, 1284, -421, -796, 539, 235, -407, 8, 472, -547, -737, 1008, 153, -1000, 857, -37, -1188, 1101, 477, -947, 644, -10, -989, 786, 719, -732, -171, 351, -331, -457, 981, 530, -1581, -73, 1168, -1038, 245, 1486, -1483, -794, 1435, -253, -124, 922, -678, -1029, 575, 995, -179, -411, 260, -642, -665, 1642, 363, -1332, 316, -323, -786, 1672, 468, -1413, 162, -51, -593, 1233, 1007, -1077, -1108, 468, 599, -218, 914, 256, -2167, -181, 1844, -314, 93, 489, -1996, -494, 1913, 262, -316, 102, -1084, -706, 1363, 1616, -680, -1288, 182, -335, 93, 2173, -277, -2244, 150, 168, 5, 2020, -127, -2396, -179, 965, 321, 991, 465, -1600, -1726]
1525a726K961P59k302o0j50j356K590J681k668l50k0j312K804J829k918j257R92
1542e03k0N28J985n00l407k49K975K4j32R77l294j078L761J41r72J092k360j969
1560c001L263K301j610j576j90m25K99K915L76l259o27O11L37K859j91l875M33
1577a360J004n74K578J046l795j653K242J659j12K02j063k861J162L724q20j066
1593C13K42l079K56M955m77k894K87q66n72K857J926k373k764N96J410Q51J748
1610B416j469l382R91J657J05K267j251m357J110K882k7M71m70k900n57K938J806
1627B230j260j018j028j552K543L526k615k080J025j681J064M230j523l707L27
1642a519P64O31J929L28l159j860K367J757j85O76k016l033K707K575j011K21
$$ y = [-1726, 1235, 1994, -308, -368, -518, -1874, 716, 2397, -271, -621, -641, -1953, 851, 2680, -238, -1495, -503, -523, 5, 1990, 1490, -1917, -2166, 809, 833, 701, 1678, -1616, -2694, 1067, 1208, 236, 1328, -1032, -3001, 262, 2563, 953, -623, -813, -1238, -939, 1976, 2352, -907, -1534, -923, -586, 2273, 2082, -1793, -1360, -356, -930, 1648, 2694, -1101, -2754, -512, 1147, 1035, 1237, 174, -2687, -1525, 2199, 1379, 313, 555, -2524, -2268, 2687, 2210, -684, -397, -1263, -1835, 1022, 2948, 575, -2189, -1593, -183, 668, 2416, 947, -2435, -1444, 213, 318, 2585, 1334, -3023, -1913, 969, 942, 1413, 943, -1957, -2514, 424, 2230, 970, -48, -1076, -2628, -85, 3441, 826, -1254, -229, -1910, -846, 3384, 1861, -1846, -1519, -755, -124, 1805, 2133, -1026, -2886, -519, 1238, 1053, 1729, -287, -3320, -613, 1962, 951, 1172]
1658A172j433k745K177K935o42j077j144j264P58K815R18k747j298O08l83K361
1674A011K211l598j955K010l31R54K784k641l368J641K142Q2R3j60k473j032L396
1691G66J493j883k05j317j432L359J701k255m68n61j210K221K238j413k086m30
1707a482P93R23J371j70k672m64J565n5J637P45l935p33L296j27l72J251j861
1724b90k156J761K484m78j438k38r18j8K984ok493M63l44r99L122Q80l211m95
1742a390J013J48Q96P07j103j582J85J390O47K14q71k213J112K166j292K90R10
1759A227k884k01L146k0j316O7o76m35J348J300j083j290N20l24M8K502r45k827
1777a843J459Q72j166J556L03k243o8J125M70K04k87q79n82J084R43r08K08K04
$$ y = [1172, -261, -3006, -829, 2106, 1464, 387, -757, -2021, -1263, 1552, 2470, -277, -1575, -967, -1350, 1011, 3222, -376, -2331, -321, -652, 302, 3086, 445, -2923, -1282, 860, 942, 1035, 875, -1598, -2630, 766, 2259, 376, 171, -1146, -2578, 781, 2482, 227, -241, -802, -2012, 209, 2447, 1034, -1052, -1482, -689, 234, 1605, 1435, -1237, -1701, -136, -191, 1446, 2191, -1744, -2477, 819, 692, 320, 1571, -290, -2446, -685, 1799, 1321, -117, -355, -1273, -1291, 1693, 1687, -806, -343, -687, -1686, 1436, 2316, -895, -1390, -377, -229, 667, 1374, 271, -1311, -1126, 264, 911, 1125, 254, -1959, -847, 1319, 27, 317, 1227, -1657, -1858, 1288, 1268, -48, 19, -657, -1092, 256, 1556, 473, -817, -297, -621, -573, 1929, 984, -1843, -384, 488, -678, 878, 1181, -1062, -1130, -5, 465, 669, 382, -497, -1079, 5, 948, 40, 248, 452]
1795D52j934R35K324j547r80J081r64jJ613m25q92j3n1J34P34N30j230r22J502
1814C46j14p74J691p40k015J657P13j128Q34j31j309O18R13k73m21K48j57q88
1832i30J016J145j693q2J259j341K40J598j369m96R52n79J12P35n32m77K46L49
1850A53j94o2O91p95o46J552m16r98J442m84j347J551J45j268P54K67q67K32P88
1869D98k62q18N93N11j185N70R96j474P6J374j255PJ153j015k05Q71m16k47M20
1888A92j03l02L9N37l84m76R67m72p36J375m00j042J331k24j104J175K0r22O40
1907A11K67n05j58N53L1q82O34M50j195N44J017j452K37J155j265J32R98q02j69
1926b99O35k82k50J60K96m05k70Q53l42o93J047l85p47J234k66j003J154k64p78
$$ y = [452, -1482, -547, 1777, 230, -750, 331, -633, -634, 979, 554, -338, -351, -402, -268, 466, 996, -234, -1156, 346, 232, -542, 1149, 409, -1606, 51, 764, -364, 470, 339, -970, -352, 561, 288, -133, 115, -42, -930, 86, 1231, -462, -544, 715, -626, -386, 1212, -157, -653, 299, -280, -168, 567, 35, -442, -196, 153, -41, -103, 588, -207, -853, 699, 283, -715, 727, 243, -1104, 447, 592, -676, 78, 345, -522, -290, 498, 236, -582, 11, 522, -663, -93, 903, -571, -495, 879, -376, -369, 784, -231, -436, 435, 19, -228, 192, 89, -213, -174, 363, -21, -497, 470, -2, -738, 637, 237, -805, 526, 302, -802, 373, 393, -529, 111, 378, -127, -285, 268, 299, -583, 51, 501, -694, -150, 867, -585, -348, 807, -458, -326, 672, -130, -299, 336, 54, -196, -36, 260, -145, -415, 438, 96, -597, 450, 65, -682, 552, 286, -717, 437, 173, -605]
1945f05R25R0p55K53L01j61k45M68M2r94O98O11j160M77Q54j591L53J230j056
1964b65k3P53o98j99O87J64n05j49M12k45k61J001m86r09J011k56n02J197n49
1983A78j013R62N5n15P82j29p15k2O19K02n14K92L8j080Q44J054j364K03N42j237
2003h18N78J200r23m25L05k93K05N59J81p94n28Q61j0q7Q09r84r60J361L3l55
2023h5Q64q54j026J140M65l18Q3l53n28Q4J086M06j158j34J33n66J223Q20j713
2042d31j38N06n90J003Q86j393o98M86L69K95L35k87j167k53J634P2m54M30j330
2061g25n53K023P9q12K89q36o31J488P78o36r25l20L69L87R93p0j737JP56q8J269
2082A099J6k266J22J196o0O59J89j639o36J113J024m3n78m90r90O39K007n37j115
$$ y = [-605, 320, 410, -345, -92, 209, 48, -197, 271, 313, -681, 17, 628, -532, -55, 799, -792, -439, 791, -265, -288, 465, -233, -432, 255, 419, -86, -235, 177, -68, -329, 672, 186, -723, 288, 32, -470, 727, 178, -835, 127, 182, -333, 449, 320, -395, -417, 202, 404, -110, 182, 220, -860, -16, 1038, -326, -123, 419, -818, -240, 960, 37, -388, -83, -376, -171, 388, 569, -225, -753, 108, 98, 11, 820, -164, -1124, 237, 270, -85, 779, -75, -1101, 39, 504, 186, 269, -84, -612, -528, 558, 964, -194, -328, -195, -761, 462, 1282, -431, -569, -63, -653, 350, 1236, -157, -855, -369, 0, 295, 630, 343, -824, -1077, 557, 629, 175, 605, -725, -1278, 745, 824, 12, 301, -535, -1166, 322, 1100, 464, -461, -781, -412, -25, 968, 898, -839, -838, -82, -170, 1099, 1115, -1151, -1029, 167, 107, 766, 955, -684, -1320, -207, 817, 774, 196, -294, -1284, -645, 1362, 825, -290]
2101b90J46q78J61K320k10j711j30j29L65J259K98j154j246L18J090N05L30q34
2119B10j827Q51J454k17N50o76k045P88J850l5k57o79j160J32J537R86r37j265
2137g40Mj62J122J663j484j655P11n7P10J674j080j906J24R05Q10M60n60j285
2155g46p50J263J332l22l08j095j172J849J399r67l06o46j108J432J704o08j156
2172b05p31K2Q57J115K00j625r67Q60M12Q83P18k079j311J696O00J41N06j292
2190b00j350Q27J380N38o04j042n88J64J637N95j346l26m33m72K086Q56j916o25
2208h19J69L1J236O85j030j134j95R24Q33K98m95j761Q4J811k9j96L89j780n77
2227a556K084N62o34m38r32L0J088Q48k48j082m48M9M89J576l60j994K45O43k02
$$ y = [-290, -144, -1022, -861, 1459, 1249, -462, -592, -721, -356, 903, 1201, 47, -1199, -881, 209, 714, 1044, 210, -1617, -766, 688, 471, 1021, 345, -1700, -912, 938, 903, 646, -33, -1193, -1061, 476, 1462, 525, -740, -736, -898, 224, 1887, 403, -1252, -541, -598, 112, 1786, 706, -1200, -1076, -171, 639, 1099, 539, -746, -1496, -233, 1099, 777, 469, -626, -1798, 51, 1450, 483, 177, -469, -1577, -145, 1559, 951, -205, -936, -914, -57, 1058, 1258, -367, -1334, -474, -62, 821, 1539, -540, -1851, -155, 445, 586, 1092, -200, -1550, -723, 657, 1195, 591, -451, -1039, -875, 762, 1357, 11, -315, -748, -1220, 866, 1722, -194, -819, -650, -619, 617, 1302, 272, -862, -1057, -133, 700, 998, 503, -1258, -1174, 637, 608, 412, 801, -979, -1556, 528, 1090, 456, 18, -914, -884, 204, 1052, 804, -278, -726, -677, -188, 1388, 1028, -966, -721, -78, -280]
2246b80J264K0j713k77O15O27P47m20j164m07O34R82n9k12k76j292M74K076o75
2265F64r93L82q74K30J454j36p51m11l35M59R90J87q72r03O17M72j65Q68m58j661
2285a236P36R34k09M16m75j089M79O72R6J57m68o80n1Q92Q34r41m97M30o05M48
2305a57J262r48p52M92k94L87R10o28p48J57K48K31Q3K69o90p74J119M85p99M07
2325B60j69r21R12N13n65J66l21m77O41L58j88k65j46P8q3M14M02r64j10P20n24
2346b69K85P04j006k47Q32l49j5N74m71n05K49N45o5m76M31k60o30J041R9q63
2366c96M29J38p08P14K71o26J98n1j85L17R8j20k66O4K71k69J21L82q08J92P26
2387D92p69J27O91q53n1P46m25j48L74j63k15O3M67k42n60P12r5p15Q65K5q22
$$ y = [-280, 984, 1004, -709, -986, -371, 256, 1003, 583, -581, -988, -354, 628, 569, 357, 81, -1211, -737, 1339, 664, -329, 53, -821, -591, 863, 727, -24, -435, -770, -311, 679, 866, -6, -909, -292, 180, 15, 883, 425, -1236, -500, 434, 225, 641, 166, -923, -444, 228, 324, 481, 13, -667, -718, 174, 1008, 67, -430, 0, -605, -157, 1105, 157, -595, -103, -397, -10, 900, 272, -476, -319, -71, 160, 243, 512, -178, -952, 167, 652, -147, 260, 91, -830, 82, 595, 30, 196, -125, -602, 39, 397, 209, -56, -202, -124, -207, 207, 609, -355, -465, 255, -269, 16, 720, -286, -533, 299, -50, -65, 509, 38, -467, -218, 327, 262, -214, 217, -43, -673, 368, 467, -396, 33, 171, -537, 177, 448, -178, 20, -31, -216, 101, 199, 79, -187, -123, 148, -121, 0, 382, -426, -234, 492, -277, -150, 541, -312, -363, 383, -42, -190, 184, 21, -194, -131, 336, 94, -466, 246, 151, -564, 301, 326, -496]
2408d96O18R3o10N50L9m22K16Q6n8l8O5J52l41N9M32n90J16M84p01K18N89p39
2430b78J41O17p11o1N94k69k38K07J64k51j26M85j90n06P17j23o33O96K2p44O11
2451A24J09n40L39Q4k25O5O6L8r4J6K43m48J62L51n64J88M61p19K55N05o27R1
2473a20L76m32O1K93j23j98J5K17j30j42N49l31m83P26p2o22P25j08p02N59J71
2494B29l68J86mj73k7K62J51m55J17K96n24L55N15p36o7N63o37K95N25o76K0K13
2516F0k40K29Q9r6k81q4M97o3k83N00m59m57R53q1n64N35k54n27P38K41m57o1
2538f5j7o0M8L14J73p63N5M49l19L72M14r72k9O43l82L01K78o91j19K99K71J03
2560C03k31k13k47R2P25j51m55L53m45k16J148j91q14M15k13k23P63P7m89m00
$$ y = [-496, 122, 215, -395, 155, 194, -228, -12, 74, 16, -22, 43, 195, -146, -87, 345, -245, -129, 355, -346, -128, 461, -278, -137, 480, -231, -292, 302, 33, -205, 2, 166, -85, -211, 274, 84, -422, 295, 172, -461, 235, 257, -487, 124, 233, -307, 32, 116, -109, -44, 22, 60, -34, -18, 225, -223, -61, 290, -274, -86, 375, -344, -89, 416, -211, -120, 256, -176, -115, 178, 55, -143, -128, 89, -41, -183, 366, 35, -448, 278, 206, -416, 309, 201, -501, 58, 229, -139, 47, 43, -130, -157, 105, 256, -199, -82, 214, -310, 45, 560, -176, -243, 320, -317, -22, 503, -173, -153, 60, -180, 49, 138, 42, -239, -323, 174, 111, -172, 328, -131, -588, 365, 284, -280, 255, 1, -526, 212, 453, -4, -65, -82, -142, -94, 220, 393, -370, -315, 134, -185, 187, 601, -371, -400, 243, -139, 162, 440, -251, -370, -71, 200, 303, 72, -141, -388, -296, 429, 278, -177, 176, -269, -485, 663, 472, -342, 73, -140, -363, 400, 477, -12, -412]
2580d12J68L27L0K68j05r56K93Q05l61J96J18j079K27R07k08l5j47n33J07M84
2600I4M19k02n63k8l6K71Q14n03q31N22k29R3J022m88r20K14K68J87M07j36o19
2621b44l54M96O20k43j4l83p45P67Q51o05q7n9q13N65R28k96l93l39j22L63M80
2642C73K21o26n92L52K28L52N31r44p69P97J87LN34o60q07M59O09K43m2n63m76
2663e90M1R06L44o66p4k15m69J076O93j113l59J54j71O42O25n78o77j76L43N91
2683C27K45k29q34l11R49J69n0K70r67n19J103L86j99j78o32k25P24N22o1m77
2703A3m15j18L30R52k3j210O4L26k85Q83L54j257k60M38K03N68m1p35m43L45O03
2724B92J59j24k07q58J18J261q0o07O5o15M3J106jl42l23m94K73P56J97n26o16
$$ y = [-412, -244, 83, 113, 381, 276, -680, -387, 418, 57, 253, 371, -708, -481, 426, 218, 183, 36, -497, -390, 94, 513, 311, -252, -280, -316, -45, 769, 266, -565, -43, -272, -179, 843, 355, -565, -351, -83, 104, 511, 375, -244, -598, -102, 518, 275, 261, -122, -867, -100, 751, 146, 59, 0, -813, -248, 680, 384, -9, -348, -470, -107, 373, 594, -32, -624, -272, -44, 308, 839, -105, -874, -77, 110, 113, 647, -13, -820, -361, 248, 491, 449, -114, -590, -549, 357, 701, 35, -39, -254, -723, 353, 1046, -67, -426, -272, -443, 199, 824, 246, -431, -607, -264, 327, 572, 343, -491, -802, 147, 316, 266, 536, -431, -950, 153, 539, 340, 162, -470, -695, 29, 551, 490, 13, -402, -520, -190, 762, 739, -471, -407, -81, -366, 517, 871, -386, -646, -208, -5, 563, 522, -213, -656, -311, 292, 451, 327, 120, -738, -620, 641, 561, -46, 19, -596, -553, 553, 552, 210, -113, -607, -334, 422, 619, 93, -523]
2745e23J57K59J32O63l10j156K49P43j19M49k27r78K05O15J33J09k62o08j57N86
2765d0P36m38m72J25m45K80J056l72p77Q6k05M01P74m23n24j03L0L33M12N4o72
2786a84n45O08M95k26K28l26q52O45O08l25J32k03p05N16N79j54k51k83j00P1
2806b72M84M13p21l24L50j62K59O03o75m44M02K0K27L32m53l87P9L82J70j23j5
2827A45l81k90O26L57m83N0j02n35P80L10m84j7j71j32L66K99j97k93p9K72q9
2848d8J97K87o87j45O18k57L9M89p23k23N95q6L4K3k29j56J45L43J3l09N9p7k25
2871c23N61J73o89K10O6k72M77J10m58M9L7r3K64N9j92j74J03K62k60M4K80n27
2893b93R0M45k99n9L06m25J4M63j91j20Q6j4j31Q1K77j40l16L41l5k92M44m0m50
$$ y = [-523, -366, -107, 25, 688, 378, -778, -529, 214, 95, 544, 317, -661, -456, 159, 292, 401, 139, -469, -626, -40, 696, 258, -214, -89, -534, -254, 802, 430, -347, -261, -466, -65, 709, 286, -238, -341, -311, 22, 434, 488, -184, -729, -121, 374, 148, 376, 50, -802, -157, 451, 126, 258, 55, -650, -134, 445, 291, 40, -243, -343, -272, 212, 625, -96, -420, -70, -232, 27, 630, -45, -489, -87, -67, 160, 492, 39, -348, -269, 113, 283, 160, 145, -236, -526, 100, 457, -26, 24, -78, -613, 167, 477, -7, -24, -195, -327, 39, 338, 141, -152, -231, 41, -48, 149, 436, -251, -396, 222, -35, 4, 493, -230, -453, 142, 56, 90, 113, -116, -272, -127, 216, 229, -80, -21, -98, -323, 238, 411, -278, -68, -2, -274, 203, 313, -145, -96, -59, -152, 112, 171, -21, -195, -92, 170, -90, -46, 234, -293, -203, 242, -57, -116, 190, -235, -221, 242, 51, -69, 17, 3, -128, -47, 230, 90, -226, 115, 80, -212, 232, 192, -258]
2916b58L42O7l19K88L0l51J64P7p3L6L0N3k63J08L11l72oL53m12J18L79m52L8
2939a12L13l78OL20j77l5N9N9j03n3K80j81k49M52j03m28N63o3n04M71L8l80L03
2962I8Lj41l0O3M3q8JJ51j95J3K78l23O4L17m37J22L20m85J77K69l56L2K51q5
2986F2j43P0J36j69j32L35j64l58N78n6m08M69q3m12L49J51l02R3M9q5o5J69P2
3009A56l19J12J91k95J51K44m21J27K38l91J96K80m66J25K06j88Q0J11j44j13
3029a20n5M06j95k00L66l24k08O53j65l92L85j44l52N06P3k64p1OQ6m1J95J12
3051B57n18O6L85k89J67K23n61O9M09k78K15J03n12J10J81J35K0j88j43p2N6N01
3073C36j51l60K40k66j3P08k65n81L27r9k5N12r6m23q1P6L07k3L8o5n87L02N07
$$ y = [-258, 84, 151, -168, 120, 150, -201, -37, 40, -33, 3, 33, 86, -177, -69, 242, -130, -136, 217, -195, -77, 302, -150, -112, 201, -177, -171, 149, -28, -63, -4, 55, -48, -101, 179, -2, -251, 201, 98, -330, 233, 170, -334, 137, 175, -205, 98, 101, -40, -70, -7, 36, -52, -51, 100, -95, -82, 196, -127, -63, 254, -183, -61, 259, -226, -49, 220, -136, -104, 147, 62, -81, -11, 125, -44, -176, 159, -5, -363, 215, 159, -249, 220, 137, -275, 74, 225, -77, 16, 65, -20, -85, 84, 156, -163, -51, 140, -155, -4, 240, -181, -54, 184, -207, -11, 269, -197, -72, 134, -54, 26, 137, -7, -120, -175, 231, 36, -164, 202, -122, -330, 323, 158, -234, 151, 7, -345, 161, 234, -30, -101, -95, -9, -50, 145, 257, -261, -195, 190, -99, 68, 291, -270, -201, 208, -70, 145, 248, -264, -154, 27, 162, 182, -6, -149, -221, -165, 336, 185, -175, 65, -201, -214, 494, 229, -352, -25, -124, -149, 363, 267, -156, -237, -161, 146, 123, 161, 96, -491, -189, 318]
3096C18k56O5%o31K86N74j44j12j49l07K19L93O8k34l76L5J05K56L99m99m67L53
3118a04J5J48N16m85n32K58J42K03K37m11m21M3M72L20l15m4k29l33N69O05n16
3139A38l09N2l43N59M75l96l70j81O4M52K86j38m55l47L77L30N4J82p02l53O43
3160A8K28M2Q8o58l52O26L60Rj86n23j48K61O57J28p19j99J20l7P06K74q86k62
3182d53J71J23N84J61o64m21Q2N04K99l2k84o37k5R05J79l24j18n76M2Q08J56
3203D80k56k95n14K15O90K11k40n30k27K11M74L67j83r02J8L85J94M89k38q70
3223e21M6M59K30L31l28o33j46M95N95j29m72j59l23K97Q76j76n82j74j72L59
3243a27P41j62n91k19q6M78N25j18n18n30K36O23J26L0m84o70M82M96Q4N6m35
$$ y = [318, 62, 127, 127, -504, -218, 356, 212, 100, -49, -356, -137, 256, 324, 90, -286, -251, -146, 110, 509, 10, -457, -104, -89, 59, 575, 90, -442, -184, -42, 161, 398, -13, -434, -391, 81, 401, 86, 42, -187, -520, 49, 654, 138, -171, -119, -462, 97, 572, 176, -194, -375, -311, 141, 427, 289, -166, -513, -136, 194, 248, 430, -272, -625, 18, 246, 288, 376, -282, -634, -8, 352, 361, 175, -348, -496, -235, 422, 550, -169, -368, -248, -285, 421, 695, -191, -453, -282, -159, 425, 586, -78, -499, -417, 87, 386, 354, 70, -567, -592, 313, 492, 168, 50, -526, -484, 324, 480, 224, -71, -585, -370, 320, 531, 291, -239, -466, -255, 219, 586, 403, -499, -481, -96, 98, 587, 349, -521, -475, -16, 214, 545, 217, -416, -562, -67, 528, 399, -73, -232, -555, -258, 618, 442, -140, -314, -486, -127, 614, 452, -139, -358, -444, 34, 559, 441, -77, -607, -371, 252, 378, 408, -76, -746, -264, 232, 316, 372, -63]
3264f3o53M50O35O4j84m41k90J80M82L96l71n75rJ23L65N50n30n91K13R8L44M11
3286F04n31m75N2L08L84L2l24l71j54M81M39k11j44k99l44O29M51l98p0l22j68
3307d31N47L13j48l39l00J33K76K94R6o42k90M91P8J37J93n74l06M50R6K25n3
3328B46m75j85L04L79M5k69k19o8L6M94J43m83j03r2J4N40M9m00j50o7J09L88
3350B36Q9k85k79l4L27J17L3n3m63k5N67q7r3Q9m48QM64N1j22j05k02R2J73K10
3374B60o2l83j2J60l1L46n8m32J46M5p7L67q7l55P2M9Q8J62j23j00j51P1L00p0
3398A25j28l3k05J35L90k70o7J42k85R7L64k02j65j8O7N5N4R1j06k13J94M0j35
3421g3K25p9l25K94J23k57J79p0j68J26J36j00J7j03L2n2R0J14j47p3K41k53R6
$$ y = [-63, -716, -266, 369, 433, 249, -192, -482, -302, 180, 576, 205, -370, -379, -256, 109, 659, 129, -462, -249, -151, 193, 604, 73, -402, -350, -42, 342, 374, 50, -321, -475, 6, 445, 234, 90, -209, -553, 76, 527, 129, 59, -263, -431, 116, 429, 281, -58, -358, -225, 51, 345, 441, -201, -491, 0, 78, 215, 408, -166, -472, -22, 74, 299, 246, -229, -414, -110, 269, 314, 45, -174, -242, -206, 288, 431, -52, -155, -247, -233, 307, 356, -44, -194, -261, -152, 236, 325, 40, -239, -273, 54, 171, 204, 151, -312, -337, 230, 143, 50, 139, -309, -301, 163, 214, 92, -13, -215, -123, 50, 260, 198, -185, -197, -37, -68, 278, 220, -212, -66, -21, -98, 269, 182, -173, -101, -52, 36, 198, 75, -25, -176, -105, 195, 125, -3, -36, -241, -106, 284, 14, -53, 89, -196, -99, 265, 63, -102, -120, -53, 2, 56, 147, 41, -172, 22, 62, -73, 152, 73, -252, 42, 165, -92, 87, 17, -151, -25, 111, 11, 28, -75, -43, -95, -5, 109, -38, -111, 130, -123, -27]
3444b7K57k88l6J87j53L7J04j04j8J8Klq0J90q7j54J97L5j94J93ol03L58j2k16
3469a03J49n9m5N2K8K5p4L6N3j37N1Q1j10QJ54k00M6J58j69OJ23j25K0P2j8L3
3495E5j27J17o4o3J90j00j03J81k3j59K07n9k10K76p9j41J67q7m8P0j2J04j28
3518c6r7K61j91N3J43k47Q9J45k24J24Q2j56M6P9j78Q3M7n0N7p0J31rk14J66J4
3543D8j78K96o2k07R5j3j03K52k4j52M0J9K3k1M3L7k07O7J79j78K5J53l08R8K08
3568A30j19lJ0j56O7J31K0m2j84J0Q2M1P8k0j87P1O4n8K94j53k24J01P9j5J15
3593A32o6k49P3J81J06j11l6l8j29J32L20k67j26N3j47R5K90j73q6rj41K27J55
3616A86o5j55j32Q0K05q5J31k34j91K27J25K2P0k03k85L05P8L9J3k54p1O3K98
$$ y = [-27, 230, -58, -94, 93, -60, -23, 81, -23, -41, -23, -21, -24, -104, 86, -1, -155, 42, 77, -117, 76, 70, -233, 125, 113, -103, 46, -13, -58, -6, 22, 47, -27, 9, 62, -75, -24, 57, -53, -45, 109, -91, -45, 113, -56, -50, 73, -52, -32, 40, 22, 55, -72, 45, -19, -82, 108, 8, -95, 86, 63, -96, 111, 52, -158, 118, 39, -102, 65, -22, -70, 0, -12, 92, -36, -133, 128, -63, -10, 133, -114, -25, 120, -104, 20, 102, -54, -8, 71, -107, -24, 23, -27, 30, -40, 91, 82, -132, 34, 48, -130, 166, 104, -103, -8, -21, -124, 128, 104, -48, -8, 11, 34, 13, 56, 93, -114, -47, 132, -46, -21, 132, -176, -78, 130, 11, 8, 18, -138, -71, 60, 80, 38, -146, -136, -54, -13, 65, 45, -142, -71, -7, -65, 229, 76, -148, -47, 32, 17, 132, 66, -183, -110, 71, 177, 66, 30, -8, -137, -5, 315, 48, -78, -25, -172, -77, 213, 40, -46, -55, -196, 31, 186, 121, -34, -166, -86, 119, 34, 165, -69, -260, -33, 92, 114, 184, -19, -304, 1, 79, 118, 131, -123, -194, -131, 167]
3639A67J43l22j31O1p9K10K45l58j24L4J0K97J00k92j70jJ93J89Lj03k80m3L29
3662G8J09j48l8k01j9L43Q3j13q2k16n8L67J54j33k86q7J29K20J93o2m05p9K19
3685c2J21J59j0m41j33L67R1J37j41k93r7J42L05J35k05l20o8O9M06Q8l07j36
3707a63r2J15M90q9l28q5r8K43K89p8j86k79K4L12J51l3j61l77O7M09J01j5k19
3730bl70J10L89J27j01k56k16J58K32J93j05l94o1J47K04L52k43n21J77P2J29
3751B1L42k79l41J3J61K63J36k32l25k4K08L79r3j84j46k71L40M26k01k23j48
3772a78j62L03L17o1k32k45M4K64K34o4k89k64J57K71P4M4k44l65K27K88O0K1
3794B00k83k65K10K36J41j08k03j44R2K47K58l89j63N4n7L48J39k49k45k1K7L53
$$ y = [167, 310, -12, -143, -82, -161, 49, 294, -64, -188, -154, -144, 153, 253, -39, -209, -210, -17, 172, 175, 72, -208, -251, 78, 187, 39, 1, -200, -219, 124, 207, 94, 12, -204, -262, 105, 259, 126, -160, -247, -118, 102, 295, 233, -172, -251, -32, 89, 248, 238, -203, -336, 31, 122, 259, 118, -175, -272, -130, 175, 310, 105, -215, -283, -214, 192, 280, -27, -163, -255, -140, 350, 261, -67, -152, -250, -7, 282, 204, 18, -261, -237, 75, 226, 193, 32, -345, -278, 131, 232, 217, -2, -372, -262, 127, 254, 153, -103, -319, -161, 71, 264, 159, -235, -296, -149, 55, 407, 164, -357, -180, -108, 21, 363, 84, -257, -244, -83, 180, 316, 84, -241, -265, -57, 322, 229, 45, -101, -372, -32, 394, 193, -30, -178, -340, -37, 280, 219, -13, -258, -214, 50, 284, 220, -69, -333, -176, 95, 169, 213, -31, -396, -169, 119, 179, 200, -83, -348, -138, 98, 239, 131, -72, -216, -124, 123, 381, -8, -171, -117, -174, 174, 313, 64, -181, -202, -175, 178]
3816A78J45k29k91n5K40J46j1n8k54j60L85K59j97k1k73j12L54K04j51o5k46j1
3838b23K28K36m7k96o5N3Q9K10N5l54j20J98l0K61L3l90k0J41J16R1r6j41j67
3861b38J20K82J5j60o6j64L7L55nk32l9q2M3L21K5l03k6j6R4J30P9j50j28pJ85
3886G0k9J06j05k58O1K36l4J00L3l85J22J52M3Pj41m0%K3K15j02j68K5pJ4K83
3911B21j49j45O7k9j4K23o7j52l6OJ52n7K0r7j26J70J47j43Q5n3k10J78J61j50
3935Bk2M7j50R5J35rj08no0L9P1O8j22j02J62p8j3J85j68j24J41k3N9Kln8J3M2
3963A6j5mp1R1j00O1J12j54J8J74j72J14L0j95J02l6k1O2LK5o5m9Q2m0k5J01p9
3990c5j57K66r9r0J55p0m0J30k3q1Q9l8pK8o8J28k01J18L2j39J30M1j85R4Q9j49
$$ y = [178, 323, 94, -197, -252, -12, 134, 123, 65, -189, -349, 36, 295, 98, 77, -196, -308, 46, 250, 99, 34, -212, -223, 5, 241, 194, -102, -167, -114, -25, 185, 240, -114, -234, -36, -66, 195, 228, -162, -182, -41, 75, 166, 70, -71, -238, -118, 164, 179, 19, -47, -211, -174, 181, 176, -56, -95, -177, -134, 187, 212, -91, -117, -133, -39, 91, 170, 20, -108, -115, 70, 41, 147, 42, -216, -155, 81, 47, 147, 180, -205, -83, 69, 112, 119, -22, -62, -62, -39, 176, 74, -94, -69, -76, -62, 221, 72, -73, -6, -35, -49, 174, 107, -45, -81, -75, 77, 20, 40, -57, -183, -13, 134, -9, 76, 23, -187, -9, 152, 2, -20, 27, -123, -28, 107, 98, -10, -15, -75, -36, 35, 103, -19, -121, 41, -37, -50, 135, -33, -157, -16, -39, 20, 22, 19, -39, -26, 16, 1, -3, -74, 17, -83, -22, 90, -64, -46, 128, -44, 70, 100, -95, 7, -29, -50, 12, 15, 40, -25, -74, 8, -32, -57, 44, -35, -192, 74, -25, -115, 40, -30, -70, 60, 37, -44, 45, 7, 0, 28, -40, 88, -113, 5, 37, -102, 28, 69, -116, -22, 67, -82]
4016h2J20N2j19L7K0k6M3n7L7j5j08J49p7p3K36j68k3J32n6j25J54n3r1J66l0
4041D3n8k6%O0p0K5J28j74J17K3j43J24J28k62P2J14j27O8j5m7N9j12J09k7j0
4066aK8p5MJ76p3j82J77q0j11K06m5p9O7j7QN0o3p9o4O7J07p3P5K9j66J72K2j19
4094c9J21p1j90J59P3m9N6q2j0LO5N6r3j10J20l5M5J22j02j91J97m4j5J86j57
4119A5q2J0O4L3Lo2j7p2J30R3j19L7o4j12K03J26j84K1k9j83K53J06j54n7n8R
4145i0Q3K1J54k43o4J81k7K7J41k31j18K23n9j9J26k03j00J74J12O5j34j25M7
4168e9j2J55J48l11m4Q0p6K81j4k40nl0L0K74l5j43k03Q0J57J29j00k2k01j0L30
4193A59K7j26o1j95M0K42M1q7n2k21J10J47J45k5k50KM8N5J83Ll73P3J13QJ50
$$ y = [-82, 38, 90, -29, 8, 28, 2, 45, -12, 25, 10, -98, 51, -26, -99, 137, -31, -54, 78, 22, -103, 51, -2, -93, 73, 43, -15, -41, -41, 19, -51, -26, 102, -72, 45, 68, -75, 49, 177, -85, -13, 101, -26, 42, 27, -20, 39, -73, 36, 9, -1, 27, -48, -44, 132, 59, -123, 54, -26, -137, 69, 24, -55, 12, -5, 3, 53, -10, -89, -153, -86, 21, -52, 23, 52, -114, 58, 80, -39, 82, 11, -179, -20, 53, 4, 60, -22, -32, -29, 36, 92, -1, -111, 9, -26, 19, 141, 39, -152, 45, 1, -14, 172, 15, -67, -57, 7, 40, 43, -19, -36, -108, 22, 115, -4, 33, -31, -143, 60, 186, 2, 23, -6, -189, 64, 170, 16, -41, -99, -90, -7, 14, 168, -75, -139, 42, 15, 42, 183, -48, -166, 57, -2, -21, 105, -98, -198, -24, 88, 153, 19, -106, -59, -71, 84, 232, -79, -123, -43, -119, 162, 148, -92, -97, -127, -97, 177, 142, -1, -204, -124, 33, 162, 62, 40, -161, -171, 159, 186, 60, -1, -196, -156, 86, 127, 40, -12, -233, -123, 24, 169, 144, -106, -104, -56, -1, 182, 185, -188, -115, -2, 6, 156]
4218A56o7l34N3J45J54M9j20j98j4J52J82J8k02l7j24J22L29j36k37J00j68J42
4240c5K89j02j81j60k3K49J25N0k60k18J87K47p3Q0k11l10K53K32QLk56j85K22
4263f9J40Q8m0k18j18R3K65J48k59k82J28kJ61K45j89k59O2K3J83J30k30k39O9
4286a70J46K07l4j01k18o7K93J49j30j31k4j35K90J11r7l7j57p7K46J44j02j89
4308h3j42J70J51J7J00l12j31K53K7J39j3l11n9J90J02M3j6k81PP5J78Q2j69j00
4332h3k6k2K36J00k90K9o4j8L76j08k19n0M4R4J66o1j13k07rL24j9M8m2k95P9
4357a30K86j40R7m0l03P1K36L7m2j27j20Q7J15M7J8k07K8K0P6J78j07k54J15L2
4381b7K9J51q8k40K7J00J33nn1m2j15J24J11m6n6J3j80J51K26j78j05pm3R8J60
$$ y = [156, 89, -245, -192, -47, 107, 156, 36, -162, -176, -24, 158, 176, -26, -63, -187, -65, 264, 128, -109, -9, -177, -35, 254, 152, -29, -189, -212, 37, 162, 212, -48, -266, -79, 168, 95, 175, -36, -346, -93, 139, 147, 150, -106, -291, -69, 71, 159, 119, -99, -217, -124, 141, 289, 30, -252, -124, -126, 35, 280, 91, -168, -106, -83, 100, 230, 0, -239, -170, -24, 183, 149, 48, -170, -237, 56, 205, 75, -56, -80, -215, 75, 186, 89, 52, -105, -182, 64, 208, 106, -83, -225, -55, 96, 113, 213, -99, -230, 23, 50, 189, 176, -135, -194, -4, 98, 141, 125, -156, -149, -74, 104, 186, 17, -83, -109, -131, 105, 205, -85, -56, -120, -138, 238, 130, -89, -139, -95, -1, 165, 104, -9, -216, -225, 99, 80, 128, 86, -209, -130, 156, 16, 113, 73, -230, -159, 77, 114, 72, -55, -175, -88, 27, 74, 92, -115, -87, -67, 9, 187, 80, -174, -59, -27, 2, 153, 65, -175, -148, -48, 85, 80, 29, -13, -128, -4, 107, 61, 5, 18, -162, -11, 215, 37, -68, -75, -118, -20, 140]
4406A40j07n5r0P0N3jJ24j25j51J63L4r4J69q7k27J57P6K6m2j43l3J49J1L3j8
4431C2r4K7j5K0K11k13l6J44j82J72J12k65L1L3nJ39Pj30mo8J11K7n1Q1j00p6
4457i2J53j6p8J11r6j16K17m8k8ok9o4J41k2j3l4l3P3q6R3O6j39K8P6j25J51J5
4484I9j57J0J13q4N1n2j7j1M6O6Jj04O4o7m4J49n2j15J54r2k1J10p7K4k5j2jO8
4512B4o5R8j24J4J35j41%J16r3l1J30j54R4J41j64P0n9J0N1o1M0J9q9J16r9o9
4538i1J52q5n3J47m0p3O7k9l7R0r8J9J4o4P5l6M1L4j01P2M2r4M1R5j58P6M4j40
4566i0R4k5m2R7m3P5n6j1K7j8o2J55r6m8J17p6RQ3q6n4J00j34M5J22j01m4QK6
4594b8N8o6M1K5o9L5N6q6J6P4j52P1P3n1j0j2L7J5j0jm3n5J50m9m2J16p3j08J37
$$ y = [140, 33, -22, -112, -42, 11, 10, 134, 9, -142, 21, 55, -39, 130, 43, -184, -27, 49, 75, 33, -110, -143, 6, 17, 50, 32, -62, -35, -50, -30, 181, -32, -68, 76, -106, 66, 178, -87, -56, -23, -28, 111, 118, -12, -16, -84, 27, 54, 3, 84, -16, -92, 61, 45, -33, 78, -18, -134, 83, 35, 7, 1, -28, -92, 49, 27, 14, -20, -53, 20, -66, 27, 93, -46, -18, 58, -67, 84, 99, -58, -48, 65, -19, 32, -20, -37, -48, -2, 64, 65, -39, 25, -42, -86, 63, 11, -104, 50, -42, -63, 47, -30, -6, -31, -43, -44, 24, -41, 57, -67, -53, 82, -59, -59, 57, -36, -67, 63, -91, 3, 144, -20, 50, -9, 1, 52, -9, 31, 50, -39, 77, -22, -91, 61, -24, -77, 70, 30, -43, 24, -5, -42, 48, -50, -31, -17, -81, -6, -42, -1, 33, -68, 4, 46, -48, -7, 88, -70, 6, 50, -90, 4, -21, -63, 34, -9, 66, 10, -1, 26, 8, -54, 101, 5, -43, 74, -2, 7, 90, 4, -50, 50, -84, -39, 83, -18, -62, -54, -28, 30, -36, 5, 30, -39, -4, 52, -34, -18, 56, -96, -25, 48, -3, -13, -25, 12, 27, 17, 16, -27, -82, 68, 19, -23, 93, 20, -88, 49]
4623D9j05MP3p9L3N1p0J12j01K0L9n5M7P4j97NR0j12J32J2Mj7p7k2J23J7r7L4
4651a3n5R3N1q1M4o4q5J14M1p5J38j69rJ88n0j36J64j54k0J05K3l5o4n2P1QM8
4678B6L4j27LR7j33J43L5k11J11N4k2J00p7r6N3j3J06l4pl8l3l8J67r7k8M5q3
4705f3L4J20m5q8K2j2J14J1m8n6q8L3O6l1Q6k7k14Q4J46n7M7m6j62J28J05K6l1
4732E4o0o7J1O1J09j08j51J45m1K1J44j18j02N9k0J09P1j39p0J9O2N2Lro3p5O7
4759c6J96j11r8J2p9J48O2j06Lm6p1J56O9q8o4n3L5J08RN5j82j2N0L0N6J23j87
4786b1p0J05K9Q2n3o5j27M4J20N5j09p2QL3J15P2j98K0m1o4K22P5k03l5KLJ23
4813E0L9q2q4k6J96k4j5oj63lJ96k9m5N1j67l2K64n4mk0j04p2J33Q4j1r0n0J7
$$ y = [49, -56, -52, 21, -58, -25, 26, -44, 68, -33, -13, 26, -29, 18, 92, -105, -100, -10, -122, 10, 22, 26, 9, -68, -90, 33, 50, -47, -13, -68, 25, 76, -5, 39, -25, -110, 4, 45, -30, 108, -61, -70, 118, 68, -68, 96, -58, -78, 27, 50, 15, -49, -101, -30, -22, 26, 60, -67, -64, 33, -100, 43, 78, -133, -22, 32, 10, 110, 33, -63, -10, -23, 83, 49, 42, 4, -29, -67, 100, 3, -25, 20, -63, -29, 91, 46, -42, -20, -32, 82, 93, 45, -11, -99, -66, 0, -31, 55, 28, -186, -102, 44, -13, 34, -12, -174, -46, 59, 85, 54, -6, -73, -62, -1, 108, 0, -151, -6, -47, -26, 118, 0, -102, -43, -63, 46, 117, -22, -92, -73, -11, 41, 44, 35, -28, -103, -36, 160, 49, -49, -37, -116, 32, 94, -12, -9, -55, -126, 30, 99, 11, -53, -106, -71, 37, 46, 101, -81, -93, -43, -13, 43, 166, -21, -91, 14, 43, 125, 72, 7, -120, -76, 44, 99, -10, -82, -74, -41, 74, 146, -52, -32, -73, -137, 85, 160, -43, -78, -76, -73, 50, 89, 7, -77, -103, 93, 69, 54, 48, -115, -118, 78, 49, 4, 55, -112, -144, 120, 66, 62, 42, -62, -134, -1, 83, 72, -18, -68, -51]
4841e1j5K31r0k06N5P5k9J50q7j75M1M7R1J0l4l1m8K5J10j5n0O0j30J1J88o2m6
4868B5l7j24J00J14J2j14J9p5N7J15N1j37j19L4R8pP6rk46J65Q5j00N9l5n0J3
4894c0O8J6J6j02j6L4k3J32n4j11J13r1J3R9p7lj8MM7O4l5p4p3M7Q4QMo9j07J28
4924fJ2j8Nj4p9Q6N3l3K6l1m5N2O4k2r0m2O0J5J3L4k9n2P8j02Q8R0j49n9J38q
4954C5k0oN2j10L3NM3Rj0l2j39J71Jp7P1n8K4M0j1p2N4n8l6J26l1N8r0o0R6m4
4984c6Q9K2r5pP2n6nP3p5KK0l0P2k3n1P1n2M6j2l9N6l5j1M7Kj03J14m8p0Q6m8
5015b4L0J1k2N7j0M5q4n4K6O2l9OJ8q4P3M7n9j5K5Pj0L9k3J5mqj6p1Q5j6m5N8
5047B0n4%Q8j14j7P7rPL6k8n6J6R3o9l6L1%M4n1P3r3L1N2l9j1K4l3J2k9L9j3L1
$$ y = [-51, -66, 165, 75, -131, -76, -1, -30, 120, 33, -142, -101, -54, 37, 47, 13, -18, -66, -41, 69, 54, 4, 64, -66, -55, 133, 71, 25, -12, -136, -36, 78, 90, -24, -5, -80, -23, 92, 143, 6, -113, -79, 19, 12, 88, 79, -167, -2, 83, -17, 42, 7, -43, -30, 38, 54, 70, -32, -48, -14, -37, 95, 41, -70, 43, -48, -35, 64, -13, -16, -34, -30, 17, 81, 46, -28, -101, -54, 30, 38, 42, -27, -134, -6, 6, -12, -7, -21, -100, -14, 39, 6, 32, 1, -44, 8, 72, 50, -40, -82, -22, -7, 6, 40, 11, -41, 37, -65, 23, 113, -36, -95, 43, 35, 15, 9, 61, -49, -16, -11, 32, 41, 31, -1, -140, 31, 32, -45, 26, -32, -8, 32, 21, -51, 3, -55, -91, 35, 4, 62, -28, -88, 8, -36, 53, 75, -20, -27, 45, -11, -16, 57, -18, -16, 4, -26, 46, 23, -28, 43, -9, 37, 25, -14, 42, 7, -4, 43, 45, -58, 56, 8, -62, 24, -24, 6, 17, -5, 52, 42, 87, 3, -51, -25, 37, -2, 4, 22, -62, 11, 58, -1, -16, 9, 16, 6, 45, 22, 37, 33, 25, 9, -62, 23, 7, -38, 20, -34, -34, 54, -60, -77, 0, -9, -2, 34, 6, -50, -34, 59, -10, -46, -15, -15, 29, -22, 51, -42, -11, 41, 2, -9, 15, -18, -6, -35, 4, -9, 22]
5079B2J4jko3M8n1R5q8l0J03q6kR9m1m9Q2k6p6Q5p1L4m0L9M6k4l8M4l4m5J22q6
5110b0J9O3j09K3O3l2orj8M8lL2p0QkO7p0R3j04j7J20r5QL6l5o8J13L3o0N3n6
5141Ej8J4m6J08q8m8J31q4N4qKn8M5m6M1ql1N3J4K1Jj8n9K7p7J30j9o2M6k4l3
5172c5L9K4o1J5Mk8P8j0l3m0mN0NL7Pj46K5J21l9J0Q0j48nP7LJ3po6k9N5N9L3
5204H4o5j9J3j8L1Mp7nL9m2J33j07KO9j02M6J27r4m2l6M9O5l9l7J4n1kR6o1O3
5234C8p7o0J10L7J9n1p6m2Q9K9Q1q3j10J30M4n8Q1j29m7M2N7M6K8j39rN8j0R8
5262I6p4q9L5L2j0J17j45L8J8j29J78kr6k0L1k6P0P6p3r6K9R9l6L9o2q0n6J66
5290C0M9q6L9q3m3J57k6l3Nl7o8J35o5R8r7k6K4K3Q3o9j18O3j6PJ11J3j43l5J00
$$ y = [22, 36, 35, 33, -30, 18, -33, 62, -26, -56, 47, -39, -41, 58, 17, -32, 50, 24, -52, 33, -38, -4, -44, -5, 41, 17, -21, 23, -11, -56, 66, -20, -1, 62, -47, -24, 39, 7, 1, -8, -26, 22, 19, 51, -19, -11, -13, 54, -16, 77, -27, -44, 76, -19, -11, 25, -10, -78, 35, 68, 8, 61, 5, -13, 1, -45, 63, -25, -73, 58, -26, 28, 20, 22, -36, 9, -37, 4, -4, -35, 18, 32, 53, 54, 36, -23, 4, -73, 57, 38, -24, 22, -2, -35, 4, 28, -33, -18, -14, -42, 36, 26, -7, -47, -51, -1, 4, 41, 48, -98, -73, 48, 9, 19, 99, -49, -54, 23, 26, 39, 32, -34, -63, -8, 51, 84, 19, 0, 13, -5, 26, 30, -47, -52, -13, -55, 78, -29, -27, 42, -60, -14, 113, 19, -23, -59, -10, 55, 16, -21, -7, -58, -60, 36, -25, 38, -39, -99, 11, 48, 67, 16, -60, -102, -13, 16, 97, 14, -96, 34, 78, 20, 101, -28, -75, -33, 24, 70, 98, -41, -50, 8, -2, 96, 22, -67, -32, 0, -10, 107, -38, 0, 18, -111, 67, 65, -31, -51, -20, -46, 24, 100, 27, -69, -40, 59, 23, 62, 0, -80, -136, 30, 79, -7, 32, -51, -94, 63, 37, 4, 9, -28, -96, 39, -26, 72, -25, -51, -27, -4, 79, 10, -108, -45, -61, -54, 57, 70, -73, -108, -8]
5319hMR1J1r8r0O2P5rM7j09Qm0J37Qj47N6m8k1J71Jq8l8k4N2JQ8n4p4kR9m5j3
5351CM4j33P0L9k5L9j5j22N4J3R3pj04L0L8j4O8o3l4K3m5Q1K4J0j07j3N8K9N0
5380H4l8j18K7J6Q7o5RL2r7L7J49j28Kj3q0Q9L7j0Rk1n2N6m3N3o6L6PL1j3Q7j06
5411bm1L7l2P9P9j17o8P3l3R4m5n2M2k5L3Q8j16j4jj9M8P2m4m0j2o1J00M5l1o2
5441b5j0L2k8K9k0j9m0J46k9N0J3j32JM2l7M8jn7o7J42lJ2rn4K5k7KM6l5q6L5
5472e6L2P5m0p5K1N6l9N7M9r0k5J8jmN8l4l2J4Rl7LQ8p2OO0j7l5NK9k3N0l6j5
5505aL4n6O4j9L2m4q4oJ13l7j2N1j28O4L5JN1r4k7K3N6l7N2p7L4p%P5m7k4R0j16
5537d1mN3l8j2M4m3j6J09j7J1m1k9Q2n7jN0j25J55k5r3J7K4n2O7Ll7L6n6KJ6j1
$$ y = [-8, -4, 87, 98, 0, -90, -28, 47, 38, 85, -24, -16, -56, 81, 89, -58, -2, -50, -71, 100, 101, 13, -25, -49, 3, 4, 92, 38, -36, -38, 61, 16, 3, 47, -86, -16, 23, -2, 37, 22, -100, -46, -33, 60, 53, -51, -21, 17, 3, 71, 8, -26, -3, -48, 33, 57, 67, -40, -53, 5, 34, 84, 46, -72, -45, -29, 58, -7, 2, 34, -63, -26, 123, -5, -3, -16, -96, -7, 30, 20, 29, 8, -44, 12, -31, 22, -44, -8, -1, 30, 17, 104, -2, -43, -6, -38, 41, 120, 3, -65, 8, -25, 69, 24, -28, 14, -11, 22, 110, -6, -20, -21, -40, 8, 80, 36, -4, -16, -77, 23, 68, 37, -25, -35, -3, -31, -2, -22, -41, -81, 65, 36, 86, 99, -33, -32, 10, -27, 21, 20, -37, -104, 38, 35, 47, 38, -16, 9, -18, -16, 30, -5, -91, -56, -24, 51, 11, -64, -43, 13, -26, 31, 80, -10, -35, -17, -18, -22, 36, 2, -30, -16, -7, -44, -41, 47, -25, -19, 41, 24, -11, -6, 23, 0, 50, 14, -1, 33, -23, 41, 22, 54, 10, -74, -80, 33, -4, -16, 35, -93, -29, 6, 7, 58, -36, -63, -40, 16, -21, 31, -46, -12, -19, -19, 56, 9, -15, 75, -41, -45, 8, -30, -42, 2, -41, -57, 52, 35, 46, 5, -24, 58, 1, 0, 50, -75, 80, 55, -38, -21, 3, -49, 18, 21, -16, 20, -36, -34, -18, -29]
5568b9N4m3lJ0k7n6J08l2L6L7j22N8M8n0K2m1J2J3L7k7j8J2M5m2n3O7j8j8O0M
5598D4j36J47oj17Q9n7OM9m1jj0K1rM8n1M9l6j4J4k4O4j0p1J8N7o4J9M2l5O9j0
5629D4o9P4o6O3L3j15L5R0j48J03J4n4jK5m2LL3j5qRM3k7r9J00o3MK9Jl5O2m6
5660b3l1R9k6p5L7k4J9L8J9J3q8N8k5j1MP9j50J31o8Q7N1p9p2k3P8j1K1o9N0o1
5690e2K7M0N8r0M4Jn0L8Jq5P5p6N4O5n2LO5q3K4m6K9L5p2O6J6l1J3J1q1j4P3k7
$$ y = [-29, 25, -18, -21, -11, -38, -94, 14, -18, 18, 55, -67, -9, 39, -11, 11, -30, -18, -5, 32, 5, -13, -1, 44, 2, -51, 16, -2, -20, 40, 44, -92, 55, 49, -68, 21, -36, -30, 19, -22, -23, -33, -12, -21, 27, -24, 25, -11, -25, -11, -35, 29, 19, -52, -34, 23, -41, -22, 20, -15, 54, 44, -25, 49, -17, 46, 79, -36, -1, 89, -59, 44, 58, 4, 3, 28, -14, -11, 22, 7, -1, 8, 51, 24, -75, 25, -38, -34, -5, -4, -39, 23, -23, -54, 45, 19, -56, -19, -43, -24, 14, 33, 46, -42, 16, -9, -20, -16, 63, -87, 44, -24, 63, 114, 35, -37, -60, 18, 7, 28, -41, 9, -52, -25, 15, 73, -17, 27, 28, -22, 16, 17, -68, 7, -69, -15, 50, -2, 1, 66, -17, 7, -39, -10, 25, -47, 19, 35, 4, 17, 28, -53, -67, 6, -21]
$$ [...]
8191f
##END NTUPLES=NMR FID
##END=
