##TITLE=1H_47-2024
 DMSO
 8 sc, 
 2.7.2024
##JCAMPDX= 6.0         $$ Bruker NMR JCAMP-DX V2.0
##DATA TYPE= NMR FID
##DATA CLASS= NTUPLES
##ORIGIN= UXNMR, Bruker Analytische Messtechnik GmbH
##OWNER= root
$$ XWIN-NMR		Version 3.5
$$ Tue Jul  2 14:03:56 2024 Russian Standard Time (UT+4h)  she@DPX200
##.OBSERVE FREQUENCY= 200.131
##.OBSERVE NUCLEUS= ^1H
##.DELAY= (6, 6)
##.ACQUISITION MODE= SIMULTANEOUS
##.ACQUISITION SCHEME= undefined
##.AVERAGES= 8
##.DIGITISER RES= 18
##SPECTROMETER/DATA SYSTEM= spect
##.PULSE SEQUENCE= zg30
##.SOLVENT NAME= DMSO
##.SHIFT REFERENCE= (INTERNAL, DMSO, 0, 15.7039)
##AUDIT TRAIL= $$ (NUMBER, WHEN, WHO, WHERE, WHAT)
$$ ##TITLE= Audit trail, XWIN-NMR		Version 3.5
$$ ##JCAMPDX= 5.01
$$ ##ORIGIN= Bruker BioSpin GmbH
$$ ##OWNER= she
$$ F:/spectra/data/she/nmr/H-F/1/audita.txt
$$ ##AUDIT TRAIL=  $$ (NUMBER, WHEN, WHO, WHERE, WHAT)
(   1,<2024-07-02 14:02:15.34 +0400>,<she>,<DPX200>,
      <created by zg, POWCHK disabled, PULCHK disabled
       configuration hash MD5:
       00 E9 B6 7A A2 85 ED C7 34 08 36 98 17 FE 4E 26
       data hash MD5: 16K
       17 26 43 27 80 D3 6C CD 42 9E 12 29 BE 52 15 15>)
$$ ##END=
$$ 
$$ hash MD5
$$ 05 50 3F 3F 43 7A 33 54 0A 4D EC 02 2E D9 12 B9
##$RELAX= 
##$RELAX= 
##$RELAX= 
##$RELAX= 
##$RELAX= 
##$RELAX= 
$$ Bruker specific parameters
$$ --------------------------
##$DU= <F:/spectra>
##$EXPNO= 1
##$NAME= <H-F>
##$PROCNO= 1
##$TYPE= <nmr>
##$USER= <she>
##$AMP= (0..31)
100 100 100 100 100 100 100 100 100 100 100 100 100 100 100 100 100 100 
100 100 100 100 100 100 100 100 100 100 100 100 100 100 
##$AQSEQ= 0
##$AQ_mod= 1
##$AUNM= <au_zg>
##$AUTOPOS= <>
##$BF1= 200.13
##$BF2= 200.13
##$BF3= 200.13
##$BF4= 200.13
##$BF5= 200.13
##$BF6= 200.13
##$BF7= 200.13
##$BF8= 200.13
##$BYTORDA= 1
##$CFDGTYP= 0
##$CFRGTYP= 5
##$CHEMSTR= <none>
##$CNST= (0..31)
1 1 145 1 1 1 1 1 1 1 1 1 1 1 1 1 1 1 1 1 1 1 1 1 1 1 1 1 1 1 1 1 
##$CPDPRG= <>
##$CPDPRG1= <>
##$CPDPRG2= <>
##$CPDPRG3= <>
##$CPDPRG4= <mlev>
##$CPDPRG5= <mlev>
##$CPDPRG6= <mlev>
##$CPDPRG7= <mlev>
##$CPDPRG8= <mlev>
##$CPDPRGB= <>
##$CPDPRGT= <>
##$D= (0..31)
0 1.2 0 0 0 0 0 0 0 0.06 0 0.03 0 0 0 0 0.0002 0 0 0 0 0 0 0 0 0 0 0 0 
0 0 0 
##$DATE= 1719914534
##$DBL= (0..7)
120 120 120 120 120 120 120 120 
##$DBP= (0..7)
150 150 150 150 150 150 150 150 
##$DBP07= 0
##$DBPNAM0= <>
##$DBPNAM1= <>
##$DBPNAM2= <>
##$DBPNAM3= <>
##$DBPNAM4= <>
##$DBPNAM5= <>
##$DBPNAM6= <>
##$DBPNAM7= <>
##$DBPOAL= (0..7)
0.5 0.5 0.5 0.5 0.5 0.5 0.5 0.5 
##$DBPOFFS= (0..7)
0 0 0 0 0 0 0 0 
##$DE= 6
##$DECBNUC= <off>
##$DECIM= 32
##$DECNUC= <off>
##$DECSTAT= 4
##$DIGMOD= 1
##$DIGTYP= 9
##$DL= (0..7)
0 120 120 120 120 120 120 120 
##$DP= (0..7)
150 150 150 150 150 150 150 150 
##$DP07= 0
##$DPNAME0= <>
##$DPNAME1= <>
##$DPNAME2= <>
##$DPNAME3= <>
##$DPNAME4= <>
##$DPNAME5= <>
##$DPNAME6= <>
##$DPNAME7= <>
##$DPOAL= (0..7)
0.5 0.5 0.5 0.5 0.5 0.5 0.5 0.5 
##$DPOFFS= (0..7)
0 0 0 0 0 0 0 0 
##$DQDMODE= 0
##$DR= 18
##$DS= 0
##$DSLIST= <SSSSSSSSSSSSSSS>
##$DSPFIRM= 0
$$ [...]
##$SUBNAM2= <"">
##$SUBNAM3= <"">
##$SUBNAM4= <"">
##$SUBNAM5= <"">
##$SUBNAM6= <"">
##$SUBNAM7= <"">
##$SUBNAM8= <"">
##$SUBNAM9= <"">
##$SW= 18.0517599122864
##$SWIBOX= (0..15)
0 0 2 0 0 0 0 0 0 0 0 0 0 0 0 0 
##$SW_h= 3612.71676300578
##$TD= 16384
##$TD0= 1
##$TE= 0
##$TE2= 300
##$TE3= 300
##$TEG= 300
##$TL= (0..7)
0 120 120 120 120 120 120 120 
##$TP= (0..7)
150 150 150 150 150 150 150 150 
##$TP07= 0
##$TPNAME0= <>
##$TPNAME1= <>
##$TPNAME2= <>
##$TPNAME3= <>
##$TPNAME4= <>
##$TPNAME5= <>
##$TPNAME6= <>
##$TPNAME7= <>
##$TPOAL= (0..7)
0.5 0.5 0.5 0.5 0.5 0.5 0.5 0.5 
##$TPOFFS= (0..7)
0 0 0 0 0 0 0 0 
##$TUNHIN= 0
##$TUNHOUT= 0
##$TUNXOUT= 0
##$USERA1= <user>
##$USERA2= <user>
##$USERA3= <user>
##$USERA4= <user>
##$USERA5= <user>
##$V9= 5
##$VALIST= <valist>
##$VCLIST= <CCCCCCCCCCCCCCC>
##$VD= 0
##$VDLIST= <DDDDDDDDDDDDDDD>
##$VPLIST= <PPPPPPPPPPPPPPP>
##$VTLIST= <TTTTTTTTTTTTTTT>
##$WBST= 1024
##$WBSW= 4
##$XGAIN= (0..3)
0 0 0 0 
##$XL= 0
##$YL= 0
##$YMAX_a= 377129
##$YMIN_a= -380908
##$ZGOPTNS= <>
##$ZL1= 120
##$ZL2= 120
##$ZL3= 120
##$ZL4= 120
##$ABSF1= 10
##$ABSF2= 0
##$ABSG= 5
##$ABSL= 3
##$ALPHA= 0
##$AQORDER= 0
##$ASSFAC= 0
##$ASSFACI= 0
##$ASSFACX= 0
##$ASSWID= 0
##$AUNMP= <proc_1d>
##$AZFE= 0.1
##$AZFW= 0.1
##$BCFW= 1
##$BC_mod= 2
##$BYTORDP= 1
##$COROFFS= 0
##$CY= 11.3945322036743
##$DATMOD= 1
##$DC= 2
##$DFILT= <>
##$DTYPP= 0
##$F1P= 15.6554695791079
##$F2P= 12.8336369535428
##$FCOR= 0.5
##$FTSIZE= 0
##$FT_mod= 4
##$GAMMA= 1
##$GB= 0.15
##$INTBC= 1
##$INTSCL= 1
##$ISEN= 128
##$LB= 0.24
##$LEV0= 0
##$LPBIN= 0
##$MAXI= 10000
##$MC2= 0
##$MEAN= 0
##$ME_mod= 0
##$MI= 1.114404
##$NCOEF= 0
##$NC_proc= 0
##$NLEV= 6
##$NOISF1= 3.799351
##$NOISF2= 2.8
##$NSP= 1
##$NTH_PI= 0
##$NZP= 0
##$OFFSET= 15.70392
##$PC= 1
##$PHC0= -25321.08
##$PHC1= 13.18748
##$PH_mod= 1
##$PKNL= yes
##$PPARMOD= 0
##$PSCAL= 0
##$PSIGN= 0
##$REVERSE= no
##$SF= 200.130013532006
##$SI= 16384
##$SIGF1= 3
##$SIGF2= 2
##$SINO= 400
##$SIOLD= 16384
##$SREGLST= <1H.CDCl3>
##$SSB= 0
##$STSI= 0
##$STSR= 0
##$SW_p= 3612.71676300578
##$SYMM= 0
##$S_DEV= 0
##$TDeff= 0
##$TDoff= 0
##$TI= <>
##$TILT= no
##$TM1= 0
##$TM2= 0
##$TOPLEV= 0
##$USERP1= <user>
##$USERP2= <user>
##$USERP3= <user>
##$USERP4= <user>
##$USERP5= <user>
##$WDW= 1
##$XDIM= 8192
##$YMAX_p= 0
##$YMIN_p= 0
$$ End of Bruker specific parameters
$$ ---------------------------------
##NTUPLES= NMR FID
##VAR_NAME=  TIME,          FID/REAL,        FID/IMAG
##SYMBOL=    X,             R,               I
##VAR_TYPE=  INDEPENDENT,   DEPENDENT,       DEPENDENT
##VAR_FORM=  AFFN,          ASDF,            ASDF
##VAR_DIM=   8192,          8192,            8192
##UNITS=     SECONDS,       ARBITRARY UNITS, ARBITRARY UNITS
##FACTOR=    0.0002768,     1,               1
##FIRST=     0,             0,               0
##LAST=      2.2672688,     0,               0
##MIN=       0,             -380908,         0
##MAX=       2.2672688,     377129,          0
$$ Real data points
##PAGE= N=1
##DATA TABLE= (X++(R..R)), XYDATA
0@%%%%%%%%%%%%Nj2J4j4J4j9K6k8L5m2M9o0O7p7R1j05J19j37J57j78K03k31K60
$$ 0 0 0 0 0 0 0 0 0 0 0 0 0 5 -7 7 -7 7 -12 14 -14 21 -21 28 -32 35 -42 49 -56 63 -74 83 -95 108 -123 137
35A37k94L33l73M14m61N16n72O32o99P74q55R44j041J146j261J392j534J687j864
$$ 137 -157 176 -197 217 -244 272 -300 332 -367 407 -448 496 -545 601 -660 732 -802 885 -979
54i79K064k287K539k831L169l566M048m644N394o378P733r714J2906j8879L3779
$$ -979 1085 -1202 1337 -1494 1675 -1891 2157 -2487 2907 -3471 4262 -5452 7454 -11425 22354
69B2354j37656k65606K81251L40602P234l16431j04385K46356K14635j56964l47789
$$ 22354 -115302 -380908 -99657 240945 248179 -68252 -172637 73719 288354 131390 -216399
80b16399n4302L32977K60865j21464l14767k172K98215J23654k48026k76202J28861
$$ -216399 -270701 62276 323141 201677 -113090 -115262 182953 306607 58581 -217621 -88760
91h8760L68222R7667k56074k40130J21990K66146l322k74840j72534K00904K77829
$$ -88760 279462 377129 121055 -119075 2915 269061 265739 -9101 -181635 19269 297098
102B97098o4087l20143j43683K48845K60594r4512k59363k5404K66028J40316
$$ 297098 233011 -87132 -230815 18030 278624 184112 -75251 -100655 165373 305689
112C05689k20064k95744o389K78871J48482j76274k16893N8699K63032M0157k77591
$$ 305689 85625 -210119 -216508 62363 210845 34571 -182322 -123623 139409 179566 -98025
123i8025k05261J44908L01537K1800k52193j30278J63475K14607p5143k59713
$$ -98025 -303286 -158378 143159 164959 -87234 -217512 -54037 160570 85427 -174286
133a74286p4779K06421K09194j10544k75262n1372K23984J78065j35690k08664
$$ -174286 -249065 -42644 166550 56006 -219256 -270628 -46644 131421 -4269 -212933
143b12933O7278K61942R7225k23360k24557O7780K27406O7955j87150j35912J34202
$$ -212933 -145655 116287 213512 -9848 -234405 -166625 60781 128736 -58414 -194326 -60124
154f0124K18532o627k55507j36808J71790K21549l0560k23274n0001K01447J51760
$$ -60124 158408 151781 -103726 -240534 -68744 152805 122245 -101029 -151030 50417 202177
165B02177j10658k24423l043K15907J26772j31580k19476J0353K02294Q0441j57851
$$ 202177 91519 -132904 -135947 79960 206732 75152 -144324 -133971 68323 148764 -9087
176i087j64069J11831K41346L3865k07258j60710J08460J81249k1452j82330p8894
$$ -9087 -173156 -61325 180021 213886 6628 -154082 -45622 135627 114175 -68155 -147049
187a47049J65941J73403o5320k15234p8776J72400J50559r2267j86002K66K04650
$$ -147049 18892 192295 126975 -88259 -167035 5365 155924 63657 -122345 -122079 82571
198H2571R6923j48028j71947M3824K06085O3986j56190j48107N5646J74863R153
$$ 82571 179494 31466 -140481 -96657 109428 173414 17224 -130883 -75237 99626 108779
209A08779j78912j06047J29967K06644j4660j92679q4127J30150J41327p9777
$$ 108779 -70133 -176180 -46213 160431 145771 -46908 -131035 -885 140442 60665
219F0665j77085j4311J71199J30167j01642j77672o724J60421R2234j29412j52005
$$ 60665 -116420 -130731 40468 170635 68993 -108679 -115403 45018 137252 7840 -144165
230a44165N3511J82083M9642j68256j28171R3325J74120J5665j63849q8668J04330
$$ -144165 -90654 91429 141071 -27185 -155356 -62031 112089 127754 -36095 -124763 -20433
241b0433J33836l9377j82227n8617J47240J49076n0287j72578k1947J50860Q9035
$$ -20433 113403 74026 -108201 -166818 -19578 129498 79211 -93367 -115314 35546 124581
252A24581j11148j63505L2268J72825P1300j17603j38750N0776J53302L0659j39011
$$ 124581 13433 -150072 -117804 55021 126321 8718 -130032 -79256 74046 104705 -34306
263c4306j14948R2260J59353n065j63108q8622J24118J44156l6257j48448l9063
$$ -34306 -149254 -56994 102359 97294 -65814 -154436 -30318 113838 77581 -70867 -109930
274a09930J38288J02456q3150j56657j8358J53977R7944q6769j33790K2716J59037
$$ -109930 28358 130814 47664 -108993 -127351 26626 124570 37801 -95989 -73273 85764
285H5764M7328j35938j26015O0411J62805K0377j34345q8061Q4494J40678j7198
$$ 85764 133092 -2846 -128861 -68450 94355 114732 -19613 -107674 -23180 117498 100300
296A00300j43296o4591J08705J32886m8964j54693m0565J27960J09576p8823j35077
$$ 100300 -42996 -107587 1118 134004 85040 -69653 -110218 17742 127318 48495 -86582
307h6582R868J42468P2240j13068j30477K6713J37975N2554j14949r9371O3676
$$ -86582 -76714 65754 137994 24926 -105551 -78838 59137 111691 -3258 -102629 -38953
318c8953J40584J3453j47399q8842Q7604J29559j8470j43911m5945J11156J07170
$$ -38953 101631 115084 -32315 -121157 -33553 96006 77536 -66375 -112320 -1164 106006
329A06006m8504j38921j7419J23476R0486p2644j39131M356J29765O3148r8911
$$ 106006 57502 -81419 -98838 24638 115124 42480 -96651 -92295 37470 100618 1707
340A707j18786M8786J38495L0658j19270j01114O6399J22440L893j19007o8540
$$ 1707 -117079 -68293 70202 100860 -18410 -119524 -53125 69315 73208 -45799 -114339
351a14339R5500J18586k3219j33159n2798J09191R7052n6392j29809j4984J26031
$$ -114339 -18839 99747 76528 -56631 -109429 -238 96814 40422 -89387 -104371 21660
362B1660P2916p7855j13649J6214J31067N1159r3254j03495L5546J27518K1322
$$ 21660 94576 16721 -96928 -80714 50353 101512 8258 -95237 -59691 67827 89149
373H9149j12221q5070O8474J27138q546j21604o0338Q5877J06614l6811j16582
$$ 89149 -23072 -108142 -39668 87470 78924 -42680 -103018 -17141 89473 52662 -63920
384f3920k9596J04976R5209n5410j14119r380J12210P0203q5255j09979J8666
$$ -63920 -93516 11460 106669 51259 -62860 -72240 39970 110173 24918 -85061 -66395
395f6395J18362M3348j01066q6988M8721J17821J9558j07745o7765O5334J07771
$$ -66395 51967 95315 -5751 -92739 -44018 73803 93361 -14384 -82149 -16815 90956
406I0956p025j17985m9122Q4899R7566l5186j21075k2854R8477P6203o0564j11492
$$ 90956 83931 -34054 -83176 1723 99289 64103 -56972 -79826 18651 94854 34290 -77202
418g7202N871J07020N8470p3462r8047L0092J09034L4800r4553r0476M8784J03685
$$ -77202 -71331 35689 94159 20697 -77350 -47258 61776 96576 2023 -88453 -39669 64016
430F4016O049j06275o5636P4979R6998j6118j05872m1313Q9216Q3110l6492j04823
$$ 64016 70065 -36210 -101846 -26867 70131 54013 -51859 -93172 -3956 79154 42662 -62161
442f2161k0061R9767O5432o0526j04215L870J07034M3592p8338q9968L0233J06947
$$ -62161 -82222 17545 82977 22451 -81764 -77894 29140 72732 -5606 -95574 -65341 41606
454D1606K1315q6996o9176N3866J06095K026r5613n6529O6327R2159k6671j01892
$$ 41606 62921 -24075 -93251 -39385 66710 68736 -26877 -83406 -17079 75080 48409 -53483
466e3483l4293Q5960Q0068m7116r6586r814R4541O3303o1235q4876J3662R9649
$$ -53483 -87776 -1816 78252 31136 -65450 -75264 19277 82580 21345 -63531 -49869 49780
478D9780M2512q0360q0506L0301R9175J9350r1926o2110N1516R2343n364r7924
$$ 49780 92292 11932 -68574 -38273 60902 80252 -11674 -73784 -22268 70075 64711 -33213
490c3213m0991P0658Q6669k0442r5601k2629P8167O8213m7228r7501k295Q8577
$$ -33213 -74204 -3546 83123 62681 -32920 -55549 22618 90831 43603 -53898 -56193 32384
502C2384N3102o4775q9448J8306Q9414L2530p4115p0496M3274R1714J4081q6230
$$ 32384 85486 20711 -68737 -50431 38983 71513 -2602 -73098 -29824 61890 75971 -10259
514a0259o1451N4065Q2236p853r1524m0771P1655P0368l0819r4394k0679Q3350
$$ -10259 -71710 -17645 64591 56738 -34786 -75557 -3902 66466 35647 -58747 -79426 3924
526C924O0538m1850q3035J964Q7627M0529o1608q0298K0335R1576K3937p2902
$$ 3924 64462 22612 -60423 -58459 29168 69697 8089 -72209 -51874 39702 63639 -9263
538i263o8746L6147Q4848N13q0007m7912N9666Q4200j2915q2192l4558O6570O7916
$$ -9263 -78009 -41862 42986 43499 -36508 -84420 -24754 59446 46531 -35661 -70219 -3649 64267
551F4267l4050q1157j4533P9311N4838n3589q0078K292Q2863L9961o1257o4376
$$ 64267 30217 -50940 -65473 13838 68676 15087 -64991 -62699 20164 60125 -1132 -65508
563f5508K5549Q4572J9502p4843n6306L9782Q3062M360p9513m0859N1071O9762
$$ -65508 -39959 44613 64115 -10728 -67034 -27252 55810 60170 -19343 -60202 -9131 60631
575F0631k0870q4866k1996O8059O5914l0356p8038n327P0716M7757n0134p3309
$$ 60631 39761 -45105 -67101 958 66872 36516 -41522 -46849 23867 71624 21490 -51819
587e1819J4236P7449L3546o3221o7516K7032P3665J5182o9180m8781M7078P1782
$$ -51819 -37583 39866 73412 10191 -57325 -30293 43372 58554 -10626 -59407 -12329 59453
599E9453k887p7598l7976N7176O4762j5257p5053j9091O5853M8643l9208p8580
$$ 59453 56566 -21032 -59008 -1832 62930 47673 -27380 -46471 19382 68025 28817 -49763
611d9763m693P3638M0685m4856o5752J4834P3422K1061n9463n9143L1362P5399
$$ -49763 -54456 19182 59867 15011 -50741 -35907 37515 58576 -887 -60030 -28668 46731
623D6731P558o6051m8426M1242O5870j1054o9185k9740N7995N9843k6230p1524
$$ 46731 54289 -11762 -60188 -18946 46924 35870 -33315 -63055 -5060 54783 28553 -42971
635d2971j8825O3434M8514l6945o1920K683P0704L3304n5092o2856J2590P0179
$$ -42971 -61796 1638 50152 13207 -48713 -46030 24674 57978 2886 -59970 -47380 22799
647B2799K0839n7435m6352L1699O8884J954o7196l6881M3276O5710j0083o7247
$$ 22799 43638 -13797 -60149 -28450 40434 42388 -24808 -61689 -18413 47297 37214 -30033
659c0033k3315N0688N3089k7859o7080n825O2600M5558l9758o4365M716O1115
$$ -30033 -53348 -2660 50429 22570 -44510 -50335 12265 57823 18065 -46300 -41584 19531
671A9531K9830m9196n1674K5969O6543J7015o0322m7958L1852N8823J777o2267
$$ 19531 49361 165 -51509 -25540 41003 58018 -2304 -50262 -18410 40413 42190 -20077
683b0077k9961M7751N4989j3706o6919k0026N4819M6813k4405o2798m632N9080
$$ -20077 -50038 -2287 52702 38996 -27923 -47949 6870 53683 29278 -33520 -38152 20928
695B0928L2533l9943n9486J1797O5007K4483m6752n2524K1282N8743N736n5138
$$ 20928 53461 13518 -45968 -34171 30836 55319 8567 -43957 -22675 36068 41804 -13334
707a3334l9765L9462O1172l705n8363l1685M3305M9201j9690n8423j4840N5637
$$ -13334 -53099 -13637 47535 43830 -14533 -46218 -2913 46288 26598 -31825 -46665 8972
719H972M3199l1398n8215l924N8188L1353m0018m9910J0873N9383J6452n1719
$$ 8972 52171 20773 -37442 -41366 16822 48175 8157 -41753 -30880 28503 44955 -6764
731f764m4452K3882O1347Q050n3030l3017L2748N2475j1958n9440k1625M4894
$$ -6764 -51216 -27334 34013 42063 -10967 -43984 -11236 41239 29281 -30159 -51784 -6890
743f890N0938j9021n6270r845M7688L7095l4121n3710M328N5270K9585m2190m8738
$$ -6890 44048 25027 -31243 -41088 6600 43695 9574 -44136 -39808 15462 45047 2857 -45881
756d5881J5139N3875J6543m8571l8116K8484N2100K086n6736l0822L6930M9620
$$ -45881 -30742 23133 39676 -8895 -47011 -18527 33573 35659 -21077 -51899 -14969 34651
768C4651o178n3204j5383M5584L9259k2771n7942n915N0857L3771k8424n0012
$$ 34651 28473 -24731 -40114 5470 44729 21958 -35984 -41899 8958 42729 14305 -35707
780c5707P717N2283J9486m0640m5874J9919N3962J1108m5149l7084K9396M9192
$$ -35707 -27990 24293 43779 3139 -42735 -22816 31146 42254 -2895 -39979 -10583 38609
792C8609j932m8531k5519M0172M4592j5397n2571j8518M4498L6529k2853m6720
$$ 38609 36677 -11854 -37373 2799 47391 31994 -20577 -39095 5403 41932 19079 -27641
804b7641j549N1683K7161l5408m7576N458N1485J7093l9768l7272J8901N0670
$$ -27641 -29190 22493 49654 14246 -33330 -27872 23613 40706 938 -36334 -17433 33237
816C3237L760m7926l1510K7964M8454n424m8477k1133L5349M1648j7462m8214
$$ 33237 36997 -10929 -42439 -14475 33979 28555 -19922 -41055 -5706 35942 18480 -29734
828b9734q575M3300L5675k7719m8085j494M3545K4517l5376l9702J3940M8921
$$ -29734 -38309 4991 40666 12947 -35138 -36632 6913 31430 -3946 -43648 -29708 19213
840A9213J6757m2546l5823K0342M5128M984m5210k4763L1255M2736o256m9406
$$ 19213 35970 -6576 -42399 -22057 23071 28055 -17155 -41918 -10663 32073 25817 -23589
852b3589j6808L7428L6955j5080m7284n532M1682K9010k5403m4539O349M6840
$$ -23589 -40397 -2969 33986 18906 -28378 -33910 7772 36782 11379 -33160 -26811 20029
864B0029K1737l2265m0454J3767M3383Q637l9893l2340K6200M4699J299m2051
$$ 20029 41766 9501 -30953 -17186 26197 34834 -5059 -37399 -11199 33500 34799 -7252
876g252k5303L1655L7883j0067m3921j4435L9962L2497j9670m3947o001M2655
$$ -7252 -32555 -900 36983 26916 -17005 -31440 8522 41019 21349 -22598 -28599 14056
888A4056K4196k7372l9774M990M4382J4232l5102l5072J5530M5903O998l7835
$$ 14056 38252 10880 -28894 -23904 20478 34710 -392 -35464 -19934 25969 32967 -4868
900d868k7442K2560M0626o605m2664k0306L1183L8594j3163m1296j0139L5750
$$ -4868 -32310 -9750 30876 24271 -18393 -38699 -7516 31078 17915 -23381 -33520 2230
912B230L0572k3464l9711j79M0692K3865l0707l6377Q462M1241J4208l5879k9886
$$ 2230 32802 9338 -30373 -30552 10140 34005 3298 -33079 -24617 16624 30832 -5047 -34933
925c4933J7824M0511M193m1146k3631K5355L8448k896m0604j3608L1701L2438
$$ -34933 -17109 23402 27595 -13551 -37182 -11827 26621 23725 -16879 -30487 1214 33652
937C3652j4499m3746n991L5667K6750k0781l9144M115L8302J8441k9009l5796
$$ 33652 19153 -24593 -30584 5083 31833 11052 -28092 -23977 14325 32766 3757 -32039
949c2039J2975L9402J0803l3786k9780K0505L7226J574l7341k1923K8149L3666
$$ -32039 -19064 20338 31141 -2645 -32425 -11920 25306 26880 -10461 -32384 -4235 29431
961B9431p496l9941j4884L3385K8449j4814l4894m801L6070K2982k3448l6288
$$ 29431 21935 -18006 -32890 495 28944 14130 -20764 -25565 10505 33487 10039 -26249
973b6249K547L9175J4168k8114l0950J2386L9218O018l3032k5746K0120L7549
$$ -26249 -23702 15473 29641 1527 -29423 -17037 22181 28199 -4833 -30579 -10459 27090
985B7090j994l5115j8768K6399L3646j1053l6070j0443L2217K8465j9118l5362
$$ 27090 25096 -10019 -28787 -2388 31258 20205 -15865 -26308 5909 34374 15256 -20106
997b0106l155L4225K1006k5236l1402O555L7159J3889l0975k7462J2973L5657
$$ -20106 -23261 10964 31970 6734 -24668 -18113 19046 32935 1960 -25502 -12529 23128
1009B3128M952l5022k1004K0661L3571l398l6999j4239K5729K9951j0831l7245
$$ 23128 28080 -6942 -27946 -7285 26286 22888 -14111 -28350 -2621 27330 16499 -20746
1021b0746o195L0178K4334j9177l5311K339L3344J7840k4918l1906R336L3149
$$ -20746 -26941 3237 27571 8394 -26917 -24578 8766 26606 1688 -30218 -20882 12267
1033A2267R937k9939k6458J7365L3371L526l3145k0046K3309L0074m775l4608
$$ 12267 22204 -7735 -34193 -16828 16543 20069 -13076 -33122 -9813 20261 15486 -19122
1045a9122j2801K8793K5800j1773l4123n072L2021K1036j8541l1536K127L5077
$$ -19122 -31923 -3130 22670 10897 -23226 -28298 3723 24759 6218 -25318 -23191 11886
1057A1886J3130k2856k9488J1665L3370Q784k9694k1086J4195L6043m133k7447
$$ 11886 25016 2160 -27328 -15663 17707 26491 -3203 -24289 -10094 25949 21816 -5631
1069e631k0447K5096K8922p519l0287j3164L0821K2215j2538l2538l805L2395
$$ -5631 -26078 -982 27940 20421 -9866 -23030 7791 30006 17468 -15070 -18875 13520
1081A3520J6865j8781l0022L031L4519R658k4393k4560Q445L4906L756l1028j7251
$$ 13520 30385 11604 -18418 -15387 19132 28790 4397 -20163 -11718 23188 26944 -4084 -21335
1094b1335J4248L0869K78l4655j3319K4109K4704r484l0091q470K4474K5429j6709
$$ -21335 -7087 23782 24060 -10595 -23914 195 24899 15415 -14676 -23146 1328 26757 10048
1107A0048l3226K689K9110J4618k1007k6331O273K8114J1925k4956k5551J3172
$$ 10048 -23178 -20489 8621 23239 2232 -24099 -17826 10288 22213 -2743 -28294 -15122
1119a5122L1484M028l0942j9134K2170K6929m599l1587j0006K5774K2026j1209
$$ -15122 16362 20390 -10552 -29686 -7516 19413 14814 -16773 -26779 -1005 21021 9812
1131I812k9720l383K7620J7030j6171k7173K811K8981J1191k0758k4401R399K9962
$$ 9812 -19908 -23291 4329 21359 5188 -21985 -19174 9807 20998 240 -24161 -14762 15200
1144A5200N227k4766k0762J5754K9526j127k8590j6506K1360K7822o257k9283
$$ 15200 20427 -4339 -25101 -9347 20179 19052 -9538 -26044 -4684 23138 16881 -12402
1156a2402j1851K3743K3326j1299k6769n039K6214J7666j8482k4827K806K9441
$$ -12402 -24253 -510 22816 11517 -15252 -20291 5923 23589 5107 -19720 -16914 12527
1168A2527J1746k3235k3125P388K9706O544k5002j7634J3229K7623j361k8417
$$ 12527 24273 1038 -22087 -14699 15007 21551 -3451 -21085 -7856 19767 18406 -10011
1180a0011j2836J8837K5899o302k7729p013K2692K1434j3736k8114j164K4666
$$ -10011 -22847 -4010 21889 15587 -12142 -19155 3537 24971 11235 -16879 -18043 6623
1192F623J6648j7930k4750O021K7146J1687k2330k2025J0510K5438M508k6209
$$ 6623 23271 5341 -19409 -13388 13758 25445 3115 -18910 -8400 17038 21546 -4663
1204d663j7253J6619K4576n70k7143j2077K0896K1780o622k7806n770K4405J7568
$$ -4663 -21916 -5297 19279 18709 -8434 -20511 385 22165 15543 -12263 -18033 6372 23940
1217B3940j3282k6920j56K5932J2268j7388k4258N936K5961O976k1810k1320J1637
$$ 23940 10658 -16262 -16418 9514 21782 4394 -19864 -13928 12033 19009 -2801 -24121 -12484
1230a2484K6109J627k3656j6575J6961K3888m543k5097j1344K1585K1055r742
$$ -12484 13625 15252 -8404 -24979 -8018 15870 11327 -13770 -25114 -3529 17526 7784
1242G784k5078n496K3831J6298j5186k3379M99K6208J1599j9229k1002O062K6442
$$ 7784 -17294 -22790 1041 17339 2153 -21226 -20727 5481 17080 -2149 -23151 -17089 9353
1255I353O308k1787j6810J1905K5612L46k4654j2976J6098K3609m699k4789p208
$$ 9353 15661 -6126 -22936 -11031 14581 14927 -9727 -22703 -6605 17004 12305 -12484 -19692
1268a9692J9970K0404j0567k4478j979K2663J7067j4965k2650L179K3456J0957
$$ -19692 278 20682 10115 -14363 -16342 6321 23388 8423 -14227 -11048 12408 23365
1280B3365j9625k0237Q086K3471N838k2683j6685J3076K2010K09k3481j0716J8258
$$ 23365 3740 -16497 -8411 15060 20898 -1785 -18470 -5394 16616 16825 -6656 -17372 886
1293H86K0299m721k5121o039K0297J6568j0216k4590j367K2132J2050j5152k3279
$$ 886 21185 16464 -8657 -14696 5601 22169 11953 -12637 -14004 8128 20178 5026 -18253
1306a8253M268K3723Q311j7535j8639J0393K2886K770k1132j5916J3799K1023
$$ -18253 -13985 9738 18049 514 -18125 -7732 15154 17924 -3208 -19124 -5325 15698
1318A5698k718k2608j2013J7573J9019o838k1538n779K1934J5741j1709k1897
$$ 15698 12980 -9628 -21641 -4068 14951 8113 -13425 -19204 2730 18471 6762 -15135
1330a5135j816K2046J0486j5637j9312M518K4053P044j8792j6754Q389K2433J068
$$ -15135 -16951 5095 15581 -56 -19368 -14850 9203 16247 -2545 -19299 -10910 11523 12591
1343A2591k0711j2570J3648K2128k900k1759q002J6510J8746q943k2381l980J8909
$$ 12591 -8120 -20690 -7042 15086 12186 -9573 -17575 -1065 17681 8738 -13643 -17623 1286
1356A286J5569j2358k0078J940K0907J1582j6680j8818N775K1355O779j8690j4216
$$ 1286 16855 4497 -15581 -13641 7266 18848 2168 -16650 -10875 10480 17259 -1431 -15647
1369a5647J0853K0628R24k2608j1811J3821J8844k379k1169n787J7622J5725r058
$$ -15647 -4794 15834 16758 -5850 -17661 -3840 15004 12625 -8544 -14331 3291 19016 9958
1382I958k2011j874J9959J3200j1482k0130K773J9481P463j6273j8087Q516K1344
$$ 9958 -12053 -13927 6032 19232 7750 -12380 -9607 9874 17337 1064 -17023 -8507 12837
1395A2837M079j7824j5223J0955J8928r04j8796r555J6496J7034o163k1392p621
$$ 12837 16916 -908 -16131 -5176 13752 12848 -5948 -15503 993 18027 11864 -9528 -17149
1408a7149J8280J4481r157j8856j646J9408J0135j3438j7587L278K1703O326j6388
$$ -17149 1131 15612 6455 -12401 -14047 5361 15496 2058 -15529 -12251 9452 15778 -610
1421f10j5927O370K0880K311j7618j2264J0749J8646l332j9503p785J5140J8230
$$ -610 -16537 -10167 10713 13024 -4594 -16858 -6109 12537 9205 -10298 -18083 -2943 15287
1434A5287p011j9678n122J6888J5357r894j7530l83J7220R500j5190j6405N334
$$ 15287 8276 -11402 -16524 364 15721 5827 -11703 -12086 5134 14634 -556 -16961 -11627
1447a1627K0238P573j7525j4797P808J9039L307j7829j0707J1477J6737k387j9391
$$ -11627 8611 16184 -1341 -16138 -8330 10709 14016 -3813 -14520 -3043 13694 11307 -8084
1460h084n767J5113J4918o732k0913k486J7342J3332r759j9468J154J7759R415
$$ -8084 -13851 1262 16180 9448 -11465 -13951 3391 16723 6964 -12504 -11350 6409 15824
1473A5824j2213j5661O217J7374L009j6509j3632J0688J8156N10j8428j1084J3381
$$ 15824 3611 -12050 -5833 11541 14550 -1959 -15591 -4903 13253 13763 -4665 -15749 -2368
1486b368J6745k862j8241p759J5151J3469o548j6817k457J7078Q970j1086j6322
$$ -2368 14377 11515 -6726 -14485 666 14135 7587 -9230 -11687 5391 14361 3275 -13047
1499a3047K570J8861O088j4998j5525N511J9882M144j5183j2780Q438J8129p45
$$ -13047 -10477 8384 14472 -526 -16051 -10540 9342 13486 -1697 -14477 -6039 12090 11345
1512A1345j6683q896J1365J4904n361j6138l676J5038J2465r827j6923n62J7504
$$ 11345 -5338 -14234 -2869 12035 6674 -9464 -13140 1898 14363 4536 -12387 -12949 4555
1525D555J0690j3004j6076K627J7977P952j4682j3700N762J6835L279j5902j0249
$$ 4555 15245 2241 -13835 -11208 6769 14721 39 -13661 -7899 8936 12215 -3687 -13936
1538a3936Q681J5150j158j5955n525J2703J3717n929j7831k729J5042J1519r157
$$ -13936 -5255 9895 8737 -7218 -12743 -40 13677 7748 -10083 -12812 2230 13749 4592
1551D592j7669J513J6744R607j1646j6396M171J5974O485j3248j3710O807J5828
$$ 4592 -13077 -11564 5180 14787 3141 -13255 -9084 6890 13375 127 -13583 -6776 9052
1564I052K019j4308r163J0598J3468k289j5593n934J3388J1095o262j6173j323
$$ 9052 11071 -3237 -12400 -1802 11666 9377 -6216 -12150 1238 12333 6071 -10102 -11425
1577a1425J6526R745r361j6175P46J7316P004j2457j4734M431J7341M512j3082
$$ -11425 5101 14846 5485 -10690 -9944 7372 14376 1919 -12815 -8384 8957 13469 387
1590C87j2464O941J6330K78j4035r342R190J3884l135j4394m760J2451J1952p429
$$ 387 -12077 -5136 11194 11472 -2563 -11905 -2715 11169 8034 -6360 -11120 1331 13283 5854
1604E854j3744j541J4190P967j1099j3223K511J6111O470j3716j2083N544J5937
$$ 5854 -7890 -9431 4759 12726 1627 -11596 -9085 7026 13496 -220 -12303 -6759 9178
1617I178K759j6065j0589Q372J6197J6j5904p119J0616J4254k870j6123m969J1502
$$ 9178 11937 -4128 -14717 -6345 9852 9868 -6036 -13155 -2539 11715 8845 -7278 -12247 -745
1631g45J1564o210j5184p78J3283R091q450j3122L114J2979M823j1390j1163O212
$$ -745 10819 4609 -10575 -11353 1930 11021 2571 -10551 -7437 5542 10365 -1025 -12188 -5976
1645e976J3302J909j2666q414R806J2465k100j5304n871J2345J1119n127j5353
$$ -5976 7326 9235 -3431 -11845 -2039 10426 8326 -6978 -12849 -504 10615 5488 -9865
1658i865j873J4964R667p220j5086K66J5296O561j0631j4541K980J6023M604j1416
$$ -9865 -11738 3226 12893 5673 -9413 -9147 6149 12710 2079 -12462 -9482 6541 11145 -271
1672b71j1760O806J4990R63j3065r608Q412J3672j932j2590n796J0127J1827n039
$$ -271 -12031 -5225 9765 10728 -2337 -11945 -3533 10139 8207 -4383 -10179 -52 11775 6736
1686F736j3065l226J1405Q453q135j1441M59J3440O215r638r624M452J2942J987
$$ 6736 -6329 -9555 1850 10303 2168 -9273 -8814 4626 10841 1203 -8421 -3969 8973 10960
1700A0960j2519q532O498J2761j067j3448n295J0052J2516m466j4088l090J1549
$$ 10960 -1559 -10091 -3593 9168 8101 -5347 -10642 -590 11926 7460 -6628 -9718 1831
1713A831J0236p249j3540K40J3097Q803r195j3243K055J3392N358j2309j2502
$$ 1831 12067 4818 -8722 -8482 4615 13418 4223 -9020 -6965 6427 11785 -524 -13026
1726a3026N587J3910L557j2499q828Q083J3237K61j3724p927R078J0827k582j3360
$$ -13026 -7439 6471 10028 -2471 -11299 -3216 10021 10282 -3442 -11369 -2291 8536 5954 -7406
1740g406m895J1480J0071m783j3138j614J2032O788p276j1737J748J2813M439
$$ -7406 -12301 -821 9250 4467 -8671 -10285 1747 8535 1259 -10478 -8730 4083 8522
1753H522q092j0052M635J1682J359j0985q581O598J1018j276j0644m908J0048
$$ 8522 430 -9622 -4987 6695 8054 -2931 -11512 -4914 6104 4828 -5816 -10724 -676
1766f76J0116m140j0664k321J0246P269p242j0661K11J2397N392q996r428L655
$$ -676 9440 5300 -5364 -7685 2561 9830 2588 -8073 -7862 4535 9927 931 -8497 -4842
1780d842J2608J994j1461p651O085J2364l29j1377m847Q659J1591l442j3026l917
$$ -4842 7766 9760 -1701 -9352 -3267 9097 8768 -2609 -7456 1203 12794 9352 -3674 -7591
1794g591R207R656o422j3258j8J2211Q371q177j1014K235J1697N180j0629j0758
$$ -7591 1616 11272 4850 -8408 -8426 3785 12156 3979 -7035 -4800 6897 12077 1448 -9310
1808i310M136J1787L051j1404q903O996J1753K14j3135o953Q910J0345k295j2638
$$ -9310 -5174 6613 9664 -1740 -10643 -3647 8106 8320 -4815 -11768 -2858 7487 5192 -7446
1822g446l162J1056R083m314j2495j858J0571O578o945j2717J474J2175N399q150
$$ -7446 -10608 448 9531 5217 -7278 -9136 1435 8013 1068 -11649 -10175 2000 7399 -751
1836g51r743M419J2119J957r519q546N875J0609j34r976o540Q635R944k567j0899
$$ -751 -10494 -6075 6044 8001 -1518 -10064 -4189 6420 6286 -3690 -10230 -1595 8349 5782 -5117
1851e117m070R471P895n673r428p27J0978O192o545q166J044J0482L328q880q466
$$ -5117 -9187 284 8179 2506 -6922 -7649 3329 9521 2976 -5190 -4146 6336 9664 784 -7682
1866g682L340J0316J008r343n342O361J0348j550j0227l660P408Q023m218r861
$$ -7682 -4342 5974 6982 -2361 -7703 -1342 9006 7456 -2771 -6431 977 9000 4782 -5079
1880e079j088Q600O806n838r407R09R291M408r069q394L724R680K491q934n782
$$ -5079 -6167 2433 9239 3401 -6006 -5097 4194 8602 -467 -8861 -5137 4543 7034 -1900 -7682
1895g682O048R106k2j0535n037O693Q077k738j0948k253R266P350m421j0393P19
$$ -7682 -1634 7472 7450 -3085 -8122 -1429 6648 3910 -7038 -9291 -25 7325 2904 -7489 -6770
1910f770R698M797o859r766K702J0018L549p575q456N080J0131R80r975p492O952
$$ -6770 2928 7725 866 -8900 -6198 3820 7369 -206 -8662 -3582 6549 7529 -2446 -9938 -2986
1925b986R333j290r851m049R264Q526l496r898k645R711O230n942j0247o90J1513
$$ -2986 6347 5057 -4794 -8843 421 8947 5451 -4447 -7092 2619 8849 2907 -7340 -8030 3483
1940C483N201p314q837K546J1397K420r309p739M030J0928M62r398n810O308J0729
$$ 3483 8684 1370 -7467 -4921 6476 8896 -413 -8152 -4122 6806 7268 -2130 -7940 -1632 9097
1955I097j847j0599m934P832Q677m544j0443j599R836P816o187r296N80R629N157
$$ 9097 7250 -3349 -8283 -451 8226 3682 -6761 -8360 1476 9292 3105 -6191 -5611 4018 9175
1970I175q122r054J956J0323L594q983p695N210J0248J307j0826n777O355Q858
$$ 9175 1053 -8001 -6045 4278 7872 -1111 -8806 -3596 6652 7959 -2867 -8644 -2289 6569
1984F569j231j0200l473Q100Q192k702j0643j766Q683O492n622j0426J192R963
$$ 6569 5338 -4862 -8335 -235 7957 5255 -5388 -7154 1529 8021 2399 -8027 -6835 3128
1998C128M757o896q758L660R437K288q215p642M805Q622Q53r097n684P109Q733
$$ 3128 7885 989 -7769 -4109 5328 7616 -599 -8241 -3436 5186 6039 -3058 -8742 -1633 7100
2013G100j413r441l927Q129O726m048r249j548R325N613m980q428L83R529L729
$$ 7100 5687 -3754 -7681 448 7174 3126 -6123 -7671 1654 7267 2287 -6141 -5758 3771 7500
2028G500o964p985K106R969J535p834n968M739R381p17q241m392N524P786k330
$$ 7500 536 -7449 -5343 4626 6161 -1673 -7641 -2902 6479 5762 -2479 -6871 -1347 6439 4109
2043D109q434k896P407P435l918q513p99Q382N157o508p479R92Q331L405o963
$$ 4109 -4325 -7221 186 7621 3703 -4810 -5609 2773 7930 1422 -6057 -5065 3266 6671 -292
2058b92n834L210Q184J582p915n263M500P800l04q924l162O231O854k236q730
$$ -292 -6126 -2916 5268 6850 -1065 -6328 -1828 5972 5668 -3256 -6418 -187 6667 4431 -4299
2073d299r73O494N294l905q441L98P483M421n149p292K481P813K422o820o479
$$ -4299 -5272 1222 6516 2611 -5830 -5432 2051 6472 1323 -5969 -3488 4325 6747 -73 -6552
2088f552L610P455L14p327m583N667O711r29p546l163O575N813k809p824j336
$$ -6552 -2942 4513 4827 -2500 -7083 -1416 5295 4366 -3180 -6343 232 6045 3236 -4588 -5924
2103e924P832M446m419p145M66P999K575n795o485K289P772J171n929n178M160
$$ -5924 1908 6354 1935 -5210 -4744 3255 5830 35 -6450 -4161 3611 4782 -1147 -6325 -2165
2118b165P854m11p157m057N429O791k798p294k097O385N410l846o841m07O782
$$ -2165 5689 5278 -1879 -5936 -507 6284 3486 -3808 -5905 480 5890 2044 -4797 -5204 1578
2133A578M338m996o161J247P224K965o423n344L029P193M80p217l887M043O390
$$ 1578 5916 920 -5241 -3994 3230 6195 -228 -5572 -2543 4650 5130 -2087 -5974 -1931 4459
2148D459q59p415k239N579O112k212p603n79O263M667m059p303R84O416L400n581
$$ 4459 3600 -3815 -6054 -475 5637 3425 -4178 -4757 1506 6173 2114 -5189 -4205 2211 5611 30
2164C0o139K432O892J998o193n194M053O840N10o949l850N358N874j102p434k332
$$ 30 -6109 -3677 3215 5213 -980 -6174 -2121 4719 5229 -1720 -5570 -212 5662 4560 -2874 -5206
2180e206O284M538k948p150p49P056L917l911o360J021P409K328n016n999K410
$$ -5206 1078 5616 2668 -4482 -5231 1825 5742 1831 -4529 -3508 3901 6229 1213 -4786 -2376
2195b376P330N00o252m906M057O740j085o457l161N195O064k150o551j991O283
$$ -2376 4954 5454 -798 -5704 -1647 5093 4008 -2449 -5610 -415 5649 3499 -3052 -5043 1240
2210A240N296m197o336l57O814L173n536n606J239O828K161o161m601K674P056
$$ 1240 6536 2339 -3997 -4354 2460 5633 97 -5509 -4270 2558 4719 -1442 -6043 -3369 3687
2225C687R39o823l450M056O766j249p271k318N136N441k918p221n70N889M752
$$ 3687 4626 -2197 -5647 -1591 5175 3926 -3345 -5663 -527 4914 1996 -5225 -5795 94 4846
2240D846l814o630Q23O656L795n345n906K426O669J796o440m730L698O000L96
$$ 4846 1032 -5598 -4775 1881 5676 331 -5575 -3149 3520 5316 -1124 -5854 -2156 3844 4240
2255D240o689l749N175N697j136o641k116O077N159k573p036o05O619L499m090
$$ 4240 -2449 -6198 -1023 4674 3538 -3103 -5219 858 6017 3444 -3592 -4197 2422 5921 1831
2270A831o635Q13P119J977m969n412K745O972R28n598m951M460O550j159o434
$$ 1831 -4804 -3991 3128 5105 136 -5276 -2531 4441 5369 -229 -5180 -720 5830 4671 -1763
2285a763l126N098N838k711o482k067O211M543l913n710n63O816L708m730n330
$$ -1763 -4889 209 6047 3336 -3146 -5213 998 5541 1628 -4082 -4645 2171 5879 1149 -4181
2300d181R47P238J803o264m935K561O757J20o381l285L552O613r32o622k357M921
$$ -4181 -3234 4004 5807 -457 -5392 -2831 3926 4046 -2335 -5620 -2068 4545 3613 -3009 -5366 -445
2316d45O115k918o745p99N695M782m412o361R18N793L553n382n830K325O237K083
$$ -445 5670 2752 -3993 -4792 903 5685 1273 -5088 -4170 1623 5176 -206 -6036 -3711 2526 4609
2332D609n967m402L546O457N69o657l620M606N307j040p275j988N829M536k060
$$ 4609 -1358 -5760 -2214 4243 4812 -1845 -5465 -859 4448 3408 -3867 -5855 -26 4510 2450
2347B450o613n44O188L726l516o572J005O670K522m623n611K131O616J144n789
$$ 2450 -4163 -4707 1481 5207 1691 -4881 -3876 2794 5316 693 -4918 -2787 3829 4973 -816
2362h16m649L510O166m51n713l711N053N996j719n906k494O013M590l228o287
$$ -816 -5465 -1955 4211 3760 -1953 -5664 -611 5385 3666 -2240 -4734 1279 5869 2641 -3646
2377c646r40O329L650m525n135P41O744J910m601n175J866O684O28n653l635L255
$$ -3646 -4586 1743 5393 868 -4267 -3526 3218 5128 527 -4648 -2782 3902 4530 -1123 -4758 -1503
2393a503O559m46o608k810M335N529k397o218j526N308N000l245n872J54N731
$$ -1503 5056 4610 -1998 -4808 -473 5056 2659 -3559 -5085 223 5223 1978 -3894 -3740 1991
2408A991L555m653n742J236O330K086n561m740L096O265O24o069l553L908N327
$$ 1991 5546 893 -4849 -3613 2717 4803 -758 -5498 -2402 3863 4487 -1582 -5135 -1227 4100
2423D100n54o596k421N366M831j931o481q14N870L881l326o824O11O222K579l935
$$ 4100 3546 -3050 -5471 -105 4726 2795 -3686 -4500 1370 5251 1925 -4899 -4288 1934 4513 578
2439E78o199K963O069J571n416m967L314N886o4n843l526M909N385j403n616k399
$$ 578 -5621 -2658 3411 4982 -434 -5401 -2087 3799 3735 -2108 -5634 -725 4660 3257 -2359 -4758
2455d758N524M384l042n845j215O144L741l917n073O01O609K181m954m927J644
$$ -4758 766 5150 2108 -3737 -4952 1192 4933 1016 -4057 -3456 3153 5334 380 -4547 -2903
2470b903O359Q39n606l731L207O414m42n700l019L950N656k401n737j856N189
$$ -2903 3456 4295 -1311 -5042 -1835 4579 4137 -1563 -4582 -632 5024 2623 -3114 -4970 219
2485B19M960l088n663J08N504L589m479n338N69N820K403n097m200K272O153R97
$$ 219 5179 2091 -3572 -3464 2040 5629 1150 -4188 -3619 2201 4604 -493 -4693 -2421 3732 4729
2501D729n906l322L233N254ko501k349M556N027j484o346r86N183L645k804o448
$$ 4729 -1177 -4499 -1266 3988 3986 -2515 -4864 -308 4719 3235 -3111 -4097 1086 4731 1927 -4521
2517d521K90N459L113l793n332K025N768J778m891m771K513N572L17n558l680
$$ -4521 -4231 1228 4341 548 -4784 -2759 3009 4787 -104 -4875 -2362 3210 3527 -2031 -5711
2532e711M040N447q52n293k432M735M412k356n658j166N530L739l151n186L88
$$ -5711 -1671 3776 2924 -2369 -4801 -66 4346 1990 -3668 -4834 696 4435 1284 -3902 -3514
2547c514O014K183m247n014J272O025J241n029l626K687O317j91n180k814L710
$$ -3514 2500 4683 436 -4578 -3306 2719 3960 -1069 -4695 -2008 4309 4118 -1062 -3876 -166
2562a66M964j595n670j905M404M866k545n276p96N419L813m059n021O72N412K487
$$ -166 4798 3203 -2467 -4372 32 4898 2353 -2923 -3719 1700 5513 1454 -3567 -2895 2517 5004
2578E004m719l945J845N595J457n710l470K479N221j99n912k488M243M728j017
$$ 5004 285 -3660 -1815 3780 5237 -473 -3943 -1464 3757 3558 -2354 -4842 -599 4129 3112
2593C112n899q55M771L857k967n801J08M752K870l431n422J544N430J671l879
$$ 3112 -2787 -3642 1129 4986 2019 -3782 -3674 1078 3948 517 -4905 -3361 2069 3740 -139
2608a39n059K676N121O28m907l691M132M711m51n101k578M274M319j946n650j365
$$ -139 -5198 -2522 2599 3227 -1680 -5371 -1239 3472 3021 -2080 -4658 -384 3935 1989 -3661 -5026
2624e026N004L521k582n021M82N940K389l669m951J188N461J068m418m211K766
$$ -5026 -22 3499 917 -4104 -3622 2318 4707 1038 -3913 -2725 2736 3804 -614 -4825 -2059
2639b059N720J07m663l275L280N262j473m984k068M352M589k210m851o10M751
$$ -2059 3661 3768 -895 -4170 -890 4372 2899 -2085 -4153 199 4788 2578 -2273 -2883 1868
2654A868L391l667m483m09M666L000m357l921J708N090J762m936l287K326N086
$$ 1868 5259 1592 -2891 -3300 1366 4366 9 -3912 -2204 2886 4648 -288 -3575 -1249 3837
2669C837M1n770k399L499M547r08n276j652M421L634k281n477l04M766L496l242
$$ 3837 3878 -1892 -4291 -792 3755 2847 -2429 -4081 340 3974 1693 -3784 -4088 678 4174 932
2685I32m939J367M732K410m062m839K028M725Q94m856l496L497M697L50n111k585
$$ 932 -4007 -2640 2092 4502 440 -4399 -2371 2354 3248 -1608 -5104 -1607 3090 3440 -1671 -4256
2701d256M320L981j504n123j505M539L186j924m929%M780K592l096m845R69N043
$$ -4256 64 4045 2541 -2582 -4087 452 3638 1714 -3215 -3215 1565 4157 1061 -3784 -2815 2228
2717B228J505l869l860J970N759J70m272l426L010M522p22m902k244L432M307
$$ 2228 3733 -136 -3996 -2026 3733 3903 -369 -3795 -785 3737 3015 -1887 -4131 -699 3608
2732C608j870m213j263M583L590k912m350l48M522K696l743m156J122M990J496
$$ 3608 1738 -2475 -3738 845 4435 1523 -2827 -3175 1347 4043 300 -3856 -2734 2256 3752
2747C752m320l330J735M937J5m802k476K993M965m80n099j386L559M050j927n327
$$ 3752 -568 -3898 -2163 2774 2789 -2013 -4489 -1496 3469 2989 -2110 -3496 63 4113 2186 -3141
2763c141l60L846L381k934m726R37M575K514l431m247J596M380J435m513l266
$$ -3141 -3501 345 3726 792 -3934 -2997 1578 4092 661 -3586 -1990 2390 3825 -688 -3954
2778c954K900M325J98m302k850L496L799r21m894j668M532L072j637m743j28M500
$$ -3954 -1054 3271 3469 -833 -3683 -187 3612 2691 -2203 -3871 661 3733 2096 -2647 -2775 1725
2794A725K489k745m559N10M793J398l455l980J689M955O39l693l475K703M227
$$ 1725 4214 1469 -3090 -2580 2213 3611 156 -3824 -2135 2820 3459 -234 -3709 -1006 3221
2809C221m23m395k496L560M114j526m011j368L745L262k370m372m03M520K561
$$ 3221 2798 -1597 -4093 -533 3581 2055 -1956 -3324 421 3683 1313 -3059 -3462 1058 3619
2824C619l258l654M43M664J871m001k942J081M824L65m489k482K586M334j90m627
$$ 3619 361 -3293 -2850 1814 3685 -316 -3258 -2177 2647 3012 -1477 -3959 -1373 2961 2771 -1856
2840a856j634K984M141j574m556j054L860L517k609m440L86M374K401l167m029
$$ -1856 -3490 -506 3635 2061 -2495 -3549 311 3828 1219 -3221 -2835 1539 3940 773 -3256
2855c256J073L987J459l813l295K130M383O56m309k342K800L658l45m607j807
$$ -3256 -2183 1804 3263 -550 -3845 -1715 2668 3324 -985 -3327 -527 3131 2786 -1821 -3628
2870c628L522L423j222m630o61M074K857k255m638M53M417J842l241l766J457
$$ -3628 -106 3317 2095 -2535 -3196 878 3735 1480 -3158 -2705 1712 3554 313 -3453 -1996
2885a996M473Q18l323l509K343M380k78m067k532L113L683o84m048j579L400L489
$$ -1996 2477 3295 -28 -3537 -1194 3186 2908 -1159 -3691 -578 3105 2421 -1627 -3206 194 3683
2901C683j737m148p88M005K419k480l738R4M757J444l092l459R44M784K79l644
$$ 3683 1946 -2202 -2990 1015 3434 954 -2784 -2690 2067 3511 419 -3040 -2096 2688 2967 -677
2917f77k524J817M272q6m438j736K636M265j465m244r91L494L170k281l888j82
$$ -677 -3201 -1384 2888 2802 -1636 -3372 -736 3529 2064 -2180 -3171 323 3493 1212 -2676 -2858
2933b858L685K976l057l782M59M183J592l687l220J680M043J017m058k588K499
$$ -2858 827 3803 746 -3036 -2577 1606 3198 -489 -3709 -2029 2014 3031 -1027 -3615 -1116
2948a116L886j92m458j505L036L337j226m131p62L625K594j893m087M03L819J912
$$ -1116 2770 2578 -1880 -3385 -349 2988 1762 -2369 -3131 494 3088 1195 -2892 -2489 1330 3242
2964C242k447m023R86M295J151l265l317K038L870J40l392k898L064L564q15l614
$$ 3242 795 -3228 -2242 2053 3204 -61 -3378 -1340 2530 2670 -722 -3620 -556 3008 2193 -1421
2980a421j787L542L117j630l953q73L957K398k421l387M6M066J648k909l073P36
$$ -1421 -3208 334 3451 1821 -2132 -3005 952 3350 929 -2458 -2412 1654 3302 393 -2680 -1944
2996a944M150O54l167k851J810L843P0l524k049K425L623r94l992j246K923L601
$$ -1944 2206 2860 -307 -3158 -1348 2495 2565 -959 -3008 -583 3040 2046 -1946 -3192 -269 3332
3012C332j996l598n18L591K645k812l407N84L893J689l653k861J238L606J073
$$ 3332 1336 -2262 -2780 811 3456 644 -2763 -2179 1714 3403 -250 -3111 -1873 1733 2806
3027B806l639k130J946L281M43m078j848K629L261m92m237r07L351K611j726l735
$$ 2806 -833 -2963 -1017 2264 2707 -1371 -3219 -590 2671 2179 -2058 -2965 386 2997 1271 -2464
3043b464j28L462K073k017m005J037L735J219k792l271J649L680N02l293k855
$$ -2464 -2592 870 2943 926 -3079 -2042 1693 2912 120 -3151 -1502 2178 2680 -613 -3468
3058c468K606L641m29l560j963L280K638j129l409j362L576K594j917l466k29
$$ -3468 -862 2779 2350 -1210 -3173 107 2745 1616 -1793 -3155 421 3015 1098 -2368 -2597
3073b597L994J712k426l052L11L994Q35l169k555J479L655L71l403k041K086L657
$$ -2597 1397 3109 683 -2369 -2058 1936 2771 -398 -2953 -1474 2181 2552 -851 -2892 -806 2851
3089B851p83l495j346K507L281j541l612o85L613K140k281l142J21L337K058l024
$$ 2851 2068 -1427 -2773 -266 3015 1474 -2138 -2823 790 2930 649 -2493 -2372 965 3023 -1
3105ak849R78L552J162l513k142J837L007M96l833j734K323L228n35m062p42L000
$$ -1 -2850 -1872 1680 2842 -671 -2813 -976 2031 2527 -1306 -3040 -717 2511 1976 -2086 -2828 172
3122A72K586j356l803j5K918K152k081l322P92L166J580k798l047J344L607M90
$$ 172 2758 1402 -2401 -2416 502 2654 573 -2749 -1957 1209 2789 -9 -3056 -1712 1895 2385
3138B385k956k420K092L305k45l317j935K941K850r33l342j373L344K422j679
$$ 2385 -571 -2991 -899 2406 2161 -1156 -3091 -150 2700 1767 -1575 -2948 396 2818 1139
3153A139l231l86L593J851k219k868J16L766J017k599k746J114L753K20k673k399
$$ 1139 -2092 -2478 1115 2966 747 -2121 -2005 1761 2778 179 -2567 -1453 2300 2520 -153 -2552
3169b552J707L421m66l132j518K339L050j167l150r61K885K388j943k983J26L088
$$ -2552 -845 2576 2110 -1022 -2540 -201 2849 1682 -1468 -2429 456 2844 901 -2082 -1956 1132
3185A132J696k730k504N15L402J181k832k366J128K973N34l140j574J406L277
$$ 1132 2828 98 -2406 -1891 1511 2692 -140 -2506 -1378 1595 2129 -1011 -2585 -1179 2098
3200B098m49l267j178K564K671j063l582l90K779K492k029l085L76L188J385k385
$$ 2098 1649 -1618 -2796 -232 2439 1376 -2206 -2596 183 2675 646 -2439 -2063 1125 2510 125
3216A25k945J271K830R52k676k643K180K770K73l179j653K463K850q50l212j216
$$ 125 -2820 -1549 1281 2233 -443 -3086 -906 1864 2137 -1042 -2695 -232 2618 1768 -1444 -2660
3232b660K924K338j229l333l92L232J935j963k768J17L054J420k292k915J107
$$ -2660 264 2602 1373 -1960 -2352 880 2815 852 -1916 -1799 1255 2675 383 -2532 -1425
3247a425L498Q0k291k491J985L058l53k924j734K386K957j215k977p93K297K680
$$ -1425 2073 2153 -138 -2629 -644 2414 2061 -863 -2597 -211 2746 1531 -1446 -2239 58 2738
3263B738j642k815o19L001J931k098k593K38L197J208k578k470J124L168M77k950
$$ 2738 1096 -1719 -2338 663 2594 496 -2097 -1859 1338 2546 -32 -2502 -1378 1790 2267 -683
3279f83j804J604L259m22l288j015K057K702q88l290n57K542K262j759k846J23
$$ -683 -2487 -883 2376 1954 -1334 -2349 -292 2410 1522 -1768 -2325 217 2479 720 -2126 -2003
3295b003K644J871k129k811R91K526J106k382k641J654K826M82k992j738J987
$$ -2003 641 2512 383 -2428 -1437 1089 2195 -187 -2828 -1174 1652 2134 -858 -2596 -609
3310f09K613k83k893j513K671K191r02l016n95K915J805j259l080R6L069J069
$$ -609 2004 1721 -1172 -2685 -14 2177 1275 -1741 -2336 579 2384 1125 -1955 -1859 1210 2279
3326B279j865k859Q09L285K70j978k383J666K769n9k655j773K092K706r53k595
$$ 2279 414 -2445 -1636 1649 1919 -59 -2442 -776 1993 1934 -721 -2494 -402 2304 1351 -1244
3342a244j114K504K512j554k658m00K663J665j921k368j57L438J149k676j619
$$ -1244 -2358 146 2658 1104 -1554 -1954 709 2374 453 -1915 -2072 1366 2515 -161 -1780
3357a780L99L215L05k646j512J241K813n6l170j010J906K559q20k896k98J677
$$ -1780 -1381 1834 2139 -507 -2019 -778 2035 1979 -1191 -2201 -295 2264 1444 -1452 -1750 -73
3373g3K372j331k810J94K244J670j737k739P61K367J350k541k118J225K405O52
$$ -73 2299 968 -1842 -1648 596 2266 529 -2210 -1449 918 2268 -273 -2391 -1166 1239 1891
3389A891k429j911K033K180k5k783j155K163J786l67l143m49K555J858r73k978
$$ 1891 -538 -2449 -416 1764 1739 -1044 -2199 -36 1750 1383 -1760 -2209 346 2204 1231 -1747
3405a747j80L017J326j938k617Q31K537P87j756k137Q74K933j0k475j779J888
$$ -1747 -1927 1090 2416 478 -2139 -1308 1229 2016 260 -1877 -1003 1930 1920 -555 -2334 -446
3421d46K606q07k379j202K321K325j176k554n67K482J835j767k348l3K813J159
$$ -446 2160 1353 -1026 -2228 93 2418 1242 -1312 -1879 603 2438 671 -1677 -1710 1103 2262
3437B262k197j804M65K571O67k500j787J272K682J06k841r46J715K129l51k729
$$ 2262 65 -1739 -1274 1297 1964 -536 -2323 -1051 1631 1737 -1104 -2050 -335 1794 1443 -1286
3453a286q97K032K187j245k588k36K351J796j646k431N51K201J437k298k208J120
$$ -1286 -2183 -151 2036 791 -1797 -2033 318 2114 468 -1963 -1412 789 2226 -72 -2280 -1160
3469a160K283Q09k573j533J455K350L0k621j148J765K081m10k688p18K487J748
$$ -1160 1123 1932 -641 -2174 -719 1631 1661 -960 -2108 -343 1738 1328 -1360 -2078 409 2157
3485B157q37k758k71K582J188j346k921O15K673R21j902k142J340K351L45k217
$$ 2157 1320 -1438 -1709 873 2061 715 -2206 -1591 1082 2003 101 -2041 -701 1650 1995 -222
3501b22j936J630K372j83k445j074K117J760p73k575q30K696J237j277k140j54
$$ -222 -2158 -528 1844 1661 -784 -1858 259 2019 1246 -1329 -2159 537 1774 497 -1643 -1797
3517a797K514J459j653k144J11K750P56k433j844R21K555L34k506j003J237K487
$$ -1797 717 2176 523 -1621 -1510 1240 1996 -437 -2281 -1360 1195 1529 -977 -1980 -743 1744
3533A744m94k382o74J650K013j018k569j08K052K018j515k441K31K071J390k237
$$ 1744 1250 -1132 -1806 -156 1857 839 -1730 -1838 214 2232 717 -1724 -1493 578 1968 -269
3549b69j638Q31J933J205k326j616J384K062L41k524j048J754J580m8k764p31
$$ -269 -1907 -1076 857 2062 -264 -1880 -496 1566 1907 -617 -1665 89 1669 1621 -1143 -1874
3565a874K256J559p13k632J83J904J289j246k185J15K517P49j650k129J055K431
$$ -1874 382 1941 1228 -1404 -1221 683 1972 726 -1459 -1344 1173 1922 272 -1857 -802 1629
3581A629m4j972j764J563K105l36j564j611K043J951p61k141j194K288J545j057
$$ 1629 1585 -387 -2151 -588 1517 1181 -383 -1994 49 2000 1239 -902 -2096 192 1737 680
3597F80k163m71K426J280j475k011oK944L69j824j433L58K568J65j877j396J147
$$ 680 -1483 -1954 472 1752 277 -1734 -1740 1204 1573 -251 -1684 -1326 1242 1407 -470 -1866 -719
3614g19K283j71k419r33J675K176j058k332l90J860J994j273j980j9K007J386
$$ -719 1564 1393 -1026 -1959 -284 1892 834 -1498 -1888 -28 1966 693 -1287 -1306 701 2087
3630B087j813j991M53K251Q98k022j428Q94K080P64k476j226J037K070j07k412
$$ 2087 274 -1717 -1264 987 1885 -137 -1565 -671 1409 2173 -303 -1529 -492 1578 1471 -941
3646i41m54J652J551m20k612k84J994J390j109k449L30K258R21j599j737O88K157
$$ -941 -1395 257 1808 1388 -1224 -1508 486 1876 767 -1682 -1352 906 1827 228 -1509 -821 1336
3663A336K10j791j676J102J769L76j792j648K022J509j32k223j016J984J599r42
$$ 1336 1546 -245 -1921 -819 950 1326 -466 -2114 -92 1417 1285 -938 -1954 30 1629 687
3679F87k134l43K173J361j067k200K84K188P28j638j850N93K304J00j414j604
$$ 687 -1447 -1790 383 1744 677 -1523 -1239 949 1677 39 -1811 -1218 1086 1186 -228 -1832
3695a832J141K205j79k145r98J699J675o47k063n07J807J539j140j587k23J609
$$ -1832 -691 1514 1335 -810 -1808 -109 1566 919 -1144 -1651 156 1695 555 -1032 -1255 354
3711C54J407j716j466J40K078P93j518j275L29K120N47k175j312J344J717j90
$$ 354 1761 45 -1421 -1281 797 1590 72 -1203 -874 1246 1793 -382 -1694 -350 1367 1177
3727A177k021q24J444J866o02k078l42J584J598j229k121L59J758J043j234j930
$$ 1177 -844 -1668 -224 1642 1040 -1038 -1380 204 1802 573 -1548 -1189 569 1612 378 -1552
3743a552O63J702Q33j873j426J013J645K61j584j295J457J625j1k187r46J844
$$ -1552 -889 813 1646 -227 -1653 -640 1005 1266 -318 -1613 -156 1469 1458 -729 -1675 169
3759A69J398p09j960m82K124R84j029j638K31J884P47j394j755L42K024L59j529
$$ 169 1567 858 -1102 -1584 540 1524 495 -1143 -912 972 1719 325 -1430 -1088 936 1295 -234
3776b34j588J061K240L1j862j153J525J362l32j866r28J660J926j220j697k57
$$ -234 -1822 -761 1479 1510 -352 -1505 20 1382 1050 -816 -1744 -84 1842 622 -1075 -1332
3792a332J956J029j243j755K84J771Q33j687j087M80J931L60k013p70N14J918
$$ -1332 624 1653 410 -1345 -1061 710 1543 -144 -1231 -751 1180 1540 -473 -1243 -729 1189
3808A189j13k075o89J411J783l16k136l81J543J340q08k044J44J273J429j207
$$ 1189 1076 -999 -1688 -277 1506 1190 -946 -1327 216 1556 748 -1296 -1152 121 1550 343
3824C43k053Q91J351R82j451j582P35J658K44j401j029J110J448M6j998q40J620
$$ 343 -1710 -819 532 1514 63 -1519 -784 874 1118 -283 -1312 -202 1246 1292 -706 -1546 74
3841G4J076m16j903m80J943J157r52j743q9K096O85j105j675M43J763M36j626
$$ 74 1150 734 -1169 -1649 294 1451 499 -1244 -1333 763 1448 343 -1332 -889 874 1310 -316
3858c16j226Q83J793r4j483j167J267J843m65j578r64J605J381p26j554m96J533
$$ -316 -1542 -659 1134 1040 -443 -1610 -343 1500 1035 -543 -1507 98 1479 753 -801 -1297 236
3875B36J144j073j448k34J892J008j581j216M08K110K92j954q01P23J575K44j930
$$ 236 1380 307 -1141 -1375 517 1525 -56 -1272 -864 1246 1538 -416 -1217 -494 1081 1325 -605
3892f05m37O53J776n96j605m43J199J470o79j815J2J419J280r48k037N44J527
$$ -605 -1042 -389 1387 791 -814 -1257 -58 1412 733 -1082 -1070 349 1629 681 -1356 -812 715
3909G15O86j243j675Q09J247O23j422j164Q73J356L74j736q89J408J228j38j941
$$ 715 1401 158 -1517 -708 539 1162 -260 -1424 -551 805 1179 -557 -1446 -38 1190 1052 -889
3926h89k31J272J161p14j668j80J469Q56q07j404l2J836N89j287j435R76J419
$$ -889 -1120 152 1313 599 -1069 -1249 220 1076 269 -1135 -1167 669 1258 -29 -1464 -488 931
3943I31L49j387j388J238J483m20j353r46J263J535p43j256n33J481J199j173
$$ 931 1280 -107 -1495 -257 1226 806 -547 -1493 -230 1305 562 -694 -1227 254 1453 280
3959B80j140p0J303J168j439j223K63J550O47j543r40L50J919J43j604r60R69
$$ 280 -860 -930 373 1541 102 -1121 -858 692 1339 -204 -1144 -794 1125 1268 -336 -1296 -327
3976c27J521Kk012n72J448J344n67j930R1J176J119r81j556R7J495J028j320j171
$$ -327 1194 1196 -816 -1388 60 1404 837 -1093 -1002 174 1293 312 -1244 -1147 348 1376 56 -1115
3994a115L02J515O87j724j015Q96J467P0j515o87R31J199N5j704o07J379J071
$$ -1115 -813 702 1389 -335 -1350 -454 1013 1083 -432 -1119 -188 1011 1066 -638 -1245 134 1205
4011A205l49j946k0J594P17q94j349Q0J631M39j031j361N30J596J66j264j263
$$ 1205 856 -1090 -1110 484 1201 307 -1042 -962 669 1108 77 -1284 -754 842 1008 -256 -1519
4028a519J106J515j21j293r77J291J058m04j381o59J555R78q80j211l55J792O51
$$ -1519 -413 1102 981 -312 -1289 2 1060 656 -725 -1384 171 1149 269 -942 -1297 495 1146
4045A146j153j113k61J963M61j088q89K84J496R9j333j039P25J552j33j268o58
$$ 1146 -7 -1120 -1381 582 1043 -45 -934 -650 846 945 -388 -1427 -702 850 717 -551 -1209
4062a209R48J552l23j529m72J468Q28r55j378K95R68Q72q71j514Q62J362L11j499
$$ -1209 -261 1291 968 -561 -1033 435 1263 308 -1070 -775 193 1065 194 -1320 -458 904 1215 -284
4080b84r60P24J192L37j289q34P23J517k53j428m91J229J133q66j627K25J177
$$ -284 -1244 -520 672 1009 -280 -1114 -391 1126 873 -555 -1046 183 1316 450 -1177 -952 225
4097B25R48q17j383Q0J487O39r55j402N44J524m3p82j274Q66J284j53j048q34
$$ 225 1173 356 -1027 -947 540 1179 224 -1178 -634 890 847 65 -1209 -343 941 788 -260 -1094
4115a094P70J337j89j554l53J113J159p01j249k47J329Q97j059r13k16J594L97
$$ -1094 -324 1013 824 -730 -1083 30 1189 488 -761 -1008 321 1218 159 -754 -970 624 1021
4132A021j268p45L62J482O4j090q54O55J342o8j431n04Q03J333l28j223m41Q89
$$ 1021 -247 -992 -630 852 916 -174 -1028 -373 969 901 -530 -1034 -231 1102 774 -449 -890 -1
4150aJ346r22j549L43J151R08j086j277K11J418P08j217j143O29J093M89j401
$$ -1 1345 423 -1126 -783 368 1276 190 -1087 -876 542 1250 33 -1110 -481 612 1101 -300
4167c00r88P73J296J27j341m81O38J244l63j624K8J040P72l19j510J25J392N33
$$ -300 -1288 -515 781 908 -433 -914 -276 968 605 -1019 -991 49 821 502 -1008 -883 509 1042
4185A042q28j187L61J133M37r91j097O11J366p1j192o94J074J169n36r71o96J164
$$ 1042 214 -973 -612 521 958 -33 -1130 -519 847 776 -416 -1110 -36 1133 597 -374 -1070 94
4203I4J004m33j371j90J363N77p03r93k09J161M49p49p77J68J089L47o67j180
$$ 94 1098 665 -706 -896 467 1044 341 -652 -861 300 749 0 -777 -609 480 827 160 -1020
4221a020O70J372j67j386o56Q18J242k17j203k13P13J024o95r27k47Q42J236r49
$$ -1020 -350 1022 855 -531 -1187 -369 873 656 -547 -760 -47 977 282 -645 -892 -50 1186 237
4239B37j279L86J394N74j195r89K45J059K75j279n49R00R38K60j331n00P91R34
$$ 237 -1042 -656 738 1312 117 -872 -627 432 707 -572 -1121 -221 717 977 -354 -854 -63 871
4257H71k60j330k39J075Q82n18j157k0J000R29q45j350L91J083K43p26j226Q35
$$ 871 611 -719 -958 117 999 481 -676 -696 304 1233 388 -962 -571 512 755 29 -1197 -362
4275c62J041J91q82j143J178P60M0j390o37J012J278l97j234l54J415N11n21j095
$$ -362 679 870 -12 -1155 23 783 823 -567 -1204 -192 1086 689 -545 -899 516 1027 506 -589
4293e89k16J066O32o94j258M22J462L4p25q27J71J217Q0j213p93Q17J262j41q33
$$ -589 -805 261 893 199 -1059 -637 825 859 134 -693 -522 695 775 -438 -1231 -414 848 707 -126
4312a26q08J099O71n59j078k41J155Q72q78j112J03J226Q48j164p83J77J022O16
$$ -126 -934 165 836 277 -801 -1042 113 985 107 -1005 -902 324 1172 8 -775 -598 424 1040
4330A040j389n92M38J174N1j124l45M91J236l63j402k62Q54J057n13p76l54J282
$$ 1040 -349 -941 -503 671 722 -402 -747 -256 980 617 -785 -1047 -193 864 351 -425 -779 503
4348E03O54r55j050L98Q45N10q67j073P73O89P05j214r24Q97P18J71j012q16R09
$$ 503 1157 202 -848 -450 395 905 38 -1035 -262 427 1132 -82 -1006 -109 609 780 -232 -1048 -139
4367a39R39o0j331j93Q21Q42o32j020l3J093O45p63j032J36J353J80o63r36J28
$$ -139 800 740 -591 -784 37 879 247 -773 -806 287 932 169 -863 -727 626 806 143 -793 -665
4386f65J336j44q26q56P92J012k87m81q70Q37J169o47r26l81R18P28n71r34K38
$$ -665 671 527 -299 -1155 -363 649 362 -119 -989 -152 1017 370 -556 -937 -19 709 138 -796 -558
4405e58P32P16o69r30J5J150K88j018m67L30J149L73j097o61N44R26r3j226m97
$$ -558 174 890 221 -709 -694 456 744 -274 -741 -411 738 1111 14 -647 -103 823 730 -496 -993
4424i93R09J173n97j045l9R74M90n92r47J1R68M30o55j013O29N51M92q64p48N55
$$ -993 -84 1089 492 -553 -592 382 872 280 -667 -656 312 742 87 -926 -297 254 746 -118 -866 -311
4444c11P86K57j127o96R06R31k54r02n13J095M66o3j296j78R97N26n67q55L45
$$ -311 475 732 -395 -1091 -185 746 492 -410 -923 172 638 575 -721 -899 98 624 57 -798 -453
4463d53R12K03n90r61M14J106k5o63r52N60J238j73r84l97P70R01p27n90l94R36
$$ -453 459 662 72 -889 -475 631 606 -57 -1009 -449 789 616 -368 -765 5 906 179 -411 -805 131
4483A31M88l31p32j88R95L07m96r24L24P57M59q46o23K66R21K72j030k05P3J141
$$ 131 619 288 -444 -632 363 670 174 -750 -426 331 790 -56 -679 -413 508 780 -250 -455 -382 759
4503G59j5j219n6M48P97n82o91L7P76Q42p17r42k8P86L64m72r10L11R60M87j027
$$ 759 744 -475 -531 -83 714 132 -559 -522 254 1096 379 -563 -591 195 559 87 -823 -512 448 935 -92
4524i2q24O29P56j27n88o86P10Q70k43r25k84R92L42j46q63m35J034M35j79j122
$$ -92 -916 -287 469 342 -246 -932 -222 648 405 -520 -804 188 530 384 -479 -914 120 555 376 -746
4544g46K48R70M78o64j062J79J067K02q30p69L27J137Q5j013m35P09R95j80j118
$$ -746 -498 472 950 286 -776 -597 470 672 -158 -927 -600 537 622 -391 -826 -117 878 698 -420
4563d20l76N97R65n54p72j97J125N49q48m16m04J142J46o66m97K04J014J45q17
$$ -420 -796 -199 766 212 -560 -757 368 917 69 -347 -751 391 537 -129 -626 -422 592 737 -80
4582h0o46O39P26j7q64l72L55J104k78j123m3P04P58m48j121JJ002J49l13o81
$$ -80 -726 -87 639 622 -242 -614 -259 845 567 -556 -599 105 863 415 -706 -705 297 446 133 -548
4602e48J66O84M30q16p68O07P14K70r58n75P34M61M1n29o52Q75N50j99j088K7
$$ -548 -382 302 732 -84 -852 -245 469 739 -219 -794 -60 401 442 -87 -739 136 686 487 -601 -574
4622e74P89L89l16r25J78P85K70l36q93K76P03M32o93q26L21Q24Po98n25O80Q07
$$ -574 215 604 288 -637 -459 326 596 260 -633 -357 346 778 85 -741 -420 404 411 -287 -812 -132 675
4643F75o7q48o35P99O47l26p00l48R80N14m76o98K6Q69K14n76n22K3Q43M25r30
$$ 675 608 -240 -875 -76 571 245 -455 -803 177 691 215 -483 -457 412 626 50 -472 -449 394 819 -111
4664a11k89J69O82R0p60o21N33R86j22p76l31M42R44n42r60J06N65O67o35p14
$$ -111 -400 -231 451 541 -219 -840 -307 679 557 -219 -550 -108 836 294 -666 -560 5 672 37 -677
4684f77J80Q56M48p89o78K63Q90O8o71n24N31Q17k58p99l08O38O51l31p24j78
$$ -677 -497 359 807 18 -660 -397 493 561 -110 -634 -103 714 456 -343 -651 -13 638 307 -417 -595
4704e95P39K42j02q04o3P95N53m27r80K62P71K41n26o15M20N89o6n01m70L10R81
$$ -595 144 386 284 -520 -583 212 765 338 -642 -380 391 632 106 -509 -89 500 434 -67 -537 -227 754
4725G54l29o70o75Q87N21m50l11l05O67N84p09m43j35Q41N69n76q47K34O00J60
$$ 754 425 -245 -920 -33 488 38 -273 -578 89 673 -36 -479 -614 227 796 220 -627 -393 207 367
4745C67o74l11L77N43J60p55m46L97P44Pr00J06K69Q37m07o66k15O76M80n44p20
$$ 367 -307 -618 -241 302 462 -293 -739 -342 402 409 -491 -385 -116 721 314 -352 -567 109 589 45 -675
4766f75K37O45O01o59p54L44N86J57o92m86M24P46J52r90m16P31O38j05r17p6
$$ -675 -438 207 808 149 -605 -261 325 482 -210 -696 -272 474 626 -364 -780 -49 589 484 -433 -509
4786e09P01M35m9j019k10Q16M09m12n79k42Q65L32m91o25L85P42N3o58n30N09
$$ -509 192 627 578 -441 -651 165 574 162 -417 -659 206 538 47 -578 -193 549 602 -56 -586 -77
4806g7M21K36q11p78P95O64q1o98l78P21N01k76o90r3N96P15n57o08J9P83J37
$$ -77 344 580 -231 -1009 -214 450 369 -329 -707 14 515 239 -451 -544 52 767 210 -398 -379 404 541
4827E41m93n29j06R25j43k56o89L34J204l46p52m67O71P25l67o66J37L06P60n75
$$ 541 48 -481 -587 338 195 -61 -750 -416 788 442 -310 -777 -106 619 252 -414 -277 29 789 214
4847B14r33P7P73M42n94m67K75M91K80o51l18J54N56K08o67m78M50P84j98p40
$$ 214 -719 -642 131 573 -21 -488 -213 278 558 -93 -411 -257 299 507 -160 -638 -188 596 398 -342
4867c42k10L66L73J75o58n8L00O55l02p80J4O75L41m77n95K71N71K37m30p79M46
$$ -342 -552 -186 187 362 -296 -354 -54 601 299 -481 -467 208 549 72 -523 -252 319 556 126 -653 -207
4888b07M46J34m71n28O78K30J83q61j30N00M68k26o41l2N92K38k54o61N1P09L71
$$ -207 239 373 -98 -626 52 282 465 -396 -526 -26 442 216 -425 -457 135 373 119 -542 -491 218 589
4909E89m42p57L01Q38J09n21p31L51P97l13m66l96O71N55j40n35l60O26L92l93
$$ 589 147 -610 -309 529 638 117 -614 -263 534 221 -245 -641 30 585 445 -90 -450 176 568 175
4929A75m55j29M80M57l85p50J49N68M36o78k41L1Q00J66q31k06J96P59j50q67
$$ 175 -280 -409 71 528 143 -607 -458 110 546 -132 -373 -342 458 624 -207 -413 -217 542 392 -475
4949d75p5K75Q62k64p49l0M63M25j40n93j10O42M02m82p08K62O10J34l81o56M87
$$ -475 -550 -275 587 323 -426 -456 7 432 292 -301 -411 231 633 151 -557 -295 315 449 68 -588 -101
4970a01M08J22m81o11Q47K68N6o51l24N17M26j54p30k96Q92J01L8o35k18R31o
$$ -101 307 429 -52 -663 184 452 508 -143 -467 50 476 322 -408 -704 188 289 327 -308 -526 405 399
4991C99l61o02J22P00J43n40m00K95O92K1o58k98N59M66Nj073J15M03L67J8n81
$$ 399 38 -564 -442 258 401 -139 -539 -244 448 469 -189 -487 72 538 543 -530 -415 -12 355 373 -208
5012b08l04M98O38n45m25L0M82J30l30m98K26O88Km92k15P3N92J9m70k27K13O47
$$ -208 -512 -14 624 79 -346 -316 166 296 -34 -532 -306 382 384 -108 -323 -250 342 361 -109 -336 -123 524
5034E24k09m60m97N92M05pq32J40L02N24k61n43j4M66M74n72n61L21N07j48k55
$$ 524 315 -145 -642 -50 355 348 -484 -344 -42 482 221 -322 -336 130 604 32 -529 -208 299 151 -104
5055a04m25O33L62r1o15j2J95O82l51n86j75O48N36p02k11j43N70J26j96p19M16
$$ -104 -529 104 466 375 -240 -252 -57 625 274 -312 -487 161 697 -5 -216 -359 211 337 141 -578 -162
5076a62L24K07l64n34K88N93l47ml82L28K94K15p59l8L16M30k36o24n9P24J73
$$ -162 162 369 5 -529 -241 352 5 1 -381 -53 241 456 -303 -341 -25 405 169 -455 -514 210 383
5097C83k64l79k77P18J91l59m16P4N35J39l37l98m1Q12j2k63n22N62J55j69l44
$$ 383 119 -260 -537 181 372 13 -403 -329 206 345 8 -390 -431 381 369 106 -416 146 301 132 -212
5118b12p1L92O81n87l78j19M26L53l45l09J04K66K74n66k01L53J66J39m70j85
$$ -212 -283 109 790 203 -175 -294 132 485 140 -169 -65 201 475 -91 -292 61 227 366 -104 -289
5138b89J63N19R1o18l72M81M98j23n15j51K33M75p3o62J12N33N6k79m24O9M49
$$ -289 -126 393 484 -134 -506 -25 473 350 -165 -316 -83 392 319 -343 -231 302 358 79 -345 -276 173
5159A73J80m62j74NM98J2l74m33K99N57q9m26j97M59L81m21j96j30M11M30l30
$$ 173 353 -109 -283 -278 220 232 -142 -575 -276 281 192 -234 -431 28 409 -12 -208 -338 73 503 173
5180A73l90l93Q75K44n91m8p9M70J89m76k46Q5N07l8m89l20K78O59j40l56m3J82
$$ 173 -217 -610 265 509 -82 -130 -209 261 450 -26 -272 -187 320 282 -207 -527 -249 410 270 -86 -129 53
5202E3N22l88l12r1K53M70o88j54N0K85M36n72k59J71N97P1m01l88J04N50L9n74
$$ 53 575 187 -125 -216 37 507 -181 -335 -285 0 436 -136 -395 -224 373 444 43 -345 -241 309 348 -226
5224b26j82J17P44M5n35l53M16L09j17l91j65L93L73k38n12L0K75L72l20m30M7
$$ -226 -408 -291 453 498 -37 -390 26 335 218 -173 -338 55 428 190 -322 -292 -17 355 35 -395 -348
5245c48O42O8k51n39J05N93mm47k97M16K78k02k18r2K83L59l47r1l07M12M52n12
$$ -348 294 362 111 -428 -323 270 266 -181 -478 -62 216 14 -204 -296 -13 346 -1 -92 -399 13 465 -47
5267d7l35k0R06j9n56k35q1Q61k70j91l22R6O47j27l27l57L26N47j91n40J44J48
$$ -47 -382 -402 504 485 -71 -306 -387 474 204 13 -309 -213 434 307 -20 -377 -51 496 305 -235 -91 57
5289E7L55k59l15nK21L66m42j71R6M50r0l81l08L55L60N3o03j30L54K69K6l51
$$ 57 412 153 -162 -167 54 420 -22 -193 -97 353 263 -118 -426 -71 289 342 -261 -391 -37 232 258 -93
5311i3l70M96L21l13l37j62L85K34n9p64L53M57J8m5n45K03N78J6m97j94L11L04
$$ -93 -463 33 354 41 -296 -458 -73 161 102 -662 -309 148 166 121 -424 -221 357 373 -124 -318 -7 297
5333B97Q1l26m81L15L78l6m73q9O19j7j69m63p0P28N2l31l66N5M40L63n52k66
$$ 297 378 52 -429 -114 264 228 -245 -334 285 268 99 -364 -434 294 346 15 -351 -296 144 507 -45 -311
5355c11R5O69m0l49k99j06Q38l43n08O9J61L21j6j95k08J82M60m23l44r9N84J29
$$ -311 -216 453 413 64 -235 -341 497 154 -354 -285 -124 197 181 -14 -222 -40 420 -3 -347 -446 138 267
5377B67n2n46J15M17K80o32k03K38K70P4m63p5J32M99j7o29M9J72M31O0o02j90
$$ 267 215 -331 -216 201 481 -151 -354 -116 154 228 -235 -310 -178 321 304 -325 -276 -104 327 387 -215 -405
5399d05L78N20l39m41K7K11L51k36n11K55M92J09l71o57N53M94q1n08j98M71R8
$$ -405 -27 493 154 -287 -260 -49 302 66 -445 -190 302 411 40 -617 -64 430 349 -159 -357 114 212
5420B12j0m12l55N00K86q1l30j49N90R3k13n50k2K75N01j59n90J27M68R9k13l42
$$ 212 202 -210 -565 -65 221 140 -190 -339 251 344 131 -419 -441 -166 335 176 -414 -287 181 280 67 -275
5442b75K07N57k22n96j17M68M26j29n35J31J38J96l68O7j64L29L25l57l41P5N77
$$ -275 -68 489 267 -329 -446 22 448 319 -216 -85 53 249 -119 -52 -216 113 438 81 -260 -185 392
5463C92pl73k40j8L48Q4m24m9J69L23M4m33j39K66J74L3n06j4M09L84k20o16R9
$$ 392 385 12 -228 -246 102 186 -238 -287 -118 205 249 -184 -323 -57 117 150 -356 -370 39 423 203 -413 -314
5486c14L02M88m42k11R8J86J65l66j80O5K56J39r1n66M15M12k60l23k55N04K53
$$ -314 -12 476 34 -177 -79 107 272 -94 -274 -209 47 186 95 -471 -56 356 96 -227 -482 22 275
5507B75J44o35j0L41J06r7l00j27O89j67j61n23K98M20j3l36j84Q3M39J97o86
$$ 275 419 -216 -226 115 221 124 -176 -303 386 219 58 -465 -167 253 240 -96 -280 -197 242 439 -247
5528b47l6J67K45j96m5l43K36L54J10l75k68L21M14m47j70L1L54P5l7m09n2N84
$$ -247 -283 -116 129 -67 -112 -455 -219 135 245 -130 -398 -77 337 -110 -280 -249 105 180 143 -266 -318 266
5550B66j6k16l47K21M99j75m18o0p7N15J70m06j96L15K81k81j42l54L72L99m92
$$ 266 250 34 -313 -92 407 232 -186 -246 -323 192 362 -44 -240 75 356 75 -67 -421 -49 350 -142
5571a42N2J05l7P8j63j44J93J95K66m76l39L88K19P1l51k19L49K82k23k14k36
$$ -142 -90 15 -22 56 -107 -251 -58 137 403 -73 -412 -24 195 266 -85 -304 45 327 104 -110 -346
5592c46M01J32j44l99R3L36j7J39n79J69N17k4k91j16j5M02R7k80o13M84L26k31
$$ -346 55 187 43 -356 -263 73 56 195 -384 -215 302 278 -13 -129 -144 258 355 75 -538 -54 272 41
5614D1p8j18J53N44m98j65j00L52L1k76J07m34N66J76j68k84k03L36L82n06k0
$$ 41 -37 -155 -2 542 44 -121 -221 131 162 -114 -7 -441 125 301 133 -151 -354 -18 364 -142 -162
5635a62J22K89K9l54k54L69L33r7m24j35M52K77l85l71K48K25J04po30L97R0K57
$$ -162 -40 249 278 -76 -330 39 372 275 -149 -284 168 445 60 -311 -63 162 266 259 -371 26 116 373
5657C73m61j66K50L66r0m09k44K13L25l3k59l05N40J79J52n28j94K69L53j53p8
$$ 373 -88 -254 -4 362 272 -137 -381 -168 157 124 -135 -440 100 279 431 -97 -291 -22 331 178 100
5678A00k39L34o3M5l68M9L11K8r2n10K45M22J6l15m11N40PJ63m86m9L50L52k64
$$ 100 -139 195 132 177 -191 -142 169 197 105 -405 -160 262 278 -37 -448 92 99 262 -224 -273 77 429 165
5701A65k19k41K96K81k64k51j3K10K17j92j85P1M37m55M8j69J51N47m15j78J50
$$ 165 -54 -295 1 282 18 -233 -246 -36 181 -11 -196 -125 312 -143 -95 -264 -113 434 19 -159 -9
5722ij47N67k87j09l76L59K16r0j28k51L72L19k02m65NK51K25l33oj39L33K41
$$ -9 -156 411 124 15 -361 -2 214 124 -4 -255 117 436 234 -231 -226 25 250 -83 -89 -228 105 346
5744C46l11l93K95L63j45j67l00K37K76p2k74mK99J31l35n4j64M60J6l21j74R8
$$ 346 35 -358 -63 300 155 -12 -312 -75 201 129 -145 -149 150 281 -54 -108 -272 188 204 -117 -291 -193
5766a93L09J65j84j99J01R4R4l86j78L27K45p5J42o27M64J97l38j0j99K70R2L17
$$ -193 116 281 97 -102 -1 93 187 -199 -377 -50 195 120 262 -365 99 296 -42 -52 -251 19 111 428
5788D28p53J00K61J66l10j09n1M19pj69j33m2M39m1k24k91M19L25l34k18m9K32
$$ 428 -325 -225 36 202 -108 -217 -268 151 144 -25 -158 -200 239 198 -26 -317 102 427 93 -125 -174 58
5810E8K80k66j90o5J95P3q2j72j80M53P7j55k71L25q4L26l51l95M74J93j04k58
$$ 58 338 72 -118 -183 12 85 3 -169 -349 104 181 26 -245 80 -4 322 -29 -424 50 243 139 -119
5832a19j59K48J82k8k55J50m8l1J87m35j5L51k3N8m62K77K93M1j68k90N9K99q0
$$ -119 -278 -30 152 124 -131 19 -29 -60 127 -308 -323 28 5 63 -399 -122 171 212 44 -246 -187 112 32
5855C2p2j12J27K48L1k38j89P3M12K9l29k94K36K78j18l92j0M29j2j20o5k86M79
$$ 32 -40 -152 -25 223 254 16 -173 -100 312 341 12 -282 -46 232 114 -278 -288 141 129 9 -56 -342 137
5878A37M25n48K5j12L41n6k75k14k4P04q2q1m82J40N10l03k85j79K06M98l02l7
$$ 137 562 14 39 -73 268 212 -63 -277 -301 403 321 240 -242 -102 408 105 -180 -359 -153 345 43 6
5900Fj25J03L08j33l67M0K09K22l14k78J80M01P2l22j48P7K00K44m56j08M51l7
$$ 6 -119 -16 292 159 -208 -168 41 263 -51 -329 -149 252 324 2 -146 -69 131 375 -81 -189 262 225
5922B25j8n73J02L36M0q0k50J7J62L29j13k52K13j92M61l18k56L7L94P4n59J03
$$ 225 207 -366 -264 72 112 32 -218 -201 -39 290 177 -75 138 -54 407 89 -167 -130 264 338 -221 -118
5944a18M6K68k4l35J04J25J89j17j84j92L30R3n9l96J19J49K68j66m81K06K78
$$ -118 -72 196 172 -163 -59 66 255 138 -46 -238 92 185 126 -270 -151 -2 266 100 -381 -175 103
5965A03o6j12j22J32L47J38m61p4N5L03k75o9j47M09K98l21k19l79M71K57l68
$$ 103 37 -75 -197 -65 282 420 -41 -115 -60 243 -32 -101 -248 161 459 138 -81 -460 11 268 -100
5986a00j08J96O6J78l43J66k10K72K30l79m00K70M66j48l26o0J79J57L8k22MK02
$$ -100 -208 -12 54 232 -111 55 -155 117 347 -32 -432 -162 304 156 -170 -230 -51 106 144 -78 -74 128
6008A28J17N1n03o0L48K52m83k05K91J74J99l47l04J59J21L13l88j0K01l2J37
$$ 128 245 296 -207 -267 81 333 -150 -355 -64 110 309 -38 -342 -183 -62 251 -137 -147 54 22 159
6029A59l26p2R9M32q7m29J36P5N7J03l59N3L44n6%j81p2J56K29j60m06J81J70
$$ 159 -167 -239 -140 292 205 -224 -88 -13 44 147 -212 -159 185 129 129 -52 -124 32 261 101 -305 -124 46
6052D6N1j9k43r5M72J06m68K3J46L15k48q6k0J94rk51j07l8M99m9l72m1K08M6
$$ 46 97 78 -165 -260 212 318 -150 -127 19 334 86 0 -20 174 165 -86 -193 -231 268 219 -153 -194 14 60
6076F0L66l87j65J14K02N9l67k00K87J21K5j76p1K31p5K68m42o1L61j43n9n8p3
$$ 60 426 39 -126 -12 190 249 -118 -318 -31 90 115 -61 -132 99 24 292 -150 -211 150 7 -52 -110 -183
6099a83L15%j98k53l7L95K34k81k71K11M14j59k72n0M27l5j32j74j52K83J58j08
$$ -183 132 132 -66 -319 -356 39 273 -8 -279 -68 346 187 -85 -135 292 257 125 -49 -201 82 240 132
6121A32k00j98L72N6k13J3j46L56j81q3k30L69O5Or4l91K43L23k17j44j65M22
$$ 132 -68 -266 106 162 -51 -38 -184 172 -9 -92 -322 47 112 118 24 -367 -124 199 -18 -162 -327 95
6143I5K23j56k35jJ40J60k07k31K68L1j39J96l11K4L96J5m09q4K00L42k46l77
$$ 95 318 162 -73 -74 66 226 19 -212 56 87 -52 144 -167 -143 253 268 -141 -225 -25 317 71 -306
6165c06k9K70K08K1m89R7L51N3K2m54J74o3L20j72k60K1L91j30p6n1L7J84K3k
$$ -306 -335 -65 143 164 -325 -228 123 176 198 -256 -82 -145 175 3 -257 -236 155 25 -51 -102 -65 119 142 140
6189A40m08K02L42J1l53k56M27J40J29l60l30K36K53j6j11p2l4L15j93l17K49
$$ 140 -268 -66 276 287 -66 -322 105 245 374 14 -316 -80 173 157 46 -26 -60 255 62 -255 -6
6210fK56o6j49k45K08L8J16j71k66K21L22j15l04j5J95Q6r6j99j5L48K9j4j43
$$ -6 250 184 35 -210 -2 36 152 -19 -285 -64 258 143 -161 -176 19 105 9 -190 -205 143 172 158 15
6233A5j00O0K38k54j12O4L9J39K8l27P0M39r4r9j93N2K56q6k50MJ23K79n4n14
$$ 15 -85 -25 213 -41 -153 -89 -50 89 117 -210 -140 299 205 106 -87 -35 221 135 -115 -111 12 291 237 -277
6257b77L52j00L00m35k6j0J68J65m7l70K80K58k56p3k99L18R1K57m27l7J62N9
$$ -277 75 -25 275 -160 -186 -196 -28 137 90 -280 0 258 2 -71 -370 -52 39 296 -131 -168 -6 53
6279E3J56m08J35P2LN3n7j46Q6J46J4l03J25J17J77q6j53M7k0R6j30j36K45o2
$$ 53 209 -199 -64 8 11 64 7 -139 -53 93 107 -196 -71 46 223 137 -16 31 11 107 -23 -159 86 24
6303B4J26m7k97K95K03m00J20j75J06O0J05k88J54o5J21j9j38J96K82j77k14O2
$$ 24 150 103 -194 101 304 -96 24 -151 -45 15 120 -168 -14 -79 42 23 -115 81 363 186 -28 34
6325C4q4J93n5r4j33J44J49Mj97j4k64M56K17l72m9L7L4o0j73J08K63O4j47k30
$$ 34 -50 143 88 -6 -139 5 154 158 -39 -53 -317 139 356 -16 -65 -28 6 -54 -227 -119 144 208 61 -169
6349a69q4L69j61J18n0r5J80j0Pj01o0K7J23n7k05J95J55j73j27o2L61r2N5k38
$$ -169 -253 116 -45 73 23 -72 108 98 105 4 -56 -29 94 37 -168 27 182 9 -118 -180 181 89 144 -94
6373i4nM09l8j55l45k9M13P4k90n2J47Q3M4k97j78K54J72m2j08j04J66N7r9r6
$$ -94 -99 310 272 117 -228 -257 156 230 -60 -112 35 118 162 -135 -313 -59 113 71 -37 -141 25 82 -17 -113
6397a13M6J10J59M2n32O3K48N6j26k22J90K09j52j04K5l1K61o3j38j06K84K8j96
$$ -113 -67 43 202 244 -288 -225 23 79 -47 -269 -79 130 -22 -126 -101 -132 129 66 -72 -178 106 134 -62
6420f2l00J56K04K98m26P3l1L7M55m85j28l5K86J54l22j49J93J52K6l03K6J22
$$ -62 -362 -206 -2 296 -130 -57 -88 -51 404 -81 -209 -244 42 196 -126 -275 -82 70 96 -207 -181 -59
6442e9Q9J76k24l47K73K47n0k31J0J97K8O6l44J47L07k84K2k52M0J33K35p7j85
$$ -59 30 206 -18 -365 -92 155 105 -126 -116 81 109 175 -169 -22 285 1 23 -229 -189 -56 179 102 -83
6465h3q4L90j51o5q5Q7J82Ml00j36K44R4n6k8k62J88M8K0j95k2J46K68k99k09
$$ -83 -167 223 72 7 -78 9 191 195 -105 -241 3 97 41 13 -249 -61 -13 7 -188 -210 -64 204 -95 -304
6489c04J30K89m0j74n0j7K70jk98l0K2K76n0J8j92J08J13j41N2l69L60O1L7k18
$$ -304 -174 115 75 -99 -149 -166 104 103 -195 -225 -203 73 23 41 -151 -43 70 -71 -19 -388 -28 33 70 -148
6513a48o2L53N0k93O6l1l4Q8K3n8J1J48l1Q0l60J05L20q8p2k17K33Nj83N1L3m7
$$ -148 -210 143 193 -100 -34 -65 -99 -11 12 -46 -35 113 82 162 -198 -93 227 139 67 -150 83 88 -95 -44 -11 -58
6539e8K79l62o3K25J27J15k8j80j38J91k7J9l45L32j5K0k37j29M37K7n3r2l68
$$ -58 221 -141 -204 21 148 263 235 55 -83 108 81 100 -245 87 72 92 -145 -274 163 190 137 45 -323
6562c23L87O0J23m20J06K21O4k88q2K61P2j10mn1R0M8q3j31k69L07J53j30N9r8
$$ -323 64 124 247 -173 -67 154 218 -70 -152 109 181 71 67 16 106 154 71 -60 -329 -22 131 1 60 -38
6586c8p0K17j49P1k96M40j51OJ2k09L31P4l61q6J79K56j32l16K78r8P3R5o5j97
$$ -38 -108 109 -40 31 -265 175 24 30 42 -167 164 238 -123 -209 -30 226 94 -222 56 -42 31 126 61 -136
6610a36J45MJ59l69J33m4L00j52o5q7K81k55oj59J59J33J60k76r4J68J93L2l97
$$ -136 9 13 172 -197 -64 -108 192 40 -25 -112 169 -86 -92 -251 -92 41 201 -75 -169 -1 192 224 -173
6633a73q0L28k4k0j07M1J18rp7qj14Q3J31j35k07M2N52l09O6l31K54K34M2k49
$$ -173 -253 75 51 31 -76 -35 83 74 -3 -11 -125 -42 89 -46 -253 -211 341 32 98 -233 21 255 297 48
6657D8k63J00J38J50n6j93r6K25N5r2n0J83m1k0k65O0J91o9JJ8j00K7p0j10K46
$$ 48 -215 -115 23 173 117 -76 -172 53 108 16 -34 149 108 88 -177 -117 74 5 6 24 -76 -49 -119 -229 17
6682A7j68M79k4j80j50J5Q3K98m61L2j6L25r2l99M71l27J57J95m64K67L8N8j52
$$ 17 -151 328 304 124 -26 -11 72 370 -91 -59 -75 250 158 -241 230 -97 60 255 -209 58 96 154 2
6705Bj64m0O5J38j51J51j29K60J64m82Q1J63k1q9M5j77J19K37l3k72j65M18N0
$$ 2 -162 -202 -137 1 -150 1 -128 132 296 -186 -105 58 37 -52 -7 -184 -65 172 139 -133 -298 120 170
6728A70l9j13j2r6J79j01Kk9K1M0j0k63L50kj14m5k48L02J26l0k20k8K40J48p2
$$ 170 131 18 6 -90 89 -12 -10 -39 -18 22 12 -251 99 97 -17 -62 -310 -8 118 88 -132 -160 80 228 156
6753A56k66K7%P7Q6k34J09J33J94k59q3j70J30J60j7M6j18M7n0J4k94J57J67M8
$$ 156 -110 -83 -83 -6 80 -154 -45 88 282 23 -60 -230 -100 60 43 89 -29 18 -32 -18 -312 -155 12 60
6777F0k19m7K76j0p5k3O2K1jq4l3K3l7K11j70q2Q5N1J00k97Q7j46K92K0j73J00
$$ 60 -159 -206 70 60 -15 -38 24 45 44 -40 -73 -50 -87 124 -46 -128 -43 8 108 -189 -102 -248 44 64 -109 -9
6803iq7l5K30k39k45L55M3o1j2J45k7m1p9j33N9MJ81j55P8nQ8N4o2l35R9K33J41
$$ -9 -96 -131 99 -140 -385 -30 13 -48 -60 85 58 17 -62 -195 -136 -132 49 -106 -28 -33 55 109 47 -288 -189 44 185
6830A85j77P6k11K52j39n7N4K8J77k87j38J47L9K23K9l18Q7J50j35Q8JQ3n2l4
$$ 185 8 84 -127 125 -14 -71 -17 11 188 -99 -237 -90 -51 172 201 -117 -30 120 -15 73 74 157 105 71
6854G1j27o0J13K27o1k31J3pJ95J04k40l71L23J95j51j76J8K51J12k94J3J46o4
$$ 71 -56 -116 -3 224 163 -68 -55 -62 133 237 -3 -374 -51 144 -7 -183 -165 86 198 -96 -83 63 -1
6877aP8k5j63J08J60L0l13K05j49L07o8j21l1k9K07k16j14o2J89p4Q3j86K45J91
$$ -1 77 52 -111 -3 157 187 -126 79 -70 237 169 48 17 -12 195 -21 -135 -197 -8 -82 1 -185 60 251
6901B51l34M2J09j02L08j22j9l65L38j49L1m0j2m2K11LJ47m16O8j0N5M3j29R8
$$ 251 -83 -41 68 -34 274 152 133 -232 106 -43 -12 -52 -64 -106 105 108 255 -161 -93 -103 -48 -5 -134 -36
6925c6n9R9J19l28J21J33K8P3k62K52r6o0p6Q0J11p8j12r7m7L45j64O9j30K8K33
$$ -36 -95 4 123 -205 -84 49 77 150 -112 140 44 -16 -92 -12 99 21 -91 -188 -235 110 -54 15 -115 -87 146
6950A46j47j04N6J42j0j42j08J84J12M5r6n0j9J22O1kl04j82N52j53j43J8pK28
$$ 146 -1 -105 -49 93 83 -59 -167 17 129 174 78 28 9 131 192 190 -114 -296 256 103 -40 -22 -29 199
6974A99p6n4j83J42N1Rr5N5k38K49J0j76M7rl2j07J7P5L65j19m1k63K83r1J53
$$ 199 123 69 -114 28 79 88 -7 48 -190 59 69 -107 -60 -69 -101 -208 -191 -116 249 130 89 -174 109 18 171
6999A71o0m54K53K25p1m8j85N6K49k47k0J05P0j44N4j84J00J38j51K76l08J31
$$ 171 111 -343 -90 135 64 16 -169 -113 136 -111 -131 -26 44 -100 -46 -230 -130 8 -143 133 -175 -44
7021d4K06N8l30K8j34L06Q6j13r4L5J33jk46K5K01l9r6j60J9K36K19l67Q4j05
$$ -44 162 220 -110 -82 -216 90 176 63 -31 4 137 136 -110 -85 116 77 -19 -179 -160 76 295 -72 12 -93
7045i3K93O4k58q4J4Q2Q5j14l43L83j08Q8j82N1j0O4R9j45R1p8L72m22j06J14
$$ -93 200 264 6 -78 -64 18 103 -11 -354 29 -79 9 -173 -122 -132 -68 31 -114 -23 -101 271 -151 -257 -143
7069a43L66j80k8L5k13O5J08j61mJ62L2J70l01j12J27L36l22j5j59L01j18m0J22
$$ -143 223 43 15 50 -163 -98 10 -151 -155 7 39 209 -92 -204 -77 259 -63 -78 -237 64 -54 -94 28
7092B8j08J00J41k17j14O8J76k44O5J40q3K53j01j4k23J90M5N8m16J73J18K10
$$ 28 -80 20 161 -56 -170 -102 74 -170 -105 35 -48 205 104 90 -133 57 102 160 -256 -83 35 245
7114B45j49M5l40K34K06m21j06Q0J96J04n0k84J25J06J30j69j8n0K07M5J9j60
$$ 245 96 141 -199 35 241 -180 -286 -206 -10 94 44 -240 -115 -9 121 -48 -66 -116 91 136 155 -5
7136ej86J68K23l48L28Q0k93lk48L61k01K35K4l47J55m3N9j23J58l5qQ6m33K44
$$ -5 -191 -23 200 -148 180 260 -33 -36 -284 77 -124 111 135 -212 -57 -100 -41 -164 -6 -41 -49 37 -396 -152
7160a52K69m9p0J38j83j1PJ30r7j48K5K13k25jK81jp1K4p8j79K13Mr3l1K7MK33
$$ -152 117 68 -2 136 -47 -58 -51 79 -18 -166 -141 72 -153 -154 127 126 55 79 1 -178 35 39 -54 -85 -58 -54 179
7187A79l01n5O3R4n2R0j58K34K79j98j41k44K02J46k85R6k47K34J23k51J90K8
$$ 179 -122 -177 -114 -20 -72 18 -140 94 373 175 34 -210 -8 138 -147 -51 -298 -64 59 -192 -2 26
7209B6r7K71j36p1L1P1q4j06j59L72M0j34M5j85J32J67m13OK47p7K94l87K07P2
$$ 26 -71 200 64 -7 24 95 11 -95 -254 118 158 24 69 -116 16 183 -230 -224 23 -54 240 -147 60 132
7233A32j18K35k03n1J3Q5m6j90Q3k36O07j43l57K6K37o5J34j16j35M1J53j13r3
$$ 132 14 249 46 -5 8 93 47 -143 -60 -296 311 168 -189 -163 74 9 143 27 -108 -67 86 -27 -120
7256a20n2K67J11j10k58J10J04J41k14J38r2K08k39j30K79k62R5J56J21k37j47
$$ -120 -172 95 206 96 -162 -52 52 193 -21 117 25 233 -6 -136 143 -119 -24 132 253 16 -131
7277a31L66l76J29j1J90p8j41o6p0K97L6m1r0l8R4N2o4p4K83n1k38M6m6Q5j43
$$ -131 235 -141 -12 -23 167 89 -52 -118 -188 109 145 104 14 -24 70 122 58 -16 267 216 -22 24 -22 63 -80
7302h0J11j30N0O6J93j36n7j55J22L5j58N9J25j0J21k32p9J31J81j68j48MJ07
$$ -80 31 -99 -49 17 210 74 17 -138 -16 19 -139 -80 45 35 156 -76 -155 -24 157 -11 -159 -155 -48
7325d8J52J87l07%J02lj72J45k92J7K41P4k64n0K28O4k10J32L2M1Q0j08L1j95
$$ -48 104 291 -16 -16 86 83 -89 56 -236 -219 22 96 -168 -218 10 74 -136 -4 28 69 149 41 72 -123
7349a23K18k8j73O8j83M17j65j15n3o2K43r1J10j48K09o1j72J46q9J24l6j02m1
$$ -123 95 67 -106 -38 -221 196 31 -84 -137 -199 44 -47 63 -85 124 63 -109 37 -52 72 36 -66 -107
7372a07R0K08o3L3k8j05jJ89r4o8k02K39q3N5j33K19K1j29m9j67K34J40j04j64
$$ -107 -17 191 128 161 133 28 27 216 122 54 -148 91 8 63 -70 149 170 41 -8 -175 59 199 95 -69
7396f9q6N7J82J34m37K9J73l9P2o0L8j07L74k85k3N5n9J49r1j53K75r3q6n0J96
$$ -69 -155 -98 84 218 -219 -190 -17 -56 16 -44 -6 -113 261 -24 -47 8 -51 98 7 -146 129 36 -50 -100 96
7421I6qj09M17m41j92M01L9k15J6l5K59j33k40M2J19j81O7k5J02k8O4l3j45q4
$$ 96 88 -21 396 -45 -237 164 203 -12 4 -31 228 95 -145 -103 16 -165 -98 -123 -21 -49 15 -18 -163 -247
7445b47K87L5j78J29j54K80q4J0r9o1J07J5q7p7J55N0J93j97j96M2J7K05l46l3
$$ -247 40 75 -103 26 -128 152 68 78 -21 -82 25 40 -47 -124 31 81 274 77 -119 -77 -60 145 -201 -234
7469b34K85QK8k66J29J5K29p2j34j51M3M53l40J62k24pM25l11k30J47p9K22n2
$$ -234 51 59 87 -179 -50 -35 194 122 -12 -163 -120 333 -7 155 -69 -76 349 38 -192 -45 -124 98 46
7492D6j63K32j83J84j95j47M02q7J34j48q3q1O6o9J5n7K48j01OKq8J27j20M0j37
$$ 46 -117 115 -68 116 -79 -226 176 89 223 75 -8 -89 -23 -92 -77 -134 114 13 19 21 -67 60 -60 -20 -157
7517a57R5jJ27j54J87L2q2k1j57O1J22l4p1P6j93PK37l1l04M19j65N5j69j17J90
$$ -157 -62 -63 64 -90 97 129 47 26 -131 -70 52 18 -53 23 -170 -163 74 43 -261 158 -7 48 -121 -238 -48
7542d8j9P6l6k39J02L76o7q8k15K05l3o0J49k50L0K28j91J3L8L1J57j77J70k6
$$ -48 -67 9 -27 -266 -164 212 145 57 -158 47 14 -46 103 -147 -117 111 -80 -67 -29 2 159 -18 152 126
7566A26n3j25M0o2j01J41L25k51Q5j64K05N9k91J66q4j6J14o0q4J61J32j84j94
$$ 126 73 -52 -12 -74 -175 -34 291 40 125 -39 166 225 -66 100 16 0 114 54 -30 131 263 79 -115
7589a15L9O7J07J24l61J79K2k4J38p0k72K35KJ40k19J04M3r2o6Q9o5Q9M9j14k02
$$ -115 -76 -9 98 222 -139 40 62 38 176 106 -166 69 71 211 -8 96 139 47 -19 70 5 94 143 29 -173
7614a73K29O5k1k49R0K22L4k77L7n1P3K09j58m2o1P3l18M39l8J5N3j48Q2J0p1
$$ -173 56 121 100 -149 -59 163 197 -80 -43 -94 -21 188 30 -12 -73 0 -318 121 83 98 151 3 85 95 24
7639B4M2o2J3J94j46J69l2m39J32K96k8j25r4m7K29j7k76O2K01j95K27l0j14J0
$$ 24 66 4 17 211 65 234 202 -237 -105 191 163 38 -56 -103 126 109 -167 -105 96 -99 128 98 -16 -6
7663fm6%q7n5K5M0R9j88K38K8Rj59N7J3J6J60j89o1J72n2L9m2M7P1j65j05R4l5
$$ -6 -52 -52 -139 -194 -169 -129 -30 -218 20 48 57 -102 -45 -32 -16 144 -45 -106 66 14 53 11 58 129 -36 -141 -47 -82
7691h2K04J1k28K25k44J18J21j11k5j5K6J81k30K8J08Q0P0p2m52J86J60j25j48
$$ -82 122 133 -95 130 -114 4 125 14 -11 -26 0 181 -49 -21 87 167 237 165 -287 -101 59 -66 -214
7714b14K13o0J68j35N1k26M42p0k89R3J13m4o4m3r1j13P3K91j80J61l24J58K00
$$ -214 -1 -61 107 -28 23 -203 239 169 -120 -27 86 42 -22 -65 -156 -269 -196 95 -85 76 -248 -90 110
7737A10M1j90Q1N8k51J03k6N3O9R3k05J64k10K80k12M0K6PR1m9j17J49Nj02p6
$$ 110 151 -39 42 100 -151 -48 -74 -21 48 141 -64 100 -110 170 -42 -2 24 31 122 73 -44 105 110 8 -68
7762f8m4L1K30K9j86o2P3J17j17J99k47m7N4j4j52K18J55k15k8j20N1J87R7k8
$$ -68 -112 -81 149 178 -8 -70 3 120 3 202 -45 -92 -38 -52 -204 14 169 -46 -74 -194 -143 44 141 113
7786A13j63J64o3j03l6k36N44k43o8P7j26K06J91j08j85j1N6O2r7N4J68l02J83
$$ 113 -50 114 51 -52 -88 -324 220 -23 -91 -14 -140 66 257 149 -36 -47 9 71 -26 28 196 -106 77
7809G7l5j69%l8L82j09r9K34k21m9R6J67l18J30R9M2k73OM8k7MJ0M9n8J67k72
$$ 77 42 -127 -127 -165 217 108 9 243 22 -27 69 236 -82 48 147 189 -84 -78 -30 -57 -53 -43 6 -52 115 -157
7835a57K84o5j8Jr1n1J77k5J26k39%L3J01N5j22P9l5l8q0j38K24J34j46L2n7j02
$$ -157 127 62 44 45 -46 -97 80 55 181 -58 -58 -25 76 131 9 88 53 15 -65 -203 21 155 9 41 -16 -118
7861a18n5K45J1j92j1J35J93l93R9j00K00oj03J69k05L65l07M6N5Q3l08L13j73
$$ -118 -173 72 83 -109 -120 15 208 -185 -86 -186 14 8 -95 74 -131 234 -73 -27 28 111 -197 116 -57
7884e7m9P0K06k23J31K7q7J20j17j8k3MK46m03P6L40k19k11J57j00kJ7K48j43
$$ -57 -106 -36 170 -53 78 105 18 138 21 3 -20 -16 230 -173 -97 243 24 -187 -30 -130 -132 -115 133 -10
7908a0k1o1K61j04j79J75p3M6n1J3n1O7M8k13K56kk22PJ42m4j05O9K38k62j61
$$ -10 -31 -92 169 65 -114 61 -12 34 -17 -4 -55 12 60 -153 103 101 -121 -114 28 -16 -121 -52 186 -76 -237
7933b37M47l00J01J27j53K95k79o6j33J69P8j07J00k95L59K04j27k86pJ38n1P
$$ -237 210 -90 11 138 -15 280 1 -65 -198 -29 49 -58 42 -253 106 310 183 -103 -110 28 -23 -16
7955a6j4J03l2N3r1N2K0q3q8K1J17J3P2p4n3o4J05R6j94J02j42M0R1J23j22K0
$$ -16 -30 73 41 94 3 55 75 -8 -96 -75 42 55 127 53 0 -64 41 137 -57 45 -97 -57 34 157 35 55
7981E5j66N6J24n6j68J95J97n73K54K46l26J97k39J31O5J98k08J08k04K8J13j62
$$ 55 -111 -55 69 13 -155 40 237 -336 -82 164 -162 35 -204 -73 -8 190 -18 90 -114 -86 27 -135
8003a35K76j03k63L06l7mj52J11j70J65J38l31J99k4j60K21k76K67q0j18J95J35
$$ -135 141 38 -225 81 44 40 -112 -1 -171 -6 132 -199 0 -24 -184 37 -239 28 -52 -170 25 160
8025A60k70q6p0K08n6K86j87m9j52J86J02j30J28k4J66k23L4j97K15N9k38J63
$$ 160 -110 -196 -266 -58 -114 172 -15 -64 -216 -30 72 -58 70 46 212 -11 23 -174 41 100 -138 25
8047B5J1j44L15k86K08k13J56P%j9j17J2K4J57k66K84l43L03O3k32J74j08K3l5
$$ 25 36 -108 207 -79 129 -84 72 79 79 60 -57 -45 -21 136 -130 154 -189 114 177 -55 119 11 34 -1
8071aRJ3P9r5N1r2r9K88k49J71k65J42K72k54k51L02m4m0N3j49P1R5O7j15n3J26
$$ -1 8 21 100 5 56 -36 -135 153 -96 75 -190 -48 224 -30 -281 21 -23 -63 -10 -159 -88 7 74 -41 -94 32
8097C2j57L9K08k59K37k04J09p9k2J94Qp9Mm7K0J24l3j04N9n4K0L5k72K27J92
$$ 32 -125 -86 122 -137 100 -104 5 -74 -96 98 106 27 31 -16 4 128 95 -9 50 -4 16 51 -221 6 198
8122A98L1m04k1Q3K78j78J42q2K6j66JJ06J41j41p8LL03l89j1N4K6mK5R5P0rj34
$$ 198 229 -175 -196 -113 165 -13 129 47 73 -93 -92 14 155 14 -64 -61 242 -147 -158 -104 -78 -82 -57 38 108 99 -35
8149c5O6k0J48k51J5J84j66J89j63J00k0N0m59M40O1jj76j74K47J63k51j03J47
$$ -35 31 11 159 -92 -77 107 -59 130 -33 67 47 97 -362 78 139 138 -38 -212 35 198 -53 -156 -9
8172ij26J96r7O9L0n1N1k9q3J83n3n6k8k26K55k0j29L84l62
$$ -9 -135 61 -36 33 63 12 63 34 -49 134 81 25 -3 -229 26 6 -123 261 -101
8191a01
$$ Imaginary data points
##PAGE= N=2
##DATA TABLE= (X++(I..I)), XYDATA
0@%%%%%%%%%%Pj4J4k1K8k8L5m9O3p6R0j05J24j46J74k06K36k73L16l62M15m75
$$ 0 0 0 0 0 0 0 0 0 0 0 7 -7 7 -14 14 -14 21 -28 35 -41 49 -56 68 -78 96 -110 126 -147 169 -193 222 -253
32b53N40o13O94p84Q81r88J107j233J374j532J699j880K082k304K544k806L095
$$ -253 287 -326 368 -416 465 -523 584 -649 725 -807 892 -988 1094 -1210 1334 -1472 1623
49A623l411L756m138M559n027N553o143O808p568Q450r481J0708j2199J4055j6438
$$ 1623 -1788 1968 -2170 2389 -2638 2915 -3228 3580 -3988 4462 -5019 5689 -6510 7545 -8893
64h893J9628k4149L1102m3301P0983k52195l923L83688j48864k75508n9742L28402
$$ -8893 10735 -13414 17688 -25613 45370 -206825 -210748 172940 24076 -251432 -311174 17228
76A7228J49718j98103l10122N4102L43202J65474k44254k92554N4667L33299O7840
$$ 17228 166946 -31157 -341279 -287177 56025 221499 -22755 -315309 -260642 72657 140497
87A40497k63030j99445K03201L34202k0711l29027j71225K06172K96200l3330
$$ 140497 -122533 -321978 -118777 215425 194714 -134313 -305538 -99366 196834 163504
97A63504k41228o5018K53739K23571j66887l40362o7488K80720K18076j63056
$$ 163504 -77724 -142742 110997 334568 167681 -172681 -240169 40551 258627 95571
107I5571k40450O0394K92645J01891k48772k23765J06305K92386P7049k47829
$$ 95571 -144879 -84485 208160 310051 61279 -162486 -56181 236205 313254 65425
117F5425j94863J12016K44063p814k79752j21109K16804K55743p5602l08037r3285
$$ 65425 -129438 -17422 226641 218827 -60925 -182034 34770 290513 214911 -93126 -186411
128a86411K04477J83368j05932k26726K4306K52051J45776j81004k82877J530
$$ -186411 18066 201434 95502 -131224 -106918 145133 290909 109905 -172972 -171442
138a71442K29069J01860j90336j97773J18037K53146K6707k44067j66449J53561
$$ -171442 57627 159487 -30849 -228622 -110585 142561 169268 -74799 -241248 -87687
148h7687K29852k722k21070j16029J62163J76751p1944k41441o2178K30606J84977
$$ -87687 142165 139443 -81627 -197656 -35493 141258 69314 -172127 -234305 -3699 181278
159A81278j07898k42477k6663K10881R8962j52034j77254P8056K53984Q1018j74225
$$ 181278 73380 -169097 -195760 15121 114083 -37951 -215205 -137149 116835 197853 23628
170B3628j87652N6797K02873J8305j93661j28858J43741K20677l2244k21035r3914
$$ 23628 -164024 -107227 95646 113951 -79710 -208568 -64827 155850 123606 -97429 -191343
181a91343J69379J83555o7482j87697l5427J74464J28456j24088j96705q28K09662
$$ -191343 -21964 161591 94109 -93588 -129015 45449 173905 49817 -146888 -147716 61946
192F1946J27133j38170j78068L4002J87947L9524j89670j33152J10443K14448
$$ 61946 189079 50909 -127159 -93157 94790 134314 -55356 -188508 -78065 136383
202A36383K8773j78900j04659J03055J57068l5498j96853o5767J55669J63192
$$ 136383 165156 -13744 -118403 -15348 141720 106222 -90631 -156398 -729 162463
212A62463p1214k03368k8427J71254J22928j04379j66171L3035J73384O9870j45713
$$ 162463 91249 -112119 -140546 30708 153636 49257 -116914 -83879 89505 159375 13662
223A3662j62018N5002J81967O2051j43116j25963R1123J60597j3275j92566r8435
$$ 13662 -148356 -93354 88613 150664 7548 -118415 -27292 133305 120030 -72536 -170971
234a70971J39235J63655k6274j63565m6808J43721J11259p9072j72580j8451J66369
$$ -170971 -31736 131919 105645 -57920 -104728 38993 150252 71180 -101400 -119851 46518
245D6518J02168j02089j66665J6524J73203O0380j30241j29837P2437J70854J1554
$$ 46518 148686 46597 -120068 -103544 69659 130039 -202 -130039 -57602 113252 124806
256A24806j56418j15667Q6049J55994m674j41481p0727J21426J39133o0999j75775
$$ 124806 -31612 -147279 -61230 94764 90090 -51391 -122118 -692 138441 77442 -98333
267i8333n4335J43716J21664q0149j42472M129J54554P6618j16840j36417K7217
$$ -98333 -152668 -8952 112712 32563 -109909 -105780 48774 125392 8552 -127865 -100648
278a00648J57565N6831j28802j18983N6215J55864J8244j48696q3268J02259J49677
$$ -100648 56917 113748 -15054 -134037 -77822 78042 96286 -52410 -135678 -33419 116258
289A16258k4279j61851o0878J07798J20209m7943j40864j4267J36125J07044q2582
$$ 116258 91979 -69872 -130750 -22952 97257 49314 -91550 -105817 30308 137352 54770
300E4770j54141m8J39861P6213j07193j24640N2178J46841L7871j30645j05882
$$ 54770 -99371 -99419 40442 116655 9462 -115178 -63000 83841 121712 -8933 -114815
311a14815P2647J34892J2080j34621q1247R3612J24600k0875j45088m7900J27054
$$ -114815 -42168 92724 104804 -29817 -111064 -17452 107148 86273 -58815 -106715 20339
322B0339J12945n5074j47724k1409J26177P3505q2375j27068K0950J42468N9653
$$ 20339 133284 78210 -69514 -90923 35254 108759 26384 -100684 -79734 62734 122387
333A22387r7764j19940L7923J36431K5459j19482r6249P7291J34981q522j31042
$$ 122387 24623 -95317 -57394 79037 104496 -14986 -111235 -33944 101037 92515 -38527
344c8527o9425R5599J14289l6400j27351m2001J09737R6843o1136j25296j1882
$$ -38527 -107952 -12353 101936 65536 -61815 -103816 5921 102764 41628 -83668 -95550
355i5550J31666Q1392q5705j17858J5265J27656L9545j11429r8095M7294J30269
$$ -95550 36116 117508 31803 -86055 -70790 56866 96411 -15018 -113113 -65819 64450
366F4450K1084j13467p6187O6536J20706q660j25985n4658R1875J11101l9068
$$ 64450 85534 -27933 -104120 -37584 83122 74462 -51523 -106181 -14306 96795 57727
377E7727j28335k5480J05797Q6487o6324j18829J325J10523O4286q3410j06417
$$ 57727 -70608 -96088 9709 96196 29872 -88957 -87632 22891 87177 3767 -102650
388a02650K8999J21117M7702r8520r1459N4582J14634J0591j18814p1401P5390
$$ -102650 -73651 47466 95168 -3352 -94811 -40229 74405 84996 -33818 -105219 -29829
399b9829J04253j3100j16205m2906R3022R2404l4589j16449k0223J06683P6269
$$ -29829 74424 61324 -54881 -97787 -4765 87639 53050 -63399 -83622 23061 99330
410I9330n9591j12714P922J15187N0201q2126j00785L1878J10645K3468r3269
$$ 99330 39739 -72975 -65053 50134 100335 18209 -82576 -50698 59947 83415 -9854
421i854q1934N6187J11284O307r9826o2219P7517J01727k3639j10032m1522R0578
$$ -9854 -91788 -35601 75683 81990 -17836 -80055 -2538 99189 75550 -34482 -76004 14574
433A4574Q0893n0472j06046j5610J01982O5183o4589r5302P870J07834M4714q2471
$$ 14574 95467 44995 -61051 -76661 25321 90504 25915 -69387 -61517 46317 91031 8560
445H560q6301L3084J11096J9859r7135p1400N1272R9305r542j03883m8600P0330
$$ 8560 -77741 -44657 66439 86298 -10837 -82237 -30965 68340 58798 -45085 -93685 -23355
457b3355R2964k5928j02046k7332Q5713Q0789m7145r9944m162R4613N7705p3003
$$ -23355 69609 43681 -58365 -85697 16 80805 33660 -66284 -70446 24167 81872 8869
469H869r4493J6545R6241L8648q1658p5856M0352R6470J7697r2187o1150O0675
$$ 8869 -85624 -69079 27162 65810 -15848 -91704 -51352 45118 62815 -29372 -90522 -29847
481b9847R4970k191r8667m2230P3458P7067l0670j02016j9600Q6604O5468m5223
$$ -29847 65123 62932 -35735 -77965 -4507 72560 41890 -60126 -79726 6878 72346 27123
493B7123r4328J678R2527M9748o0348q3572K6602R8037K8803p9183p7057M1406
$$ 27123 -67205 -65527 27000 76748 16400 -67172 -40570 57467 86270 7087 -69970 -28564
505b8564Q9943N178q5178n5335O1291Q3965j4706q9958l8279P6100P6579k9196
$$ -28564 61379 66557 -18621 -73956 -12665 71300 56594 -33364 -71643 4457 81036 51840
517E1840q7226j7473Q4968N5165n5844q7487J949R1343M0331o6024p5111K0998
$$ 51840 -35386 -52859 32109 87274 31430 -56057 -54108 37235 77566 11542 -63569 -42571
529d2571Q9194J9607p6136o0136M3986R2482K810q4409m8501N3619P8254k2050
$$ -42571 46623 66230 -9906 -70042 -26056 66426 69236 -15173 -63674 -10055 68199 46149
541D6149q7638k6882O9413O7417l9693q6567j0439P7316N6381n0086p4255J1441
$$ 46149 -41489 -68371 1042 68459 28766 -57801 -68240 9076 65457 15371 -58884 -47443
553d7443Q2959L5924p1243p1541K7254Q2849J9822p6588n4290M3579P5006l184
$$ -47443 35516 71440 197 -71344 -44090 38759 58581 -18007 -72297 -28718 46288 43104
565D3104q4455l7872O0850P4306j4538q3030k1271O7904N6770l7426q2412j573
$$ 43104 -41351 -79223 -18373 55933 41395 -41635 -62906 4998 61768 24342 -58070 -59643
577e9643P7293M3586n2209p6849J3158P7465K9041n9470o0208L6676P9312J0722
$$ -59643 17650 61236 9027 -67822 -54664 22801 51842 -7628 -67836 -31160 48152 58874
589E8874p2789n4698M7077P2576n316p2918l3778O1055O1453k7271p8638j9580
$$ 58874 -13915 -68613 -21536 51040 45724 -27194 -60972 83 61536 34265 -44373 -63953
601f3953P0848N3817l5001o9429o18P5736L5777n3036o5612J7067P9300K1262
$$ -63953 6895 60712 25711 -43718 -44336 31400 67177 14141 -51471 -34404 44896 66158
613F6158o3041n7111K8494P2600K735o7145l9068M9473P2136j2536p3246l0371
$$ 66158 3117 -53994 -25500 47100 49835 -17310 -56378 -6905 65231 52695 -20551 -50922
625e0922N3511N9546k7864o8664r232O6033M7236m5947o9383J491O7565L4873
$$ -50922 2589 62135 34271 -34393 -43625 22408 69644 23697 -45686 -44195 23370 58243
637E8243n3126n6055K1208O9146J7854o5303m8338L5118O8570M078o9024l6454
$$ 58243 5117 -50938 -29730 39416 57270 -8033 -56371 -21253 47317 51395 -17629 -54083
649e4083M2928N7382j5930p1279j8095N8665N4714k6211o9984p230N9042L7674
$$ -54083 -11155 46227 30297 -40982 -59077 -412 54302 28091 -41893 -49123 9919 47593
661D7593m0688o2791J3309O8100K7772n2270n8604K2989O3250J1882n7762m3271
$$ 47593 6905 -55886 -42577 25523 53295 1025 -57579 -34590 28660 40542 -17220 -60491
673f0491L9904O0984l724o3903l3028N0269N6518j4503o2539j8419N6196M1465
$$ -60491 -20587 40397 36673 -27230 -60258 -9989 46529 32026 -30513 -48932 7264 48729
685D8729l3041o3301k872O6066L6051l8382n5769R426O2108J7082n1634m8286
$$ 48729 15688 -47613 -50485 15581 51632 13250 -42519 -33093 29015 46097 -5537 -53823
697e3823K7015O6337P980n5975l9146L4792N8061r277n8886k4929M7877N2581
$$ -53823 -26808 39529 47509 -8466 -47612 -12820 45241 35964 -22922 -47851 26 52607
709E2607k3188o1263j4341N3942M4200l2167n3907K152N7710K8357m8108n2496
$$ 52607 29419 -31844 -46185 7757 51957 19790 -34117 -31965 25745 54102 5994 -46502
721d6502J3579O1125K1112m9797m0018K6321N6063J441o0056l2231L7542N5503
$$ -46502 -32923 28202 49314 -483 -40501 -14180 41883 43324 -16732 -48963 -11421 44082
733D4082p125n8973j9363M4718M4803k2365n9051n014N2796L6775l3716n7360
$$ 44082 36957 -22016 -41379 3339 48142 25777 -33274 -38288 14508 51283 17567 -39793
745c9793N045N3487K5722m1026m6284K1147N5315J2078n2924m3080K9104N2619
$$ -39793 -34748 18739 44461 3435 -42849 -21702 33613 45691 -7233 -50313 -21209 31410
757C1410K155n1057k6966M1454M6619j4128n8288j9639M7654L9754k2244n3448
$$ 31410 33565 -17492 -44458 -3004 43615 29487 -28801 -48440 -786 38968 16724 -36724
769c6724m456N2646K8306l3985m9936Q558N6947J9326m1677m4609J7690N3190
$$ -36724 -41180 11466 39772 5787 -44149 -35591 21356 40682 -995 -45604 -27914 25276
781B5276N789m6474l2708L2658N2913n553n2076k7183L7080M4917j6311m8376
$$ 25276 31065 -15409 -48117 -15459 37454 31901 -20175 -47358 -10278 34639 18328 -30048
793c0048j0206M8233L8486k8482m9773k922M9512K7812l6195m2996J0865N1563
$$ -30048 -40254 7979 46465 17983 -31790 -34712 14800 42612 6417 -36579 -25714 25849
805B5849J6237m4620l6819K2050N2434P062m8261k8162K8979M5185p715n1149
$$ 25849 42086 -2534 -39353 -17303 35131 42193 -6068 -34230 -5251 39934 32219 -18930
817a8930j6431L9831M2837j7187n1376q970M0975L1365k8616m6886O264M8339
$$ -18930 -35361 4470 47307 30120 -21256 -30226 10749 42114 13498 -33388 -27124 21215
829B1215K4890l5859m3506J3734M5805J2771m2652l4925K4513M4375J177m7675
$$ 21215 46105 10246 -33260 -19526 26279 39050 -3602 -38527 -14014 30361 31538 -16137
841a6137k7217L3552M2146p048m7197j6207L9325L2866k0038m7929n478M6019
$$ -16137 -43354 -9802 32344 25296 -21901 -38108 1217 34083 14045 -33884 -39362 6657
853F657K8540k6152m4144M160M5272J5106l5338l9106J6946M8854Q783l8760l1255
$$ 6657 35197 9045 -35099 -30939 14333 29439 -5899 -45005 -28059 20795 29578 -9182 -40437
866d0437K4986M4051k920m2576k2402L3122L9888j3924m4042j4264L9343L4154
$$ -40437 -15451 28600 25680 -16896 -39298 -6176 33712 19788 -24254 -38518 825 34979
878C4979k0849m0431k529M3883K4084l1710l9369P045M5866J7195l5498l1592
$$ 34979 14130 -26301 -28830 15053 39137 7427 -31942 -24897 20969 38164 2666 -28926
890b8926J6277M3371M086m2942k6399K4947M2310l724m3099j6124L1760L6623
$$ -28926 -12649 30722 34808 -8134 -34533 -9586 32724 29000 -14099 -30223 1537 38160
902C8160j4822m3593o706L7051K9783k4254m2732J183L9050K1758l0452l6012
$$ 38160 23338 -20255 -26961 10090 39873 15619 -27113 -25930 13120 34878 4426 -31586
914c1586J2995M0943J2342l7979l2246K0068L9449M062l9531k1886K8535L5607
$$ -31586 -18591 22352 34694 -3285 -35531 -15463 23986 28048 -11483 -33369 -4834 30773
926C0773o919m3330j5864L3870L0774j4597m1469m541L8333K4262k2688l8967
$$ 30773 23854 -19476 -35340 -1470 29304 14707 -26762 -31303 7030 31292 8604 -30363
938c0363M993M1406J6301k9450l5364J2207L9870P161l3925k7950K2669L9355
$$ -30363 -25370 16036 32337 2887 -32477 -20270 19600 26761 -7164 -35114 -12445 26910
950B6910j063l7941k1959K8017L4642j0222l7220j2312L5157K9212j8261l8045
$$ 26910 25847 -12094 -34053 -6036 28606 18384 -18836 -31148 4009 33221 14960 -23085
962b3085m854L6594K3752k7341l3283L245M0401J4699l2420k8671J2781M0454
$$ -23085 -27939 8655 32407 5066 -28217 -24972 15429 30128 -2292 -30963 -18182 22272
974B2272N893l5246k3791J9905L6165l668l8121j5731K7567L3920j1519l7880
$$ 22272 28165 -7081 -30872 -10967 25198 21530 -16591 -32322 -4755 29165 17646 -20234
986b0234q741L1261K7362j9924l5996J456L5199K1623k6306l2941Q795L5594J2837
$$ -20234 -28975 2286 29648 9724 -26272 -24816 10383 32006 5700 -27241 -18446 17148 29985
999B9985l1551k7477J6493L5139M642l5441k0627K3853L3105k869l6985j3143
$$ 29985 -1566 -29043 -12550 22589 27231 -8210 -28837 -4984 28121 25252 -11733 -24876
1011b4876K8736K7664j2186l7155n384L3048K2724j7999l5274K764L4586J5086
$$ -24876 3860 31524 19338 -17817 -23201 9847 32571 14572 -20702 -17938 16648 31734
1023C1734k5086l1920J1101L5917Q060k9722k6308J8180L3446j47l3220j9354
$$ 31734 6648 -25272 -14171 21746 29806 84 -26224 -8044 25402 25255 -7965 -27319
1035b7319K3674L0338q563l3618j3342K9864K5736j5064l2926n059L2666J9944
$$ -27319 -3645 26693 18130 -15488 -28830 1034 26770 11706 -21220 -26279 6387 26331
1047B6331k2299l0892K018L4993J2724k5586k7879J0766L4019O284l1485k0821
$$ 26331 4032 -26860 -24842 10151 22875 -2711 -30590 -19824 14195 20479 -11006 -31827
1059c1827J5894L4471l000l1258j6013K3502K9734r740l1604r931K9598K2311
$$ -31827 -15933 18538 15538 -15720 -31733 -8231 21503 11763 -19841 -29772 -174 22137
1071B2137j2707l5507K575K7291K1893k2419k9996R281K9151J5222k8007k5745
$$ 22137 9430 -26077 -23502 3789 25682 3263 -26733 -17452 11699 26921 -1086 -26831
1083b6831J5953K8361P792l0853k0576K2302K7389j442l0371j5524K5531K7142
$$ -26831 -10878 17483 25275 -5578 -26154 -3852 23537 22095 -8276 -23800 1731 28873
1095B8873j1643l1430m444K5647K2841j4944l3670K609L1865J2378k1265k6243
$$ 28873 17230 -14200 -18644 7003 29844 14900 -18770 -16161 15704 28082 6817 -19426
1107a9426P531K8928J1033k5835k6355J6228L1672m36k9964j6827K2394K4755
$$ -19426 -11895 17033 28066 2231 -24124 -7896 23776 23340 -6624 -23451 -1057 23698
1119B3698o175k8343j1454K3408K2219r736k9178p232K8166J9683j7273k8856
$$ 23698 17523 -10820 -22274 1134 23353 13617 -15561 -22793 5373 25056 7783 -21073
1131b1073m31L1961J3815k2673k6096P793L2152O599k6305k2031J3739L1388k74
$$ -21073 -21504 10457 24272 1599 -24497 -16704 15448 22047 -4258 -26289 -12550 18838 18564
1144A8564k7904j6492J8597K7816o748k8053r141K2857K2327j3144k6930j681
$$ 18564 -9340 -25832 -7235 20581 13833 -14220 -23361 -504 21823 8679 -18251 -19932
1156a9932K6036J6987k0332k5673N384K9159J2691k4667k3895R424K8229O627
$$ -19932 6104 23091 2759 -22914 -17530 11629 24320 -347 -24242 -14818 13411 20038
1168B0038k5621j7204J5510K5900j807k9947j2017K1286K4798o149k9104o987
$$ 20038 -5583 -22787 -7277 18623 16816 -13131 -25148 -3862 20936 14787 -14317 -21304
1180b1304K3188J9222j4104k8618R75K7284J5665j7089k5747O192K6662Q243k2692
$$ -21304 1884 21106 7002 -21616 -20641 6643 22308 5219 -20528 -14336 12326 20569 -2123
1193b123k2735J2789K7120L042k4072j7150J7922K5065k781k6234j2155K2533
$$ -2123 -24858 -12069 15051 18093 -5979 -23129 -5207 19858 17077 -9157 -21312 1221
1205A221K1250r725k7485o057K5707J7001j4013k4656O39K7463J2043j8642k2703
$$ 1221 22471 12746 -14739 -20796 4911 21912 7899 -16757 -16118 11345 23388 4746 -17957
1218a7957O472K8261O651k1945j9129J2171K6932k65k5077j4499J7105K4508o166
$$ -17957 -11485 16776 23427 1482 -17647 -5476 21456 21191 -3886 -18385 -1280 23228 17062
1231A7062k5999r072K0128K0692j1575k5206l559K3629J6717j6817k3183J362
$$ 17062 -8937 -18009 2119 22811 11236 -13970 -17529 6100 22817 6000 -17183 -15821
1243a5821K4841J1555k0241k0211P499K5109N885k3957j7008J1958K4437N96k5264
$$ -15821 9020 20575 334 -19877 -12378 12731 18616 -5341 -22349 -10391 14046 14642 -10622
1256a0622j1576J6880K2018n158k6346o560K0630J9283j0425k5276r73K2338J3913
$$ -10622 -22198 -5318 16700 11542 -14804 -21364 -734 18549 8124 -17152 -18125 4213 18126
1269A8126j5209k3389M466K4101R664j9248k0715R942K3115M103k1884j5968J5256
$$ 18126 2917 -20472 -16006 8095 17759 -1489 -22204 -12262 10853 14956 -6928 -22896 -7640
$$ [...]
8191B1
##END NTUPLES=NMR FID
##END=
