##TITLE=1H_47-2023
 CDCl3
 8 sc, 
 7.8.2023
##JCAMPDX= 6.0         $$ Bruker NMR JCAMP-DX V2.0
##DATA TYPE= NMR FID
##DATA CLASS= NTUPLES
##ORIGIN= UXNMR, Bruker Analytische Messtechnik GmbH
##OWNER= root
$$ XWIN-NMR		Version 3.5
$$ Mon Aug  7 13:50:29 2023 Russian Standard Time (UT+4h)  she@DPX200
##.OBSERVE FREQUENCY= 200.13135
##.OBSERVE NUCLEUS= ^1H
##.DELAY= (6, 6)
##.ACQUISITION MODE= SIMULTANEOUS
##.ACQUISITION SCHEME= undefined
##.AVERAGES= 8
##.DIGITISER RES= 18
##SPECTROMETER/DATA SYSTEM= spect
##.PULSE SEQUENCE= zg30
##.SOLVENT NAME= CDCl3
##.SHIFT REFERENCE= (INTERNAL, CDCl3, 0, 15.7039)
##AUDIT TRAIL= $$ (NUMBER, WHEN, WHO, WHERE, WHAT)
$$ ##TITLE= Audit trail, XWIN-NMR		Version 3.5
$$ ##JCAMPDX= 5.01
$$ ##ORIGIN= Bruker BioSpin GmbH
$$ ##OWNER= she
$$ F:/spectra/data/she/nmr/H-F/1/audita.txt
$$ ##AUDIT TRAIL=  $$ (NUMBER, WHEN, WHO, WHERE, WHAT)
(   1,<2023-08-07 13:49:23.68 +0400>,<she>,<DPX200>,
      <created by zg, POWCHK disabled, PULCHK disabled
       configuration hash MD5:
       00 E9 B6 7A A2 85 ED C7 34 08 36 98 17 FE 4E 26
       data hash MD5: 16K
       B7 E1 85 D0 7D C3 0A 8A 7F 95 88 58 03 42 CB F6>)
$$ ##END=
$$ 
$$ hash MD5
$$ 50 02 08 65 43 F9 D7 07 2D BD 0B BC F5 4B 02 35
##$RELAX= 
##$RELAX= 
##$RELAX= 
##$RELAX= 
##$RELAX= 
##$RELAX= 
$$ Bruker specific parameters
$$ --------------------------
##$DU= <F:/spectra>
##$EXPNO= 1
##$NAME= <H-F>
##$PROCNO= 1
##$TYPE= <nmr>
##$USER= <she>
##$AMP= (0..31)
100 100 100 100 100 100 100 100 100 100 100 100 100 100 100 100 100 100 
100 100 100 100 100 100 100 100 100 100 100 100 100 100 
##$AQSEQ= 0
##$AQ_mod= 1
##$AUNM= <au_zg>
##$AUTOPOS= <>
##$BF1= 200.13
##$BF2= 200.13
##$BF3= 200.13
##$BF4= 200.13
##$BF5= 200.13
##$BF6= 200.13
##$BF7= 200.13
##$BF8= 200.13
##$BYTORDA= 1
##$CFDGTYP= 0
##$CFRGTYP= 5
##$CHEMSTR= <none>
##$CNST= (0..31)
1 1 145 1 1 1 1 1 1 1 1 1 1 1 1 1 1 1 1 1 1 1 1 1 1 1 1 1 1 1 1 1 
##$CPDPRG= <>
##$CPDPRG1= <>
##$CPDPRG2= <>
##$CPDPRG3= <>
##$CPDPRG4= <mlev>
##$CPDPRG5= <mlev>
##$CPDPRG6= <mlev>
##$CPDPRG7= <mlev>
##$CPDPRG8= <mlev>
##$CPDPRGB= <>
##$CPDPRGT= <>
##$D= (0..31)
0 1.2 0 0 0 0 0 0 0 0.06 0 0.03 0 0 0 0 0.0002 0 0 0 0 0 0 0 0 0 0 0 0 
0 0 0 
##$DATE= 1691401763
##$DBL= (0..7)
120 120 120 120 120 120 120 120 
##$DBP= (0..7)
150 150 150 150 150 150 150 150 
##$DBP07= 0
##$DBPNAM0= <>
##$DBPNAM1= <>
##$DBPNAM2= <>
##$DBPNAM3= <>
##$DBPNAM4= <>
##$DBPNAM5= <>
##$DBPNAM6= <>
##$DBPNAM7= <>
##$DBPOAL= (0..7)
0.5 0.5 0.5 0.5 0.5 0.5 0.5 0.5 
##$DBPOFFS= (0..7)
0 0 0 0 0 0 0 0 
##$DE= 6
##$DECBNUC= <off>
##$DECIM= 32
##$DECNUC= <off>
##$DECSTAT= 4
##$DIGMOD= 1
##$DIGTYP= 9
##$DL= (0..7)
0 120 120 120 120 120 120 120 
##$DP= (0..7)
150 150 150 150 150 150 150 150 
##$DP07= 0
##$DPNAME0= <>
##$DPNAME1= <>
##$DPNAME2= <>
##$DPNAME3= <>
##$DPNAME4= <>
##$DPNAME5= <>
##$DPNAME6= <>
##$DPNAME7= <>
##$DPOAL= (0..7)
0.5 0.5 0.5 0.5 0.5 0.5 0.5 0.5 
##$DPOFFS= (0..7)
0 0 0 0 0 0 0 0 
##$DQDMODE= 0
##$DR= 18
##$DS= 0
##$DSLIST= <SSSSSSSSSSSSSSS>
$$ [...]
##$SUBNAM2= <"">
##$SUBNAM3= <"">
##$SUBNAM4= <"">
##$SUBNAM5= <"">
##$SUBNAM6= <"">
##$SUBNAM7= <"">
##$SUBNAM8= <"">
##$SUBNAM9= <"">
##$SW= 18.05172834244
##$SWIBOX= (0..15)
0 0 2 0 0 0 0 0 0 0 0 0 0 0 0 0 
##$SW_h= 3612.71676300578
##$TD= 16384
##$TD0= 1
##$TE= 0
##$TE2= 300
##$TE3= 300
##$TEG= 300
##$TL= (0..7)
0 120 120 120 120 120 120 120 
##$TP= (0..7)
150 150 150 150 150 150 150 150 
##$TP07= 0
##$TPNAME0= <>
##$TPNAME1= <>
##$TPNAME2= <>
##$TPNAME3= <>
##$TPNAME4= <>
##$TPNAME5= <>
##$TPNAME6= <>
##$TPNAME7= <>
##$TPOAL= (0..7)
0.5 0.5 0.5 0.5 0.5 0.5 0.5 0.5 
##$TPOFFS= (0..7)
0 0 0 0 0 0 0 0 
##$TUNHIN= 0
##$TUNHOUT= 0
##$TUNXOUT= 0
##$USERA1= <user>
##$USERA2= <user>
##$USERA3= <user>
##$USERA4= <user>
##$USERA5= <user>
##$V9= 5
##$VALIST= <valist>
##$VCLIST= <CCCCCCCCCCCCCCC>
##$VD= 0
##$VDLIST= <DDDDDDDDDDDDDDD>
##$VPLIST= <PPPPPPPPPPPPPPP>
##$VTLIST= <TTTTTTTTTTTTTTT>
##$WBST= 1024
##$WBSW= 4
##$XGAIN= (0..3)
0 0 0 0 
##$XL= 0
##$YL= 0
##$YMAX_a= 655039
##$YMIN_a= -570128
##$ZGOPTNS= <>
##$ZL1= 120
##$ZL2= 120
##$ZL3= 120
##$ZL4= 120
##$ABSF1= 10
##$ABSF2= 0
##$ABSG= 5
##$ABSL= 3
##$ALPHA= 0
##$AQORDER= 0
##$ASSFAC= 0
##$ASSFACI= 0
##$ASSFACX= 0
##$ASSWID= 0
##$AUNMP= <proc_1d>
##$AZFE= 0.1
##$AZFW= 0.1
##$BCFW= 1
##$BC_mod= 2
##$BYTORDP= 1
##$COROFFS= 0
##$CY= 11.3945322036743
##$DATMOD= 1
##$DC= 2
##$DFILT= <>
##$DTYPP= 0
##$F1P= 15.7292609196834
##$F2P= 12.9074282941183
##$FCOR= 0.5
##$FTSIZE= 0
##$FT_mod= 4
##$GAMMA= 1
##$GB= 0.15
##$INTBC= 1
##$INTSCL= 1
##$ISEN= 128
##$LB= 0.24
##$LEV0= 0
##$LPBIN= 0
##$MAXI= 10000
##$MC2= 0
##$MEAN= 0
##$ME_mod= 0
##$MI= 1.114404
##$NCOEF= 0
##$NC_proc= 0
##$NLEV= 6
##$NOISF1= 3.799351
##$NOISF2= 2.8
##$NSP= 1
##$NTH_PI= 0
##$NZP= 0
##$OFFSET= 15.70392
##$PC= 1
##$PHC0= -21042.76
##$PHC1= 8.652719
##$PH_mod= 1
##$PKNL= yes
##$PPARMOD= 0
##$PSCAL= 0
##$PSIGN= 0
##$REVERSE= no
##$SF= 200.130013532006
##$SI= 16384
##$SIGF1= 3
##$SIGF2= 2
##$SINO= 400
##$SIOLD= 16384
##$SREGLST= <1H.CDCl3>
##$SSB= 0
##$STSI= 0
##$STSR= 0
##$SW_p= 3612.71676300578
##$SYMM= 0
##$S_DEV= 0
##$TDeff= 0
##$TDoff= 0
##$TI= <>
##$TILT= no
##$TM1= 0
##$TM2= 0
##$TOPLEV= 0
##$USERP1= <user>
##$USERP2= <user>
##$USERP3= <user>
##$USERP4= <user>
##$USERP5= <user>
##$WDW= 1
##$XDIM= 8192
##$YMAX_p= 0
##$YMIN_p= 0
$$ End of Bruker specific parameters
$$ ---------------------------------
##NTUPLES= NMR FID
##VAR_NAME=  TIME,          FID/REAL,        FID/IMAG
##SYMBOL=    X,             R,               I
##VAR_TYPE=  INDEPENDENT,   DEPENDENT,       DEPENDENT
##VAR_FORM=  AFFN,          ASDF,            ASDF
##VAR_DIM=   8192,          8192,            8192
##UNITS=     SECONDS,       ARBITRARY UNITS, ARBITRARY UNITS
##FACTOR=    0.0002768,     1,               1
##FIRST=     0,             0,               0
##LAST=      2.2672688,     0,               0
##MIN=       0,             -570128,         0
##MAX=       2.2672688,     655039,          0
$$ Real data points
##PAGE= N=1
##DATA TABLE= (X++(R..R)), XYDATA
0@%%%%%%Qj6J6j6J6k4M0m8N6p2R6j20J44j76K08k48K96l52M16m82N58o46P46q57
$$ 0 0 0 0 0 0 0 8 -8 8 -8 8 -16 24 -24 32 -40 56 -64 80 -96 112 -136 160 -192 224 -258 300 -346 400 -457
30d57R81j120J272j441J627j833K062k312K585k883L211l571L960m386M852n360
$$ -457 524 -596 676 -765 862 -971 1091 -1221 1364 -1519 1692 -1879 2081 -2305 2547 -2813
46b813N917o527P191p919Q724r611J0594j1686J2907j4281J5841j7631J9701k2131
$$ -2813 3104 -3423 3768 -4151 4573 -5038 5556 -6130 6777 -7504 8337 -9294 10407 -11724
60a1724K5036k8577L3002l8711M6394n7330P4201j03778J69987n61961J09668
$$ -11724 13312 -15265 17737 -20974 25420 -31910 42291 -61487 108500 -453461 -343793
71c43793R98832r64000J08491N17465n24294k8595O91649k84543m66352L30521
$$ -343793 655039 -308961 -200470 316995 -207299 -235894 455755 171212 -295140 35381
81C5381K58066l24882J26667L2906k81538K45269Q7712k56478J42198j27289J1621
$$ 35381 293447 -31435 95232 128138 -153400 91869 179581 -76897 65301 -61988 -50367
92e0367K68686l25928m0348L21955k38507j2021J71759j85339j4245J73801k7901
$$ -50367 218319 -107609 -147957 173998 -64509 -76530 95229 -90110 -104355 69446 41545
103D1545j74772K9482J78519j29954N584J09481k23474J33775J90388k46427P3305
$$ 41545 -133227 -103745 74774 -55180 -49596 59885 -163589 -29814 160574 -85853 -12548
114a2548O6880j21977J64260k0369r6745N4586o5369J00471K7286j57016O6122
$$ -12548 54332 -67645 96615 76246 -20499 34087 -31282 69189 96475 -60541 5581
125E581J239j8097N7520p9860L4329j7344m7382J47306r0338o3268J24896q7089
$$ 5581 6820 -11277 46243 -33617 712 -16632 -64014 83292 -7046 -70314 54582 -32507
137c2507L4073N1045r9314P1312l1465j6300Q8769j25212N1648O5723j49685J10741
$$ -32507 1566 52611 -46703 24609 -6856 -23156 65613 -59599 -7951 57772 -91913 18828
149A8828K5133j22411R5678j0819l1430L4316l3600O2217m1089l6624R4880p6698
$$ 18828 43961 -78450 17228 6409 -25021 9295 -24305 37912 -3177 -39801 55079 -21619
161b1619K1093N2267j08689Q6874n349q1965J24034p6284m1669J10577q4318K9275
$$ -21619 -526 51741 -56948 29926 24577 -57388 66646 -9638 -51307 59270 -25048 4227
173D227L3349q6423P7448j3263l4157N3612n9781L4906N920n3471Q7067o7994
$$ 4227 37576 -48847 28601 15338 -18819 34793 -24988 9918 15838 -37633 49434 -18560
185a8560k7314R9025r0185K6035M0485q6862Q2015k2489m7327R0485p1962J2364
$$ -18560 -45874 53151 -37034 -10999 29486 -57376 24639 2150 -45177 45308 -26654 -14290
197a4290N2264q1452P2328j0481o4188R1623n1069j6218N7892n7050L5220j2963
$$ -14290 37974 -43478 28850 18369 -45819 45804 -5265 -21483 36409 -20641 14579 1616
209A616k8332P3029p0718J0780N5607q7078O6202J457p2514R5637n4715k7995
$$ 1616 -26716 46313 -24405 -13625 41982 -45096 21106 22563 -49951 45686 -9029 -37024
221c7024R0334p9922J4474L8333n7829N3553k6788j9894N5077n8271L1771J2655
$$ -37024 53310 -26612 -12138 26195 -31634 21919 -4869 -24763 30314 -27957 3814 16469
233A6469n3149P1856m7480j6270Q3108q7446K5309N1512q2863O0813q891m5390
$$ 16469 -36680 35176 -12304 -28574 54534 -32912 -7603 43909 -38954 21859 12968 -32422
245c2422P3421n6752J973M6647o2551M4220j0145l2321O4171o2418J4756M8992
$$ -32422 40999 -15753 -13780 32867 -29684 14536 4391 -27930 36241 -26177 -11421 37571
257C7571p8487N2401K914m9854P0258n1427k847N9831p4102L8878J6218n3881
$$ 37571 -40916 11485 14399 -35455 34803 -16624 -19471 40360 -33742 5136 21354 -32527
269c2527O1872l8120q351N6417o9786L4841K2300n8336N7964k9431j5400N7117
$$ -32527 29345 -8775 -17126 39291 -30495 4346 26646 -31690 26274 -3157 -18557 38560
281C8560o7131K9579K8480o4888N6852k0204k6453N9048o0547K1289L4368o7558
$$ 38560 -28571 1008 29488 -35400 21452 1248 -25205 33843 -26704 -5415 28953 -38605
293c8605N3526q790l4832N8751n2732J4840L8866o7142N0652r57m1786N9283m5137
$$ -38605 14921 6131 -28701 30050 -22682 -7842 31024 -36118 14534 13577 -28209 31074 -14063
306a4063P381M2095o7897M7549N014n0124O0564l8470m086M5209o4987M0506J1396
$$ -14063 -6682 35413 -32484 15065 20079 -30045 30519 -7951 -12037 33172 -31815 8691 20087
319B0087n5331N8638l0406j2111M7875n9880L4459J6727n7066N8957k2636k1564
$$ 20087 -35244 23394 -7012 -19123 28752 -31128 3331 20058 -37008 21949 -687 -22251
331b2251N1842n3140K6367K1922n8492N6255j6001k9510N4109m9164J7546K7132
$$ -22251 29591 -23549 2818 24740 -33752 22503 6502 -23008 31101 -18063 -517 26615
343B6615n9046N2410r854l7085N5888m2501P588L1315n6543M7062m845m1798N8098
$$ 26615 -32431 19979 10125 -26960 28928 -13573 -5985 25330 -31213 15849 11004 -30794 27304
356B7304l8749n77L7085n5923M1895J078m5140N8244l3285q081M3556n4041L5814
$$ 27304 -11445 -12022 25063 -30860 11035 12113 -33027 25217 -8068 -16149 27407 -26634 9180
369I180P757m8587N9735k8394j8373M9039m9204K4707J3516m8295N3208k4407
$$ 9180 16937 -31650 28085 -309 -18682 30357 -18847 5860 19376 -28919 24289 -118
381a18k0450M8756m9040K0289J8411n0188N3256k0402k9339N7264m5026R496K9063
$$ -118 -20568 28188 -20852 -563 17848 -32340 20916 514 -28825 28439 -16587 -7091 21972
394B1972n0500M4082q587l1695N2463l8745L570L0260m6054L9965q843l2977N4904
$$ 21972 -28528 15554 6967 -24728 27735 -11010 -7440 22820 -23234 16731 7888 -25089 29815
407B9815m0073o47L9587n2561L4165K691m0381N4203l2102j2627M3368m6891K4534
$$ 29815 -10258 -10905 28682 -23879 10286 12977 -27404 26799 -5303 -17930 25438 -21453 3081
420C081Q564l8704M7808k9203j1375M6071m9049K2841J5643m4600N0363k1669
$$ 3081 11645 -27059 20749 -8454 -19829 26242 -22807 34 15677 -28923 21440 -229
432b29j9884M9883m5473J4840K3306m3962M2263j7770k2047N1049m5772Q875K9031
$$ -229 -20113 29770 -15703 -863 22443 -21519 20744 2974 -19073 31976 -13796 -4921 24110
445B4110m9474L7822o380k8337M5473l8596M679L2148m6095L2938m730k8572M9026
$$ 24110 -25364 12458 6078 -22259 23214 -15382 -10703 21445 -24650 8288 3558 -25014 24012
458B4012l7417J080L7344n0401L1405P704l7939M6858k7863q666M1936m4378K0681
$$ 24012 -13405 -12325 25019 -25382 6023 13727 -24212 22646 -5217 -13883 28053 -16325 4356
471D356J2295l5068M0022k4152p558L8127m7028K2823J4607m3343M4567k0871
$$ 4356 16651 -18417 21605 -2547 -10105 28022 -19006 3817 18424 -24919 19648 -1223
483a223j9495M6261m4709J2712K6344m6252L4894o900k0734M0446l7881J1131
$$ -1223 -20718 25543 -19166 -6454 19890 -26362 8532 1632 -19102 21344 -16537 -5406
495e406K4565m3590L7530o761k6894M4270l5821O481L0615m8575L2593K402l2485
$$ -5406 19159 -24431 13099 6338 -20556 23714 -12107 -5626 24989 -23586 9007 11409 -21076
508b1076M3404k9847k954L3582m3411K6884O218l4290M0563k5692m887L6545m6283
$$ -21076 22328 -7519 -10473 23109 -20302 6582 12800 -21490 19073 -6619 -11506 25039 -21244
521b1244K3350J3883m0274L9549j6050j4035L4805l7701J8792J4406l8054L8474
$$ -21244 2106 15989 -24285 15264 -786 -14821 19984 -17717 1075 15481 -22573 15901
533A5901j6066j5590L9389m0005J6030K0281m6060L9467o192k7928M1437l1824
$$ 15901 -165 -15755 23634 -16371 -341 19940 -26120 13347 7155 -20773 20664 -11160
545a1160L922K5276l8989K9506l560k3517L7157l0102P466K3374m2800L5486j638
$$ -11160 -7238 18038 -20951 8555 4995 -18522 18635 -11467 -4001 19373 -23427 12059 10421
558A0421l2795M6329k9000o133L6163m2083K2423R188l4240L5580j8447p155K7789
$$ 10421 -22374 23955 -5045 -11178 24985 -17098 5325 14513 -19727 15853 -2594 -9749 18040
571A8040l6555K4106N276l5054M2191k0699j4882L7883l6908J4938J5148l7536
$$ 18040 -18515 5591 10867 -24187 18004 -2695 -17577 20306 -16602 -1664 13484 -24052
583b4052L6680j1529j9375L7334l1532R335J8225l4839L3477r207k0404L7821
$$ -24052 12628 1099 -18276 19058 -12474 -3139 15086 -19753 13724 4517 -15887 21934
595B1934l1676P942K2559l9668L2350l904k7651L9674k6366k126K5249l5248K5280
$$ 21934 -9742 -1800 20759 -18909 13441 9537 -18114 21560 -4806 -6932 18317 -16931 8349
608H349j413k7008L8816k7205l637L0935l8859K2941O305l2116L8381j9270r950
$$ 8349 6936 -20072 18744 -8461 -12098 18837 -20022 2919 9224 -22892 15489 -3781 -13731
621a3731L2020l3971J7954Q997l0569L6586j8387j2525L5166l4118J3541J4955
$$ -13731 18289 -15682 2272 11269 -19300 17286 -1101 -13626 21540 -12578 963 15918
633A5918l4363L3682j2416j7716L6641l2674P704J9872l4979K8751o818k0492
$$ 15918 -18445 15237 2821 -14895 21746 -10928 -3224 16648 -18331 10420 3602 -16890
645a6890L4764k8303M676K0693l4188K7566m513k2541L7247k7629J41K7630l6246
$$ -16890 17874 -10429 -5753 14940 -19248 8318 3805 -18736 18511 -9118 -8977 18653 -17593
658a7593K3421L264k7123L5872k1766n222K8631l3328J8278O412k7499L3044j9344
$$ -17593 5828 9092 -18031 17841 -3925 -9147 19484 -13844 4434 10846 -16653 16391 -2953
671b953p802L0276l4968J6489J0691l1448L3165j5430j3134L3957l2854J1209
$$ -2953 -10755 19521 -15447 1042 11733 -19715 13450 -1980 -15114 18843 -14011 -2802
683b802J6257l2425K9858r746j5671L2944k9508Q246J9163l3547K7832n679j9263
$$ -2802 13455 -18970 10888 1142 -14529 18415 -11093 -2847 16316 -17231 10601 4922 -14341
696a4341L3440k7735M303K2087l4212K4398q93k3287L2915k4010p10K4609l3851
$$ -14341 19099 -8636 -4333 17754 -16458 7940 7047 -16240 16675 -7335 -8045 16564 -17287
709a7287K1093L502k5074L1636k0264l787K7122l2809J8102P696k7684L1733j5876
$$ -17287 3806 7308 -17766 13870 -6394 -10181 16941 -15868 2234 9930 -17754 13979 -1897
722a897q480K8810l1415J4905J1604l0304L0758j2508j2948L0495l0229J1249
$$ -1897 -10377 18433 -12982 1923 13527 -16777 13981 1473 -11475 19020 -11209 40
734D0J4662l2129K8176q558j6048L0418k7826P279J7768l2421K6580m354k0129
$$ 40 14702 -17427 10749 2191 -13857 16561 -11265 -3986 13782 -18639 7941 3587 -16542
747a6542L2029k4842L440K1518l2795K3773N57k2988L2043k1022j468K3693l1623
$$ -16542 15487 -9355 -5915 15603 -17192 6581 7138 -15850 16193 -4829 -6297 17396 -14227
760a4227K0467L812k5415L0699j7859n477K4976l0391J6696P091k7691L0117j4857
$$ -14227 6240 10052 -15363 15336 -2523 -8000 16976 -13415 3281 10372 -17319 12798 -2059
773b059r948K7536k9279J3526J0872k8825K8284j0112j3227K8690k6764R806J4233
$$ -2059 -12007 15529 -13750 -224 10648 -18177 10107 -5 -13232 15458 -11306 -1500 12733
786A2733k9560K7429p050j6716L0398k5160N586J7959l0646K4469l439k0283L0868
$$ 12733 -16827 10602 3552 -13164 17234 -7926 -2340 15619 -15027 9442 6003 -14280 16588
799A6588k2817Q51K0243l0746K1927N4k2725L0312j9511l283K3507k9714J8382
$$ 16588 -6229 -5378 14865 -15881 6046 6100 -16625 13687 -5824 -9107 14400 -15314 3068
812C068M163k4295L0135j6521o348K5447k8259J5061P868k5777K8515j2674j0283
$$ 3068 7231 -17064 13071 -3450 -9798 15649 -12610 2451 10319 -15458 13057 383 -9900
825i900K6724k6710J0886J1105k7315K6741r831j3603K8053k5531O785J4748k7914
$$ -9900 16824 -9886 1000 12105 -15210 11531 1700 -11903 16150 -9381 -2596 12152 -15762
838a5762K4303o364j6417K8576k3131L807J7578k8399K2394k505j8690K9349k1161
$$ -15762 8541 2177 -14240 14336 -8795 -4988 12590 -15809 6585 4080 -14610 14739 -6422
851f422N15K0821k8384J9565J252k1029K8843j8914k915K2830k8294J6487M018
$$ -6422 -5907 14914 -13470 6095 7347 -13682 15161 -3753 -6668 16162 -12132 4355 8373
864H373k3060K7952j6244o368K4441k7806J3589P988k5126K7007j2689r768K6073
$$ 8373 -14687 13265 -2979 -9347 15094 -12712 877 8865 -16261 10746 -1943 -11711 14362
877A4362k5908J0024J2194k6022K4978q345j2846K6788k3859P172J4349k6644
$$ 14362 -11546 -1522 10672 -15350 9628 1283 -11563 15225 -8634 -1462 12887 -13757
889a3757K2910n104j5546K7271k2527L134J7610k7362K0006j302j8769K6896j9586
$$ -13757 9153 4049 -11497 15774 -6753 -3619 13991 -13371 6635 5333 -13436 13460 -6126
902f126k08J9365k7289J7813K014k0349K6972j7166l129K1820k6866J5865N808
$$ -6126 -6334 13031 -14258 3555 5569 -14780 12192 -4974 -8103 13717 -13149 2716 8524
915H524k2716K6343j3750o653K3678k5750J2533Q497k4170K5272j1281j0216K4871
$$ 8524 -14192 12151 -1599 -8252 15426 -10324 2209 10706 -13464 11808 527 -9689 15182
928A5182k4984R463J1635k5911K3074p158j3372K5383k2523N687J4136k5195K0958
$$ 15182 -9802 -339 11296 -14615 8459 1301 -12071 13312 -9211 -3524 10612 -14583 6375
941F375l888j5253K5782k0508L279J7101k6555J9463L74j8745K5985j7038j711
$$ 6375 2487 -12766 13016 -7492 -4213 12888 -13667 5796 6170 -12575 13410 -3628 -5339
954e339J9493k5328J5686L075j9700K4243j5168l787K0373k5117J3993N370k2434
$$ -5339 14154 -11174 4512 7587 -12113 12130 -3038 -6825 13548 -11569 2424 7794 -14640
967a4640K5020j2493p589K2791k4355J0611R330k3183K3072q264j0832K3773k2044
$$ -14640 10380 -2113 -9702 13089 -11266 -655 8675 -14508 8564 300 -10532 13241 -8803
980h803Q039J1317k3746K2389o639j2489K4356k1688N331J4522k4929J9916k992
$$ -8803 -764 10553 -13193 9196 2557 -9932 14424 -7264 -1933 12589 -12340 7576 4584
993D584j6698K5106j8498Q05J6293k4510J7248L93j7633K3869j6617j425J8679
$$ 4584 -12114 12992 -5506 -4701 11592 -12918 4330 4723 -12910 10959 -5658 -7083 11596
1006A1596k4024J5185L342j9642K4112j3377m650K0712k3389J2174P064k1241
$$ 11596 -12428 2757 6099 -13543 10569 -2808 -7458 13254 -10135 2039 9103 -12138
1018a2138K2907j0452q126K1199k1830R574Q792k2759K1842q154j0972K2883k1305
$$ -12138 10769 317 -7809 13390 -8440 1134 9926 -12833 9009 855 -10117 12766 -8539
1031h539O158J1868k3098K0285n062j3472K3414j9418M140J4452k3765J8957j992
$$ -8539 -2381 9487 -13611 6674 1612 -11860 11554 -7864 -3724 10728 -13037 5920 3928
1044C928j5736K4402j7308K11J7041k3324J6267J013j7155K2541j4941k349J8282
$$ 3928 -11808 12594 -4714 -4503 12538 -10786 5481 6494 -10661 11880 -3061 -5410 12872
1057A2872k3260J3809L297j9387K3245j3199n370J9908k2640J1080P170k0937
$$ 12872 -10388 3421 6718 -12669 10576 -2623 -7993 11915 -10725 355 7525 -13412
1069a3412K1634r297q457K1173k0169P821R512k0459J9745o690j0241K1798j9889
$$ -13412 8222 -1075 -9532 11641 -8528 -707 8805 -11654 8091 1401 -8840 12958 -6931
1082f931O019J2068k2477J8984m059j3577K2515j8101K168J4229k2360J6284p97
$$ -6931 -912 11156 -11321 7663 3604 -9973 12542 -5559 -3391 10838 -11522 4762 3965
1095C965j5216K1768j5705n29J5952k1896J4680J419j6478K2377j4083k908J8788
$$ 3965 -11251 10517 -5188 -5717 10235 -11661 3019 4438 -12040 10337 -3746 -6654 12134
1108A2134k2366J2703M902j8815K1819j1024o222J9596k0741R491P367j9675J9740
$$ 12134 -10232 2471 7373 -11442 10377 -647 -6869 12727 -8014 1477 8844 -10831 8909
1121H909q290q543J9826j9865O911R435k0665J9031n946j0936K0992j8341M047
$$ 8909 619 -7924 11902 -7963 -1052 8383 -12282 6749 803 -10133 10859 -7482 -3435
1134c435J2764k1212J6796k218j3295K1256j5845J783J3719k0389J5452n22j4714
$$ -3435 9329 -11883 4913 2695 -10600 10656 -5189 -3406 10313 -10076 5376 4854 -9860
1147i860K1323j4591j286J6124k1065J3032K480j6794K0436j2228m138J7564k0720
$$ -9860 11463 -3128 -4414 11710 -9355 3677 6157 -10637 9799 -2429 -6567 10997 -9723
1160i723J1213M650j8015K0017r952o090J8110j9594R026P539j8863J9041o887
$$ -9723 1490 6140 -11875 8142 -1810 -7900 10210 -9384 -358 7181 -11682 7359 472
1173D72q656J9416j8141O308R995j9746J7742m608j1023J9850j6757L257J1947
$$ 472 -8184 11232 -6909 -601 9394 -10352 7390 2782 -8241 11609 -5148 -1891 10056
1186A0056k0105J5522k167j3059J9674j4852P50J3593k0037J3743O49j4634J9645
$$ 10056 -10049 5473 3306 -9753 9921 -4931 -4181 9412 -10625 3118 3767 -10867 8778
1199H778j2828j605J5690j9821J2098L287j6151J9461j0583l824J6726j9100R481
$$ 8778 -4050 -5655 10035 -9786 2312 5599 -10552 8909 -1674 -5498 11228 -7872 1609
1212A609N724j7312J8477q325o716J7389j7958P450P284j8281J7684o564q867
$$ 1609 7333 -9979 8498 173 -6543 10846 -7112 338 7622 -10659 7025 461 -8406
1225h406J8389j7025M830R748j8349J5941l463j0658J8753j5676K838J2037j8949
$$ -8406 9983 -7042 -2212 7536 -10813 5128 1665 -8993 9760 -5916 -3078 8959 -9990
1238i990J4908j551j2404J9202j3707J85J3563j8676J2650J324j4642J8595j1773
$$ -9990 4918 3367 -9037 10165 -3542 -3357 10206 -8470 4180 5504 -9138 9457 -2316
1251b316k908J5025j7966J0174L395j5839J7890r520m800J5957j7563Q448N951
$$ -2316 -5224 9801 -8165 2009 5404 -10435 7455 -2065 -6865 9092 -8471 -23 5928
1264E928j6284J7156p329o593J6810j6275O201Q147j7008J5990n051q766J7578
$$ 5928 -10356 6800 -529 -7122 9688 -6587 -386 7761 -9247 6743 1692 -7074 10504
1277A0504j5463M035R644j7519J4581k837j0845J7277j3944J525J1388j7938J3427
$$ 10504 -4959 -924 8720 -8799 5782 2945 -7900 9377 -4567 -3042 8346 -9592 3835
1290C835j067j2178J7593j2484m94J3267j7614J1654J650j3541J7584j0410k853
$$ 3835 2768 -9410 8183 -4301 -4795 8472 -9142 2512 4162 -9379 8205 -2205 -5058
1303e058J4471j6811R206M152j4701J6715q185n151J5009j6290P734N750j5713
$$ -5058 9413 -7398 1808 5960 -8741 7974 -211 -5362 9647 -6643 1091 6841 -8872
1316h872J5554o660o726J5856j5623N143Q069j6366J4680m272q960J6578j4183
$$ -8872 6682 22 -6704 9152 -6471 -1328 6741 -9625 5055 783 -8177 8401 -5782
1329e782L537R514j6301J3376k274r939J6624j2504J383J0820j6381J2098j22
$$ -5782 -2245 7269 -9032 4344 2070 -7869 8755 -3749 -2366 8454 -7927 4171 4049
1342D049j1813J6527j1129r79J2383j6466R940K479j3375J5942r513l236J3331
$$ 4049 -7764 8763 -2366 -3345 9038 -7428 2512 4991 -8384 7558 -1955 -5191 8140
1355H140j5890Q477L914j3986J5762p552n186J4552j4960O604N970j4480J4756
$$ 8140 -7750 727 4641 -9345 6417 -1135 -6321 8231 -6729 -125 5845 -8635 6121
1368F121n651o789J5423j3909M609P516j5137J3425l541q626J5341j2590J817
$$ 6121 470 -6319 9104 -4805 -196 7320 -7817 5608 2067 -6559 8782 -3808 -1991
1381a991R231j5095J1789j340j0536J5262j1413O40J0459j5050J0478N05j1204
$$ -1991 7240 -7855 3934 2594 -7942 7320 -4093 -3453 7006 -8044 2434 2939 -8265
1394h265J5108r702j557J2072j4822R349K527j2739J5110q210l015J2776j4814
$$ -8265 6843 -2859 -4416 7656 -7166 2183 4710 -8029 7081 -1129 -4144 8632 -6182
1407f182P879M139j3627J4291o519n202J3485j3904N660N774j4050J3550n087
$$ -6182 1697 5836 -7791 6500 -19 -5221 8264 -5640 20 5794 -8256 5294 207
1420B07p129J4473j3135L754P796j4253J1938k569p994J4170j1355J954R199j4336
$$ 207 -6922 7551 -5584 -1830 5966 -8287 3651 1082 -6912 7258 -4097 -2143 7056 -7280
1434g280J1218j184r281J4327j0362K15J0273j4546R818P93j0960J3947q862k035
$$ -7280 3938 2754 -6527 7800 -2562 -2347 7926 -6620 3198 3991 -6969 6978 -1884 -3919
1448c919J1551j4237P803K531j1599J3311o696l932J2129j3403O734M297j2576
$$ -3919 7632 -6605 1198 3729 -7870 5441 -1255 -5187 6942 -6461 273 4570 -8006
1461h006J3311n866m700J2993j2746M729O305j3201J2402l693o744J3148j1782
$$ -8006 5305 -561 -5261 7732 -5014 -285 6020 -7181 5221 1528 -5216 7932 -3850
1474c850K956P422j3423J1223k229q377J3328j0831J552Q310j3696J0353r50r078
$$ -3850 -894 6528 -6895 4328 2099 -6278 7050 -3781 -2229 6081 -7615 2738 1788 -7290
1488g290J3721r615m82J0132j3400R076J144j0346J3146p820j651J0761j3000
$$ -7290 6431 -3184 -3666 6466 -6934 2142 3286 -7060 6086 -1734 -3385 7376 -5624
1501e624P407K890j1294J2962o709l831J1665j2525N643M228j1698J1799n291
$$ -5624 1783 4673 -6621 6341 -368 -4199 7466 -5059 584 4812 -6886 4913 -378
1514c78m967J2076j1889M088N915j2733J1588k965o920J2604j0642K368P638j2334
$$ -378 -5345 6731 -5158 -1070 4845 -7888 3700 735 -6185 6419 -4223 -1855 5783 -6551
1528f551J0306j773p675J2449r740J775P731j2579R504k22r095J2891q992q04
$$ -6551 3755 1982 -5693 6756 -2984 -1209 6522 -6057 3447 3225 -5870 7021 -1971 -2775
1542b775R783j2763P312K037j0195J1794p021k208J0064j1886O436K704j0487
$$ -2775 7008 -5755 1557 3594 -6601 5193 -1828 -4036 6028 -5858 578 3282 -7205
1555g205J1791n935l502J1589j1797N020N116j1540J1344m048n427J1375j0291
$$ -7205 4586 -1349 -4851 6738 -5059 -39 5077 -6463 4881 833 -4594 6781 -3510
1568c510K983O071j1340R873k508o597J1625r936J722P011j1838R530j330q012
$$ -3510 -527 5544 -5796 4077 1569 -5028 6597 -3339 -1617 5394 -6444 3086 1756 -6256
1582f256J1899q918N39Q174j1597Q018M03q654J2033p520j222R610j2191P344
$$ -6256 5643 -3275 -2736 5438 -6159 1859 2262 -6392 5641 -1879 -3101 6509 -5682 1662
1596A662K081r384J1401o349k393R760j1336N915K807j0033J0693n161l849J0398
$$ 1662 3743 -5641 5760 -589 -2982 6778 -4558 1357 4164 -5869 4824 -337 -4186 6212
1610F212j1025M797M228j1207J0641l509n336J0700r451K329O115j0873R495k175
$$ 6212 -4813 -16 4212 -6995 3646 137 -5199 5501 -3950 -1621 4494 -6379 3116 941
1624I41n665J0467q676J493O852j0838Q425o48p346J1175q377M3Q195j1036P110
$$ 941 -4724 5743 -2933 -1440 5412 -5426 2999 2351 -4995 6180 -2197 -2154 6041 -4995 2115
1639B115O23q349J0604o598j657Q525j0481O024K063r214J0715n629k756R495
$$ 2115 2738 -5611 4993 -1605 -3262 5263 -5218 806 2869 -6345 4370 -1259 -4015 5480
1653E480j0439N535L191r770J0465m437m082J0079r741L628M825j0087R351k673
$$ 5480 -4959 576 3767 -6003 4462 25 -4057 6022 -3719 -91 4734 -5353 3998 1325
1667A325n479J0289r238K242N760j0538Q659j909o374J0414q163P39P201j0743
$$ 1325 -4154 6135 -3103 -861 4899 -5639 3020 1111 -5263 5151 -3012 -2273 4928 -5815
1681e815P537k9p400J0464o908n05Q043j0289O582J245q190J0082n675j858Q641
$$ -5815 1722 1693 -5707 4757 -2151 -2656 5387 -4902 1680 2925 -5265 4817 -858 -2716 5925
1696E925j0076N493K267q603R760m945l231R272r900L821L876r302R092l731m293
$$ 5925 -4151 1342 3609 -4994 4766 -179 -3410 5862 -4038 -217 3659 -5643 3449 -282 -4575
1711d575R531q803L007M641r771Q831k305n165R728q050J585O031r754P837j007
$$ -4575 4956 -3847 -840 3801 -5970 2861 556 -4609 5119 -2931 -1346 4685 -5069 2768 1761
1726A761o303R900p394M11P196j0154O913L55p552R744o470j155P675r517N576
$$ 1761 -4542 5358 -2036 -1625 5571 -4583 2330 2685 -4867 4877 -1593 -2748 4927 -4590 986
1741I86J432p868R636n549k330Q543r473M784K916q562R421m087l483Q746q785
$$ 986 2418 -5450 4186 -1363 -3693 4850 -4623 161 3077 -5485 3936 -151 -3634 5112 -3673
1756c673L877L891r002Q869l332m468R340q252K116N287r491P650j756n254R262
$$ -3673 204 4095 -4907 3962 630 -3838 5502 -2750 -634 4653 -4838 2812 1056 -4198 5064
1771E064p678J153N517r583P310n78o328R730p119K8O855r435O636N69p078R426
$$ 5064 -2614 -1461 4056 -5527 1783 1205 -5123 4607 -2512 -2484 4371 -5064 1572 2141 -4937 4489
1787D489n713j144P532r333N448J924p851R214m634k686Q270r242M158L119q317
$$ 4489 -1224 -2368 5164 -4169 1279 3203 -4648 4566 -68 -2754 5516 -3726 432 3551 -4766
1802d766Q181l303l944Q594q476L101M330q815P759k447m593Q803p519K094M939
$$ -4766 3415 112 -3832 4762 -3714 -613 3717 -5098 2661 214 -4379 4424 -3095 -1001 3938
1817C938r030P530q89n644Q966p057P92O363r180O795m18o370R218o386m62O472
$$ 3938 -5092 2438 1549 -4095 4871 -2186 -1394 4969 -4211 2584 2166 -4204 5014 -1372 -1834 4638
1833D638q928N517R04p006Q663n144j503P362q777M821K067p540Q229m096k500
$$ 4638 -4290 1227 2131 -4875 3788 -1356 -2859 4503 -4274 547 2614 -4926 3303 -793 -3293
1848c293Q068q624M083K784p936Q267k665l942Q300p488K187M591q656P471k078
$$ -3293 4775 -3849 234 3018 -4918 3349 684 -3258 5042 -2446 -259 4332 -4324 3147 1069
1863A069m690Q286p109J202N616q952O637q29n542Q526o559M20N906q691O232
$$ 1069 -3621 4665 -2444 -1242 4374 -4578 2059 1230 -4312 4214 -2345 -1925 3981 -4710 1522
1878A522J03o138Q659n711o71O647q326N153J462o934Q506n149j493P240q350
$$ 1522 1625 -4513 4146 -1565 -2236 4411 -3915 1238 2700 -4234 4272 -877 -2370 4870 -3480
1893c480M341K221p528P956l675k978P976q317L094L512p850P454l030l585P821
$$ -3480 861 3082 -4446 3510 -165 -3143 4833 -3484 -390 3122 -4728 2726 -304 -3889 3932
1908C932p001K305M014q162P212j787m350Q477p030J152N512p968O099r48n351
$$ 3932 -3069 -764 3250 -4912 2300 513 -3837 4640 -2390 -1238 4274 -3694 2405 1457 -3894
1923c894Q652o140O0N759q314N577N50o323Q014n332j060O441q021M673J349o731
$$ -3894 4758 -1382 -1322 4437 -3877 1700 2250 -4073 3941 -1391 -2451 3990 -4031 642 1991 -4740
1939d740Q230m641j801P012p761M056K359p057P824l540k688P338p543L066L426
$$ -4740 3490 -1151 -2952 4060 -3701 355 2714 -4343 3481 -59 -2747 4591 -2952 114 3540
1954C540p557P026k292l871P813p183J888M539q335O754j286n113Q225o532Q20
$$ 3540 -4017 3009 717 -3154 4659 -2524 -636 3903 -4432 2322 1036 -4077 4148 -2384 -1564
1969a564N247q409O170j31n591P972n606j89N908p737N388M39o037Q230m919j141
$$ -1564 3683 -4726 1444 1313 -4278 3694 -1912 -2101 3807 -3930 1458 1897 -4140 4090 -829 -1970
1985a970O401p747M474J704o821P608m005k126O924p581L326K824p231O924l266
$$ -1970 4431 -3316 1158 2862 -3959 3649 -356 -2482 4442 -3139 187 3011 -4220 2704 -562
2000e62k876P562p004K320L459p601P055k136l799P648o668J590M806p837O217
$$ -562 -3438 4124 -2880 -560 2899 -4702 2353 217 -3582 4066 -2602 -1012 3794 -4043 2174
2015B174q77m585P626n839K17N502p747N462pn605P598n189o94N887p667M767
$$ 2174 1297 -3288 4338 -1501 -1284 4218 -3529 1933 1926 -3679 3919 -1270 -1964 3923 -3744 1023
2031A023R37o376P549m349j479O474p479M158J789o583P572l642k272O610p185
$$ 1023 1960 -4416 3133 -1216 -2695 3779 -3700 458 2247 -4336 3236 -406 -2678 3932 -3253
2046c253L423K931p204P020k361l019O679o630K068L800p411O645j867m246P328
$$ -3253 170 3101 -4103 2917 556 -2463 4216 -2414 -346 3454 -3957 2688 821 -3425 3903
2061C903o229J447M107p224N976j204m682P544n738L96N283p879N582J15n453
$$ 3903 -2326 -879 3228 -3996 1980 776 -3906 3638 -2100 -1704 3579 -4300 1282 1397 -4056
2076d056P506m777l89N956p809M987J048n813P297m571j510O545p716L935K095
$$ -4056 3450 -1327 -1716 4240 -3569 1418 2466 -3347 3950 -621 -2131 4414 -3302 633 2728
2091B728o595O995l340k857O750o627K506L081o902O732k457l179P033o446J780
$$ 2728 -3867 3128 -212 -3069 3681 -2946 -440 2641 -4261 2471 14 -3165 3868 -2578 -798
2106g98M066p384O266j300m215P182n556R42M382p053N545n39m576O945n144M2
$$ -798 3268 -4116 2150 850 -3365 3817 -1739 -797 3585 -3468 2077 1538 -3038 3907 -1237 -1195
2122a195M913p288M843O53n631P005m445j107N859p190M149J384o002O899l641
$$ -1195 3718 -3570 1273 1926 -3705 3300 -1145 -2252 3607 -3583 566 1950 -4052 2847 -794
2137g94j728O228o923L603J954o150O971l007k711O728o861K525L304o541N853
$$ -794 -2522 3706 -3217 386 2340 -3810 3161 154 -2557 4171 -2690 -165 3139 -3402 2451
2152B451j672l477O740o451K008L544o866N717j434m107O970n475O04M642o986
$$ 2451 779 -2698 4042 -2409 -401 3143 -3723 1994 560 -3547 3423 -2052 -1448 3194 -3792
2167c792M975j79m744P086m975%M886o718M433J213n458O488l947r62N657o827
$$ -3792 1183 1004 -3740 3346 -1629 -1629 3257 -3461 972 2185 -3273 3215 -732 -1694 3963 -2864
2183b864L725J422n789O749l492k392O316o579K897K391o062O057k596l074O632
$$ -2864 861 2283 -3506 3243 -249 -2641 3675 -2904 -7 2384 -3678 2379 -217 -3291 3341
2198C341o144K383K919o380O196j882l709O671n451J275L846o535N676j047m090
$$ 3341 -2803 -420 2499 -3881 2315 433 -3276 3395 -2056 -781 3065 -3470 2206 1159 -2931
2213b931O605n104N83M281o583N012l98m766O593m557n10N116o612M155Q11n453
$$ -2931 3674 -1430 -847 3434 -3149 1863 1465 -3301 3292 -1265 -1775 3341 -3271 884 1695 -3758
2229c758O641l775j408N724o314L303J576n671O575l207j731N773o149K573K651
$$ -3758 2883 -892 -2300 3424 -2890 413 1989 -3682 2893 -314 -2045 3728 -2421 152 2803
2244B803o087N958k030l078N918n394J602L223o372N540j533l398N991n185Q05
$$ 2803 -3284 2674 644 -2434 3484 -1910 -308 2915 -3457 2083 550 -2848 3143 -2042 -1237
2259a237M174o413M873o82m170O643m796j04M976o645M537M90m881O536m145n78
$$ -1237 2937 -3476 1397 715 -3455 3188 -1608 -1712 3264 -3381 1156 1646 -3235 3301 -844 -1422
2275a422N150o154L522J060n299O278l569j588N632o215K697K023n515N682k833
$$ -1422 3728 -2426 1096 2156 -3143 3135 -434 -2022 3610 -2605 92 2115 -3400 2282 -551
2290e51j756N420o007K574K368n833N569j842l023O440n230J438L479o171M896
$$ -551 -2307 3113 -2894 -320 2048 -3785 1784 -58 -3081 3359 -1871 -433 3046 -3125 1771
2305A771q46l476O001m839Q98L559n853M502l83m113N904m309j80M666o418M190
$$ 1771 925 -2551 3450 -1389 -491 3068 -2785 1717 1334 -2779 3125 -1184 -1364 3302 -3116 1074
2321A074L54m798O302l619j120M677n702L070J435m995N910k994j712N387n800
$$ 1074 1428 -3370 2932 -687 -1807 2870 -2832 238 1673 -3322 2588 -406 -2118 3269 -2531
2336b531K878K045n368N391k127k562N670n429J922K648n727N272j651l116N916
$$ -2531 347 2392 -2976 2415 288 -2274 3396 -2033 -111 2537 -3190 2082 431 -2685 3231
2351C231m958R97L251n908M726q82l637N927m087Q7L757n614M397k06m197N738
$$ 3231 -1727 -730 2521 -3387 1339 457 -3180 2747 -1340 -1253 2504 -3110 1287 1081 -3116 2622
2367B622l437o58M690n883L556R49m781N607l251p93M590n628K884J714n340N572
$$ 2622 -815 -1473 3217 -2666 890 1839 -2942 2665 -586 -1379 3211 -2417 467 2181 -3159 2413
2383B413k554j822N086n508K464J739n224N225k162k164N199m754J609K948n706
$$ 2413 -141 -1963 3123 -2385 79 1818 -3406 1819 -343 -2507 2692 -2062 -453 2495 -3211
2398c211M972j190l141N689m836J081L632n526M392r30l590N649m198M83L339
$$ -3211 1761 571 -2570 3119 -1717 -636 2996 -2530 1862 932 -2658 2991 -1207 -724 2615
2413B615n466M079J03m324N747l604r45M537n681L326R13m517N581l002j188M376
$$ 2615 -2851 1228 1331 -2993 2754 -850 -1795 2742 -2939 387 1300 -3217 2364 -638 -1826 2550
2429B550n161L016J558m682N172k518j611N046n434K387J958m806M604j832k525
$$ 2550 -2611 405 1963 -2719 2453 -65 -1676 3370 -2064 323 2281 -2525 2079 247 -2278
2444b278N555n009J318K835n358M245q53k847M913l993N51L017n248M166l79l491
$$ -2278 3277 -1732 -414 2421 -2937 1308 455 -2392 2521 -1472 -921 2096 -3152 1014 635 -2856
2460b856N084l301N3L727n035L385K43m182N579l280n61M002n069K911R20m328
$$ -2856 2228 -1073 -1020 2707 -2328 1057 1300 -2882 2697 -583 -1144 2858 -2211 700 1620 -2708
2476b708N303k721j405M323m927K250J575m673M844k007j873M602m541J566K212
$$ -2708 2595 -126 -1531 2792 -2135 115 1690 -2983 1861 -146 -2019 2583 -1958 -392 1820
2491A820m820M428j152k494M925m488J344K808m827M077p76l016N111m227O21
$$ 1820 -3000 1428 276 -2218 2707 -1781 -437 2371 -2456 1621 845 -2171 2940 -1287 -666
2506f66L287m985L469l36l202M884l314j54L722n378L234M67l616M832l326k97
$$ -666 2621 -2364 1105 769 -2433 2451 -863 -1017 2705 -2673 561 1028 -2588 2244 -1082 -1379
2522a379L798m806K819Q89m107M838k250j395M169m443K201J858m603M487k035
$$ -1379 2419 -2387 432 1321 -2786 2052 -198 -1593 2576 -1867 334 2192 -2411 2076 41
2537D1j822M764m535J324K258m546M129j424k514M435l787J094K602m991M026
$$ 41 -1781 2983 -1552 -228 2030 -2516 1613 189 -2325 2110 -1677 -583 2019 -2972 1054
2552A054n17k986M710l447J68L142m245L051%l334M950l393j59L518m676L085
$$ 1054 537 -2449 2261 -1186 -1018 2124 -2121 930 930 -2404 2546 -847 -1006 2512 -2164 921
2568I21O06l898M745k867q07L926m611K432J335m353M309j989j315L814m035J640
$$ 921 1527 -2371 2374 -493 -1300 2626 -1985 447 1782 -2571 1738 -251 -1566 2248 -1787 -147
2584a47J453m109M227j284j967M391m320J407K447m179L599r54k406M542l924
$$ -147 1306 -2803 1424 140 -1827 2564 -1756 -349 2098 -2081 1518 564 -1842 2700 -1224
2599a224J124K392m275L244m32k917M576l464J03L040m654L332p4l148M263k803
$$ -1224 -100 2292 -1983 1261 829 -2088 2488 -976 -873 2167 -2487 845 771 -2377 1886 -917
2615i17m60L250m093K466J017l803M411k175j310L840m016K276Q88l322L830j790
$$ -917 -1377 1873 -2220 246 1263 -2540 1871 -304 -1614 2226 -1790 486 1374 -1948 1882 92
2631I2j542L973m086J632J927m327L938j453j955L968l743J143K319m437L641
$$ 92 -1450 2523 -1563 69 1996 -2331 1607 154 -1801 2167 -1576 -433 1886 -2551 1090
2646A090q30k638M475l437N59K812m349L143j33k710M326k996l22L357m183K892
$$ 1090 260 -2378 2097 -1340 -781 2031 -2318 825 692 -2018 2308 -688 -1010 2347 -1836 1056
2662A056O5l167M177k334p10L162l976K451P64l690L888j965j145L404l774J895
$$ 1056 1121 -2046 2131 -203 -913 2249 -1727 724 1488 -2202 1686 -279 -1424 1980 -1794 101
2678A01J289l849L809j451j605L559l424J430J652l611L631j399j840M049l802
$$ 101 1390 -2459 1350 -101 -1706 1853 -1571 -141 1511 -2100 1531 132 -1708 2341 -1461
2693a461J102K312l848L478q94k287M009l229K97K514m081L042j04l097L906k630
$$ -1461 -359 1953 -1895 1583 689 -1598 2411 -818 -521 1993 -2088 954 850 -2247 1659 -971
2709i71p6K999m133K927K70l108L931k566m99L513m298K587P03l268L828j803
$$ -971 -1047 1952 -2181 746 1016 -2092 1839 -727 -1226 2287 -2011 576 1279 -1989 1839 36
2725C6j214L208l650J707J554l735L755j472j619L690l796J471J552l567L277
$$ 36 -1178 2030 -1620 87 1641 -2094 1661 189 -1430 2260 -1536 -65 1487 -2080 1197
2740A197j037k133L884l453Q53K346l889L040m49k376L652k516J54K533l859K879
$$ 1197 160 -1973 1911 -1542 -689 1657 -2232 808 359 -2017 1635 -881 -727 1806 -2053 826
2756H26J08k703L938k626k04K983m002K592L36l118L601k010j010L509m023K048
$$ 826 934 -1769 2169 -457 -661 2322 -1680 912 1248 -1870 1731 -279 -1289 2220 -1803 245
2772B45R63l388L655j734j280L558l676J636J514l739L488j257j672L738l229
$$ 245 1208 -2180 1475 -259 -1539 2019 -1657 -21 1493 -2246 1242 -15 -1687 2051 -1178
2787a178Q03J991l270K841o36j899L237k560M33K241l889K759J7k495L560k633
$$ -1178 -375 1616 -1654 1187 551 -1348 1889 -671 -238 2003 -1886 873 890 -1605 1955 -678
2803f78j4K307l672K640j34k367L704k600j83K708l715K443P84l312L853k221
$$ -678 -692 1615 -2057 583 449 -1918 1786 -814 -997 1711 -2004 439 1223 -2089 1764 -457
2819d57n33L076l606J947J030l283L289j234j341L159l227J201J521l557L281
$$ -457 -990 2086 -1520 427 1457 -1826 1463 229 -1112 2047 -1180 21 1542 -2015 1266
2834A266j026j954L507l151R55J704l162K753o74j808L297k693L93K278l694L059
$$ 1266 240 -1714 1793 -1358 -403 1301 -1861 892 218 -1590 1707 -986 -593 1685 -2009 1050
2850A050m78k311L688k624J46K547l395K177L79k816L252j719q20K912l340J790
$$ 1050 572 -1739 1949 -675 -529 2018 -1377 800 1179 -1637 1615 -104 -924 1988 -1352 438
2866D38P94l132L418j898p30K784l147J595J053l107L406j606j397L454l140J359
$$ 438 1232 -1900 1518 -380 -1110 1674 -1473 122 1175 -1932 1474 -132 -1529 1925 -1215 144
2882A44J267l346L217j146j542L381l052Q53J966l539K686m08j859L260k707L99
$$ 144 1411 -1935 1282 136 -1406 1975 -1077 -224 1742 -1797 889 481 -1378 1882 -825 -426
2898d26K143l660K758j07k481L153j996n6K018l026K132K30k608L145j704l87
$$ -426 1717 -1943 815 708 -1773 1380 -616 -672 1346 -1680 452 682 -1926 1219 -485 -872
2914h72K692l145J512J199k831K988j296j316K779l064J356J379l184L008j010
$$ -872 1820 -1325 187 1386 -1445 1543 247 -1069 1710 -1354 2 1381 -1803 1205 195
2929A95j438K885k923R73J568l071K759m66j908L003k631M74K054l138K590k67
$$ 195 -1243 1642 -1281 -308 1260 -1811 948 482 -1426 1577 -1054 -580 1474 -1664 926 659
2945F59k242L220k341J47K328l448K525q6k092L023j966l18K415l110J589O76
$$ 659 -1583 1637 -704 -557 1771 -1677 848 762 -1330 1693 -273 -591 1824 -1286 303 979
2961I79k541L005j661p19K331l024J835J003k910K777j114j165K914k960J110
$$ 979 -1562 1443 -218 -937 1394 -1630 205 1208 -1702 1075 -39 -1204 1710 -1250 -140
2976a40J441l123L051r87j627L131l039J138J498l076K643k29j940L017k552M84
$$ -140 1301 -1822 1229 242 -1385 1746 -1293 -155 1343 -1733 910 681 -1259 1758 -794 -310
2992c10J933l136K299l25j911K938k243j24K319l049K048J28k379L118j940r6
$$ -310 1623 -1513 786 461 -1450 1488 -755 -879 1440 -1609 439 567 -1812 1306 -634 -730
3008g30K334l140K129L99k705L081j648q78K942k717J032J174k832L138j654j215
$$ -730 1604 -1536 593 992 -1713 1368 -280 -1158 1784 -933 99 1273 -1559 1579 -75 -1290
3024a290L056k831R03J713l357L000r78j568K896k917R08J913l368K290J8j930
$$ -1290 1766 -1065 -162 1551 -1806 1194 216 -1352 1544 -1373 -465 1448 -1920 370 388 -1542
3040a542K965k323N72J973l260K174K01k378L261k111K7J819k646J776M40k466
$$ -1542 1423 -900 -328 1645 -1615 559 760 -1618 1643 -468 -441 1378 -1268 508 948 -1518
3056a518K992j636o82K268k964J759Q06k615K916j518r25K682k868J114J103k368
$$ -1518 1474 -162 -844 1424 -1540 219 1025 -1590 1326 -192 -1117 1565 -1303 -189 914 -1454
3072a454K416j066j167L049k760O70J694k900K592o14j747L045k508P92J426l032
$$ -1454 962 -104 -1271 1778 -982 -312 1382 -1518 1074 460 -1287 1758 -750 42 1468 -1564
3088a564K709p42j800K967k031q0K051l120J942P0k015L255k300k80K159k659
$$ -1564 1145 403 -1397 1570 -461 -541 1510 -1610 332 402 -1613 1642 -658 -938 1221 -1438
3104a438J944K91k559L096j594p51K858l100J566P71k461K654j056j217K754k741
$$ -1438 506 797 -1762 1334 -260 -1011 1847 -1253 313 1084 -1377 1277 221 -996 1758 -983
3120i83J244R26k685K598j101j330K843k557R07J395k889K469q07j559L043k453
$$ -983 261 1187 -1498 1100 -1 -1331 1512 -1045 -138 1257 -1632 837 30 -1529 1514 -939
3136i39N21J798l087K407m90j533K852k120Q9J915k652J724K37k288L035j881
$$ -939 -418 1380 -1707 700 210 -1323 1529 -591 -502 1413 -1239 485 722 -1566 1469 -412
3152d12k10K180k999K179J39k477K821j605o08K439k663J090J020k440K914j576
$$ -412 -622 1558 -1441 738 877 -1600 1221 -384 -992 1447 -1216 -126 894 -1546 1368 -208
3168b08r41K662k654Q85J334k616K967j331j176K661k563J140J452l036K477o49
$$ -208 -1149 1513 -1141 -256 1078 -1538 1429 98 -1078 1583 -980 160 1612 -1424 1053 404
3184D04j536K763k468N61J387k232J893k68j994K984k253P6J931k602J720L76
$$ 404 -1132 1631 -837 -276 1111 -1121 772 504 -1490 1494 -759 -683 1248 -1354 366 742
3200G42k061K526j517o82K230k783K049M89k272K558j380o18K568l160J642P07
$$ 742 -1319 1207 -310 -992 1238 -1545 504 993 -1279 1279 -101 -719 1849 -1311 331 1038
3216A038k507K565j129r32K542k676R26J283k837K844j068j212K627k642P78J802
$$ 1038 -1469 1096 -33 -965 1577 -1099 -173 1110 -1727 1117 49 -1163 1464 -1178 -400 1402
3232A402k850K295o88j357K564k220N32J557k462J808k1j775K713j977K11J615
$$ 1402 -1448 847 159 -1198 1366 -854 -322 1235 -1227 581 560 -1215 1498 -479 -268 1347
3248A347k930K115J1j752K476j832k32K114k876J865L17k198K530j373m83K067
$$ 1347 -1583 532 543 -1209 1267 -565 -797 1317 -1559 306 623 -1575 955 -418 -901 1166
3264A166k643J617O49k472K683j281p37K370k427J196Q68k400K539p86j291K359
$$ 1166 -1477 140 789 -1683 1000 -281 -1018 1352 -1075 121 989 -1411 1128 342 -949 1410
3280A410k130M57J517k707K179l78j646K781k156K82J452k518J865j15j534K432
$$ 1410 -720 -263 1254 -1453 726 348 -1298 1483 -673 -391 1061 -1457 408 293 -1241 1191
3296A191j779j11K018k832J970L32k245K754j454l13K012k540J569J91k314K880
$$ 1191 -588 -699 1319 -1513 457 789 -1456 1298 -156 -469 1543 -997 572 763 -1551 1329
3312A329j286r11K479k387R91N60k244K540j318o27K205k443R02J236k387K357
$$ 1329 43 -868 1611 -776 215 775 -1469 1071 -247 -874 1331 -1112 -210 1026 -1361 996
3328I96r79j286K830k250K70J619k545J874k84j344K246j865N50J303k216J539
$$ 996 17 -1269 1561 -689 -419 1200 -1345 529 245 -1099 1147 -718 -168 1135 -1081 458
3344D58N1k010K843j861n6K118k741J625L24k174K598j465p41K216k572J483O89
$$ 458 509 -1501 1342 -519 -575 1543 -1198 427 751 -1423 1175 -290 -1031 1185 -1387 96 785
3361G85k265K479j251p27K369k428J127Q17k117K219r16j027K317k019R60R52
$$ 785 -1480 999 -252 -979 1390 -1038 89 906 -1211 1008 92 -935 1382 -637 323 1275
3377A275k526K241r05r24K156j871M66J200k485J981m02j486K486k060K72J604
$$ 1275 -1251 990 85 -839 1317 -554 -88 1112 -1373 608 206 -1280 1206 -854 -582 1022
3393A022k380J650L5j567K381j609j51J754k133J599Q5k046K545j276n13K072
$$ 1022 -1358 292 327 -1240 1141 -468 -619 1135 -998 601 686 -1360 1185 -91 -604 1468
3409A468k564J433K91j907K225j051p63K245k546J325P01k192K257q68r07K317
$$ 1468 -1096 337 628 -1279 946 -105 -868 1377 -1169 156 857 -1335 922 54 -853 1464
3425A464k279M59J012j795J876o40j027K028j594L15J204k231J913m06j538K597
$$ 1464 -815 -356 656 -1139 737 97 -930 1098 -496 -181 1023 -1208 705 299 -1239 1358
3441A358j849K37J459k099J318q9j715K606j690m36J932k104J499Q7j778K109
$$ 1358 -491 -254 1205 -894 424 335 -1380 1226 -464 -900 1032 -1072 427 514 -1264 845
3457H45j191l71J786k153J252P20k204K369j098p76J992j934R79P17k099J973
$$ 845 -346 -717 1069 -1084 168 888 -1316 1053 -45 -821 1171 -763 216 933 -1166 807
3473H07o04j087K337k099M71J452k436J910m29j182J995j803K73J270j712J252
$$ 807 203 -884 1453 -646 -175 1277 -1159 751 322 -860 1135 -668 -395 875 -837 415
3489D15q7j458J912j191l35J848k289J423L18j542K272j677j07J635k037J186
$$ 415 328 -1130 782 -409 -744 1104 -1185 238 556 -986 1286 -391 -498 1137 -900 286
3505B86M52j636K016j191q45K068k064P83Q21j717J867r10q60J808j777P80R22
$$ 286 738 -898 1118 -73 -918 1150 -914 -131 690 -1027 840 -70 -930 878 -899 -119 803
3522H03k184K000o25p83J607j474M13J217k100J672k81j254K255j662L17R32j791
$$ 803 -1381 619 -6 -789 818 -656 -243 974 -1126 546 265 -989 1266 -396 -79 853 -938
3539i38J508j2j375J936j517q6J193j892J370J74j426J685q07p20K146k520J450
$$ -938 570 558 -817 1119 -398 -484 709 -1183 187 361 -1065 620 -187 -907 1239 -1281 169
3556A69M44j676J707j034j24J652j814O49P94j736J919r03q33J916j675O68Q62
$$ 169 613 -1063 644 -390 -514 1138 -676 -27 767 -969 950 47 -786 1130 -545 123 985
3573I85k050J980n96j121J804j623M19P26j936J830p1j434J842j587P31J106j898
$$ 985 -1065 915 319 -802 1002 -621 -202 524 -1412 418 347 -1087 755 -832 -101 1005 -893
3590h93J220o1j203J948j370j55J471j893J288K40j578J763r60m37J692j840Q54
$$ -893 327 266 -937 1011 -359 -514 957 -936 352 592 -986 777 -183 -620 1072 -768 86
3607H6L99j389J655r42o19J747j549N86P21j447J276o85o36J887j715M58P57j697
$$ 86 485 -904 751 -191 -810 937 -612 -26 695 -752 524 -161 -797 1090 -625 -167 590 -1107
3625a107J649l58j066J991j635M01O91j440J475m95o22J574j335K44R05j856J512
$$ -1107 542 184 -882 1109 -526 -125 566 -874 601 106 -516 1058 -277 -33 872 -984 528
3642E28j57j377K044j229m33J479j618J042J89j360J647q08l56J235j658J080
$$ 528 371 -1006 1038 -191 -624 855 -763 279 468 -892 755 -53 -409 826 -832 248
3658B48K36j549J920j062l11J790j945M95P33j419J715q18p09J611j324K61Q50
$$ 248 484 -1065 855 -207 -518 1272 -673 -178 555 -864 851 33 -676 935 -389 -128 722
3675G22j613J466n45o04J484j529L39J189j835J460l66r32J617j417J86J216j816
$$ 722 -891 575 30 -574 910 -619 -280 909 -926 534 168 -764 853 -564 -378 838 -978
3692i78J376j47j052J770j434JJ410j606Q35M13j294J726j411k61J318j444R65
$$ -978 398 251 -801 969 -465 -464 946 -660 175 588 -706 1020 -391 -652 666 -778 187
3709A87K95j511J685q30k51J013j304O42O88j467J603n03r17J628j229K19R83
$$ 187 482 -1029 656 -174 -425 588 -716 -74 614 -853 750 247 -670 958 -271 -52 931
3726I31j687J242k28j026J892j649L89R75j791J398k00r75J364j153L1J157j671
$$ 931 -756 486 258 -768 1124 -525 -136 839 -952 446 246 -729 635 -518 -487 670 -1001
3743a001J607l46j139J553o90m98J328j759J176L2j108J669r48j94J562j683M74
$$ -1001 606 260 -879 674 -16 -514 814 -945 231 263 -845 824 -124 -318 1244 -439 35
3760C5O41j602J546o20m70J401j605O34M80j432J676o18r35J769j625P52N69j510
$$ 35 676 -926 620 0 -470 931 -674 -40 440 -992 684 66 -869 900 -725 27 596 -914
3778i14J257l86l60J077j296L68J048j666J074p5n60J128r01j59J198j392J064
$$ -914 343 -43 -403 674 -622 -254 794 -872 202 127 -433 695 -206 -365 833 -559 505
3795E05j51r31J362j094J40R13j610R33M06j248J170o33J23J018j554Q41L72j548
$$ 505 354 -577 785 -309 -169 744 -866 67 473 -775 395 -238 -115 903 -651 190 562 -986
3813i86J737j036j23J147j643R76L24j333J806p29j003J667j193L04O11j083R49
$$ -986 751 -285 -408 739 -904 72 396 -937 869 140 -863 804 -389 -85 526 -557 392
3830C92k10q32J478j178J14J036j420R39l97p68J673j135oQ76j511J253j89n68
$$ 392 182 -650 828 -350 -236 800 -620 319 -78 -846 827 -308 -314 562 -949 304 115 -453
3848d53J055q87r8J066j348Q52J34j000J203n97l10J333j447P39K98j133J118
$$ -453 602 -285 -383 683 -665 187 321 -679 524 -73 -383 950 -497 242 540 -593 525
3865E25n63m95J460j550M54M33j016J243n63l70J284j275Q3Q77j477J483l83p21
$$ 525 -38 -533 927 -623 -169 264 -752 491 -72 -442 842 -433 -350 527 -950 533 150 -571
3883e71J414j218LJ038j368J197m64o57J461j020k77J223j422R07J50j006J304
$$ -571 843 -375 -372 666 -702 495 31 -626 835 -185 -462 761 -661 246 396 -610 694
3900F94o14p73J597j823Q21M10r31J510q94m75J022j445Q97N09j135J342q84m76
$$ 694 80 -693 904 -919 -98 312 -619 891 -3 -478 544 -901 -4 505 -630 712 -172 -648
3918f48J309q49O7O89j327J422m81o18J221j258N96M31j140J081l65q06J309r93
$$ -648 661 -188 -121 568 -759 663 182 -436 785 -473 123 554 -586 495 130 -676 633 -360
3936c60R0Q08j406J172J3j166J538j036j6J056j572J092L59j307J417o89l79R70
$$ -360 -270 538 -868 304 317 -849 689 -347 -363 693 -879 213 572 -735 682 -7 -386 584
3954E84j388J137J31j088J311p25k48J231j397O27K15j213J339m89q83J476j460
$$ 584 -804 333 464 -624 687 -38 -286 945 -452 175 390 -823 516 27 -856 620 -840
3971h40P40O76j457J215n00k96J229j059J92R32j574J161k30q62J353j061N89
$$ -840 -100 576 -881 334 -166 -462 767 -292 -100 832 -742 419 189 -673 680 -381 208
3988B08M98j212P34n8q17J234p59K5N88j214J245j21p92J093r53J59P51j446J134
$$ 208 706 -506 228 170 -647 587 -172 -147 441 -773 472 351 -441 652 -301 -142 609 -837 297
4007B97J09j220J363r46K82O39j024N52M47j193R67l78l1R08j199M10M43j243
$$ 297 406 -814 549 -397 -115 524 -500 52 499 -694 273 -105 -136 772 -427 -17 426 -817
4025h17J178j86m86J262j302M8Q38j184J031j88r69J652j341J87Q98j187R02K20
$$ -817 361 175 -311 951 -351 -303 535 -649 382 194 -775 877 -464 -277 621 -566 336 556
4043E56j155J333j003j21J160j294Q99j12q69J009o46O2P99j298P78J27p59J212
$$ 556 -599 734 -269 -390 770 -524 375 263 -606 403 -243 -181 618 -680 98 225 -534 678
4061F78p56m78J266j205M06K68r10J373r50mP66p94L75L47r91R50k43l22Q22p46
$$ 678 -78 -556 710 -495 -89 179 -731 642 -308 -312 454 -340 35 382 -609 341 98 -224 598 -148
4081a48J77P30j389J132j85q90J394j198L51N87j408Q43K86q58J052p22l5Q50
$$ -148 29 759 -630 502 317 -573 821 -377 -26 561 -847 -4 282 -576 476 -246 -281 569
4099E69j166O51J89j049J406j071RJ027j164O69L08q60J153q35l00J395j163K76
$$ 569 -597 54 243 -806 600 -471 -462 565 -599 70 378 -482 671 -164 -464 931 -232 44
4117D4N78j050R96n53m60Q34q22N70N60j361J109p40j53R27r60N74N18j342J250
$$ 44 622 -428 568 15 -445 389 -433 137 697 -664 445 -295 -448 479 -481 93 611 -731 519
4136E19k86r97J550j108J54O58j092Q35J2q06J265r33R8Q28j287P39M12r57Q11
$$ 519 233 -764 786 -322 -168 490 -602 233 245 -561 704 -229 -131 697 -590 149 561 -396 415
4155D15k81l21Q58j323Q01K74r35J064p42j25Q60r88M36L13p63R57m63l79R16
$$ 415 134 -187 671 -652 149 423 -512 552 -190 -315 545 -443 -7 306 -457 500 37 -342 574
4174E74q28K25M59j184J061r0n60P97r53N32L23q72Q33k91o34R37q97M08Q17j363
$$ 574 -254 -29 430 -754 307 217 -343 454 -499 33 356 -516 317 26 -608 329 -568 -160 657 -706
4194g06Q92j82m27J021q97N8P38j065L93L74q34J273q07k42J138j218P92L5j055
$$ -706 186 4 -423 598 -299 -241 497 -568 -175 199 -635 638 -169 -411 727 -491 301 336 -719
4213g19J176n45k29Q79r26N24p6o55R91m88j78P54p63J39M84r21N39j40k42J184
$$ -719 457 -88 -317 562 -364 160 84 -571 420 -68 -246 508 -255 -116 368 -553 -14 -154 -396 788
4233G88r33J33N24j276R85j13o24J278j040n0J010j025P51j92o94J258j027K59
$$ 788 -145 -12 512 -764 221 108 -516 762 -278 -328 682 -343 408 216 -478 780 -247 12
4251A2M84r77O49J29r53J114n28j70J012j464P76L57j156J201o06m74J151j064
$$ 12 496 -481 168 297 -656 458 -70 -240 772 -692 84 441 -715 486 -120 -594 557 -507
4269e07O26K89q82P70k67o71J266r06L75L56j155J059k68n33R39r11K74P80j075
$$ -507 119 408 -474 296 29 -642 624 -282 93 449 -706 353 85 -448 491 -420 -146 634 -441
4288d41P64k76o51J156q98n2Q98j035R56l65o05R91n63l32Q98j002P07Nr15J344
$$ -441 323 47 -604 552 -346 -398 500 -535 421 56 -549 442 -121 -453 445 -557 150 155 -760 584
4308E84r11Q4Q06j082P11m7o32J149p56k40J006j022N41J5q21J007m62j34O55
$$ 584 -327 -243 563 -519 192 145 -487 662 -94 -334 672 -350 191 206 -615 392 -70 -204 451
4327D51j070N82O57j320J178m33o61J271r78L41L04p16O83q9q48J156p10j3R77
$$ 451 -619 -37 620 -700 478 45 -616 655 -323 18 322 -394 289 200 -648 508 -202 -215 762
4346G62j236R12j45n84R71j000K21P61j133N72j68n56J179p72j14P96j006O80
$$ 762 -474 438 293 -291 680 -320 -99 662 -471 101 -67 -623 556 -216 -330 466 -540 140
4364A40L02j101J277m31o83J034j087L83P31j001N36K24n83P08p23L04N10r47
$$ 140 442 -659 618 187 -496 538 -549 -166 565 -436 100 324 -259 449 -274 30 540 -407
4382d07Q79k56n42R52r05O0O35p83R90m10q64J404j131J46Q97j195P57J18p28
$$ -407 472 216 -326 626 -279 -219 416 -367 623 213 -651 753 -378 -232 665 -530 227 345 -383
4401c83J000q70J95M20r06P68k3p28R84p66J50P67r82K89M21o80Q92o99m7P19
$$ -383 617 -253 -58 362 -544 224 201 -527 457 -309 -159 608 -374 -85 336 -344 548 -151 -198 521
4421E21r15M92P2n34O13q8m06O89j179Q40R9r38R41q3n17R85j125O82K79j019
$$ 521 -394 98 170 -364 249 161 -245 444 -735 105 204 -734 207 124 -393 592 -533 149 428 -591
4441e91P07J4o16J281j049j3O68j009P21J37p43P50n05L0Q96j022O54l04m43R94
$$ -591 116 130 -486 795 -254 -267 401 -608 113 250 -493 257 -248 -218 678 -344 310 6 -437 557
4461E57q12k6O91j073Q39J74p87R52o38n5P80j088L89L61j068J191k04p46R50
$$ 557 -255 -281 410 -663 176 350 -437 515 -123 -178 602 -486 -97 264 -804 387 183 -563 387
4480C87n43Q2N50j282J304n12n81J217j035J76P02j005N84M5n89R91q90J30Q23
$$ 387 -156 -74 476 -806 498 -14 -595 622 -413 -237 465 -540 44 89 -500 491 -399 -269 554
4499E54j070R35k46q79J115p79J69O71j071O74K12p88J063q76N3O51p58N03L69
$$ 554 -516 419 173 -706 409 -370 -201 470 -601 73 285 -503 560 -316 -263 388 -370 133 502
4518E02r79R54o99j05R43r76M62K13p10N81k19m66P59n57J10K63m55O31l07l62
$$ 502 -477 477 -222 -327 616 -360 102 315 -395 186 -33 -499 260 -297 -187 76 -379 252 -55 -417
4538d17O63o89K75R88j075O35l62n69R52o10R6O40j015P85j32r33P62j34j96Q69
$$ -417 246 -443 -168 820 -255 380 18 -551 401 -209 -113 527 -488 297 165 -768 -6 -140 -336 533
4558E33j125R83j38q17J038n23l46P47p15N10k1m81P45m38l04Q92r93K70L79q28
$$ 533 -592 391 253 -564 474 -49 -395 352 -363 147 126 -355 390 -48 -352 540 -453 -183 196 -632
4578f32J073n65r2Q14r94L08M62n82N38l80k21P50q41M50L60n54N68l06o93J174
$$ -632 441 -124 -216 598 -396 -88 374 -208 330 -50 -271 479 -362 88 448 -106 462 156 -537 637
4598F37r11L57J17q60R66j4q99Q14q6m39Q29r58P32J74q58O48n21j64Q02o00N71
$$ 637 -274 83 200 -660 306 292 -607 207 121 -318 511 -447 285 459 -399 249 -272 -436 366 -234 337
4619C37j8r18P16k06j76N72o48K28M01p04P42k69m41Q55m66k17N56o17M78r9n95
$$ 337 319 -599 117 -89 -265 307 -341 -113 288 -416 326 57 -384 471 5 -212 344 -273 205 106 -489
4640d89Q26l81j32O84q66M66J93p42O20n59L84J73m71L68J18o04O88n08j0N83
$$ -489 337 -44 -176 508 -358 108 301 -441 179 -380 4 177 -294 74 192 -412 276 -232 -242 341
4660C41q57M84J37l78O20k48k50N96o51O9J74k33N80j58o54P23o71L47K58q65
$$ 341 -516 -32 105 -273 347 99 -151 445 -206 -137 37 -196 384 226 -428 295 -376 -29 229 -636
4680f36R12l70k91Q30q96N39L44p11N86k81m39Q96m45o8N11r65P00j15q10J009
$$ -636 276 -94 -385 445 -451 88 432 -279 307 26 -413 483 38 -30 481 -484 216 101 -709 300
4700C00m13q3P41r93N63M0o44Q04p04J30N92n13K26K75o68N26k85l60J125r19
$$ 300 -113 -196 545 -448 115 155 -489 315 -389 -259 333 -180 46 321 -347 179 -106 -466 659 -260
4720b60J73M90q22O79k58l88Q03n07K10J03p76R68k20o03O36p23M28K07l84K76
$$ -260 -87 403 -419 260 2 -386 417 -90 120 223 -553 415 195 -408 228 -495 -67 140 -244 32
4740C2Kl54P10m39j47N39o29M26j87k24N05n55j9R18j089Q22q1o29R22o36R7K82
$$ 32 34 -320 390 -49 -196 343 -286 140 -47 -271 234 -321 -340 578 -511 311 230 -399 523 -113 -16 266
4762B66l80O0L11n80Q54o17l95J093q77M12ro63P38j64m78P93m68J65J89p04P65
$$ 266 -114 -54 257 -323 531 -86 -481 612 -265 147 138 -525 213 49 -429 364 -104 61 250 -454 311
4783C11j15m77P48r34L81M60o47M49j26l59O31m80l2N57o70P08q0o26O63m58j2
$$ 311 196 -281 467 -467 -86 374 -273 176 50 -309 322 -158 -190 367 -303 405 325 -301 362 -96 -108
4804a08N62r00N35J20p67J033n20k09Q70j029N74K22q96P45l23q1N19q61L96K88
$$ -108 454 -446 89 209 -558 475 -45 -254 616 -413 161 383 -513 232 -91 -172 347 -514 -118 170
4824A70n29Q40m03j56M25p60M65K94n55M85k97j97O20m35n6M09n37L11j78k71
$$ 170 -359 481 78 -78 347 -413 52 346 -209 276 -21 -218 402 -33 -89 320 -217 94 -84 -355
4844c55N73o33L30M47q13N11N5n37O58k66k13P25p84M58J87p42O00k31l07N52
$$ -355 218 -415 -85 362 -451 60 115 -422 236 -30 -243 482 -302 156 343 -399 201 -30 -337 215
4864B15m51L19J05r45J024k46l6M36q79O93Q0p92N49j02j90M78p75L77L81o13
$$ 215 -236 83 188 -757 267 21 -15 421 -458 235 315 -477 72 -30 -220 258 -517 -140 241 -372
4884c72P53j73m97P68o87j4Q16j156N49J64o53P38k64j00O05r26N41n4o34R12
$$ -372 381 208 -289 479 -208 -222 594 -562 -13 151 -502 236 -28 -128 477 -449 92 38 -596 316
4904C16m83n4M03m28M89M8n69N33l45l71P93n99K44K81r50P60k5l51O86m82o3
$$ 316 -167 -221 182 -246 243 291 -278 255 -90 -461 332 -267 -23 258 -692 68 43 -308 378 -104 -167
4925a67M83o91N33l83j06Q99p66K28L04o29O06k81j21L52n34K40L14q03P21qn35
$$ -167 316 -375 158 -225 -331 568 -198 30 334 -295 311 30 -91 261 -273 -33 281 -522 199 191 -344
4946c44O98k69j98M06p83M94K29l68M34m29J17M27p98K37K13l61M90k24o0K91
$$ -344 354 85 -113 293 -490 4 233 -135 299 -130 -13 414 -384 -147 66 -295 195 -29 -89 202
4966B02m65L76J60q62R23k97k58N21o77N02R6n26O78l30k38O53p87J99L01n01
$$ 202 -263 113 273 -589 334 37 -221 300 -377 125 221 -305 373 43 -195 458 -329 -130 171 -330
4986c30K62J90l47L51k02j07N20q90Q06l4p81R31m19q2O33o11M23n6n40N98m86
$$ -330 -68 122 -225 126 -76 -183 337 -553 253 219 -562 369 -50 -132 501 -110 313 257 -283 315 -171
5007a71K2P94q56J24K1k04O84k67k42K44l47L60L79n94L67n27k4L77l53J87J85
$$ -171 -149 645 -211 -87 -66 -270 414 147 -95 149 -198 162 541 -53 314 -213 -237 140 -213 -26 159
5028A59m74O66l75n1M89n33nL03o06Q71k69n19O98m93L0N44n82M92l71m81R09
$$ 159 -315 351 -24 -75 414 -119 -124 179 -427 444 175 -344 354 -139 -109 435 -147 345 -26 -507 402
5049D02k65m12O94q69O54K81r73O57o54L96N61o93K21M94m86n5j56J4N76p16K81
$$ 402 137 -275 419 -450 204 485 -488 169 -485 -89 472 -221 0 494 8 -47 -203 -189 387 -329 -48
5070d8L28n14O90l48m50N90o50L29L57p58N74q5m48P53n42J66L48n14J38K40m65
$$ -48 280 -234 456 108 -342 248 -402 -73 284 -474 100 15 -433 320 -222 -56 292 -222 -84 156 -309
5091c09Q03m57k98P50j031M91K83p91Q49n89R1O13q85M78O7n59N35m3j11L01l41
$$ -309 494 37 -261 489 -542 -51 232 -559 290 -299 -208 405 -480 -2 65 -494 41 -2 -113 188 -153
5112a53J69L21o48O30o1o45Q49n15K10L68j037O55k8k90M52n40L58N4o62O10Q4
$$ -153 16 337 -311 319 258 -387 462 -53 157 525 -512 143 115 -175 277 -263 95 149 -513 97 181
5133A81m83O41m47J6N68r56O41q4o99R91n48R2N45o91L56j22m65O08l17O6O05
$$ 181 -302 339 -108 -92 476 -480 161 77 -622 369 -179 -87 458 -233 123 1 -464 144 -173 -107 498
5154D98r58N76J79n86K86p5PL69n77L52J30m04J93j7j38O74q18J61M34p88O26
$$ 498 -460 116 295 -291 -5 -80 -73 296 -281 71 201 -203 -10 -27 -165 509 -309 -148 286 -502 124
5175A24l27K1O03n41J10L25n41L83q4j17M19n84m1N34n21N69l15k10M94m51M5
$$ 124 -203 -182 421 -120 -10 315 -226 157 73 -44 375 -209 -250 284 -237 332 17 -193 301 -150 -105
5196a05L18n51N42j61k23N11n35O4M15n96M29ll76O43m27L5J40j95K76j13l71
$$ -105 213 -338 204 43 -180 331 -204 -140 275 -321 108 105 -271 372 -55 -20 120 -75 201 88 -283
5217b83M89o4l53N18m61R4L76o99M67j13o3M82o87L84K68n40K27Pk13O35n57k37
$$ -283 206 142 -211 307 -154 -60 316 -383 84 -29 -92 390 -297 87 355 -185 42 49 -164 471 -86 -323
5239c23P18p44M12K76n47M75m92J67K55l88J02J41j18L78l22o4M87n33Q4M80o63
$$ -323 395 -349 63 339 -208 267 -225 -58 197 -191 -89 52 -66 312 -10 -74 413 -120 -36 444 -219
5260b19M31j53l40N56n34K52M28o72N10k52l10N13l08J33J51n99N17M4r6M51o67
$$ -219 212 59 -281 275 -259 -7 421 -251 259 7 -303 210 -98 35 186 -413 104 148 52 503 -164
5281a64%M60o63J03M18n66O33l49j35N92n62J5K07l41O21j77k62N96p64K96K53
$$ -164 -164 296 -367 -264 154 -412 221 -128 -263 329 -233 -218 -11 -352 269 92 -170 426 -338 -42 211
5302B11q06J027m10k72O26n82M11m8o18O70k46J19K21n57J94K52n38M73r4j85
$$ 211 -595 432 22 -250 376 -206 205 157 -461 209 -37 82 303 -254 -60 192 -346 127 33 -152
5322a52N48p02L04J10n53M99J23n12O04k65l32N17n45M03pl19O73l77k06J84n48
$$ -152 396 -306 -2 108 -445 54 177 -335 269 4 -328 189 -356 47 40 -279 394 17 -189 -5 -553
5343e53N64J71o14O29j01n52R19q09N61j23o88Q04k26k17M90k79j59L64p41J008
$$ -553 11 182 -432 197 96 -456 463 -346 215 92 -596 208 -18 -235 255 -24 -183 181 -560 448
5363D48l36m06P58p25L38J98o68Q40m16l01M52m43J73P18r91N34J2n71Q05n36
$$ 448 112 -294 464 -261 77 275 -393 447 31 -270 182 -261 -88 630 -361 173 185 -386 419 -117
5383a17r7O41q04M92j68m06O01k73j8K43m56N49k35l41N82j95Q6M89m64J67k02
$$ -117 -214 427 -377 115 -53 -459 142 -131 -149 94 -362 187 -48 -389 193 -2 84 573 109 276 74
5404G4n43O05r0m18P20n61J13L92m79L33l68j54Q59l92j48K49k98L90k90k63P25
$$ 74 -469 136 46 -372 348 -213 -100 292 -187 146 -222 -376 483 91 -57 192 -106 284 -6 -269 456
5425D56n58Q1J95l30M72j95m27L97j11j45P33r01M88m6n10O13l76L7N90o84M11
$$ 456 -102 -21 174 -156 316 121 -306 91 -20 -165 568 -333 155 109 -401 212 -164 -127 463 -221 190
5446A90j51j69L91l87k40P38m17K30J56q02O79l06N3M53o07J97q6l54N89j89l57
$$ 190 39 -130 261 -126 -366 372 -45 185 341 -461 218 -88 -35 418 -189 8 -78 -432 157 -32 -389
5467c89Q38p41K26M00o82M92k58k69O26m88%N90r05P67J52p03N80p05N29L93n83
$$ -389 449 -292 -66 334 -348 144 -114 -383 243 -245 -245 345 -560 207 359 -344 236 -469 60 453 -130
5488a30M09l07k35Q38p10M4J75m65N58j68j74M80j68m35L51n31N39J32k45M57
$$ -130 279 -28 -263 575 -135 -91 84 -381 177 9 -165 315 147 -288 63 -468 71 203 -42 415
5508D15k73k57O50q89K39K47n38N62j01l27M66j89q7N21p46L11L22o55N97k87
$$ 415 142 -115 535 -354 -115 132 -406 156 55 -272 194 5 -82 439 -307 4 326 -329 268 -19
5528a9m02R45r33P56k24k36L61p10L63L60o64K72L24n14O36l39n1M70o78L50J88
$$ -19 -421 524 -409 347 123 -113 248 -462 -99 261 -403 -131 193 -321 315 -24 -75 395 -283 67 255
5549B55q91J058n30o8M63l93J15K43l69L52k46l32P79l92K1J98n41L69j10j02
$$ 255 -636 422 -108 -176 287 -106 9 252 -117 235 -11 -343 436 44 65 263 -278 91 -19 -121
5569a21M05l85J31R0n58N33J6m49O82m99J33N43r53N99j06l25N89l61j44O19q23
$$ -121 284 -101 30 120 -438 95 111 -338 344 -155 -22 521 -432 167 61 -264 325 -36 -180 439 -384
5590c84M31K6m30O72j41m75M12p04Q34nm55K19n4J11Q7n04N05l9m60L65j53j40
$$ -384 47 73 -357 315 174 -301 111 -593 241 236 -219 0 -54 57 144 -360 145 106 -354 11 -142 -282
5612b82L82j72m3L82o37O28j25o06P68l19k12M49l70K85o3l82N92k44j14L36n48
$$ -282 100 -72 -115 267 -370 258 133 -473 295 -24 -236 213 -157 128 65 -317 275 31 -83 253 -295
5633b95L11k09j67N49l08J18J13l80L23K99n76L68j66k13M01k41J68Jn20N45J2
$$ -295 16 -193 -360 189 -119 -1 112 -268 55 354 -222 146 -20 -233 168 -73 95 96 -424 121 133
5654A33j44J59m92L21J77m85M49r5l17M19l97L19L78p50L93j92k16P90m63m31
$$ 133 -11 148 -344 -23 154 -331 118 23 -294 125 -272 47 425 -325 68 -124 -340 450 -13 -444
5674d44O90m51K49J09m21M89l11J5J0k03M21J13o86R68o50j60N94p26M58K60o20
$$ -444 246 -205 44 153 -268 221 -90 -75 -65 -268 153 266 -420 548 -102 -262 332 -394 64 324 -296
5695b96O93k93l45N22l56P8L13n22M60o8l94M14m63J5M66q64O72j27k91N51k18
$$ -296 397 104 -241 281 -75 3 316 -206 254 186 -208 206 -257 -242 224 -640 32 -95 -386 165 -53
5716e3J33K08l20P1j0l87P27n97K76K66n40M38j63m72P83j71k21J80j28N8J3j80
$$ -53 80 288 -32 39 29 -358 369 -228 48 314 -226 212 49 -423 360 189 -32 148 20 78 91 -89
5738h9L32m25j98N77n20K84J6l64N97l21j13N04n01J00L06o51Q90k84l46M36m90
$$ -89 243 -182 -380 197 -323 -39 -23 -387 210 -111 -224 280 -221 -121 185 -466 424 140 -206 230 -260
5759b60J42L40m41O00m27m48P57j35k31N32q01N92j8n49M22j63l81Q13m73J65
$$ -260 -118 222 -219 381 -46 -494 263 128 -103 429 -372 220 202 -347 75 -88 -469 344 -129 36
5779C6J47m82O89p36J47M36m01L87j30m05P06o11R6K22m89L56J1k84O35l20j36
$$ 36 183 -299 390 -346 -199 237 -164 223 93 -312 394 -217 -121 101 -388 -32 -21 -305 330 10 -126
5800a26L89l16J17J21n67M02k65j08O49o00L5M65l55M44l53k60O09l55j65K18
$$ -126 263 -53 64 185 -382 20 -245 -353 296 -304 -269 196 -159 285 -68 -328 281 -74 -239 -21
5820b1l49M27j1r7K95m00j52N66k49RJ09m17N73m43J87K55o03K55J21j39L58k62
$$ -21 -370 57 46 -51 244 -156 -308 258 9 18 127 -290 283 -160 27 282 -321 -66 55 -84 274 12
5842A2rL87p46M06kn67R76n70k43O30l79J42K45p56P47k63l30P65p11K29L33m99
$$ 12 3 390 -356 50 48 -519 457 -113 -356 274 -105 37 282 -474 273 10 -320 445 -266 -37 296 -203
5864b03M33o4l19L53k38n8M75n43K14J26l19L39m71K99N17q92N45O6m63L14m25
$$ -203 230 166 -153 200 -38 -96 379 -164 50 176 -143 196 -275 24 541 -351 194 260 -203 111 -314
5885c14J90O38q76M76m6l28M32l42K6L77k97K46n4l88P07m98q5N72q26J99M33
$$ -314 -124 514 -362 114 68 -260 172 -170 -144 233 -64 182 128 -260 447 -51 -136 436 -390 -191 242
5906B42l91J68r1j96O11m06j92L93l90L52Rn30P98m58j81M28m10M27j98k44N82
$$ 242 -149 19 -72 -268 343 -63 -255 138 -252 100 109 -421 377 -81 -262 166 -244 183 -15 -259 323
5927C23l03j97M77o71M48J71o22N86k47k57N93n42l3K91k61M21l9l90N25l67R0
$$ 323 20 -177 300 -371 77 248 -374 212 -35 -292 301 -241 -274 17 -244 177 138 -252 273 -94 -4
5948dO2k88N46l65k81P30n25K9L97k76L0j40p3K92m35K18L69o84N33L3m98P27
$$ -4 58 -230 316 -49 -330 400 -125 -96 301 25 55 -85 -158 134 -301 -83 286 -398 135 168 -330 397
5970C97o06J13K77m42L71J91o98M36k14Q3L43m02Q3K58m63P08l54l93O10n13J74
$$ 397 -209 -96 181 -261 110 301 -397 39 -175 -92 251 -151 -68 190 -273 435 81 -312 298 -215 -41
5991d1J98n66O40o3n19O82q22N82n5n56O72j01j13M15o99L71J72o72N20Q4k97
$$ -41 157 -409 231 168 -351 331 -491 91 36 -520 152 51 -62 353 -346 25 197 -475 45 129 -168
6012a68M75m47m9O63o73L05J35j83K56l09j59M82p66L47M18p42P69l87j84M47
$$ -168 307 -140 -189 474 -199 106 241 58 314 5 -154 328 -438 -91 327 -415 354 -33 -217 230
6032B30m96L95l8m04O03m70O3K30l24K38K78l54K57k46l25O47l39J25M0l79O07
$$ 230 -266 129 91 -313 290 -180 -117 113 -211 27 305 -49 208 -38 -363 284 -55 70 110 -269 338
6053C38n12j97Q68l06j74K23n33M46k68k14O86m90M2M66r10O85m7j08K68m31q
$$ 338 -174 -371 497 191 17 240 -293 153 -115 -329 357 -133 -91 375 -535 150 103 -5 263 -168 -176
6074a76K02m46M83J55l86N01n11N7N41o26J97M01p86O48k80k40N30n40N7L8j32
$$ -176 26 -420 63 218 -168 333 -178 -121 420 -206 -9 392 -394 254 -26 -266 264 -276 -219 -181 -313
6095c13M11o4m05O62k34j06L38q74O21n3j93N58o28L79K11n07K51j46l40O53m86
$$ -313 98 34 -371 291 57 -49 289 -585 36 -17 -210 348 -280 99 310 -197 54 -92 -432 221 -265
6116b65J72N43q22M22L2m10N29n16L2N82n12M76j77l37M84n19J00L05k65K19K48
$$ -265 -93 450 -372 50 82 -328 201 -315 -283 299 -213 263 86 -251 233 -286 -186 119 -146 73 321
6137C21m19L41k74j60M48l77K47l9l49J13R4n6K13l32J29K66l86M13j51j74M97
$$ 321 -98 243 -31 -191 257 -120 127 88 -261 -148 -54 -110 103 -229 -100 166 -220 193 42 -132 365
6158C65n30K34Q1n07M33l60QO89m16JQ2l51M06j60r7N24o88Q3O99q44N70k67m12
$$ 365 -165 69 150 -357 76 -284 -276 413 -3 -2 80 -271 135 -25 -122 402 -286 -203 496 -348 222 -45 -457
6181d57P35m45k05N32m35M85J04o48N37l15M7L40l67j6K34m56M25k3l61O64m26
$$ -457 278 -167 -372 160 -275 210 314 -334 203 -112 -65 275 -92 -108 126 -330 95 72 -289 375 -51
6202e1j35J11j65M29o6l88P89p15K19Q4l45N24l18k65M17k61J43L01n39Q9K75
$$ -51 -186 -75 -240 189 123 -265 524 -191 28 112 -233 291 -27 -292 125 -136 7 308 -231 -142 133
6223A33n90O61k62m14P68n46L37k2k59N53l06m16O07n70K39J93k79N02k41j56
$$ 133 -457 204 -58 -472 296 -250 87 65 -194 359 53 -363 244 -326 -87 106 -173 329 88 -68
6243f8K56m03K61J19n65M76N9o93Q36r3j20l4l25N78j20o74N79k11J9K87n60L67
$$ -68 188 -215 46 165 -400 76 135 -558 278 185 65 31 -294 284 164 -510 69 -142 -123 164 -396 -29
6265b9K33o29O63l13j7L51p00N61%q7N2jj32L89o33J78J89j76M06k64k67L35k41
$$ -29 204 -425 238 -75 -92 259 -441 120 120 33 85 84 -48 341 -292 -114 75 -101 305 41 -226 109 -132
6288a32J28K15m02M26q4k29L24k96J05K62q19M81R2j68M44m22m3M96o98L35J8
$$ -132 -4 211 -191 235 151 -78 246 -50 55 317 -502 -21 71 -97 347 -75 -118 378 -320 15 33
6309C3l20M74l94J09L26n54O10k11m40O77k85k51K63k39K25J14n23N15k10j25
$$ 33 -287 187 -207 -98 228 -326 284 73 -367 310 25 -226 37 -202 23 137 -386 129 -81 -206
6329b06M49o49N32rk43M06k22k29L06m39Q2O08q47O54K5k81J92m23K19N92m41
$$ -206 243 -406 126 117 -126 280 58 -171 135 -304 -222 386 -461 193 218 -63 129 -294 -75 517 76
6350G6L44k91j22Q8m14K72Q7k55L71j34m31N98J17m59K89o10L92J11j00J49l65
$$ 76 420 129 7 95 -319 -47 40 -215 156 22 -409 189 306 -153 136 -474 -82 29 -71 78 -287
6371b87K08J69k81M22l27l27O26k12o0L87o41J80K93l18L04j10k47O98r18M50
$$ -287 -79 90 -191 231 -96 -423 203 -9 -69 318 -323 -143 150 -168 136 26 -221 477 -441 9
6391IK83p09O22k5n51N63m72M0M42m54M48m5m08L59K1m3M23p42J4L32l45L85k45
$$ 9 292 -417 205 180 -371 192 -280 -240 202 -252 196 151 -257 102 123 80 503 -239 -225 107 -238 147 -98
6414i8o2N79o50N24k47j42K48l8k69K57l28K78J11m35O23m44j14O75o67K43N5
$$ -98 -160 419 -231 293 46 -96 152 114 -155 102 -226 52 163 -272 351 -93 -207 468 -199 44 99
6435I9l26O26k81m64M18k14J4K29n11O10l56l1L72m04M63l5m20N04q9l22K59k58
$$ 99 -227 399 118 -346 72 -142 -128 101 -410 200 -156 -187 185 -219 244 209 -211 293 204 -118 141 -117
6457a17NK86m02J65J77j70K13l99M8O63o88J52Q0m14N98j97r4K32j54P1M1l46
$$ -117 -112 174 -228 -63 114 -56 157 -242 -194 469 -219 -67 13 -401 197 0 -94 138 -16 55 96 -250
6479b50N81l85l77P78l35J24J35p19P53l41j68N69n01J1K94m67N53l50j95L42
$$ -250 331 -54 -431 347 12 136 271 -448 305 -36 -204 365 -136 -125 169 -298 255 -95 -290 52
6499E2k3k90K78k88M77k26j26L08m81L26K47n34K78J64m00N28j39j70K18l99L66
$$ 52 29 -261 17 -271 206 -20 -146 162 -319 7 254 -280 -2 162 -238 290 151 -19 199 -200 166
6520A66j30l46O01o82L89L70n95N84p6o67M45l7l4L18l53n4K14n05L12N6M6J6
$$ 166 36 -310 291 -391 -2 368 -227 357 281 -386 59 22 -12 306 -47 -101 113 -392 -80 -24 22 38
6542C8k57L40%m91K08J8rN42k45j68K44m03L55n5l47N52o19L11K08n34L75J18
$$ 38 -219 121 121 -370 -162 -144 -153 389 144 -24 220 -183 172 117 -230 322 -297 14 222 -312 63 181
6564A81l63M41l76R8L11m84k3M77m78L64n23J4M15l4oJ24m52P13l00l73O99p03
$$ 181 -182 259 -117 -19 292 -192 -215 262 -216 148 -375 -361 54 20 14 138 -314 399 99 -274 425 -278
6586b78J78J32l35N18K5m91N46l27k7M97n67L33j49k60N64l46l81N46n07L97J04
$$ -278 -100 32 -303 215 240 -251 295 -32 -59 438 -129 204 55 -205 359 13 -368 178 -329 68 172
6607A72n02O15n16K70J98n37J70K27m47N22j36l13N24k18K56no31M28M9j20M96
$$ 172 -330 285 -231 39 237 -300 -130 97 -350 172 36 -277 247 29 285 280 -351 77 126 6 502
6628E02m92k00K94k60L9J52j30L05n84L56J41j74J35M9m62O24l68p9L63k53J12
$$ 502 10 -190 104 -156 -117 35 -95 210 -374 -18 123 -51 84 133 -329 295 -73 -152 211 -42 70
6649G0L08o77P01k48r7J88m25K45N4l48L40j72j17M31m41L31J81l97J97j59j79
$$ 70 378 -299 402 154 57 245 -180 65 119 -229 111 -61 -178 253 -188 143 324 -73 124 -35 -214
6670b14M58o55M34qk41N41m87k22Q38o14J04K87o03O32P2m24K69k87K9K92n32
$$ -214 244 -411 23 15 -226 315 -172 -394 444 -170 -66 221 -382 250 322 -102 167 -120 -91 201 -331
6691c31M98k9l41L13j51J09K98o07K13P8j59K94l27j15P40o64K28Q7m63N53l84
$$ -331 167 138 -203 110 -41 68 366 -241 -28 50 -109 185 -142 -257 483 -181 47 134 -329 224 -160
6712a60N5N73p00K65J34p13P54k33j20K78l67K46J63o08Q85n69q0O26m11r4K85
$$ -160 -105 468 -232 33 167 -546 208 -25 -145 133 -234 12 175 -433 452 -117 -197 429 18 -76 209
6733B09n10L83k8m21N77k98M4K20k20Q8j3k46R5p5J74M20m91O0O5k22N44p07M29
$$ 209 -301 82 54 -367 210 -88 -44 176 -44 44 31 -215 -120 -195 -21 399 -92 -32 33 -189 355 -352 77
6756G7J71n96L83J00m78J49J80k40O69o10L83L7m29M06k09j23L20l51Q6J69l77
$$ 77 248 -348 35 135 -343 -194 -14 -254 415 -195 188 225 -204 202 -7 -130 190 -161 -75 94 -283
6777b83N86j54l78N09l63q4L55l60L82Om14L16m11J29K86m27J75J71k73O59m06
$$ -283 303 149 -229 280 -83 -167 188 -172 210 216 -198 118 -293 -164 122 -305 -130 41 -232 427 21
6798B1o8K82o24O00q2k42J92L2k7m1j96K56K3n15O24o3l69O66n60L13P2n51L61
$$ 21 -47 235 -389 211 129 -113 79 111 84 43 -153 103 126 -389 235 172 -197 469 -91 222 294 -257 104
6821A04m52K19M62n03J77J87m69N55k83j84L38P8p0J21p99M51J37l15M55k75n8
$$ 104 -348 -129 333 -170 7 194 -275 280 -3 -187 151 229 159 280 -519 -68 69 -246 209 -66 -124
6842a24M01o05L54J92p16O42l12M9R2l67L75J59m03L94o6l61O23j21k21K09l93
$$ -124 277 -328 26 218 -498 144 -168 -119 -27 -394 -19 140 -263 131 65 -296 327 206 -15 194 -199
6863a99N09k02m32O09m00r3L81n12K64L48k17P5j51o4J08n18M44L2r0M50m08M
$$ -199 310 108 -324 285 -115 -208 173 -339 -75 273 56 131 -20 -84 24 -494 -50 -18 -108 342 -66 -62
6885f2J11l50L51Q8k58K67l15J3K85k42L47L5n11N73m62J60K6k66M61l36j26L12
$$ -62 49 -301 50 138 -120 147 -168 -155 130 -112 235 270 -241 332 -130 30 56 -210 251 -85 -211 101
6907A01k92J53L90r23N52J37l08K98j16k90L52j20j60O36r54O39n9l28O86p17
$$ 101 -191 -38 352 -571 -19 118 -190 108 -8 -298 54 -66 -226 410 -544 95 36 -292 394 -323
6927c23K36J31l09L33j37J16K92k85j62L42k96J17o7n1K48m43m2N37m50K58J49
$$ -323 -87 44 -265 68 -69 47 339 54 -108 234 -62 55 -12 -63 185 -258 -300 237 -213 45 194
6948A94l35L58l7m10L45l90K97J34k64L82l28NK67n05J94J68rL07l53k61J55j65
$$ 194 -141 217 180 -230 115 -275 22 156 -108 274 -54 -49 218 -287 -93 75 66 373 20 -241 -86 -251
6970b51K96J04k07jQ7m24J17J40j5K20j53O7j26j88M57j19l6M40o47M8L86l24
$$ -251 45 149 -58 -59 28 -396 -279 -139 -154 66 -87 -20 -146 -334 123 4 -32 408 -239 -191 195 -129
6992a29M00j50j04J82l18L4K99m86L46r7j3K93p17M88L30m95L48k44N8L4k79J55
$$ -129 271 121 17 199 -119 -85 214 -272 74 -23 -36 257 -460 28 358 -137 211 -33 25 59 -220 -65
7014f5N7N1P8N5k15L25n07J82L29n67O04k24j47L46l48J5K50m67L77Nn12K49J12
$$ -65 -8 43 121 176 -39 286 -221 -39 290 -277 327 103 -44 302 -46 -31 219 -248 129 134 -378 -129 -17
7037a7k13M08m32L98o9n2m1J89j81L42l88j76M79l09J62j6j32J73l08K47J1l98
$$ -17 -230 178 -254 144 75 23 -18 171 -10 332 -56 -232 247 -62 100 84 -48 125 -183 64 75 -323
7059c23N83L6k64J27n11K54O5j16L28l78k1K42j81J00K17l30K68j15L8L72l40
$$ -323 260 296 32 159 -352 -98 -33 -149 179 -199 -220 22 -159 -59 158 -172 96 -19 19 391 51
7080E1J19K2l47J51m9q1J52m9O6l6o0J72J00m74N37k64m71R13o14R5j46J18L00
$$ 51 170 192 -155 -4 -53 -134 18 -31 35 -1 -61 111 211 -263 274 10 -461 452 -162 -67 -213 -95 205
7103B05l15J05J40k00k70N85m56L54J91l18K89m86j9N35m83J57j3j18L08k63j91
$$ 205 -110 -5 135 -65 -335 250 -206 148 339 21 310 -176 -195 340 -143 14 1 -117 191 -72 -263
7124b63L15l87M65l45K6L15O1l14L79k09k0k8j21J19J35j02K25k91q7K29j59K98
$$ -263 52 -335 130 -215 -189 126 187 -127 252 43 23 -5 -126 -7 128 26 251 -40 -127 102 -57 241
7146B41j53q1K36j42R6o4k76L93j48L9k23K47k70K50l27M64l58Q7J13l31J71K00
$$ 241 88 7 243 101 197 133 -143 250 102 141 -82 165 -105 145 -182 282 -76 11 124 -207 -36 164
7168A64l6j47J89l04L23l13j40N09m65M23O1j63M0l24J19R5j46P4K46m07J35L3
$$ 164 128 -19 170 -134 189 -124 -264 245 -220 203 264 101 141 -183 -64 31 -115 -41 205 -202 -67 -34
7190c4j24K15l62M50pm28N30m33nM37j23j04q0k12M32k34P0K21o63M72J8r3m8
$$ -34 -158 57 -305 145 138 -290 240 -193 -198 239 116 12 -68 -280 152 -82 -12 209 -454 18 36 -57 -105
7213a05P0q3K92P3k29o0l2J39j29J4K31l58K08K30o43L22J77l74L12Q0pr7l17
$$ -105 -35 -118 174 247 18 -42 -74 65 -64 -50 181 -177 31 261 -382 -60 117 -257 55 135 128 31 -286
7236b86J88M05n06Q7J31n5j21k51O23j64l90L95j87Q1L82n38J6L34k32M9k0P1
$$ -286 -98 307 -199 -112 19 -36 -157 -408 215 51 -339 56 -131 -50 332 -206 -190 144 -88 -39 -59 12
7258A2K06r3j02K14p61O85k61J84k3r8r1K04k17J52J14j49N7l01L42j35j95K58
$$ 12 218 125 23 237 -524 161 -100 84 61 -37 -128 76 -141 11 125 -24 33 -268 74 -61 -256 2
7280BO5l6J5Q4j52L8j65N7L97p19M03j31N1J14M7k30J95K2j16J0j51J01Pk0J79
$$ 2 67 31 46 130 -22 16 -149 -92 305 -414 -11 -142 -91 23 70 -160 35 57 -59 -49 -200 -99 -92 -112 67
7305F7l67J75M06m66L84k96l9J65L9J64j2l35N1p9O2K48j21%rP3R7j09l7L0n6
$$ 67 -300 -125 281 -185 199 -97 -136 29 68 232 220 -115 -64 -143 -81 167 46 46 37 110 207 98 61 91 35
7330C5l9K37l13M9P0j93P1k59K50K10j21K58k23j52L31m00K17qj26Ok5l3K11%
$$ 35 -4 233 -80 -31 39 -154 -83 -342 -92 118 -3 255 32 -120 211 -189 28 20 -106 -100 -125 -158 53 53
7354E3j88L32m73N28j76k35M82l57j75J76j44j29J96k34M32q5o8K89m32L3J60
$$ 53 -135 197 -276 252 76 -159 323 -34 -209 -33 -177 -306 -110 -344 88 3 -65 224 -208 -175 -15
7375a5j94M81k90O3j27K00o4K13m70K66o9L0K38l17K9P2k51M05P7m25L93ok5k10
$$ -15 -209 272 -18 45 -82 118 54 267 -203 63 -6 24 262 -55 -26 46 -205 200 277 -148 245 239 214 4
7399Dl02M20j98j8K26j06k10L37r8n4lj5J71l01J59M4k54K55p1k79M20Kj29N10
$$ 4 -298 122 -76 -94 132 26 -184 153 55 1 -2 -17 154 -147 12 56 -198 57 -14 -293 127 129 0 510
7423E10n81R1J34k46P3o9K71q7k43J2K76o4o6M4q1J45j10k72K70n5m1M66l86L12
$$ 510 -71 20 154 -92 -19 -88 183 96 -147 -135 141 77 11 55 -26 119 9 -263 7 -48 -89 377 -9 303
7447C03k11j0j31j62L44L3k74M9J53k59L39p6n3K02l63K41n8j23J17Q1l5L5k85
$$ 303 92 82 -49 -211 133 166 -108 -59 94 -165 174 98 45 247 -116 125 67 -56 61 142 107 142 -143
7470a43oK93j61m4o7K23N0q8q2J50k38k0K5K25j1p7J22l35Q0J42j46K39j59j52
$$ -143 -149 144 -17 -61 -128 95 145 57 -25 125 -113 -133 -108 117 106 29 151 -184 -104 38 -108 131 -28 -180
7494a80J28l1k8L17m32J77K39n97K55K36j93L03j30j00J95j85j06O15o70L19J09
$$ -180 -52 -83 -111 206 -226 -49 190 -407 -152 84 -109 194 64 -36 159 -26 -132 483 -187 132 241
7515B41o32L61j40K41j67q9L00mk10J85l27L06N0k31r0J31R0J37L3n2k87p9L94
$$ 241 -391 -30 -170 71 -96 -185 115 111 -99 86 -241 65 115 -116 -206 -75 15 152 185 133 -154 -233 161
7538A61n8k42L13k97k04M23j93K19Kk28M40n40K64J46l63J72o3k12L32J8l28M74
$$ 161 103 -139 174 -123 -327 96 -97 122 124 -104 336 -204 60 206 -157 15 -48 -260 72 90 -238 236
7560B36k87K8M2j7J32o4k30L16j64J37j79L00j19k7k10J71J05k40L7Q3n8J75l28
$$ 236 -51 -23 19 2 134 70 -160 156 -8 129 -50 250 131 104 -106 65 170 -70 -33 50 -8 167 -161
7583a61L75k45m4K52p3K13j30k58K15q0k54K65j33J41j49k21K87J03q3L11k1k80
$$ -161 214 -31 -75 177 104 317 187 -71 144 64 -190 75 -58 83 -66 -287 0 103 20 331 310 30
7605C0N2n37O26p7l23N15k23k12M28m20L48k39j16K45j08qN9K33l30Kk96L53j99
$$ 30 82 -455 171 94 -229 286 63 -149 279 -141 207 -32 -148 97 -11 -19 40 273 -57 -55 -351 2 -197
7628a97M0M7J42j79K76j51O5Q1l46N94o19J83Q5l99N98k54J86m42O2K68J26j47
$$ -197 -157 -110 32 -147 129 -22 43 124 -222 372 -247 -64 21 -378 220 -34 152 -290 -228 40 166 19
7650A9qj62J15J07q3Q6k15k5M72k30%k3K7j48J69j61L21m9l84M54l59K09J6m37
$$ 19 11 -151 -36 71 -12 74 -141 -166 306 76 76 53 80 -68 101 -60 261 212 -172 282 -77 132 148 -289
7674b89J22K58l16L95m96K76p6J36K07j73n6L0J6j97J47j85K88j05J12k33J33
$$ -289 -167 91 -225 170 -326 -50 -126 10 217 44 -12 18 34 -163 -16 -201 87 -18 94 -139 -6
7695fj01J89l06K95J42j52J28k24l63L56N0q6M33o25K88j5l00J86Q8PM44o65J01
$$ -6 -107 82 -224 71 213 61 189 -35 -398 -42 8 -78 355 -270 18 3 -297 -111 -23 -16 428 -237 -136
7718a36M9o4K87j79j07N05o77J18L57k07r6J42P1r1k05K42K25j26Qj05j0J92k71
$$ -136 -87 -151 136 -43 -150 355 -322 -204 153 -54 -150 -8 63 -28 -233 9 234 108 116 11 1 193 -78
7741g8j06L02k14J08J17l29J67k3k50M38m20M02k79q6L69k83P6J91k94KL07l54
$$ -78 -184 118 -96 12 129 -200 -33 -56 -306 132 -288 114 -165 -251 118 -165 -89 102 -192 -190 117 -237
7763b37L92j44k44N50m56L7K82j73n9l0j52M19m85K59L77m91K71K26l67L02l06
$$ -237 155 11 -233 317 -139 -102 180 7 -52 -82 -234 185 -300 -41 336 -155 116 342 -25 277 -29
7784b9Q8J61k18K9j3M9J28j56n7J32j92L86k66m2p7j30K33J88l17j07L19r0Q5
$$ -29 59 220 2 31 18 67 195 39 -18 114 -78 308 42 0 -77 -207 26 214 -103 -210 109 19 104
7807A04j89k45L99k08r1L13l64K90q0q3R1jL66o8k82K51j28l42N07m14K91K8k31
$$ 104 -85 -330 69 -139 -230 83 -281 9 -71 -154 -63 -64 302 234 -48 203 75 -267 240 -174 117 145 -86
7830h6J79j02J8K54l09o0L50m37N04k32m99N15j88q0Q8j12K36Q7l35K77j99L03
$$ -86 93 -9 9 263 -46 -106 244 -193 311 79 -420 95 -93 -173 -85 -197 39 126 -209 68 -131 172
7852A72K8l15K1Q0j59M35j27l37L17k07K80j79k41N53l56nR9j46o1j5J91P3j6
$$ 172 200 -115 -94 -14 -173 262 135 -202 115 -92 188 9 -232 321 -35 -40 59 -87 -148 -163 28 101 85
7875H5m07K71j02L19j31J41N1k61j85Q9J03k04J00J41J27l7j03K26m05J12K70
$$ 85 -322 -51 -153 166 35 176 227 -34 -219 -130 -27 -231 -131 10 137 100 -3 223 -182 -70 200
7896B00m14J76kl1J83k1j18O3j19K31j59m2J13p9l0K20m50J48J59j41J10J1q1
$$ 200 -214 -38 -40 -71 112 91 -27 36 -83 148 -11 -53 60 -19 -49 171 -279 -131 28 -113 -3 8 -73
7919g3L85k72l29M91k37M9r2M8p4Ol6L62j76R6n4j28M69m04q2L09l36K93n8l08
$$ -73 312 40 -289 202 -35 14 -78 -30 -104 -98 -134 228 52 148 94 -34 435 31 -51 258 -78 215 157 -151
7943a51L92j11k7j16J03L2j49j89K74O7q9Q6o5k03P3k73N24pl09O9j52J84J27
$$ -151 241 130 103 -13 90 122 -27 -216 58 125 36 122 57 -146 -73 -346 178 171 -138 -69 -221 -37 90
7966I0l04J90J32m76O67l36P0L38m39QK86j8K3k29P1q9k17N30m73P8K43r6j26
$$ 90 -214 -24 108 -368 299 -37 33 371 -68 -60 226 208 231 2 73 -16 -233 297 -176 -98 145 49 -77
7989g7L99l21r9L52n99L88J21k19J84m85K38L44n95N15J22m31J66J15j39O5k93
$$ -77 322 1 -98 254 -345 43 164 -55 129 -356 -118 226 -369 146 268 -163 3 118 -21 44 -249
8010b49L80j63m7J00l8J72N2m03L27k1j59K02j06k33N0m7K24j00J14K45l00NJ06
$$ -249 131 -32 -79 21 -17 155 207 -196 131 110 -49 153 47 -186 -136 -183 41 -59 55 300 0 5 111
8033A11l13J75K86l54J98j45M2L67n69K64n1jl7j03O0J78k82J72q5R8J40J41m68
$$ 111 -202 -27 259 -95 103 -42 0 367 -202 62 11 10 -27 -130 -70 108 -174 -2 -87 11 151 292 -176
8056a76K20n5J54J77n08N33k73k77N55m36J69j93Q9J68j76j71K88j11j42K58k04
$$ -176 44 -11 143 320 -188 345 72 -205 350 -86 83 -110 -21 147 -29 -200 88 -23 -165 93 -111
8077a11qJ80m72P37r9l68L24m70N19j62l51L97nl35O70n84J30J49l85L96j73r0
$$ -111 -119 61 -411 326 227 -141 183 -287 232 70 -281 116 111 -224 446 -138 -8 141 -244 152 -21 -111
8099a11M35o41J96N3P9J93j72j91N72n98J42L39m46K57q6j05J67j34q8K38l78
$$ -111 324 -317 -121 -68 11 204 32 -159 413 -185 -43 296 -150 107 21 -84 83 -51 -139 99 -279
8120b79M77k16j90L27p1k36O91m96J96j53KM02n73j28L56l74L58l2l14K27Mj43
$$ -279 198 -18 -208 119 48 -188 503 7 203 50 52 454 -119 -247 109 -265 93 61 -253 -26 -22 -165
8142a65J28J45j89J62j42J56jj51K32k64n7K76k75K84l14J26J96l01j2L74l00
$$ -165 -37 108 -81 81 -61 95 94 -57 175 -89 -146 130 -145 139 -175 -49 147 -154 -166 208 -92
8163i2o4K43k06O5J33PJ75k22J12k35k41N95lk78J83k86J35K07o48N32J9k34L63
$$ -92 -156 87 -119 -54 79 86 261 39 151 -84 -325 270 267 -11 172 -114 21 228 -420 112 131 -103 260
8186B60k53j60K34k25L46
$$ 260 7 -153 81 -144 202
8191B02
$$ Imaginary data points
##PAGE= N=2
##DATA TABLE= (X++(I..I)), XYDATA
0@%%%%%%%%%%Mj0J4j6K4l2L2m0N6p2Q8j04J20j41J69k00K33k73L20l68M21m84
$$ 0 0 0 0 0 0 0 0 0 0 0 4 -6 8 -8 16 -16 16 -24 32 -40 48 -56 64 -77 92 -108 125 -148 172 -196 225 -259
32b59N55o33P18q11R16j032J156j293J446j613J793j991K210k447K704k986L294
$$ -259 296 -337 381 -430 486 -546 610 -683 763 -850 943 -1048 1162 -1285 1419 -1567 1727
49A727l631M000m402M847n341N887o493P174p945Q819r822J0988j2364J4012j6025
$$ 1727 -1904 2096 -2306 2541 -2800 3087 -3406 3768 -4177 4642 -5180 5808 -6556 7456 -8569
64h569J8545k1787K6096l1982L9782n8477O75619p15803m93552Q28972m12080
$$ -8569 9976 -11811 14285 -17697 22085 -36392 639227 -76576 -570128 258844 -153236
75a53236k32522O44725j37404n88283L50712L86476l22042n9706K28026k44214
$$ -153236 -385758 258967 121563 -466720 -116008 270468 -51574 -111280 116746 -127468
85a27468J40118K22419l00622N5566Q1721j20439K54180j88318j90985L74072
$$ -127468 12650 235069 -65553 -9987 71734 -48705 205475 17157 -173828 200244
95B00244j30266j83430K43083j22258q3888J88469k7172j69840J2666J83246q3543
$$ 200244 69978 -113452 129631 7373 -76515 111954 84782 -85058 -72392 110854 27311
106B7311j20250J42099j40976o619K45220k30504n9949J89957j33232Q0472O6077
$$ 27311 -92939 49160 -91816 -98435 146785 -83719 -143668 46289 -86943 -6471 59606
117E9606j56527P9057J1911K2472Q0017j54272L3863R0651o4831N1990m9600k4021
$$ 59606 -96921 -17864 -5953 16519 96536 -57736 -23873 66778 1947 53937 4337 -19684
129a9684N0391o9713R5237j8473j36104J36026k3802n4369R8791r3627K2137M8749
$$ -19684 30707 -39006 56231 37758 -98346 37680 13878 -40491 58300 -35327 -13190 35559
141C5559o9364R0229o3816l4493J25415j28215K5341J04985j49500N2446N3953
$$ 35559 -33805 56424 -7392 -41885 83530 -44685 -19344 85641 -63859 -11413 42540
152D2540q4236M4917j8018J5039J0565p0866Q8764k2172m9941R2573q5238K0764
$$ 42540 -41696 3221 -14797 242 10807 -60059 28705 6533 -43408 49165 -36073 -15309
164a5309P2200j13805Q3737N330j06797J21490l5896m9515Q2092q1247L3305M6821
$$ -15309 56891 -56914 26823 32153 -74644 46846 10950 -38565 43527 -37720 -4415 42406
176D2406p5936N5238k2020j4228N3575o4671N2314j596p9099J07196m3381m6853
$$ 42406 -33530 21708 -312 -14540 39035 -25636 26678 25082 -54017 53179 9798 -37055
188c7055Q7029q1849K7265M2616r0396P6723j8744n3342Q6494o6469J3902N1501
$$ -37055 49974 -31875 -4610 38006 -52390 24333 5589 -47753 38741 -27728 -13826 37675
200C7675r0936O9602O588o8224P6880l5190j0145L6000n1939N8979k3708m5513
$$ 37675 -53261 16341 22929 -45295 31585 -3605 -13750 22250 -29689 29290 5582 -39931
212c9931Q5459o5211N146O1593r3427O2283J3076q1494R5668l7148m5211P8941
$$ -39931 45528 -19683 -14537 47056 -46371 15912 28988 -52506 43162 6014 -39197 39744
224C9744n5968J5951K2106n4732N8359k8633j7800N2079o1925L8867Q573o3642
$$ 39744 -16224 -273 21833 -32899 25460 -3173 -20973 31106 -30819 8048 16621 -47021
236d7021Q5519m3725l7884R1828p3372J0887M9872p3884N9240q063m7827P1687
$$ -47021 38498 -5227 -43111 48717 -24655 -13768 36104 -37780 21460 13397 -34430 37257
248C7257m7662R17L7991n7673N2268j7894l7468P5381o2424K627N4194p2200M8062
$$ 37257 -10405 -9488 28503 -29170 23098 5204 -32264 43117 -19307 -16680 37514 -34686 13376
261A3376o12n2083P6262m8813j2851O0748o5228L3628J1220n0601O6367m0736
$$ 13376 12764 -39319 36943 -11870 -24721 36027 -29201 4427 15647 -34954 31413 -9323
273i323j5211O2294o4321K7712K0052n3189O1527l3879j9576O5085o4406K1602
$$ -9323 -24534 37760 -26561 1151 21203 -31986 29541 -4338 -23914 41171 -23235 -1633
285a633K9729n9105N6155k2941k7735O4657o0469J3447L8276o2330M8328j2741
$$ -1633 28096 -31009 25146 2205 -25530 39127 -21342 -7895 30381 -31949 16379 3638
297C638l2615O3010n5950P869M4521o4292M4163k946l7650O2148m9982L163N0217
$$ 3638 -28977 34033 -21917 -14048 30473 -33819 10344 7398 -30252 31896 -18086 -14923 35294
310C5294o6255M0775P565m5256O0089m1501m345N2228o5221L3121J5599n0519
$$ 35294 -30961 9814 17379 -27877 32212 -9289 -13634 38594 -26627 6494 22093 -28426
322b8426N5531l3999j1672N2677o2873K9138K2056n6389N3415k2969j8928N3538
$$ -28426 27105 -6894 -18566 34111 -28762 376 22432 -33957 19458 -3511 -22439 31099
334C1099n7751K3606K8439n8267N0339j4248k5866N4029n2041J6181L3921o0555
$$ 31099 -26652 -3046 25393 -32874 17465 3217 -22649 31380 -20661 -4480 29441 -31114
346c1114M6542n332l3493N2831m4924R806L6531o0764M3587M96m0349N3623l9065
$$ -31114 15428 10096 -23397 29434 -15490 -5684 30847 -29917 13670 14166 -26183 27440 -11625
359a1625J187L9956n9447L8587O374m6049N4424l3616n953M3976n7932L4876J4017
$$ -11625 -10438 29518 -29929 8658 15032 -31017 23407 -10209 -16162 27814 -30118 4758 18775
372A8775n1913N4438k2762j5250M5188n0916K7423J7513n0741N1193k0733k0215
$$ 18775 -33138 21300 -1462 -16712 28476 -22440 4983 22496 -28245 22948 2215 -18000
384a8000M7996n0131K2658K1141n7223N2294j2641l2080N1602m2518R834K9446
$$ -18000 29996 -20135 2523 23664 -33559 18735 6094 -25986 25616 -16902 -7068 22378
396B2378n2120M2298n029l3201M9059l5949O511K8404n0951M3271m350l7816N4725
$$ 22378 -29742 12556 7527 -25674 23385 -12564 -6053 22351 -28600 14671 10321 -27495 27230
409B7230l5723l150L9095n1435L4977N947m4440N2064k5509j2299L8992m5433
$$ 27230 -8493 -11643 27452 -23983 10994 16941 -27499 24565 -944 -13243 25749 -19684
421a9684K6627P399m2166N0739k6647j6034M4337m7640K3419J5982m8464M9208
$$ -19684 6943 14342 -27824 22915 -3732 -19766 24571 -23069 350 16332 -32132 17076
433A7076j8020k2813M8156m1078J4478K0231m4990M7501j4548k8013N1272m0549
$$ 17076 -944 -23757 24399 -16679 -2201 18030 -26960 20541 5993 -22020 29252 -11297
445a1297O980K9858m7097L6680p122k9212M8030l6337J339K8711m4684L6568n243
$$ -11297 -4317 25541 -21556 15124 8002 -21210 26820 -9517 -8178 20533 -24151 12417 7174
458G174l3979N0780l5264m329L9386m8048K7695O776l8409M7857k4566j2984L9954
$$ 7174 -26805 23975 -11289 -15618 23768 -24280 3415 10191 -28218 19639 -4927 -17911 22043
471B2043m0155K1030R417l4236M4577k5993j0592M2922m5303K0984J5926m4482
$$ 22043 -18112 2918 12335 -21901 22676 -3317 -13909 29013 -16290 4694 20620 -23862
483b3862M5773j7742k3090M7341m1603P480K5411m0687L3812j1773k2047M3837
$$ -23862 21911 4169 -18921 28420 -13183 -5703 19708 -20979 12833 1060 -20987 22850
495B2850l8371Q981K5681m4609L5945n872k6603M6226l6691J462L4827m5359K9782
$$ 22850 -15521 -6540 19141 -25468 10477 4605 -21998 24228 -12463 -11001 23826 -21533 8249
508H249K252l2675M3625k8021m205L4392m2803K4745O092l2693M3040k7069r345
$$ 8249 10501 -22174 21451 -6570 -10775 23617 -19186 5559 11651 -21042 21998 -5071 -14416
521a4416M0299m3554J8666J5590l7852L6348j7105j2031L6625l9693J6612J5497
$$ -14416 25883 -17671 995 16585 -21267 15081 -2024 -14055 22570 -17123 -511 14986
533A4986l7827L8920j6207j6876M2012m1673J3051K6273m5243L3494l939k5820
$$ 14986 -22841 16079 -128 -17004 25008 -16665 -3614 22659 -22584 10910 6971 -18849
545a8849L9927l0600L404K3951l8276K9296m946k2432L7985l3962O976K9008m6694
$$ -18849 21078 -9522 -6118 17833 -20443 8853 3907 -18525 19460 -14502 -7526 21482 -25212
558b5212L3214K352l4728M4906k4878q056L5331l9138J9830J0270l0538L3776
$$ -25212 8002 10354 -24374 20532 -4346 -12402 22929 -16209 3621 13891 -16647 17129
570A7129k0959m152L0307m0979K4455R934l9007M0336j6411j5789L6224l7123
$$ 17129 -3830 -7982 22325 -18654 5801 15735 -23272 17064 653 -15136 21088 -16035
582a6035J4495J7472l8820L3960r820j9270L5125l1745J0284J8327l6907L2545
$$ -16035 -1540 15932 -22888 11072 1252 -18018 17107 -14638 -4354 13973 -22934 9611
594I611p380k0907L8475l2338O632K5493m0191L0406N35k7674L6365k3629p9K5124
$$ 9611 2231 -18676 19799 -12539 -5907 19586 -20605 9801 10336 -17338 19027 -4602 -4681 20443
608B0443l7112K7106J43k9424L9562k5239n539L0608l8716K1620Q558l3746L5764
$$ 20443 -16669 10437 10580 -18844 20718 -4521 -10060 20548 -18168 3452 12010 -21736 14028
621A4028j7556j0014L0550l4331J8833R388l3435L6919j5235j4277L4353l3200
$$ 14028 -3528 -13542 17008 -17323 1510 10898 -22537 14382 -853 -15130 19223 -13977
633a3977J3589J5667l5333L4206j0393j9307L6098k9885O581J9736l4470K8728
$$ -13977 -388 15279 -20054 14152 3759 -15548 20550 -9335 -2754 16982 -17488 11240
645A1240n631k1123L4132k7425M181K0893l5219K7959l280k5397L7430k5459k648
$$ 11240 5609 -15514 18618 -8807 -4626 16267 -18952 9007 5727 -19670 17760 -7699 -10347
658a0347K7366l5078K2795M069k8543L5780j9907o798K8898l2188J8391O293k8571
$$ -10347 17019 -18059 4736 8805 -19738 16042 -3865 -10663 18235 -13953 4438 10731 -17840
671a7840L4748j8372r545L1278l3991J5874J1544l3071L3676j3871j5163L3480
$$ -17840 16908 -1464 -11009 20269 -13722 2152 13696 -19375 14301 430 -14733 18747
683A8747l1234R683J5931l2399K9686r252j7690L4308k9196O618J9574l2605K7436
$$ 18747 -12487 -2804 13127 -19272 10414 1162 -16528 17780 -11416 -4798 14776 -17829 9607
696I607n403k0367L4874k6276J697K3620l3448K3947j23k3920L3814k3158k341
$$ 9607 4204 -16163 18711 -7565 -5868 17752 -15696 8251 8128 -15792 18022 -5136 -7477
709g477K5543l2975K0094L354k6101L2688j9856o401K8038l2682J6849Q041k7878
$$ -7477 18066 -14909 5185 8539 -17562 15126 -4730 -11131 16907 -15775 1074 9115 -18763
722a8763L1486j6119r097K9805l1164J3704J2387k9744L0385j2005j3155L1540
$$ -18763 12723 -3396 -12493 17312 -13852 -148 12239 -17505 12880 875 -12280 19260
734A9260l0025R771J6359l1242K7412p989j6583L1397k7753O165J8870l2768K5177
$$ 19260 -10765 -994 15365 -15877 11535 3546 -13037 18360 -9393 -3228 15642 -17126 8051
747H051l859k0106L1907k5295J821K2609l2423K2276O71k2705L1788k1176j966
$$ 8051 4192 -15914 15993 -9302 -7481 15128 -17295 4981 5652 -17053 14735 -6441 -8407
760h407K5095l1957J9609N445k5421L0581j7498n448K5973l0251J5702Q728k7900
$$ -8407 16688 -15269 4340 9785 -15636 14945 -2553 -8001 17972 -12279 3423 12151 -15749
773a5749K9131j3731j0230K7775k9289J1775J1960k9030K7387r927j3664K8820
$$ -15749 13382 -349 -10579 17196 -12093 -318 11642 -17388 9999 72 -13592 15228
785A5228k7092Q626J5873l0466K6262n810j6833L0160k4591M626J9100l0347K3812
$$ 15228 -11864 -3238 12635 -17831 8431 2621 -14212 15948 -8643 -4017 15083 -15264 8548
798H548j808k0428L0270k1816O13K1501l1097K0897J761k3506K9851j9094l916
$$ 8548 6740 -13688 16582 -5234 -4621 16880 -14217 6680 8441 -15065 14786 -4308 -8224
811h224K3626l0278J7825N489k5311K8596j5310p578K5600k8106J4202R130k6525
$$ -8224 15402 -14876 2949 8438 -16873 11723 -3587 -11165 14435 -13671 531 9661 -16864
824a6864K7823j1238j0823K7199k6837J0928J2614k7967K6173q037j4238K7378
$$ -16864 10959 -279 -11102 16097 -10740 188 12802 -15165 11008 2971 -11267 16111
836A6111k4139O543J5105k8522K3887n094j7219K8233k2891L153J8024k9079K2008
$$ 16111 -8028 -1485 13620 -14902 8985 3891 -13328 14905 -7986 -4833 13191 -15888 6120
849F120j561k0227K9304k0247o63K1042k8574J9509K088k2036K8894j6886m077
$$ 6120 4559 -15668 13636 -6611 -7274 13768 -14806 4703 6791 -15245 13649 -3237 -7314
862g314K2577k7696J6657N306k3900K7931j4493p834K4978k7449J3102Q785k6010
$$ -7314 15263 -12433 4224 9530 -14370 13561 -932 -8766 16212 -11237 1865 10650 -15360
875a5360K6525j1596j1565K6409k5221Q921J2209k6311K4344p418j3692K6785
$$ -15360 11165 -431 -11996 14413 -10808 -1887 10322 -15989 8355 937 -12755 14030
887A4030k3118O207J5003k6911K2859m311j6434K7694k0908J948J7934k6763J9542
$$ 14030 -9088 -2881 12122 -14789 8070 3759 -12675 15019 -5889 -3941 13993 -12770 6772
900F772n38j8691K6771j8742j519J9966k7018J7317K173k1365K7219j6808m290
$$ 6772 6234 -12457 14314 -4428 -5947 14019 -12999 4318 6491 -14874 12345 -4463 -8753
913h753K2345k6786J4635O009k2683K6692j3805p431K3958k5268J1760R626k4552
$$ -8753 13592 -13194 1441 7450 -15233 11459 -2346 -9777 14181 -11087 673 10299 -14253
926a4253K5664j0350j0803K5667k4304P888J2834k5402K2618o854j4040K5878
$$ -14253 11411 1061 -9742 15925 -8379 -491 12343 -13059 9559 2705 -11335 14543
938A4543k2046M191J4714k5353K0691m174j5657K5996k0803J989J8210k6301J8343
$$ 14543 -7503 -3312 11402 -13951 6740 2566 -13091 12905 -7898 -5909 12301 -14000 4343
951D343J080j9129K5479j6019k377J9780k4603J5601L109j9561K5061j4735m671
$$ 4343 5423 -13706 11773 -4246 -6623 13157 -11446 4155 7264 -12297 12764 -1971 -6642
964f642K1303k5354J3429O597k2980K4780j1993q405K3097k3884R142J0156k3509
$$ -6642 14661 -10693 2736 9333 -13647 11133 -860 -9265 13832 -10052 -910 9246 -14263
977a4263K2529q149j0977K3503k2101P431J2037k3941K1689n666j3438K5477k1145
$$ -14263 8266 117 -10860 12643 -9458 -2027 10010 -13931 7758 2092 -11346 14131 -7014
990g014M048J5954k5211J9208j380j6437K4409j8046O40J6857k4437J6698N03
$$ -7014 -2966 12988 -12223 6985 5605 -10832 13577 -4469 -3829 13028 -11409 5289 5792
1003E792j8259K3898j5479k763J8696k4496J4500M423k0478K4023j3066n621K0965
$$ 5792 -12467 11431 -4048 -6811 11885 -12611 1889 6312 -14166 9857 -3209 -8830 12135
1016A2135k3266J1795P461k1124K2559r883q076K1990k2286R487R719k2713K1633
$$ 12135 -11131 664 8125 -12999 9560 -323 -8399 13591 -8695 792 10511 -12202 9431
1029I431p221j1590K2599k0523N908J2138k3077J9392m864j3713K3544j9489L235
$$ 9431 2210 -9380 13219 -7304 -1396 10742 -12335 7057 2193 -11520 12024 -7465 -4230
1042d230J4764k4277J8650j314j6634K4218j6381n10J7269k2870J5307K012j7646
$$ -4230 10534 -13743 4907 3593 -13041 11177 -5204 -5714 11555 -11315 3992 6004 -11642
1055a1642K3460j4587l053J8830k2992J4091M044k0146K2905j2385n834K0216
$$ -11642 11818 -2769 -5822 13008 -9984 4107 8151 -11995 10910 -1475 -7309 12907
1067A2907k2411R938P869k1253K1004q140r523K0964k0251P366R736k1072J9902
$$ 12907 -9504 434 8303 -12950 8054 -86 -9609 11355 -8896 -1530 8206 -12866 7036
1080G036o425j0767K2105j9060M620J3046k2368J8757l022j4048K2571j6926J208
$$ 7036 611 -10156 11949 -7111 -2491 10555 -11813 6944 3922 -10126 12445 -4481 -3273
1093c273J5083k2080J5422K19j6214K1830j4705j497J6390k2360J4434J839j7464
$$ -3273 11810 -10270 5152 5371 -10843 10987 -3718 -5215 11175 -11185 3249 5088 -12376
1106a2376K2119j3422l932J9099k2192J2026N404j9119K1188j0048o511J9751
$$ -12376 9743 -3679 -7611 11488 -10704 1322 6726 -12393 8795 -1253 -7764 11987
1118A1987k0406R141P834j9301J9706p926q649K0218j9239O364J0149k1039J8538
$$ 11987 -8419 722 8556 -10745 8961 1035 -7614 12604 -6635 -271 9878 -11161 7377
1131G377n077j2032K1117j7611K868J2727k0975J6177j966j3506K0715j5770J328
$$ 7377 2300 -9732 11385 -6226 -3358 9369 -11606 4571 2605 -10901 9814 -5956 -4628
1144d628J4204k0889J5409P3j5030K1260j3765j509J6432k0976J2995L050j6852
$$ -4628 9576 -11313 4096 4169 -10861 10399 -3366 -4875 11557 -9419 3576 6626 -10226
1157a0226K0382j1502m207J7244k0132J0322N444j8274J9401r576o732J8798j9921
$$ -10226 10156 -1346 -5553 11691 -8441 1881 7325 -10949 8452 -1124 -7856 10942 -8979
1170h979Q177Q052j9357J8837o678r143J9474j7880N650J0448j9758J7414l939
$$ -8979 -802 7250 -12107 6730 52 -9091 10383 -7497 -1847 8601 -11157 6257 2318
1183B318j1422K0124j6084K747J2597j9788J5266j418j3258J9829j4965K59J4219
$$ 2318 -9104 11020 -5064 -2317 10280 -9508 5758 4340 -8918 10911 -4054 -3795 10424
1196A0424k0143J3447P02j5137J9747j2406k521J5606j9891J1510M069j6766J9261
$$ 10424 -9719 3728 4430 -10707 9040 -3366 -5887 9719 -10172 1338 5407 -11359 7902
1209G902r862n009J7093j8311R319O160j7634J8170p630o683J7750j7699P070
$$ 7902 -1960 -6969 10124 -8187 1132 7292 -10342 7828 198 -6485 11265 -6434 636
1222F36Q013j8624J7769o088r945J8873j6829M481J0538j9260J5461l255j1196
$$ 636 8649 -9975 7794 1706 -8239 10634 -6195 -1714 8824 -10436 5025 1770 -9426
1235i426J8698j5095K066J2170j8743J4045o28j2993J8913j3022q7J3900j8795
$$ -9426 9272 -5823 -3757 8413 -10330 3715 3087 -9906 9007 -4015 -4102 9798 -8997
1248h997J2407J931j4576J8502j0910k753J4717j7947R814M347j6243J7716q981
$$ -8997 3410 5341 -9235 9267 -1643 -4396 10321 -7626 2188 6535 -9708 8008 -973
1261i73n479J6220j7639P827O282j6660J6670o536p811J7236j6197N666Q728j7325
$$ -973 -6452 9768 -7871 -44 6238 -10422 6248 -288 -8099 9137 -7060 -1394 7334 -9991
1275i991J5437m302q830J7635j5250L512J0448j7538J4421k035j1536J7870j3544
$$ -9991 5446 1144 -7686 9949 -5301 -1789 8659 -8879 5542 3507 -8029 9841 -3703
1288c703J125J1830j7490J2290l68j2917J7814j1917j320J3165j7627J1424J848
$$ -3703 -2578 9252 -8238 4052 3684 -9233 8581 -3336 -4656 8509 -9118 2306 4154
1301D154j4282J7607j0111l335J5092j7360R240M479j4573J6298p841n090J5353
$$ 4154 -10128 7479 -2632 -5967 9125 -8235 1005 5484 -9089 7209 -632 -5722 9631
1314I631j5732O880O379j5759J5638n807p530J6278j5482M744Q179j6533J4356
$$ 9631 -6101 779 7158 -8601 7037 1230 -6300 9978 -5504 -760 7419 -9114 5242
1327E242l880r011J5910j3460K288R932j6409J3259j830j0455J6327j1866M54
$$ 5242 1362 -7649 8261 -5199 -2911 7021 -9388 3871 2041 -8414 7913 -3953 -3499
1340c499J1431j6343J2137j87j1644J6654j0951j379J3112j6573R892K780j3484
$$ -3499 7932 -8411 3726 3539 -8105 8549 -2402 -3781 9331 -7242 2650 5430 -8054
1353h054J5733q962l368J3632j5685P597M532j4142J5116p466n333J4384j4597
$$ -8054 7679 -1283 -4651 8981 -6704 893 5425 -8717 6399 -1067 -6400 7984 -6613
1366f613N744O750j4946J4086m710p365J5214j3388L877Q433j5094J3330l182
$$ -6613 -869 5881 -9065 5021 311 -7054 8160 -5228 -1351 7082 -8012 5318 2136
1379B136q865J5384j2142J866R559j5112J1529j116j0848J5534j0831k05J0546
$$ 2136 -6729 8655 -3487 -1621 7938 -7174 4355 3239 -7609 7925 -2906 -3111 7435
1392G435j4993J0045Q48j1978J5493j0000j656J2223j5003Q837K692j2629J5017
$$ 7435 -7558 2487 3335 -8643 6850 -3150 -4806 7417 -7586 1251 3943 -8686 6331
1405F331p409m181J3435j4202P087M572j3236J4040n971n271J3580j3956N257
$$ 6331 -1078 -5259 8176 -6026 1061 5633 -7603 6437 466 -4805 8775 -5181 76
1418G6O616j4389J3354m542p547J4388j2761L164P941j4324J1733k575q487J4489
$$ 76 6692 -7697 5657 1115 -6432 7956 -4805 -1641 6300 -8024 3709 1134 -7353 7136
1432G136j1295J033R244j3819J0899o53r751J4435j0105K5J0591j4545R570J663
$$ 7136 -4159 -3126 6118 -7701 3198 2545 -7206 7229 -2876 -2851 7740 -6805 2765 4428
1446D428j1333J4164q254k550J1342j3552P406L181j2073J3270o877m040J2062
$$ 4428 -6905 7259 -995 -3545 7797 -5755 1651 4832 -7241 6029 -848 -4888 7174
1459G174j3628O429M698j2869J3088n416n583J3335j2561M376O293j2949J2221
$$ 7174 -6454 -25 4673 -8196 4892 -524 -6107 7228 -5333 -957 5336 -7613 4608
$$ [...]
8191B2
##END NTUPLES=NMR FID
##END=
