##TITLE=1H_47-2022
 CDCl3
 8 sc, 
 25.07.2022
##JCAMPDX= 6.0         $$ Bruker NMR JCAMP-DX V2.0
##DATA TYPE= NMR SPECTRUM
##DATA CLASS= NTUPLES
##ORIGIN= UXNMR, Bruker Analytische Messtechnik GmbH
##OWNER= root
$$ XWIN-NMR		Version 3.5
$$ Mon Jul 25 14:39:26 2022 Russian Standard Time (UT+4h)  she@DPX200
##.OBSERVE FREQUENCY= 200.1313499994
##.OBSERVE NUCLEUS= ^1H
##.ACQUISITION MODE= SIMULTANEOUS
##.ACQUISITION SCHEME= undefined
##.AVERAGES= 8
##.DIGITISER RES= 18
##SPECTROMETER/DATA SYSTEM= spect
##.PULSE SEQUENCE= zg30
##.SOLVENT NAME= DMSO
##.SHIFT REFERENCE= (INTERNAL, DMSO, 0, 15.7513)
##AUDIT TRAIL= $$ (NUMBER, WHEN, WHO, WHERE, WHAT)
$$ ##TITLE= Audit trail, XWIN-NMR		Version 3.5
$$ ##JCAMPDX= 5.01
$$ ##ORIGIN= Bruker BioSpin GmbH
$$ ##OWNER= she
$$ F:/spectra/data/she/nmr/H-F/1/pdata/1/auditp.txt
$$ ##AUDIT TRAIL=  $$ (NUMBER, WHEN, WHO, WHERE, WHAT)
(   1,<2022-07-25 14:38:12.20 +0400>,<she>,<DPX200>,
      <created by zg, POWCHK disabled, PULCHK disabled
       configuration hash MD5:
       00 E9 B6 7A A2 85 ED C7 34 08 36 98 17 FE 4E 26
       data hash MD5: 16K
       8B 9B 54 2C A9 50 7E E0 E0 5B 84 75 1B 05 FC 59>)
(   2,<2022-07-25 14:38:14.62 +0400>,<she>,<DPX200>,
      <Start of raw data processing
       efp BC_mod = 2 LB = 0.24 FT_mod = 6 PKNL = 1 PHC0 = -18040.01 PHC1 = 9.20068 SI = 16K 
       data hash MD5: 16K
       C4 57 CA 23 18 DF 31 CF CB B4 02 8C 92 26 2F 04>)
(   3,<2022-07-25 14:38:38.65 +0400>,<she>,<DPX200>,
      <pk PHC0 = 2.360204 PHC1 = 8.940697e-08 
       data hash MD5: 16K
       08 6D 48 94 BA 1B 80 B8 BF F4 A0 7C 68 42 A7 07>)
(   4,<2022-07-25 14:38:41.96 +0400>,<she>,<DPX200>,
      <abs ABSG = 5 
       data hash MD5: 16K
       D0 2F AB 83 19 9F 46 3C 91 00 D6 F5 C5 6C C1 F8>)
$$ ##END=
$$ 
$$ hash MD5
$$ C2 38 20 B2 E2 B4 C1 82 C4 3A D3 53 E0 76 C3 0D
##$RELAX= 
##$RELAX= 
##$RELAX= 
##$RELAX= 
##$RELAX= 
##$RELAX= 
$$ Bruker specific parameters
$$ --------------------------
##$DU= <F:/spectra>
##$EXPNO= 1
##$NAME= <H-F>
##$PROCNO= 1
##$TYPE= <nmr>
##$USER= <she>
##$AMP= (0..31)
100 100 100 100 100 100 100 100 100 100 100 100 100 100 100 100 100 100 
100 100 100 100 100 100 100 100 100 100 100 100 100 100 
##$AQSEQ= 0
##$AQ_mod= 1
##$AUNM= <au_zg>
##$AUTOPOS= <>
##$BF1= 200.13
##$BF2= 200.13
##$BF3= 200.13
##$BF4= 200.13
##$BF5= 200.13
##$BF6= 200.13
##$BF7= 200.13
##$BF8= 200.13
##$BYTORDA= 1
##$CFDGTYP= 0
##$CFRGTYP= 5
##$CHEMSTR= <none>
##$CNST= (0..31)
1 1 145 1 1 1 1 1 1 1 1 1 1 1 1 1 1 1 1 1 1 1 1 1 1 1 1 1 1 1 1 1 
##$CPDPRG= <>
##$CPDPRG1= <>
##$CPDPRG2= <>
##$CPDPRG3= <>
##$CPDPRG4= <mlev>
##$CPDPRG5= <mlev>
##$CPDPRG6= <mlev>
##$CPDPRG7= <mlev>
##$CPDPRG8= <mlev>
##$CPDPRGB= <>
##$CPDPRGT= <>
##$D= (0..31)
0 1.2 0 0 0 0 0 0 0 0.06 0 0.03 0 0 0 0 0.0002 0 0 0 0 0 0 0 0 0 0 0 0 
0 0 0 
##$DATE= 1658745491
##$DBL= (0..7)
120 120 120 120 120 120 120 120 
##$DBP= (0..7)
150 150 150 150 150 150 150 150 
##$DBP07= 0
##$DBPNAM0= <>
##$DBPNAM1= <>
##$DBPNAM2= <>
##$DBPNAM3= <>
##$DBPNAM4= <>
$$ [...]
##$SUBNAM2= <"">
##$SUBNAM3= <"">
##$SUBNAM4= <"">
##$SUBNAM5= <"">
##$SUBNAM6= <"">
##$SUBNAM7= <"">
##$SUBNAM8= <"">
##$SUBNAM9= <"">
##$SW= 18.0517283424941
##$SWIBOX= (0..15)
0 0 2 0 0 0 0 0 0 0 0 0 0 0 0 0 
##$SW_h= 3612.71676300578
##$TD= 16384
##$TD0= 1
##$TE= 0
##$TE2= 300
##$TE3= 300
##$TEG= 300
##$TL= (0..7)
0 120 120 120 120 120 120 120 
##$TP= (0..7)
150 150 150 150 150 150 150 150 
##$TP07= 0
##$TPNAME0= <>
##$TPNAME1= <>
##$TPNAME2= <>
##$TPNAME3= <>
##$TPNAME4= <>
##$TPNAME5= <>
##$TPNAME6= <>
##$TPNAME7= <>
##$TPOAL= (0..7)
0.5 0.5 0.5 0.5 0.5 0.5 0.5 0.5 
##$TPOFFS= (0..7)
0 0 0 0 0 0 0 0 
##$TUNHIN= 0
##$TUNHOUT= 0
##$TUNXOUT= 0
##$USERA1= <user>
##$USERA2= <user>
##$USERA3= <user>
##$USERA4= <user>
##$USERA5= <user>
##$V9= 5
##$VALIST= <valist>
##$VCLIST= <CCCCCCCCCCCCCCC>
##$VD= 0
##$VDLIST= <DDDDDDDDDDDDDDD>
##$VPLIST= <PPPPPPPPPPPPPPP>
##$VTLIST= <TTTTTTTTTTTTTTT>
##$WBST= 1024
##$WBSW= 4
##$XGAIN= (0..3)
0 0 0 0 
##$XL= 0
##$YL= 0
##$YMAX_a= 799825
##$YMIN_a= -689196
##$ZGOPTNS= <>
##$ZL1= 120
##$ZL2= 120
##$ZL3= 120
##$ZL4= 120
##$ABSF1= 15.7524
##$ABSF2= -2.299449
##$ABSG= 5
##$ABSL= 3
##$ALPHA= 0
##$AQORDER= 0
##$ASSFAC= 0
##$ASSFACI= 0
##$ASSFACX= 0
##$ASSWID= 0
##$AUNMP= <proc_1d>
##$AZFE= 0.1
##$AZFW= 0.1
##$BCFW= 0
##$BC_mod= 2
##$BYTORDP= 0
##$COROFFS= 0
##$CY= -3
##$DATMOD= 1
##$DC= 0
##$DFILT= <>
##$DTYPP= 0
##$F1P= 0
##$F2P= 0
##$FCOR= 1
##$FTSIZE= 16384
##$FT_mod= 6
##$GAMMA= 0
##$GB= 0
##$INTBC= 1
##$INTSCL= 0
##$ISEN= 128
##$LB= 0.24
##$LEV0= 0
##$LPBIN= 0
##$MAXI= 10000
##$MC2= 0
##$MEAN= 0
##$ME_mod= 0
##$MI= 1.114404
##$NCOEF= 0
##$NC_proc= -5
##$NLEV= 6
##$NOISF1= 3.799351
##$NOISF2= 2.8
##$NSP= 0
##$NTH_PI= 0
##$NZP= 0
##$OFFSET= 15.7513
##$PC= 1
##$PHC0= -18037.65
##$PHC1= 9.20068
##$PH_mod= 1
##$PKNL= yes
##$PPARMOD= 0
##$PSCAL= 0
##$PSIGN= 0
##$REVERSE= no
##$SF= 200.130004051058
##$SI= 16384
##$SIGF1= 3
##$SIGF2= 2
##$SINO= 5.538805
##$SIOLD= 16384
##$SREGLST= <1H.CDCl3>
##$SSB= 0
##$STSI= 16384
##$STSR= 0
##$SW_p= 3612.71676300578
##$SYMM= 0
##$S_DEV= 0
##$TDeff= 16384
##$TDoff= 0
##$TI= <>
##$TILT= no
##$TM1= 0
##$TM2= 0
##$TOPLEV= 0
##$USERP1= <user>
##$USERP2= <user>
##$USERP3= <user>
##$USERP4= <user>
##$USERP5= <user>
##$WDW= 1
##$XDIM= 16384
##$YMAX_p= 345602762
##$YMIN_p= -216012
$$ End of Bruker specific parameters
$$ ---------------------------------
##NTUPLES= NMR SPECTRUM
##VAR_NAME=  FREQUENCY,     SPECTRUM/REAL,   SPECTRUM/IMAG
##SYMBOL=    X,             R,               I
##VAR_TYPE=  INDEPENDENT,   DEPENDENT,       DEPENDENT
##VAR_FORM=  AFFN,          ASDF,            ASDF
##VAR_DIM=   16384,         16384,           16384
##UNITS=     HZ,            ARBITRARY UNITS, ARBITRARY UNITS
##FACTOR=    0.220516191357247, 1,           1
##FIRST=     3152.30770440963, 0,            0
##LAST=      -460.409058596147, 0,           0
##MIN=       -460.409058596147, -216012,     0
##MAX=       3152.30770440963, 345602762,    0
$$ Real data points
##PAGE= N=1
##DATA TABLE= (X++(R..R)), XYDATA
$$ [...]
6445h1003j1042J1143N4660j9081m5549j055P3502M7436o8448j9058p2365J8990
6433a11870K1399L6368J4654K2874Q9617o0175k2187Q321p5612l9622O6421P3650
6421B3838q7702R5183k985r1778n1520r177l5156N1318K0487j4280J1069M2139
6409d8564K3492j6199J6286L6459r5720l4391j7990N6927M1363p7311N2985L5087
6397b7576J5719p6679J0602q919K2156Q100p1442M2280Q4230J0227m2306p343
6385d0951q801M0746l0805p6958L4017K0469j7760L5165O3191p1777j2035j8483
6373h3982m1584k9304J32049N7113J6617o072m3267L7510j3585p8165J8971j5298
6361d8997J4981l7220K6660r276l1387Q943j6966m4045K9764P2615q524j51J8581
$$ plain form
6445 -81003 -92045 -80902 -26242 -45323 -90872 -91927 -18425 29011 -39437 -58495 -130860 -111870
6433 -111870 -90471 -54103 -39449 -16575 73042 12867 -9320 -999 -76611 -116233 -49812 23838
6421 23838 -63864 31319 28334 -63444 -114964 -124141 -159297 -107979 -87492 -101772 -90703 -48564
6409 -48564 -25072 -41271 -24985 11474 -84246 -118637 -136627 -79700 -38337 -115648 -62663 -27576
6397 -27576 -11857 -88536 -77934 -86853 -64697 -56597 -128039 -85759 -1529 8698 -33608 -40951
6385 -40951 -49752 -9006 -39811 -116769 -82752 -62283 -80043 -44878 18313 -53464 -65499 -83982
6373 -83982 -125566 -154870 -22821 34292 50909 44837 1570 39080 25495 -52670 -33699 -48997
6361 -48997 -34016 -71236 -44576 -53852 -85239 -76296 -93262 -137307 -107543 -34928 -43452 -43603 -25022
6348b5022n8259p0204P6716K8742j8303L7760O8027N219m8595r312m53j5357n2453
6335h1494l1060M4785k2369L7585M3566k1914J3616N2640J5926k1309J0893m967
6323C5898j6367m3202M061M2554k0619j21p3209q440j574j1429K1919M2359p6636
6310a04806L3722J7846l2091J5893K0576J8617l8055j6795K4470M3676q3864L9667
6298f1144J0467J8131Q1422l5155j1997j3404l2115k1999L7494N8909l464o733
6286B0412l084j2037K837n6923J1476J2385n5385P7425O7021m6773p5413J0288
6274d7771P9655m0180l228q235Q5113k3342n6245j1361j3044L4423l9078M9953
6262F660J3491l4230m2358p212p373M0889Q027L357p0945k3578K6235L3421P0934
$$ plain form
6348 -25022 -83281 -153485 -76769 -48027 -66330 -28570 39457 44676 -3919 -13231 -13684 -29041 -81494
6335 -81494 -112554 -67769 -90138 -52553 -8987 -30901 -17285 35355 51281 29972 40865 35898
6323 35898 19531 -23671 -19610 22944 2325 2204 -71005 -79445 -81019 -92448 -70529 -28170 -104806
6310 -104806 -71084 -53238 -85329 -69436 -48860 -30243 -68298 -85093 -60623 -16947 -100811 -61144
6298 -61144 -50677 -32546 48876 13721 1724 -11680 -43795 -65794 -28300 30609 27145 20412
6286 20412 17328 5291 8128 -48795 -37319 -24934 -80319 -2894 64127 17354 -58059 -47771
6274 -47771 31884 -8296 -11524 -19759 65354 42012 -14233 -25594 -38638 -4215 -43293 6660
6262 6660 20151 -14079 -56437 -63649 -71022 -30133 -22106 -18749 -89694 -113272 -87037 -53616 17318
6249A7318J0781o5171l7763L9459k8817J4616j761L5067N204l3026k4123K883
6237f5333K8598k4281m9161J8406N4356J1201M4532o7249k0924N229K4934L4374
6225e318M4509r8491n5623L1843o2854L8029J09568O0563r0433n2097R775k4760
6213i5289m1493R5081P9167k3633k7939n5542o0364J27293M0402o4667J5742J8933
6201G691J9403k4871k8910l50L4623l3241J5775L8083o8554n709L403L8819J06813
6188A02975J7500n5610q5588p3872J4118N6203l8416q05J03931m5529J5133K9639
6176C9679k9283m2056j13935R6642L7315m1747K7531Q68l1967O7831P8949n1399
6164C8428n6993L5068j3809o4989k5307k4211M9869k8202O5761O9817n9230O7505
$$ plain form
6249 17318 28099 -37072 -74835 -35376 -64193 -49577 -51338 -16271 -11067 -44093 -68216 -65333
6237 -65333 -36735 -61016 -110177 -91771 -37415 -26214 18318 -48931 -69855 -64626 -39692 -5318
6225 -5318 39191 -59300 -114923 -83080 -145934 -107905 1663 62226 -28207 -80304 -70529 -95289
6213 -95289 -136782 -41701 37466 13833 -14106 -69648 -130012 -2719 37683 -26984 -11242 7691
6201 7691 27094 2223 -26687 -27037 7586 -25655 -9880 28203 -40351 -46060 -42657 -3838 102975
6188 102975 120475 64865 -20723 -94595 -80477 -24274 -62690 -63495 40436 -5093 10040 39679
6176 39679 10396 -31660 -145595 -48953 -11638 -53385 -25854 -24986 -56953 10878 89827 38428
6164 38428 -18565 16503 2694 -62295 -87602 -111813 -61944 -90146 -24385 45432 -13798 53707
6152E3707j3305P086N6773k0202j3749p5571r6383N7417M1718j02845L974K3889
6140g7491N6954L7266j22352O4294o2982J8326P4551k9325m0223N534K6231n7433
6128a06650P5491j4948Q698l0383L0741P8613p1496J3934L6336n2467q581J10180
6116F9468l2818o8341K9207k093L0759j6000r9449m3069N3086O5516N4482n6161
6104a5413j3776M922Q144O552M4928r8123P5119r524n2256L0666J3313m4463l1329
6091h1240L5939l4230K9612n784J43726m2344l7863j5906J2148k4826J6115L1696
6079B7043n717l4823J7674m370J5500K5243J5820J8258m8812J9329j5905j0949
6067A8291k5433k2421M2026p5051K7482K4829n9429L9262K5874M6895l182l0642
$$ plain form
6152 53707 40402 47488 104261 84059 70310 -5261 -101644 -44227 -2509 -105354 -101380 -77491
6140 -77491 -20537 16729 -105623 -41329 -104311 -85985 -11434 -40759 -80982 -75448 -49217 -106650
6128 -106650 -31159 -46107 -37409 -67792 -37051 41562 -29934 -16000 20336 -32131 -40712 69468
6116 69468 36650 -31691 -2484 -4577 26182 10182 -89267 -132336 -79250 -13734 40748 -15413
6104 -15413 -29189 -24267 -16123 -9571 35357 -62766 12353 2829 -49427 -18761 -5448 -49911 -81240
6091 -81240 -45301 -79531 -49919 -55703 88023 45679 7816 -8090 4058 -20768 -4653 27043
6079 27043 21326 -13497 4177 -193 15307 40550 56370 74628 25816 45145 29240 18291
6067 18291 -7142 -29563 12463 -62588 -35106 -10277 -69706 -30444 -4570 42325 39143 8501
6055H501o2966k1902P181R6281k4485j0309Q6893q4794j13548L0384J24767l2406
6043C597M7535M8821n6678n877L9830l7153m0634N1688o3596N350j4438O2465
6031D0910J5415n2513m617M8767J6754m2177J2688L218k4544l8251m3501O4693
6019c158k0935K6212O231K3281R595L6173O061j5757o5651K4478n5002M6618j5988
6006B158K4678M4971k4193M498l6461j5249J0786n3252K9273J05334j00236L808
5994c885k158m54j9922N0947J2442J3027p2248j2557M6373O2470o1476o6522k9195
5981h3158K9124j1143M7820n912N237K2470R012j6790K1457o9490O2877P4362
5969H5866o2163l6223l7200m0861N0427K7779P8666j4278o2094M3759l7422n6286
$$ plain form
6055 8501 -54465 -76367 -69186 27095 2610 -7699 79194 -5600 -119148 -88764 36003 3597
6043 3597 51132 99953 43275 37398 77228 40075 -559 51129 -12467 -7117 -21555 40910
6031 40910 56325 3812 -805 47962 64716 22539 35227 38445 13901 -24350 -67851 -3158
6019 -3158 -24093 2119 8350 31631 41226 77399 83460 67703 2052 26530 -28472 18146 2158
6006 2158 26836 71807 47614 52112 15651 402 11188 -42064 -12791 92543 -7693 -3885
5994 -3885 -6043 -6497 -26419 24528 36970 49997 -22251 -34808 11565 74035 12559 -53963 -83158
5981 -83158 -54034 -65177 -17357 -23269 -18032 4438 13450 -3340 18117 -51373 11504 85866
5969 85866 23703 -12520 -49720 -90581 -40154 -12375 66291 52013 -10081 33678 -3744 -60030
5957f0030j8603P4993j512j4711O0163j6380j6476M7688l7333L4895M315p1029
5945a4020L6898K4067J321L6316J2289n8345q3752l0112K4105L9767J8420M7939
5933E4893j5825j1102j497j6295k1149p9466j818R1570J2742o523o1131K8047
5921b7554J8045n5027J07246l9068J0298L9755l8715J6436J5144l5570j717N9255
5909F8528m9483m4197K5944j9460p6549J7703n8771L1980j4189J0380J13583L5349
5897D0818L144P002k6544p8584L2365J087j8022O2080P873j9213j8316K4255Q568
5884B6513J5697j1469n9910O3989P3563p1585l2731L7280o7849K300k6974J24548
5872G3372J9406j20048k4031J19978j2009k192K680m3788j6230K3095O6179r3793
$$ plain form
5957 -60030 -78633 -3640 -5152 -19863 40300 23920 7444 55132 17799 52694 57009 -14020
5945 -14020 22878 46945 48266 84582 96871 38526 -45226 -75338 -51233 -11466 6954 54893
5933 54893 39068 27966 26469 10174 -10975 -90441 -92259 -689 12053 5530 -55601 -27554
5921 -27554 -9509 -64536 42710 3642 13940 53695 14980 31416 46560 10990 9273 68528
5909 68528 19045 -25152 792 -18668 -95217 -77514 -136285 -104305 -118494 -108114 5469 40818
5897 40818 43962 50964 24420 -54164 -21799 -20712 -38734 23346 31219 12006 -6310 17945 26513
5884 26513 42210 30741 -29169 34820 108383 36798 4067 41347 -26502 -24202 -51176 73372
5872 73372 92778 -27270 -51301 68677 56668 54476 57156 13368 -2862 20233 86412 -7381
5860g381k0166k6591L8178j0810K7640J9757M8338m5019k596o2212L0699N6175
5848D6012K452P516L3345k7179K0367m6608L2857R514O5109k4889o9213k5979
5836B3304L8445Q1804k8395J5574m9464j3903J1149R513n8515J0269q449n3589
5824b2257j7819o4157J4223R9147O6173K3588n0407m191n1269k0528L1762L1586
5812C5851J7000j06326Q1460P9831n6602l5188K3001J5295j8166M4473k8326L4572
5800H6875k4456m1351R865n1854O854P2808K3393o2776n4690M7849L698k9942
5788a3727L0180M6603k7918P1543r3782P189M4791J4593N0890l7337r6981o629
5776a0585J250N3124K7660N9921n5011k2340R582j1888Q479L6115J2938j9010
$$ plain form
5860 -7381 -27547 -54138 -15960 -26770 870 20627 68965 23946 21350 -40862 -10163 46012
5848 46012 48464 55980 89325 62146 82513 35905 68762 78276 143385 118496 49283 23304
5836 23304 61749 143553 115158 130732 81268 67365 78514 88027 29512 39781 31332 -22257
5824 -22257 -40076 -104233 -90010 9137 75310 98898 48491 44300 -6969 -27497 4265 35851
5812 35851 52851 -53475 27985 107816 51214 16026 39027 54322 36156 80629 52303 86875
5800 86875 62419 21068 30933 -20921 -14067 58741 82134 19358 -35332 12517 16215 -13727
5788 -13727 16453 63056 35138 106681 12899 20088 64879 79472 130362 93025 -3956 -10585
5776 -10585 -9335 43789 71449 131370 76359 54019 63601 51713 60192 96307 109245 90235
5764I0235m0495l6536P262O9776L2903j16455j0964m074Q758n8768k8808J0914
5752g6252J04301J02854n8936m6246m0392O3617q759o7736L0025l850J6588K0139
5740C5353o937K4170j4496j7123l8282M9526M0593M8780O608l2699J8854m86k4380
5727H9481j5966N9874J4072l9552L7276k0002n6128l3967j6905K3379L466J2810
5715E7838J1094P3920k1152n2849m4242p893m1426R5553n5183P9146P164j1186
5703I0784O5526m6181M102L1187j3183N5695n6354J7135J7296p9505j1967k3399
5691E1136J7458L406J5283k2913K1618n9731j9018P7262J0489O1221p8287m2254
5679C5670L7408P359K1415O259L9893j7524J450m5458n3029L1172N943J4609J18554
$$ plain form
5764 90235 49740 13204 20466 90242 123145 6690 -4274 -8348 410 -58358 -87166 -76252
5752 -76252 28049 130903 71967 25721 -14671 48946 40187 -27549 2476 -1374 15214 35353
5740 35353 28416 52586 38090 20967 -17315 32211 72804 121584 128192 95493 114347 113861 89481
5727 89481 73515 133389 147461 107909 145185 125183 69055 35088 18183 41562 45028 57838
5715 57838 68932 142852 121700 68851 24609 16716 -24710 70843 15660 94806 101970 90784
5703 90784 156310 110129 114231 145418 132235 187930 131576 148711 166007 86502 74535 51136
5691 51136 68594 72000 87283 64370 85988 26257 7239 84501 94990 156211 77924 35670
5679 35670 73078 80437 101852 108111 148004 130480 131930 86472 33443 64615 70558 85167 203721
5666B03721k2754O131j07149L7144m119m205M0339R1209n2738O0032l9275r432
5654A98904J1774J4999Q3555k7797q833r1950R3743o1861q0399Q5055O9396q603
5642B77983N1050j35179n8595J9081N5504L5836K2626n723p431k0486L491P2275
5630C10432j3465q6838l4139j7790K9332J7651M8126l6521r695l5908Q88k8211
5618A43862Q9274n6667L2611L3778k9363K6464o8023p3920Q2396L0091q045j086
5606B01372l4335M6680m1980k7266L2102j2313n322O8968m3816k4569M9392m1562
5594A67351l4055R0548J9741N0256K5550L407k0420j2265M0478N320K4567J39036
5582D99514K8200n596p2717l0988M8915L6050k4697P6659j29952m7821j8583p4074
$$ plain form
5666 203721 180967 187098 79949 117093 112974 108769 149108 240317 187579 247611 208336 198904
5654 198904 210678 225677 309232 281435 272602 180652 274395 212534 132135 217190 286586 277983
5642 277983 329033 193854 135259 154340 209844 245680 268306 262583 255152 234666 238157 310432
5630 310432 296967 210129 175990 158200 187532 205183 253309 216788 207093 171185 172073 143862
5618 143862 233136 176469 209080 242858 213495 239959 171936 98016 180412 210503 202458 201372
5606 201372 167037 213717 171737 144471 176573 164260 158938 227906 184090 159521 208913 167351
5594 167351 133296 223844 243585 293841 319391 322798 302378 290113 330591 335911 360478 499514
5582 499514 527714 522118 449401 418413 467328 503378 478681 555340 425388 377567 358984 284910
5570B84910k9366J3350j5195L0107J3322k5866Q8098j1096p9510L5141l4293m
5558B69598M1313j7196m5219j6540O2036p7958j1400N0849P8187L041o2624K8312
5546C02399K1462o482j3790K1663L5068N4053o0330o1668o589Q0457j06356k3286
5534B36601N8716Q8630l0024r500L0437o2001k6952L7300N6621J3331L9473J4401
5522D47033m0272m333n436q2474R276L8668Q315o4257K7708p689N0337P4521l564
5509D47833j887K3916j15407m0518R5935P9833j3141j120l3678J4840l3465Q902
5497D32043N7104l4923M150J08810N6408j08183O5171K0373r0657K6481j8258
5486E18519K938L2058L6792M0264m7569p3773L5064N4884N2597k4411k0311R501
$$ plain form
5570 284910 255544 268894 253699 283806 297128 271262 359360 348264 268754 303895 269602 269598
5558 269598 310911 293715 248496 231956 293992 216034 204634 255483 333670 336711 274087 302399
5546 302399 323861 317379 303589 325252 360320 414373 354043 292375 285786 366243 259887 236601
5534 236601 295317 383947 353923 344423 374860 312859 285907 323207 379828 393159 432632 447033
5522 447033 406761 402428 396992 314518 323794 362462 370777 306520 334228 326539 376876 451397 447833
5509 447833 445946 469862 354455 313937 409872 489705 476564 475444 441766 456606 423141 432043
5497 432043 489147 454224 458374 567184 623592 515409 580580 600953 510296 536777 518519
5486 518519 521457 553515 590307 630571 583002 509229 544293 599177 651774 627363 607052 616553
5474F16553K2266k893p411j6415P4665O1373m1991O6839m315p714j2339O9201
5462H17819K9498o5932O9929Q2383k6329p4302P0902j2225j282Q8681J2823l7866
5450I54099P0878M0489j35R9148p147L995J63245k1425m4427n03m8655O9052Q7324
5437A365938R582k705j178J42095l3620j8976P1266N4164L6711M8401J39161P0882
5425A881721P4712N377M834k696J12992L8349R3504J22041J38638O1138J0507
5414B541117M0481Q2823K01783Q8274Q1362M4667N5803J19504L3418J56627K31406
5403C677265J03942J03474J32116J35659K4668J40570J78269J40754K34506O8438
5393D939661K17143K98621J44727K32729K51521L02418K92115K88003L36937M36118
$$ plain form
5474 616553 638819 635926 628515 612100 686765 748138 706147 772986 768671 760957 748618 817819
5462 817819 847317 781385 851314 933697 907368 833066 903968 891743 890461 979142 991965 954099
5450 954099 1024977 1065466 1065331 1164479 1157332 1161327 1324572 1303147 1258720 1258217 1209562 1278614 1365938
5437 1365938 1375520 1372815 1371637 1513732 1480112 1461136 1532402 1586566 1623277 1671678 1810839 1881721
5425 1881721 1956433 1961810 1966644 1963948 2076940 2115289 2208793 2330834 2469472 2530610 2541117
5414 2541117 2581598 2664421 2866204 2954478 3035840 3080507 3136310 3255814 3289232 3445859 3677265
5403 3677265 3781207 3884681 4016797 4152456 4177124 4317694 4495963 4636717 4871223 4939661
5393 4939661 5156804 5455425 5600152 5832881 6084402 6386820 6678935 6966938 7303875 7739993
5383G739993M44839M50570N85839N72399N50705Q57837R21503J005868J098519
5374A4228072J240938J575131J710409J939944K218179K464803K788389L079286
5366C1245151L460562L744223L757650L418356K502692R48539j053681k785375
5358D5238117m063283m713358m547934l911714l280392k787737k220098j771879
5350A7941722j578490j216830j017159r54450q39944o75723o42437m80373m79228
5341A0057088l69004l62176k38365l55301k24038j79868k01259j77085j60046
5332G789946j17582j56670j12736J14355m9718j09554L8984k038L4666J00144
5322G529797M8707R0957J58374J42972J60378J83256K35893J71388K55390K64761
$$ plain form
5383 7739993 8184832 8635402 9221241 9793640 10344345 11202182 12123685 13129553 14228072
5374 14228072 15469010 17044141 18754550 20694494 22912673 25377476 28165865 31245151
5366 31245151 34705713 38449936 42207586 45625942 48128634 49077173 48023492 45238117
5358 45238117 41174834 36461476 31913542 28001828 24721436 21933699 19713601 17941722
5350 17941722 16363232 15146402 14129243 13174793 12334849 11659126 11016689 10536316 10057088
5341 10057088 9688084 9325908 9087543 8732242 8508204 8328336 8127077 7949992 7789946
5332 7789946 7672364 7515694 7402958 7517313 7467595 7358041 7397025 7394987 7429653 7529797
5322 7529797 7578504 7669461 7827835 7970807 8131185 8314441 8550334 8721722 8977112 9241873
5312I241873L59937L93264N38928M89525N72353P48569P39708Q44672J027741
5303A4956570J101363J392964J492906J727642K012153K377650K527708K792450
5295C0381406L175469L484732L699722L525157L002100J776929o4174k009510
5287D6971831l548823m630740m774369m367924l670981l030091k582687k056887
5279A8309329j731383j423802j257491j031563q11571q48608p49325p06675n43080
5270I205831m85657m88006l30829l95258m36388l50012j94405k32102k53599k59260
5260E780315k30563j90060j67869k22454k76703j94691l8752j67549j62377m9917
5250D079380m4034r5795p6932j86262j65892k5062o4560l086m2774r7775j14483
$$ plain form
5312 9241873 9601810 9995074 10534002 11023527 11595880 12344449 13084157 13928829 14956570
5303 14956570 16057933 17450897 18943803 20671445 22683598 25061248 27588956 30381406
5295 30381406 33556875 37041607 40741329 44266486 47268586 49045515 48981341 46971831
5287 46971831 43423008 38792268 34017899 29649975 25978994 22948903 20366216 18309329
5279 18309329 16577946 15154144 13896653 12865090 12053519 11204911 10455586 9748911 9205831
5270 9205831 8720174 8232168 7901339 7506081 7069693 6719681 6525276 6293174 6039575 5780315
5260 5780315 5549752 5359692 5191823 4969369 4692666 4497975 4459223 4291674 4129297 4079380
5250 4079380 4035346 3939551 3862619 3676357 3510465 3485403 3420843 3417757 3374983 3277208 3162725
5239C162725P51p3962l1713K820L642k4978p2367L1091l4516m8589n0438p806
5227B856660r0811q1120L8357n8543K2472l186p0095j0752m6059K1977p5040o3537
5215B440323o3736K6275L4510o5043m3068J2430l4057J6572n169j9723R1289n3854
5203B336749j3356Q856R4164j9015J685O2356q4578K0834J59504o5995n0176Q9438
5191B540466K0426J6551L2025J28336n9156M1692P3676Q8630Q3884J2221K6635
5180C005386Q1126m3653O2300N5158L4307J14899J03498J24577M5673J47495L8025
5169C768791L1064M3670J60520J68991K01408J36734J14675J16658J24290J62750
5159E029551J54872J27396K84425J76789K75483K84170K78246L09389L99879L28058
$$ plain form
5239 3162725 3163476 3089514 3057801 3060621 3064263 3039285 2966918 2998009 2963493 2914904 2864466 2856660
5227 2856660 2765849 2684729 2723086 2664543 2687015 2683829 2613734 2602982 2556923 2578900 2503860 2440323
5215 2440323 2376587 2402862 2437372 2372329 2329261 2341691 2307634 2324206 2319037 2299314 2390603 2336749
5203 2336749 2323393 2332249 2426413 2407398 2409083 2471439 2386861 2407695 2567199 2501204 2451028 2540466
5191 2540466 2560892 2577443 2609468 2737804 2678648 2720340 2794016 2882646 2966530 2978751 3005386
5180 3005386 3086512 3042859 3105159 3160317 3194624 3309523 3413021 3537598 3583271 3730766 3768791
5169 3768791 3799855 3843525 4004045 4173036 4374444 4511178 4625853 4742511 4866801 5029551
5159 5029551 5184423 5311819 5596244 5773033 6048516 6332686 6610932 6920321 7320200 7648258
5149G648258M31104M49032M33782N12929N60526N95701P26205Q70131Q76189J012969
5139A4116826J100892J089931J147809J217919J152709J206079R52690R31192
5131B2916047O08824K72127j13904l26873n76203q02687o55869o92982p26583
5122A9901897n04418m25259l21103q9928N5611K29849K25170L09413N18518O59438
5112B0559188O99140P69856R24355R90726J025963J132485J271028J210537J286707
5103B9869985J141184J093994R15244P64093O31216L18480Q0539o8383l03453
5094C4442899o48001p26904q72845q84457r62249j024003r81967r94564j042560
5085B6305349r82772r20864q89983q22495o43511o72430n86002m88883m10906
$$ plain form
5149 7648258 8079362 8528394 8962176 9475105 10035631 10631332 11357537 12227668 13103857 14116826
5139 14116826 15217718 16307649 17455458 18673377 19826086 21032165 21984855 22916047
5131 22916047 23524871 23796998 23683094 23356221 22780018 21977331 21321462 20628480 19901897
5122 19901897 19397479 18972220 18651117 18561189 18616800 18846649 19071819 19381232 19899750 20559188
5112 20559188 21258328 22028184 22952539 23943265 24969228 26101713 27372741 28583278 29869985
5103 29869985 31011169 32105163 33020407 33784500 34415716 34734196 34814735 34746352 34442899
5094 34442899 33794898 33067994 32195149 31310692 30348443 29324440 28342473 27347909 26305349
5085 26305349 25322577 24401713 23511730 22689235 22045724 21373294 20787292 20298409 19887503
5076A9887503k05574j42121p9016J12451K79490M34307L86744N34633O93724P52655
5066B2654796Q00199P75315P07374M89741L17499J8363m97373p85367j225986
5057B3254561j387620j469943j526006j364017j260288j180754j047908r01475
5049A3116550q16434o68516n86202n10079m57364l80909l94943l22178k59200
5040H720725k68249k21918j55674j76295j23479j68267r0292r3960j95435j65194
5030G061962N67P698L3538m610j269K7387n6684J01628P345Q1611J20729P8922
5018G458824J29058M2063J70546J34194J97006J69930K29136K78546K73701K41264
5008I324268M13741M13210L70733M66497O34157O00525O79246O66070Q13995R41781
$$ plain form
5076 19887503 19681929 19539808 19460792 19573243 19852733 20287040 20673784 21208417 21902141 22654796
5066 22654796 23454995 24230310 24937684 25427425 25744924 25763287 25265914 24480547 23254561
5057 23254561 21866941 20396998 18870992 17506975 16246687 15065933 14018025 13116550
5049 13116550 12300116 11631600 11045398 10535319 10077955 9697046 9302103 8979925 8720725
5040 8720725 8452476 8230558 8074884 7898589 7775110 7606843 7516551 7422591 7227156 7061962
5030 7061962 7062529 7070227 7103765 7099155 7097886 7125273 7068589 7170217 7177562 7259173 7379902 7458824
5018 7458824 7587882 7629945 7800491 7934685 8131691 8301621 8530757 8809303 9083004 9324268
5008 9324268 9738009 10151219 10521952 10988449 11622606 12223131 12902377 13568447 14382442 15324223
4998A5324223Q05414Q64941J008484J009359R41383Q02411P03983P20589M96674
4989B2677461K63528Q8786O083L9495k01227k07856k48313j97059p8278l2852
4979B2109768L5603J00557K30527K86086M78399N36997N33921O07775P86160P19402
4969B6425195P75768R45309J004518P94509Q99598Q55924O38716N12618M34331
4960C3286486J25680J66645n0256k63770l61466m26629n26777o54508p92169q14373
4950B9688863p81245q03495r25003r03393q45804q69487q78100p21228o86188
4941B2274920o14310n02176m72481l27708k55330n4436j9625N0443K37918K85950
4931B0603165M64262N63860N01764N93293N55412N27988L55009J06401j81818
$$ plain form
4998 15324223 16129637 16994578 18003062 19012421 19953804 20756215 21460198 22180787 22677461
4989 22677461 22940989 23029775 23035858 23075353 22874126 22666270 22417957 22220898 22142620 22109768
4979 22109768 22145371 22245928 22476455 22762541 23240940 23777937 24311858 24919633 25705793 26425195
4969 26425195 27200963 28146272 29150790 29945299 30844897 31700821 32339537 32852155 33286486
4960 33286486 33412166 33578811 33528555 33264785 32903319 32476690 31949913 31295405 30503236 29688863
4950 29688863 28907618 28104123 27179120 26275727 25429923 24560436 23682336 22961108 22274920
4941 22274920 21660610 21158434 20685953 20358245 20102915 20048479 20028854 20079297 20317215 20603165
4931 20603165 21067427 21631287 22133051 22726344 23281756 23809744 24164753 24271154 24089336
4922B4089336m42632p40170r95116j210344j374483j423083j351499j282496j120941
4913A4148572j110177r80612q43860p45849p11561o15437n02781m85440m24800
4904G728055l38229k88225m16815l86612k78916k09715j99885j75724j56095k21105
4894E056734k05310j91501j63958p1488j08230j57727j24924j28687j17363j45081
4884C642465j15849r2126j15845m9971p9902k7606j54960j30990j6383l3477m2589
4873B782767j18403r2928p9600j4471k6580j06843p9796K9258j0750p1680m2159
4862B168815q2882j4994L8365j02489q0580K2397M997j35531j5593k2686J6461
4851A796280j6443j1190l682r8875j5410R815J5263p3298n3354J9044J6070n5087
$$ plain form
4922 24089336 23646704 22906534 21911418 20701074 19326591 17903508 16552009 15269513 14148572
4913 14148572 13038395 12057783 11213923 10468074 9756513 9141076 8638295 8152855 7728055
4904 7728055 7389826 7101601 6684786 6298174 6019258 5809543 5609658 5433934 5277839 5056734
4894 5056734 4851424 4659923 4495965 4424477 4316247 4158520 4033596 3904909 3787546 3642465
4884 3642465 3526616 3434490 3318645 3268674 3188772 3161166 3006206 2875216 2858833 2825356 2782767
4873 2782767 2664364 2571436 2491836 2477365 2450785 2343942 2264146 2293404 2282654 2210974 2168815
4862 2168815 2085933 2070939 2109304 2006815 1926235 1948632 1953629 1818098 1802505 1779819 1796280
4851 1796280 1779837 1768647 1764965 1666090 1650680 1660495 1675758 1602460 1549106 1568150 1584220 1529133
4839A529133k9380k8233J00927k202n9867o1622k8091l498J4080J8272J0946K3711
4827A484176r2820P301L0904K9777q0579o077J5303K4587Q837k1366k4053k9009
4815A346981P0967j5158q3242m6169L1470O1392J7198J5737K1289K9844p111q1025
4803A362173n9220J1558p4397O1906j6472K6694o2166k361J07409K101Q2720O4563
4791A504508o5776j15473J5876L1907O9122K5697m2549r1998K9652M2928k7256
4780A376638p590R2739l9623J9840Q825r391p323n3456j9167N7420j2207j9013
4768A387692k0582J4301K0706M394o260k0099J3732j2935J9988k3615K1320k1108
4756A377534m1583l0361m3387P0376N9693q1971j534l4486J7708O6405o6133M8842
$$ plain form
4839 1529133 1499753 1471520 1572447 1570245 1510378 1448756 1420665 1417167 1431247 1449519 1460465 1484176
4827 1484176 1391356 1398657 1429561 1459338 1378759 1372682 1387985 1412572 1421409 1400043 1375990 1346981
4815 1346981 1417948 1402790 1319548 1273379 1304849 1366241 1383439 1399176 1420465 1450309 1443198 1362173
4803 1362173 1302953 1314511 1240114 1302020 1285548 1312242 1250076 1247715 1355124 1357225 1439945 1504508
4791 1504508 1438732 1323259 1339135 1371042 1440164 1465861 1423312 1331314 1360966 1403894 1376638
4780 1376638 1369048 1461787 1422164 1442004 1450829 1441438 1434115 1380659 1361492 1418912 1406705 1387692
4768 1387692 1367110 1381411 1402117 1406511 1400251 1380152 1393884 1380949 1400937 1377322 1398642 1377534
4756 1377534 1335951 1305590 1262203 1332579 1392272 1310301 1308767 1274281 1291989 1358394 1292261 1341103
4744A341103L313p428n0111p7742m301p59J6796J5554j1579p718n3064k1526k1043
4731A121495j5852j3641p238M1836J171J4280q0561k7568K5400o758q3737N07
4719I69334R9655M096N1527q8084p2478m1566l2825M4290o0287m8578L3221j2912
4707H45393j1140P464q9397O7217J0939l3037r2576J992M0723k847N9574l5109
4695G69196J085M5540l2300l0918L5341K9664L3089m4180K9191n5423m6677l0941
4683G02667n9412L5371n8667P0363P1148q7919O718k0119p4671J112q7509J2748
4671E11830k3821K4035o430p053o1327N8982J18887q173l7548l0689K5185o2392
4659E01486J1150O6757l2966p3222k3799k2129J8699P5140M0034n1801j4115k5251
$$ plain form
4744 1341103 1344416 1336988 1286877 1209135 1204834 1204075 1220871 1236425 1224846 1217128 1164064 1142538 1121495
4731 1121495 1105643 1092002 1084764 1126600 1127771 1142051 1061490 1033922 1059322 1052564 968827 969334
4719 969334 1068989 1073085 1124612 1036528 964050 922484 889659 933949 873662 825084 858305 845393
4707 845393 834253 841717 752320 819537 830476 797439 704863 706855 747578 744731 804305 769196
4695 769196 770281 815821 783521 752603 787944 817608 850697 806517 835708 780285 733608 702667
4683 702667 643255 678626 619959 690322 761470 673551 680269 660150 585479 586591 499082 511830
4671 511830 488009 512044 505614 498561 437234 496216 615103 606930 569382 538693 563878 501486
4659 501486 512636 579393 546427 473205 449406 427277 445976 521116 561150 509349 495234 469983
4647D69983L8902L5161n7218o8056K0805P6041N0694j4951M6150j00185k847j4509
4635D79970k6469N237k1363J7744l4819M4790n4464k8606n1523N9419P1593n8093
4623D03416k3407K9378K6543q4665J9568J4074L2795J834l4607k597O215k6840
4611C61707M3641j4040p540M5083j6160o6681O7726N5884k1454L6745p9461o0662
4599C44788M3963O9729l2300j5618l1012o2272l2981K0972J1605N7550q3959J0439
4587C00904j4166l1615R668l196K827j0601j19259l0533P8638Q5771n6545L6772
4575B48665J2718k2097n8319m7519M5013J822N2182r244j3132M7Q998m9523J4117
4562A83728N528R537o7350P7862n1925o9389j8066Q8188M3385j6479j3726k5520
$$ plain form
4647 469983 508885 544046 486828 418772 439577 515618 566312 551361 597511 497326 494479 479970
4635 479970 453501 458738 437375 455119 420300 465090 410626 382020 330497 389916 461509 403416
4623 403416 380009 409387 435930 351265 370833 384907 417702 419536 384929 382332 388547 361707
4611 361707 405348 391308 383768 428851 412691 346010 413736 469620 448166 484911 405450 344788
4599 344788 388751 458480 426180 410562 379550 317278 284297 305269 316874 374424 290465 300904
4587 300904 286738 255123 264791 261595 264422 253821 134562 104029 182667 268438 211893 248665
4575 248665 261383 239286 180967 133448 178461 180283 232465 223221 210089 210136 219134 169611 183728
4562 183728 189256 198793 131443 209305 157380 87991 69925 158113 201498 185019 171293 145773
4550A45773M3370L0737q1745m7685M0280J1914N7870l4190j0704Q886j9616J7862
4538A62752J7572k4471m7049j3744K8495j6326J5177M0274k3068l2983R3873J9032
4526B19534k0896o1704q1159M991M7567L9563n9221R496k004L3692j2403L6064
4514A53520L2507N7088K3806P78m3176r6295M2520K9966N3967q0413m7911N6264
4502A82621Q45O9581j2617J8077m0092q0311M6577K4153P859l4254n1708O0354
4490A91085L9979j26348l7706J4049K4834j1671O085L5238R930P122L1388J9228
4478B03213k7095k1323j1818j1681J5308j8493N9980K8472q0183j6240K2587J9571
4466A62298l1775M6695P7590j1471k5309m3939L5789q123K8043m5096K2838K1340
$$ plain form
4550 145773 189143 219880 138135 90450 130730 142644 200514 166324 155620 164506 144890 162752
4538 162752 180324 155853 108804 95060 123555 107229 122406 162680 139612 106629 200502 219534
4526 219534 198638 136934 55775 60766 108333 147896 88675 98171 96167 129859 117456 153520
4514 153520 186027 243115 266921 267699 224523 128228 170748 200714 254681 174268 126357 182621
4502 182621 183466 253047 240430 258507 218415 138104 184681 208834 216693 182439 130731 191085
4490 191085 231064 104716 67010 81059 105893 94222 100307 135545 145475 152597 183985 203213
4478 203213 176118 154795 142977 131296 146604 128111 188091 216563 136380 120140 142727 162298
4466 162298 130523 177218 254808 243337 218028 174089 209878 201755 229798 184702 207540 228880
4454B28880p7343N6869k229n5714K7729j8057r6365J14641K1043j603N1830q0421
4442A69260M099N3385l083J3343o4K1225l6342m1204R0911K1836j12012L8854
4430B20208J08818m1816k3840l7890M9201M2161J5417n136k336l2451N2426K5383
4418C70145n4334M8680k5581m4673R200O4192n182n1413p904R217O5718N6952
4406D35017N791m11l843j0860o0119R301L8957k4087K5811k7859k2173Q0873J2830
4393D59228j0588R8039m129m519p9018m973K7709q87k6814J08586K7013m4614
4381E45033M4640M190J1533m015N8523j1437O1987M8337p5932l0503J10155r061
4369G53450j7129m9215M6885K4986K4221q5406k1844Q9870N1751k0011L7851J096
$$ plain form
4454 228880 151537 208406 206177 150463 178192 160135 63770 178411 199454 197851 249681 169260
4442 169260 173359 226744 223661 237004 236940 258165 221823 180619 271530 293366 181354 220208
4430 220208 329026 287210 263370 225480 274681 316842 332259 327123 324787 292336 344762 370145
4418 370145 315811 364491 338910 294237 303437 367629 362447 311034 303130 312347 378065 435017
4406 435017 440808 440397 436554 425694 365575 374876 413833 389746 415557 387698 365525 446398 459228
4393 459228 448640 546679 542550 538031 459013 454040 481749 480862 454048 562634 589647 545033
4381 545033 589673 593863 605396 601381 659904 648467 710454 758791 682859 652356 762511 753450
4369 753450 736321 687106 733991 758977 783198 697792 675948 765818 817569 797558 835409 836505
4357H36505o6350n9051k3177K789M5707K8611j0327O4752J08022L5638J7147l1107
4345I49159K3004m5817R9571r875m6429J0661J1731J03018o2420L4384P7274M0841
4333A185102m6821n7285o1469R2791k3368N3197J36216k1787n781K5050O7615
4322A343460M9851Q3809K0982o443N0045J4044k7269l2604J00896R9228P0972
4311A766971M512O9867L3709K1199N2865Q8452n857L502N7395M7993Q7479P1822
4299B299909N0704M55O3798J11755Q4714O8552Q5212Q2713Q9918P0437P9305R7301
4287C184773J07002M8866J37257J01269J7103J65801J71510J09408J26270J70031
4277D339290J63811J85695J90992K02241J71737J74432K27292K16970K52866K84932
$$ plain form
4357 836505 770155 711104 687927 690716 736423 765034 754707 819459 927481 963119 980266 949159
4345 949159 972163 926346 1025917 1016042 969613 980274 992005 1095023 1032603 1066987 1144261 1185102
4333 1185102 1138281 1080996 1019527 1112318 1088950 1142147 1278363 1256576 1250795 1275845 1343460
4322 1343460 1393311 1477120 1498102 1491659 1541704 1555748 1528479 1495875 1596771 1695999 1766971
4311 1766971 1771483 1841350 1875059 1896258 1949123 2037575 2031718 2035220 2092615 2140608 2228087 2299909
4299 2299909 2350613 2351068 2414866 2526621 2611335 2679887 2765099 2847812 2937730 3008167 3087472 3184773
4287 3184773 3291775 3340641 3477898 3579167 3596270 3762071 3933581 4042989 4169259 4339290
4277 4339290 4503101 4688796 4879788 5082029 5253766 5428198 5655490 5872460 6125326 6410258
4267F410258L16567L39353K43397M13207L49513M71482L93940M15010O06893N85954
4257A0545574N35891O30181O80288P52464P54151Q27926R62054Q81492R01306
4248A7471327J046858J025917J002050J067469R13848Q32071P74489O26667M53304
4239B5214000L43712K4800j79033l70214n41506p44783q04422q29621r59433q65216
4229B0288284q74594q86771o93040p45324p28380p13341p98870q61016p95107
4220A3191841p99408q43986q09079p29456o22411o25209m76924m62134l96738
4211G426496l79452l49208k94401k72513k15482l21703j77219l14704j61658j97012
4201D743144k05435k05853j57518j78359j49320k2050j58546l4550r3082j12429
$$ plain form
4267 6410258 6726825 7066178 7309575 7722782 8072295 8543777 8937717 9352727 9959620 10545574
4257 10545574 11081465 11711646 12391934 13144398 13898549 14726475 15688529 16570021 17471327
4248 17471327 18518185 19544102 20546152 21613621 22527469 23359540 24134029 24760696 25214000
4239 25214000 25557712 25582512 25403479 25033265 24491759 23746976 22942554 22112933 21153500 20288284
4229 20288284 19413690 18526919 17833879 17088555 16360175 15646834 14847964 13986948 13191841
4220 13191841 12392433 11548447 10739368 10009912 9387501 8762292 8285368 7823234 7426496
4211 7426496 7047044 6697836 6403435 6130922 5915440 5593737 5416518 5101814 4940156 4743144
4201 4743144 4537709 4331856 4174338 3995979 3846659 3824609 3666063 3631513 3538431 3426002
4191C426002j37359j24201j19814j24771r7846j30331n426r767q8048o8152J408
4180B521695j32560o9616j9916r0889o9762J19j1487j09119j23017K3262k1007
4169A897703q3818j1676m6669l2333r2521J9844m9544n8110n3420k8754m9377
4158A411325K9284q5676r2537l4995O9304k0665q0101Q4256r167L2369k6058q5426
4146A191913m067l4384j9725k2965Q451J3096q6937l1408m998o0867L0949m7951
4134I31107J6426j5665m4803o951q1016K4316j5903K0842p7873k0414j5509K9663
4122G44220N2576J5292q1546k1231L0958q125q2064m5858K3182l7990l2615O9143
4110F25942q9710o955p027L110P7750j0242j5662m4615J6811Q8820M945j38890
$$ plain form
4191 3426002 3288643 3164442 3044628 2919857 2822011 2691680 2686254 2676487 2588439 2520287 2521695
4180 2521695 2389135 2319519 2299603 2208714 2138952 2139071 2127584 2018465 1895448 1918710 1897703
4169 1897703 1813885 1802209 1755540 1723207 1630686 1650530 1600986 1542876 1489456 1460702 1411325
4158 1411325 1440609 1354933 1262396 1227401 1296705 1276040 1195939 1280195 1271028 1303397 1277339 1191913
4146 1191913 1187846 1153462 1133737 1110772 1119223 1132319 1045382 1013974 1008976 948109 979058 931107
4134 931107 947533 931868 887065 880114 799098 823414 807511 828353 750480 730066 714557 744220
4122 744220 796796 812088 730542 709311 740269 732144 650080 604222 627404 589414 556799 625942
4110 625942 536232 529277 522250 525360 603110 592868 577206 532591 549402 638222 643167 504277
4098E04277O4700L9487n1740K1944m1380n6235k7222m6961J442j5318Q1221M2850
4086E17065P587K768J4622l3095n4230m0070l1260q738K2046K7681M3687n0680
4074D17383l6605k2788j8105K4790L7443J4779K6294K3046J4346n9869n4031L0301
4062C96984J34818J6956j15792j0168P1j2558J870n4530p8421o097Q1171L0274
4050C84578o1802K6149M2390k7972l169l5474J1132N4158n567n9319j0082J3392
4038C28414m709m3567J5435k5732K1478k0572N9031o334Q9273P886j05569L4768
4026C49802Q734o7407J5631P2864P278p1078o3994N5524k6941M7777n5397m1166
4014B31627k0585j1804o953M5801k7738R708j6680l073M8579J6199j07048K5304
$$ plain form
4098 504277 568977 608464 556724 578668 537288 481053 453831 406870 408312 392994 474215 517065
4086 517065 524652 527420 542042 508947 454717 414647 383387 374649 396695 424376 468063 417383
4074 417383 380778 357990 339885 364675 402118 416897 443191 466237 480583 420714 366683 396984
4062 396984 531802 548758 432966 422798 422869 410311 412181 357651 279230 273133 354304 384578
4050 384578 322776 348925 391315 363343 360174 324700 335832 389990 384423 325104 315022 328414
4038 328414 323705 280138 295573 269841 291319 270747 329778 323444 412717 420603 315034 349802
4026 349802 358536 291129 306760 379624 386902 315824 251830 307354 280413 328190 272793 231627
4014 231627 211042 199238 192285 238086 210348 220056 203376 200303 248882 265081 158033 183337
4002A83337O7726J0723l2670k8008l41R4456j05112k7963N505r471M7604n0654
3990A55132L0324L0119o0073M7872L4363O6309J3882r5760j3040j4896q648N1351
3978B36935k5209p800J6479l2733P9978L9933j468K5211N870p0663n6384m203
3966B05946m218J1016o3321p289J2823p3111N4017R7349p637L8894J6654k9806
3954B51317p3431L9306K3106r7137j4176j496K9672Q9434L3152k3617K8770l0039
3942B54861l8454j7282J27822o1860n9834j4597Q5492L2163k7285K06M8639k9820
3930C00051n6213L9682k0839j2662J4662j4362N3229l7240l4011K341J6401K2812
3918B73851o2102M8792l6603j2240p723l3962L4401O8565O8168n3336j8670Q3783
$$ plain form
4002 183337 251063 261786 229116 201108 200767 295223 190111 162148 167653 158182 205786 155132
3990 155132 185456 215575 155502 203374 237737 304046 317928 222168 209128 194232 185584 236935
3978 236935 211726 203926 220405 187672 267650 307583 306115 331326 337196 266533 210149 205946
3966 205946 201728 212744 149423 142134 154957 81846 135863 233212 225575 264469 281123 251317
3954 251317 177886 217192 240298 143161 128985 127489 157161 246595 279747 256130 284900 254861
3942 254861 216407 199125 326947 265087 205253 190656 276148 308311 281026 281232 329871 300051
3930 300051 243838 283520 262681 250019 264681 250319 303548 266308 232297 234638 251039 273851
3918 273851 211749 260541 223938 211698 203975 170013 204414 272979 341147 287811 269141 352924
3906C52924j0214j09925m1360l6357O8718M3696p7180J6113j544j4781M0683n6066
3894A74707M0558M1979j9279M695N5k4015j3737r5571k4259R8937J09807j1034
3882B82843n5035k9102m8876K7169m8103N011k2999Q2430j2081k2825N3263N9258
3870B70953p860o500O139p4831L5850q0784k2105N8136N5824J8240m4841m3405
3858A64816K4712R77l0600J34210K8159o6010j01807L2608J09145n3582l295P0831
3846C10164K1294k2719j05250o908P0888k9908j8485l3649J2418m6417k838P1382
3834B19972j6764O5873L9113M98q4757K9928K3051O385K41m9679l756m1964Q2318
3821B70459q747N2904M6177q2022k7285q292J10771l2962q0576P7852J1527l6850
$$ plain form
3906 352924 342710 232785 191425 155068 223786 267482 190302 206415 204871 190090 230773 174707
3894 174707 215265 257244 237965 242660 242715 218700 204963 109392 85133 184070 293877 282843
3882 282843 227808 198706 149830 176999 128896 133907 110908 193338 181257 158432 211695 270953
3870 270953 263093 256593 262732 187901 223751 142967 120862 178998 234822 253062 208221 164816
3858 164816 189528 190505 159905 294115 322274 256264 154457 187065 296210 242628 239333 310164
3846 310164 331458 308739 203489 196581 267469 237561 219076 185427 197845 151428 148590 219972
3834 219972 203208 269081 308194 308692 223935 253863 276914 283299 283540 233861 230105 188141 270459
3821 270459 261712 314616 360793 278771 251486 243194 353965 321003 240427 318279 329806 292956
3809B92956l1679R339Q716q4832r909L0105Q9368L4074n7586p9054M1293M2238
3797B85029j6896L6088R736N7022k1489n9898O507j4712J4956Q2877J058J1627
3785C91905m0440n2668K165M2412l2936K7464n1836L3870M2688q6204K7777Q5150
3773C89347n6528J2846K2975n8612N1741K7958J625m8980P8431m1203r919o2662
3761C07019k06R2771L1848j08178l1858M4793P5096l4645k4011L319P0141N2408
3749D78497l8250L053O7207K8884j2610L051o2788n2660O0511P5979K8336k4886
3737E54324o2879j9931O460Q0863K214m5212j2962M0571j7829N6654l9488k462
3725E40323J5814o8778O7129M5432L6840m423L796K9679M40q5967m5365O7593
$$ plain form
3809 292956 261277 270616 279332 194500 184591 214696 304064 338138 280552 201498 242791 285029
3797 285029 268133 304221 313957 370979 349490 289592 296099 281387 296343 379220 380278 391905
3785 391905 351465 298797 300962 343374 310438 337902 286066 319936 362624 276420 304197 389347
3773 389347 332819 345665 368640 310028 361769 389727 391352 342372 420803 379600 369681 307019
3761 307019 306813 399584 431432 323254 291396 336189 411285 376640 352629 355948 426089 478497
3749 478497 440247 443300 510507 539391 526781 529832 467044 414384 474895 550874 579210 554324
3737 554324 491445 471514 477974 558837 561051 515839 502877 543448 525619 582273 542785 540323
3725 540323 556137 487359 554488 599920 636760 632337 636133 665812 666252 580285 534920 602513
3713F02513j0636K3706k0711J11378m9125j00283j6123L5198R1360k361r833N4664
3701G09747o7765o493M3143K7095r5930L8673m9031Q397N353P9712n467j43387
3689E44047M0245L402L8361L916J5849j1751k3928L388j179K173l7365l5035K1990
3676E64113J3337J13969K3115r764L2884p1711l11k5009l5270O6080L908M0746
3664G16087J7793P02p069j2193j5159j7267m831L4444l8822L1963L2003j2036
3652G25615l7359k1061Q2113P2184j02355J6153L2107j7727P4947k1877m6024
3641G56716k5623O0257O552r1020J0978P6675M243l9518L3909n2271l3637M7194
3629G54455J26844o8127n365l213L138Q4507J2634J5795j1072J03792K7731j30839
$$ plain form
3713 602513 591877 615583 594872 706250 657125 556842 540719 575917 667277 664916 655083 709747
3701 709747 641982 635489 678632 705727 609797 648470 599439 607836 613189 692901 687434 544047
3689 544047 584292 587694 626055 629971 645820 634069 610141 613529 612350 614523 577158 542123 564113
3676 564113 577450 691419 714534 704770 737654 665943 665632 640623 605353 671433 675341 716087
3664 716087 733880 734582 727513 715320 700161 682894 678063 712507 673685 705648 737651 725615
3652 725615 688256 667195 749308 821492 719137 735290 767397 749670 824617 802740 756716
3641 756716 731093 791350 797902 706882 717860 794535 798778 759260 793169 740898 707261 754455
3629 754455 881299 813172 807807 804594 807732 892239 904873 920668 909596 1013388 1041119 910280
3617I10280j920M1214J2245m8877j5190M2668L6164R434N3079M3994k803L7987
3605A118275n6799M0601O8662J4706K2561k8339K3313N6764L3244m5133N552L8423
3593A291830N4842P2516R92K4478N2727j8235M5571J6574L2551J51589m9685n5319
3581A620431M0664R6996O4296J6674N4107j1O546O1434K9567L8698L1356J3011
3569B073769q467J03501Q45p068L5643K2305L3537Q1496O2031J20728M5259L9289
3557B602868K1428O6520L1219J10488Q9518k7445O6949P9315J00803N9535R5633
3546C296831Q7485m9489Q0917J20837J4945P9376J11226J2229P908J60000J42563
3535D064828P6681J16536P9289L236J49541Q9747J60322J03112J92453J96954
$$ plain form
3617 910280 908360 949574 961819 912942 897752 940420 976584 986018 1039097 1083091 1080288 1118275
3605 1118275 1061476 1102077 1170739 1185445 1208006 1179667 1202980 1259744 1292988 1247855 1253407 1291830
3593 1291830 1346672 1419188 1420180 1444658 1497385 1479150 1524721 1541295 1573846 1725435 1675750 1620431
3581 1620431 1661095 1758091 1822387 1839061 1893168 1893157 1899703 1961137 1990704 2029402 2060758 2073769
3569 2073769 2065302 2168803 2169648 2162580 2198223 2220528 2254065 2335561 2397592 2518320 2563579 2602868
3557 2602868 2624296 2690816 2722035 2832523 2922041 2894596 2961545 3040860 3141663 3201198 3296831
3546 3296831 3384316 3334827 3415744 3536581 3551526 3630902 3742128 3754357 3762265 3922265 4064828
3535 4064828 4141509 4258045 4337334 4340570 4490111 4579858 4740180 4843292 5035745 5232699
3525E232699O9790J33303J36774K25156J37090J74549J06058J25892K17751J57201
3515F716263J32300K84562J85878Q3968K66799K33322L26345K38146K27970J56163
3505H851716K44683K96496J92078K07393K63294J90054K04791K21497K41048J87445
3495A1100495K45020J47979K22108K10976J60978K75334K13046K16947K06791
3486A2999674L02728J99713L77271L03167L65087L88289L68035L77057M46758
3477A6127779N24424L74595M35832M41294N20077L14950L37976M74980K68582
3468A9820489K21296K56497K94215K44136K22763L8433J43564J67101J68751J87899
3458B1765144J62648K09661J58317K64177J99089P7587K57505K19842J91946K73675
$$ plain form
3525 5232699 5302489 5435792 5572566 5797722 5934812 6109361 6215419 6341311 6559062 6716263
3515 6716263 6848563 7133125 7319003 7402971 7669770 7903092 8229437 8467583 8695553 8851716
3505 8851716 9096399 9392895 9584973 9792366 10055660 10245714 10450505 10672002 10913050 11100495
3495 11100495 11345515 11493494 11715602 11926578 12087556 12362890 12575936 12792883 12999674
3486 12999674 13302402 13502115 13879386 14182553 14547640 14935929 15303964 15681021 16127779
3477 16127779 16652203 17026798 17462630 17903924 18424001 18738951 19076927 19551907 19820489
3468 19820489 20041785 20298282 20592497 20836633 21059396 21097829 21241393 21408494 21577245 21765144
3458 21765144 21927792 22137453 22295770 22559947 22759036 22836623 23094128 23313970 23505916 23779591
3448B3779591K31166J82659J85890K39852K87436J93401J98160K87472J51291
3439B5736918J68832J68341J72633J37693Q9648J82303n7850n9989L3454o4062
3429B6507921j30334j47093q6503k01177r2146j32827j26603j78789k29121j54127
3419B5029201j72076j36389j39738j92777j51118j32624j17537j68292j38130
3410B3680520j69323j25043j52985j48715r9923j70096j63350k07381j56342k16159
3400B2071203j86829j26686k52529k66378k89956k60126k64602l24253k87375
3391A9812469l96567m26096l34606l21589l57994k23246k98366l26798k82062
3382A6845145j65364j74304k45623j12251j52743j54727j45883j93848j17613
$$ plain form
3448 23779591 24010757 24193416 24379306 24619158 24906594 25099995 25298155 25585627 25736918
3439 25736918 25905750 26074091 26246724 26384417 26474065 26656368 26598518 26538529 26571983 26507921
3429 26507921 26377587 26230494 26143991 25942814 25850668 25717841 25591238 25412449 25183328 25029201
3419 25029201 24857125 24720736 24580998 24388221 24237103 24104479 23986942 23818650 23680520
3410 23680520 23511197 23386154 23233169 23084454 22984531 22814435 22651085 22443704 22287362 22071203
3400 22071203 21884374 21757688 21505159 21238781 20948825 20688699 20424097 20099844 19812469
3391 19812469 19415902 18989806 18655200 18333611 17975617 17752371 17454005 17127207 16845145
3382 16845145 16679781 16505477 16259854 16147603 15994860 15840133 15694250 15500402 15382789
3373A5382789j02836k01934q1328p1283k32510j66520o1444j14711j13610o3034
3363A4173579j18402m9278j11419j21214m3347m8686j03872O4103J00704K6199
3353A3768367J1943K9373Q8696J9382O0039Q6342J43650J74755J14872J47025
3343A4644444K21297K40380K10624J48605K33951K66037K64549K09442L43589
3334A6782918K77266L15255L47607L66496L57454L76229L82308M73425M61419
3325B0140377M27531M93869N46240N90219N28831N71222N92289O01309O21214
3316B5113101P75813Q70621P86912P90805Q75964R04719J014038R77629J065597
3307C3175199J034641J041068J041456R85073R92308J026882R36030Q63313R92133
$$ plain form
3373 15382789 15279953 15078019 14996691 14925408 14692898 14526378 14464934 14350223 14236613 14173579
3363 14173579 14055177 14005899 13894480 13773266 13729919 13681233 13577361 13641464 13742168 13768367
3353 13768367 13780310 13809683 13898379 13917761 13977800 14064142 14207792 14382547 14497419 14644444
3343 14644444 14865741 15106121 15316745 15465350 15699301 15965338 16229887 16439329 16782918
3334 16782918 17060184 17375439 17723046 18089542 18446996 18823225 19205533 19678958 20140377
3325 20140377 20567908 21061777 21608017 22198236 22727067 23298289 23890578 24491887 25113101
3316 25113101 25888914 26759535 27546447 28337252 29213216 30117935 31131973 32109602 33175199
3307 33175199 34209840 35250908 36292364 37277437 38269745 39296627 40232657 41095970 42088103
3298D2088103J000119J038678R98340J004559R92832J119390J136085J181776
3290E0559882J214777J281992J475280J468321J691633J908396J898320J944029
3282F3442630K112431K151846K293098K279166K371424K430492K491444K627524
3274H2200055K628227K627273K687824K762803K752141K643498K677164K778736
3266A03757721K836203K850471L062164L155519L259893L424455L677676L884131
3258A29908233M099208M370682M739227M898984N087561N431200N609542N975355
3250A70119992O159270O353151O648668O948379P211352P594873P917317Q386722
3242B27339724Q645342R242236R687831J0249214J0699536J0944651J1071525
$$ plain form
3298 42088103 43088222 44126900 45125240 46129799 47122631 48242021 49378106 50559882
3290 50559882 51774659 53056651 54531931 56000252 57691885 59600281 61498601 63442630
3282 63442630 65555061 67706907 70000005 72279171 74650595 77081087 79572531 82200055
3274 82200055 84828282 87455555 90143379 92906182 95658323 98301821 100978985 103757721
3266 103757721 106593924 109444395 112506559 115662078 118921971 122346426 126024102 129908233
3258 129908233 134007441 138378123 143117350 148016334 153103895 158535095 164144637 170119992
3250 170119992 176279262 182632413 189281081 196229460 203440812 211035685 218953002 227339724
3242 227339724 235985066 245227302 254915133 265164347 275863883 286808534 297880059
3235B97880059J0950280J0517894R376052P811803N758652L149887J58135l015595
3227C42587167o013453q583384j0345349j1290625j1463453j0915999j0084289
3220B73890615r224636q227252p378990o686000n871014n211814m548774m169042
3212B22573093l576777l169593k765364k513837k221614j926610j601457j333699
3204B03464142q88666o44146m10819J6990K16657K64332L21379J03121n2042l72101
3194B02018847o66527j039694j319754j483114j680832j810085j964934k249686
3186A89804221k455812k636363k835620l056958l181600l300474l281759l120362
3178A65935273l005193k851436k819229k697754k498353k426445k505736k394797
$$ plain form
3235 297880059 308830339 319348233 328724285 336536088 342294740 345444627 345602762 342587167
3227 342587167 336573714 327990330 317644981 306354356 294890903 283974904 273890615
3220 273890615 264665979 256438727 249059737 242373737 236502723 231290909 226742135 222573093
3212 222573093 218996316 215826723 213061359 210547522 208325908 206399298 204797841 203464142
3204 203464142 202575476 201931330 201520511 201537501 201754158 202018490 202339869 202442990 202390948 202018847
3194 202018847 201352320 200312626 198992872 197509758 195828926 194018841 192053907 189804221
3186 189804221 187348409 184712046 181876426 178819468 175637868 172337394 169055635 165935273
3178 165935273 162930080 160078644 157259415 154561661 152063308 149636863 147131127 144736330
3170A44736330k403045k462557k601195k625907k748521k759064k835664k899073
3162A23401304l000156k858135k913383k749333k768708k622270k517773k423952
3154A01547594k391080k326520k253626k234806k224126k249344k204632k168199
3146H3495261k056338j967147k135694k030416k038735j983757j861107j831390
3138F7590677j784673j741627j724743j547892j543765j469977j417835j265471
3130E5094694j235488j182533j059970j057201r63620j033426r46206q93680q53782
3121D5868788q69269r16937r13797r05185q54515q61055q56600q08681q46933
3112C8035816p38464p49066o13689p38957o85772o13519o50322o71233n79963
$$ plain form
3170 144736330 142333285 139870728 137269533 134643626 131895105 129136041 126300377 123401304
3162 123401304 120401148 117543013 114629630 111880297 109111589 106489319 103971546 101547594
3154 101547594 99156514 96829994 94576368 92341562 90117436 87868092 85663460 83495261
3146 83495261 81438923 79471776 77336082 75305666 73266931 71283174 69422067 67590677
3138 67590677 65806004 64064377 62339634 60791742 59247977 57778000 56360165 55094694
3130 55094694 53859206 52676673 51616703 50559502 49595882 48562456 47616250 46722570 45868788
3121 45868788 44999519 44082582 43168785 42263600 41409085 40548030 39691430 38882749 38035816
3112 38035816 37297352 36548286 35934597 35195640 34509868 33896349 33246027 32574794 31994831
3103C1994831n94123n01015n14591o06281n67426n22002n51621n08139n51273
3094B7078360n63509n13682m84795n19064n08256m49413n32388n18735m04330
3085B2584188n06580m68117m71324m40816l20278m03978l90012l99022m58457
3076A8725604m24607m35109l46457l65909l72768l80110l35022l16534l33045
3067A5416043k91644l55315l53185k74706k68529k76620l27504k71680l31871
3058A2664989k65049k56642k04333k12563k64745j82099k04558j71589j93637
3049A0709774k58400k39943k44476j51240j24531j28165j70792j92666j85763
3040I013798j29347j06986k19653j39277j28521j46586j24850j34810n6888r9821
$$ plain form
3103 31994831 31400708 30899693 30385102 29778821 29211395 28689393 28137772 27629633 27078360
3094 27078360 26514851 26001169 25516374 24997310 24489054 24039641 23507253 22988518 22584188
3085 22584188 22077608 21609491 21138167 20697351 20377073 19973095 19583083 19184061 18725604
3076 18725604 18300997 17865888 17519431 17153522 16780754 16400644 16065622 15749088 15416043
3067 15416043 15124399 14769084 14415899 14141193 13872664 13596044 13268540 12996860 12664989
3058 12664989 12399940 12143298 11938965 11726402 11461657 11279558 11075000 10903411 10709774
3049 10709774 10451374 10211431 9966955 9815715 9691184 9563019 9392227 9199561 9013798
3040 9013798 8884451 8777465 8557812 8418535 8290014 8143428 8018578 7883768 7826880 7727059
3030G727059r7348n5391j12955r7187j30549k8554k7400o7905o2136r5024n5526
3019F897084r2663k2703q6369r742L1467k5358n631l980l9263o9437k7109j7650
3007F528646K220K4604K1631q6060J21432J7468J7750j2585J4951L8128J6112
2996F704297P0766L835P1795J25273m1774P9889R6937J23233J16334P6966M7759
2985G475310J29341Q0440L2760J29421J38448J31640J69502J36296O1012Q3485
2975H567655J13929J60680K17806J63860J30847K18315J79146K03996L04231K50294
2965A0510759K24969K01016L08734L24229J85377K39537K92787K13261L26449
2956A2827118L24491K76917K94723L56957L55383L59835L93768M03680L65320
$$ plain form
3030 7727059 7629711 7574320 7461365 7364178 7233629 7205075 7177675 7109770 7047634 6952610 6897084
3019 6897084 6804421 6781718 6695349 6685607 6717074 6691716 6686085 6682105 6642842 6573405 6546296 6528646
3007 6528646 6530866 6555470 6577101 6491041 6612473 6629941 6647691 6635106 6650057 6688185 6704297
2996 6704297 6775063 6778898 6850693 6975966 6934192 7014081 7111018 7234251 7350585 7427551 7475310
2985 7475310 7604651 7685091 7717851 7847272 7985720 8117360 8286862 8423158 8484170 8567655
2975 8567655 8681584 8842264 9060070 9223930 9354777 9573092 9752238 9956234 10260465 10510759
2965 10510759 10735728 10936744 11245478 11569707 11755084 11994621 12287408 12500669 12827118
2956 12827118 13151609 13428526 13723249 14080206 14435589 14795424 15189192 15592872 15958192
2947A5958192M53364N50465M82954N54450O38687O24705O64474Q32645P54201
2938B1514137Q21520Q36029R40911J098826J074370J231027J406172J421312J572577
2929C1916881J656095J788344J977708K157789K338626K593770K826789L043704
2921E0299706L203417L490411L721449L852290L800513L697410L504024K972593
2913G8541813K364764J586963P98264J74868l64673o07155n95298n01444m33728
2904H0964374j99343L2606K25163N49735P22153R78564J480744J920712K433230
2895H9107938L042220L592948M172006M908045N718713O567361P258837P470231
2887A31838299O708107M642964K371848q36017m878964p466990r145782j0394978
$$ plain form
2947 15958192 16411556 16962021 17444975 17999425 18638112 19262817 19927291 20759936 21514137
2938 21514137 22335657 23171686 24112597 25211423 26285793 27516820 28922992 30344304 31916881
2929 31916881 33572976 35361320 37339028 39496817 41835443 44429213 47256002 50299706
2921 50299706 53503123 56993534 60714983 64567273 68367786 72065196 75569220 78541813
2913 78541813 80906577 82493540 83291804 83466672 83101999 82494844 81899546 81398102 80964374
2904 80964374 80765031 80797637 81022800 81572535 82294688 83273252 84753996 86674708 89107938
2895 89107938 92150158 95743106 99915112 104823157 110541870 117109231 124368068 131838299
2887 131838299 138546406 143189370 145561218 144725201 139846237 132379247 123233465 112838487
2879A12838487j0087081q611780o931246n661393m752026l895505l335448k825502
2871F6738506k377984k058383j541059j107254q25583m55275j48559N1586L81490
2862E8657485O85191Q32216J052078J144933J179211J058160Q47025K83598l58651
2853F5381246j112506j840358k535009l306976l718131l888001l760092l603548
2845D1616625l229608k804907k516085k215703j934558j836989j578542j369893
2837B4130340j398748j238224j017138j029000r46397q18088p60393p48560o23060
2828A5550732o00648n98039m67609m99367m97469m89752m88662l20901m29995
2819A1158290m50588k89000l59738l42966l57464k53063k44054k64989k42379
$$ plain form
2879 112838487 102751406 94139626 87208380 81546987 76794961 72899456 69564008 66738506
2871 66738506 64360522 62302139 60761080 59653826 58828243 58372968 58224409 58275995 58657485
2862 58657485 59342676 60174892 61226970 62371903 63551114 64609274 65456299 65739897 65381246
2853 65381246 64268740 62428382 59893373 56586397 52868266 48980265 45220173 41616625
2845 41616625 38387017 35582110 33066025 30850322 28915764 27078775 25500233 24130340
2837 24130340 22731592 21493368 20476230 19447230 18500833 17682745 16922352 16173792 15550732
2828 15550732 14950084 14352045 13884436 13385069 12887600 12397848 11909186 11588285 11158290
2819 11158290 10707702 10418702 10058964 9715998 9358534 9105471 8861417 8596428 8354049
2810H354049k59890l04450j48530j51193k04971j76201k34726k27805j88310k00461
2800F257512j26270k5447j88187j05617j12013j09180j08407j22023j18263j32602
2790E109503j15844j44100j30511j61783j15050j69141m2697p2932j55741o6426
2780C935278j21807j45258K606q7870p5528r9135k7498p3285k7588p198j02809
2769C169908r3993n6772j5706l1901k3642n5947p1596p3824p872j13110j3275
2758B612270k0040j01736j9735m0027m633r0166l4049O221l9646l5692l4668p1363
2746B126736m4967N1627m4228M5186n9035O7240j78549m4150P0607j22112L6708
2735A905063m3777p0766l7786n3712n8580l1202M5223k9510j9196K7620k182l1904
$$ plain form
2810 8354049 8094159 7789709 7641179 7489986 7285015 7108814 6874088 6646283 6457973 6257512
2800 6257512 6131242 6105795 5917608 5811991 5699978 5590798 5482391 5360368 5242105 5109503
2790 5109503 4993659 4849559 4719048 4557265 4442215 4273074 4230377 4157445 4001704 3935278
2780 3935278 3813471 3668213 3670819 3582949 3507421 3408286 3380788 3307503 3279915 3272717 3169908
2769 3169908 3075915 3019143 3003437 2971536 2947894 2891947 2820351 2746527 2738655 2625545 2612270
2758 2612270 2592230 2490494 2470759 2430732 2426099 2335933 2301884 2308105 2268459 2232767 2198099 2126736
2746 2126736 2081769 2133396 2089168 2134354 2075319 2142559 1964010 1919860 1990467 1868355 1905063
2735 1905063 1861286 1790520 1752734 1699022 1640442 1609240 1654463 1624953 1605757 1633377 1631195 1599291
2723A599291k65m7791k5804o175k2157n9549n6487j5987N9147r979l942l3214
2711A377088r1361O4738L900l2187n6794J3976K1406l3565j29873r294N6927J3792
2699A198753k1485n2358j2390m9572l8444j7185L2242k1476n1248O39R548p2704
2687I04320m2521O3010M8723p050Mp7390l450J2409l0671l399J57J4350n7970
2674H20522K8620l4051J107q878j0956l5272K251K8104J604N5017o2566o6392
2662G19110l4881Q8966M9378j7791j8466k851j6481J2748o9587k8425K0894j3530
2650F89084K5738L102Q760n9200L8748k1977N0446L0267j270N7l1105O2408l5287
2637G59771n3424N9703M4349K4971k0546j745K3629j6716N3899J3035n8016m4755
$$ plain form
2723 1599291 1599026 1551235 1525431 1519256 1497099 1437550 1381063 1365076 1424223 1414244 1410302 1377088
2711 1377088 1285727 1350465 1354365 1322178 1265384 1279360 1300766 1267201 1137328 1128034 1184961 1198753
2699 1198753 1177268 1124910 1112520 1062948 1024504 1007319 1039561 1018085 966837 967476 977024 904320
2687 904320 861799 924809 973532 966482 966486 889096 885646 898055 867384 863985 864142 878492 820522
2674 820522 849142 815091 816198 807320 796364 761092 763343 791447 793051 848068 785502 719110
2662 719110 684229 773195 822573 804782 786316 783465 766984 779732 710145 681720 702614 689084
2650 689084 714822 717924 726684 667484 706232 684255 734701 764968 763698 763755 732650 795058 759771
2637 759771 706347 766050 810399 835370 814824 813079 836708 819992 873891 886926 828910 784155
2625G84155J1602O673l6994k1675Q764K1148J8906k2491o9143O3762R7065P197
2613H68969o0094q92q2971M7532O5214J7064O7855J4952P5111Q3600J38920K7025
2601A262285o6552l7970k3644j3797j42674n9320m057n7431j29069m1070K7898
2590G14599m8704n062k7954o4110K1753M423J2529m2453N0927L0174q0246k1982
2578E43894N2307J2405k4472M0353l2130r0543J8531l407N6558q945l1117J07024
2566F40458l3495q2551j07853m532O5834o0381j4598j1723m4179L306q1144J8780
2554B87922O2898k2233l3157q3761k9475J4383K5647M0537J9444k3020L0228n148
2542B84265l5066K1167N7227j923n592n76j6738o9399M071L3303k5054K543r6332
$$ plain form
2625 784155 795757 802430 765436 743761 752525 773673 792579 770088 700945 764707 861772 868969
2613 868969 808875 807983 725012 772544 837758 854822 922677 937629 1012740 1096340 1235260 1262285
2601 1262285 1195733 1157763 1134119 1120322 977648 918328 914271 856840 727771 686701 714599
2590 714599 665895 660833 632879 568769 590522 594945 607474 565021 615948 646122 565876 543894
2578 543894 596201 608606 584134 624487 592357 501814 520345 516938 573496 564551 533434 640458
2566 640458 606963 524412 416559 412027 477861 417480 402882 391159 346980 350286 269142 287922
2554 287922 350820 328587 295430 211669 182194 196577 222224 262761 282205 259185 289413 284265
2542 284265 249199 270366 327593 325670 320078 319502 302764 233365 237436 270739 245685 248228 151896
2529A51896k0707L8127O3478r4058M3016j6869k9531J6188M4928J2197K6296o7559
2517A67402p2856J1885l2922k3904P9403N3177l3623j51786L3237J06692L5561
2506A72266O242p7852r840j0723N8508M6090r3987k1853P8674k8570r9878M1480
2494F0557N7350M0960K4774j8243o2948M3546K8978q0831k030l075N133M4931
2482A39102m6229o2096J0758j0566O3268K4688O671p1159n3385L3621m9729R6967
2470H1911R6922r7949j28885L9568J02271k554l2442j4911M3630R1349m720l0962
2458A43228m8383n2170j1942L5438J2894q0264O9138j07068N4664Q8279n7442
2447D6372j3262L8624J147N417j1893m3222J17853k7586p1525l9099N5877L8306
$$ plain form
2529 151896 131189 169316 232794 138736 181752 164883 135352 151540 196468 208665 234961 167402
2517 167402 94546 106431 73509 49605 129008 182185 148562 -3224 30013 136705 172266
2506 172266 178508 100656 90816 80093 138601 184691 90704 68851 147525 118955 19077 60557
2494 60557 117907 158867 183641 165398 102450 145996 174974 94143 92113 89038 94171 139102
2482 139102 92873 30777 41535 30969 94237 118925 125596 54437 1052 34673 -15056 81911
2470 81911 178833 80884 -48001 -8433 93838 91284 58842 43931 87561 178910 174190 143228
2458 143228 94845 42675 30733 66171 79065 -1199 67939 -39129 15535 103814 46372
2447 46372 33110 71734 72881 78298 66405 23183 141036 113450 41925 2826 58703 97009
2435I7009P386k9090q0185R562L494L2337K6542J0465L2505k2925K245J6209p58
2422A04796j7997o0072M3332M6133o316l5324p577l5627P216l306l4198o857J5781
2409I984l9798O1234K9809n2980r977M6976L9837J2537n7786r8657L8811k333
2397b2343K11R638N4719J7444k0288K4815j4025M1012n0205J3399N6408K4015
2385A34800q5346n0116m9316j3128m352M9882P8749J23181m2269j4150j6218J1403
2373A23120J4285N5006O8034m6007k7580k5752L512P2088p7698j188J29976m5486
2361B42310n146Q5116J02208Q054J9806k8045J16586n5107l7571m4821p4990j8475
2349C09925n7655r1469m2999J6174N942q100r135J4288L168j9557j0314L9350
$$ plain form
2435 97009 104395 75305 -4880 4682 8176 40513 67055 77520 110025 87100 89345 105554 104796
2422 104796 86799 26727 70059 116192 109876 74552 66975 31348 38564 35258 1060 -5797 9984
2409 9984 -29814 31420 61229 8249 -1728 45248 85085 97622 39836 -58821 -20010 -22343
2397 -22343 -22132 -12494 42225 59669 39381 64196 50171 91183 40978 54377 110785 134800
2385 134800 49454 -662 -49978 -63106 -67458 -17576 61173 184354 142085 127935 111717 123120
2373 123120 137405 192411 260445 214438 186858 161106 164618 236706 159008 157820 287796 242310
2361 242310 237164 322280 424488 432542 452348 424303 540889 485782 448211 403390 328400 309925
2349 309925 252270 160801 117802 133976 139918 131818 122683 136971 140139 120582 110268 149618
2337A49618m366p5025R649J0092o4470m5473J1228r873O9089P2132p202M2740
2325A58139n9151q7871L8497K026J7409q943N2787M9262p7137P8398j7744r7134
2313D8538P3446k2994k9227N6846k6557k8801K3404K3949j3218N6193M0980p9620
2301A22939l4096N1786q313m2469J2086Q9158m9875o2596K1035p224k4815k903
2289F4713j7047M1861J6144k0636J8157k1246M1042L1748P8747n4170o5987k0225
2277I3101K8000L1740M8048j6794k9059l4630J64474k169r7390k3677l2415l669
2265A25560N7104j733n9083j2580P4107N4666l9237j1954p2581J7083Q0556n021
2253B06887L0617n958n4143o4793J0828Q7325j0500Q5418Q445r833K0621l3235
$$ plain form
2337 149618 145252 70227 79876 89968 25498 -19975 -8747 -18620 50469 122601 115399 158139
2325 158139 98988 11117 49614 51640 69049 60106 112893 162155 85018 163416 145672 48538
2313 48538 121984 98990 69763 126609 100052 71251 94655 118604 105386 161579 202559 122939
2301 122939 88843 140629 132316 89847 101933 191091 141216 78620 99655 92431 67616 64713
2289 64713 47666 89527 105671 85035 103192 81946 122988 154736 233483 179313 113326 93101
2277 93101 121101 152841 200889 184095 155036 120406 284880 282711 185321 161644 129229 125560
2265 125560 182664 180931 121848 109268 183375 238041 198804 186850 114269 131352 211908 206887
2253 206887 237504 231546 177403 112610 123438 210763 200263 285681 294126 284293 304914 271679
2241B71679K0828p0415n6392O753L2182P7095o1140L8101R767k886m3233M7433
2229B69772K5477n770Q806r753O7316k5944N6829P9999Q7065j0384j02p7615P3002
2216E38698J8581J65049Q5727l7134P7033Q6588P8536K9426j22796k3076L3018
2205I29650N3318J01372K0825K0505r3683o2918j25196p5547p5267m7525K9361
2194F74895M736K0004j1895L757k8338m1426M9850M4098P0122J07141k3167l929
2182H65848p2990p5194P4070M6091P3509n8037j9421M4770R2580J5201O9915N0035
2170A106377M7511L207J848M9323L7453j5794N7955j2058Q4397K5385N7033R3416
2158A536053J32060J55148O9101L5871R2180J08741J92753J04852J55866l1588
$$ plain form
2241 271679 292507 222092 165700 172453 204635 281730 220590 258691 268458 265572 222339 269772
2229 269772 295249 289479 298285 288532 355848 329904 386733 466732 553797 543413 543311 465696 538698
2216 538698 557279 722328 808055 770921 847954 934542 1013078 1042504 919708 896632 929650
2205 929650 982968 1084340 1105165 1125670 1031987 969069 843873 768326 693059 645534 674895
2194 674895 679631 699635 687740 691497 663159 621733 671583 715681 785803 892944 869777 865848
2182 865848 792858 717664 791734 837825 911334 853297 833876 878646 971226 986427 1056342 1106377
2170 1106377 1153888 1157095 1158943 1208266 1245719 1229925 1287880 1275822 1360219 1385604 1442637 1536053
2158 1536053 1668113 1823261 1892362 1928233 2020413 2129154 2321907 2426759 2582625 2551037
2148B551037M5104o3260j0678l0829j0465M5885J66955Q7504P9596N9702J16898
2137C037449J02741N5959Q7439J22593Q8215Q2230R1758J53533J27484J54227
2127D103628J78921J61384K03907J69654J16258K63562L02964L08566K51147K28396
2117F288387K11291L29195L42290L98039M49496N08648M98702P16941Q23957R10074
2107A1477020R50064J062358J181317J365967J238568J513770J471800J856532
2099B2117396K412204L119234L783299M507938M900852N591608O780299R653243
2091F2866073J1516030J2248652Q328592k742812n019364j4558531j7923886j1939902
2083D2774852p742754n280826m187759l018129k411930j810839j548136j146819
$$ plain form
2148 2551037 2596141 2532881 2522203 2491374 2480909 2526794 2693749 2781253 2860849 2920551 3037449
2137 3037449 3140190 3196149 3283588 3406181 3494396 3576626 3668384 3821917 3949401 4103628
2127 4103628 4282549 4443933 4647840 4817494 4933752 5197314 5500278 5808844 6059991 6288387
2117 6288387 6499678 6828873 7171163 7569202 8018698 8527346 9026048 9742989 10566946 11477020
2107 11477020 12427084 13489442 14670759 16036726 17275294 18789064 20260864 22117396
2099 22117396 24529600 27648834 31432133 35940071 40840923 46432531 53212830 62866073
2091 62866073 74382103 86630755 94959347 92216535 87197171 72638640 54714754 42774852
2083 42774852 35032098 29751272 25563513 22545384 20133454 18322615 16774479 15627660
2075A5627660q95029p89117r50140q03013r94170r30971q18242n38335n91194
2066H317449m66728m95624m03467n08961l75403l12063k50070k34009j99151k39002
2056D832971j46838k86457j53849k41111j72041j48156q0433j19401q0850r8732
2046C305103j26307j56070j2524p0572p3425j17384j02709j70723l0150j6226
2036B429013j0043r7160N0591j59934k6803q146n3341m2759L4662j84331j8905
2025A912844M6387p5535p1632o7517j20611p1438j16106m4885p4141L2532l3267
2014A316631o0714k4913n2309n1942m7804n5250j8196N1916k4432L1387N749p8929
2002I91194j81147q095J24934n0503l0392M405o3860q3307n711M8237N0852q0047
$$ plain form
2075 15627660 14732631 13943514 12993374 12190361 11196191 10265220 9446978 8908643 8317449
2066 8317449 7850721 7355097 6951630 6442669 6067266 5755203 5505133 5271124 5071973 4832971
2056 4832971 4686133 4399676 4245827 4004716 3832675 3684519 3604086 3484685 3403835 3305103
2046 3305103 3178796 3022726 3010202 2939630 2866205 2748821 2646112 2475389 2445239 2429013
2036 2429013 2418970 2321810 2372401 2212467 2185664 2177518 2124177 2081418 2116080 1931749 1912844
2025 1912844 1959231 1883696 1812064 1744547 1623936 1552498 1436392 1391507 1317366 1349898 1316631
2014 1316631 1255917 1231004 1178695 1126753 1078949 1023699 1005503 1057419 1032987 1064374 1070123 991194
2002 991194 810047 801952 926886 876383 845991 850396 786536 703229 697518 745755 796607 716560
1990G16560J9497L358j7930K9059q6383o2019k2784l2087l4286k816L648j25903
1978C87914J5422J5004O9387K7545o1868N508M9662R526k4695m4670K6598O4108
1966E39441j32481l2846M6685l1812l3244J0993Q95Q6966l7244k3058l586R729
1954D00438m989L4993K1519o0480m3858N6800k4916K3617K608l0435n3756K6034
1942C47575J00120r8863M2029N9977j38813n2082M7968m0272l4088P2481l8455
1931B67577j16696n097O7974m8412j605j1671M6222N3315N5422k9101K4820r3900
1919B08848L4977J1816J7301k498o0797n1171k6929k5140P019j7947O3791m595
1907A54675L6832P3679j25541N1017J7909K7829k7648r0451J6525Q886l2350p209
$$ plain form
1990 716560 736057 739415 721485 750544 664161 602142 579358 547271 512985 510169 513817 387914
1978 387914 403336 418340 487727 515272 453404 458912 508574 518100 493405 448735 475333 539441
1966 539441 406960 374114 420799 388987 355743 366736 367631 454597 417353 394295 390709 400438
1954 400438 395449 430442 451961 391481 347623 404423 379507 403124 405732 375297 321541 347575
1942 347575 447695 348832 390861 450838 312025 259943 307911 267639 233551 306032 267577
1931 267577 150881 145784 213758 165346 163741 152070 198292 251607 307029 277928 302748 208848
1919 208848 243825 255641 272942 270444 209647 158476 131547 106407 113426 95479 159270 154675
1907 154675 191507 265186 139645 190662 208571 236400 208752 118301 134826 143712 111362 104153
1895A04153P2555K9163q9356L2972M782l7191k125J3890J01787m3297J3358j23169
1883G7522m082K314j0264J9739L8484j390n8395j2523j4795M6507P0819p3868
1871H0068j8357R8436k6878J1127m3404L2685j6611k9675n0805j9041N555M3442
1859F6542q74l489Q945m1324J8783o8838Q0482L3596j4796k0078N1670p906k4759
1846G7954k4635K4648j0036m8081N4453j2689p972k6217J5563N444Q2496m5625
1834H5303m7135M747K1885m1093O8686M374n2968Q4010O3118R487J39774K2352
1822C62540N2222L3455o771J6616K8888n2976p9958n1550J2885j05303q9319q8
1810A20641l6884k9270M7619O3461n9361n2555k3517L0559m2094l3767K1451P272
$$ plain form
1895 104153 176708 205871 116515 149487 154269 117078 114953 128843 230630 187333 200691 77522
1883 77522 73440 75754 65490 85229 123713 122323 63928 51405 36610 83117 153936 80068
1871 80068 61711 160147 133269 144396 100992 133677 117066 87391 36586 17545 23100 66542
1859 66542 65668 62179 71124 29800 48583 -20255 60227 93823 79027 58949 110619 102713 77954
1846 77954 53319 77967 67931 19850 74303 61614 53642 27425 42988 48432 130928 85303
1834 85303 38168 42915 64800 23707 92393 96767 43799 127809 190927 200414 340188 362540
1822 362540 414762 448217 441446 458062 486950 433974 354016 302466 315351 210048 120729 120641
1810 120641 83757 54487 102106 165567 106206 53651 30134 60693 18599 -15168 6283 13555
1798A3555m887p0550J7103m8828q901O9200k7564J2011N2572p88k8060P625R034
1785h478J3875J1552R162j9281j7619M5642n8732N9604j1026p0768M0831Q26j4732
1772a9144N8593N3679j07150k9364j4190k1184M7693K1978m3439q156M2062K9168
1760A0546k9275o9753L9024P5700n2615M330Q2522o9313r1818O97K4083O1068
1748a4804O4042k3100l6153L4269K2094K0196p3324l2440J2901l0384k6134q7761
1736a70598N2203O1458O31O2479K8566p3596n630O9241r9537K8695o433k4645
1724g7166J5958O733L3218j4999M711M1041n8220L7211P046j30476j0782O6674
1712g9051J085L2029l5862p9286M3346P4506K5914j9315l3433K3330o8481N4503
$$ plain form
1798 13555 8668 -61882 -44779 -93607 -102508 -33308 -60872 -48861 3711 2923 -25137 -17512 -8478
1785 -8478 5397 16949 26111 6830 -10789 34853 -23879 35725 24699 -46069 -5238 -4412 -19144
1772 -19144 39449 93128 -14022 -43386 -57576 -78760 -31067 -9089 -52528 -60684 -18622 10546
1760 10546 -18729 -88482 -49458 26242 -26373 -22043 60479 -8834 -100652 -99955 -75872 -14804
1748 -14804 49238 26138 -10015 24254 46348 66544 -6780 -39220 -26319 -56703 -82837 -170598
1736 -170598 -118395 -56937 -56306 6173 34739 -38857 -44487 24754 -74783 -46088 -52521 -77166
1724 -77166 -61208 -54475 -21257 -36256 -31545 9496 -48724 -11513 -4467 -134943 -145725 -79051
1712 -79051 -77966 -45937 -81799 -161085 -117739 -43233 -17319 -36634 -70067 -46737 -115218 -60715
1700f0715L8343n063k2718M625j0247L3298L3362L5533o1879j0854M785O0926
1688C9396j6631o7459M8272q2126k6992Q1492M7061P941j07523L409K7856m8127
1676i3431Q8314p7752n3929q091L7158J5968J03081j21633m9662O0519L2725O8324
1664A591m1459M884K6376m9723j0127L210M8024q160N4924k08m2215k0079j5591
1651d8553l8196O7664P2846o9372j9093L5128j3758r047r321K6740p313L4385
1639B2110p8376k0569q347M2904l278N4985L9217r875m5272o2823J7582M9942
1627a800J3555n3073Q858P880N2208l3264r3459j5739J37177n908J5244q793m1125
1614a8239m571M0963n3309J2226p6978J27443J982j20665j6762J0475R4869j4116
$$ plain form
1700 -60715 -22372 -27435 -50153 -45528 -55775 -22477 10885 46418 -15461 -26315 -21530 39396
1688 39396 22765 -44694 3578 -78548 -105540 -24048 23013 30954 -76569 -73160 -45304 -93431
1676 -93431 -5117 -82869 -136798 -144889 -107731 -91763 11318 -110315 -159977 -99458 -66733 1591
1664 1591 -39868 -34984 -8608 -58331 -68458 -65248 -17224 -25384 29540 29332 -12883 -32962 -48553
1651 -48553 -86749 -19085 53761 -15611 -34704 424 -13334 -22381 -31702 -4962 -12275 22110
1639 22110 -56266 -76835 -85182 -42278 -45556 9429 48646 38771 -6501 -69324 -51742 -1800
1627 -1800 11755 -41318 -32460 -24580 27628 -5636 -99095 -114834 22343 16435 31679 22886 -18239
1614 -18239 -22810 18153 -35156 -22930 -99908 27535 29517 -91148 -107910 -97435 -2566 -16682
1602a6682j8679n85K506l0944q210R8160m5743r1005L3775o508p127Q2888N828
1589b326L7192J1341m0052j9o042m9428L1566k2511Q690k9750q404r054J7171
1576f1626N6791n8023M1156r806K2411J636p1815l4346L3484j966j9275P7403
1564b3976P4647q7895k8692j985m777M5042P82M4073l1220l2209J1096m633l6869
1551g6616K0962k2731j7642l6196J36084M6095j03052O2461m673r0448K5403N1866
1539h487J7123M2962p5355o5837J1137N5765J0085k9264M3571Q7000k8068j03711
1527d3079n5766L3725N0939J4956j4931L0900j3778l8187m0700L0809L6191N30
1515h391l7692J3408j8600P4209k7975o3676j117N5490r900p114O190J7484q9177
$$ plain form
1602 -16682 -35361 -35946 -33440 -64384 -72594 25566 -20177 -111182 -77407 -83915 -91042 -8154 -2326
1589 -2326 34866 46207 6155 6136 94 -49334 -17768 -40279 -31589 -61339 -69743 -78797 -61626
1576 -61626 -4835 -62858 -21702 -31508 -9097 -7461 -79276 -113622 -80138 -82104 -101379 -23976
1564 -23976 50671 -37224 -65916 -67901 -72678 -27636 -26854 17219 -14001 -46210 -35114 -39747 -76616
1551 -76616 -55654 -78385 -96027 -132223 3861 49956 -53096 9365 4692 -85756 -60353 -8487
1539 -8487 8636 51598 -23757 -89594 -78457 -22692 -12607 -41871 1700 88700 60632 -43079
1527 -43079 -98845 -65120 -14181 775 -14156 16744 2966 -35221 -75921 -45112 -8921 -8391
1515 -8391 -46083 -32675 -51275 22934 -5041 -68717 -69834 -14344 -24244 -31358 -25168 -7684 -96861
1502i6861K8832p7918L8947Q742O4898R942j3452K3493n2868O8763j7384j316
1490a6182N8841m215q5133J5777K075q725m0842j6185j4630J04109k3010L398
1478b4722m1718J2694J12959r066k5881K5779o4167m7107j7327k032J6973O0971
1466b644j4495o8293L058l2223L1849P5204o8200n9058L6515P8379J0098o2090
1454g1900K8176N2370n21l3325o7751o5798K3093Q1891J6066J1485L1246r2055
1442h7023k7672q0479l293J10650K6194j3785j7382n1251O3065P8099O8517k1002
1430D4638l8576p9423j02416N7960N4623L0831n4473J6492L8384k0477j05450
1419a57887r747J01275M6733K2129j412l8846L3889l4783k1375J06498K6079k00663
$$ plain form
1502 -96861 -68029 -145947 -107000 -98258 -33360 -23418 -36870 -13377 -66245 2518 -14866 -16182
1490 -16182 42659 38444 -46689 -30912 -28837 -37562 -78404 -94589 -109219 -5110 -28120 -24722
1478 -24722 -66440 -53746 59213 50147 24266 50045 -14122 -61229 -78556 -80588 -63615 -2644
1466 -2644 -17139 -85432 -82374 -114597 -82748 -7544 -75744 -134802 -98287 -19908 -9810 -71900
1454 -71900 -43724 8646 8125 -25200 -92951 -158749 -135656 -53765 -37699 -26214 5032 -87023
1442 -87023 -114695 -195174 -198467 -87817 -61623 -75408 -92790 -144041 -80976 -2877 65640 44638
1430 44638 6062 -73361 -175777 -117817 -63194 -32363 -86836 -70344 -31960 -52437 -157887
1419 -157887 -167634 -66359 -19626 2503 1091 -37755 -3866 -38649 -60024 46474 72553 -128110
1407a28110q688L0796j4551J06603o4732J1180N0603k1632o6258N317O7001P274
1395b5197j6948n4066R3449J3742M6674l8742J9766k173m2456r0177K7107O8724
1383b97k9484m9004R2857Q5733j5218n0542l4289k1295J0858n1362M890J4149
1371d3004N1190l0815p8531K6221m1737N3724J0800n9982k1897M5166L4299j9139
1359g3705j4491K4175K062r883N1816l0007Q4465M6735m9804n8232L807J2938
1347a0124l7889L025j4306N3488m0717K9421o112M6795m672Q429n3879j743o6087
1334i4371l7400O9127R7975k7701k8097M0980k754l5193l4372j5973O1765j4194
1322b0208j30360Q2306J1844n2071K6488O909P1683j0610k1186o1290J25774m834
$$ plain form
1407 -128110 -136798 -106002 -120553 -13950 -78682 -67502 -16899 -38531 -104789 -99472 -32471 -25197
1395 -25197 -42145 -96211 -2762 10980 57654 18912 38678 36505 -5951 -96128 -69021 -297
1383 -297 -29781 -78785 14072 99805 84587 34045 -244 -21539 -10681 -62043 -57153 -43004
1371 -43004 8186 -22629 -101160 -74939 -116676 -62952 -52152 -112134 -134031 -88865 -54566 -73705
1359 -73705 -88196 -64021 -61959 -71842 -20026 -50033 34432 81167 31363 -26869 -23062 -10124
1347 -10124 -48013 -44988 -59294 -5806 -46523 -17102 -23214 23581 18909 27338 -26541 -28284 -94371
1334 -94371 -131771 -62644 35331 7630 -20467 20513 17759 -17434 -51806 -67779 -6014 -20208
1322 -20208 -150568 -68262 -56418 -108489 -82001 -75092 -3409 -14019 -35205 -96495 29279 24445
1310B4445l9331o2905p2111l7121O4495J20032O707m7626j0363p652J4238k4656
1298g1848n3077Q4173N8342l5409l986m1485L4269j6911L2329J8135p4632P612
1286f2488J2638k5814L4343K1265M9112q6018m0963R6602k382M6309R41m5105
1274a560p909L2960l0501l9462k6481o7288M0289L7740J99L6807q02M7776k4104
1261b336n5153J0540J03297j4360j3225o6759M5950o1991l0593J8552K5733m3372
1249h3717J04282r3195j6559J01550n2478J8974q888q622M5828J5270j1686Q4958
1237I5717j9847n0682l0852m4522O5745k9012j7479L0754n0321K4760M3149m1834
1225b4424K6501O405P010j4142k6060K6609j8870L0387o1334k0640O2104k5992
$$ plain form
1310 24445 -14886 -77791 -149902 -187023 -122528 -2496 4211 -43415 -53778 -61430 -47192 -71848
1298 -71848 -124925 -40752 17590 -17819 -21805 -63290 -29021 -45932 -13603 4532 -70100 -62488
1286 -62488 -49850 -75664 -41321 -20056 29056 -56962 -97925 -1323 -3705 42604 43545 -1560
1274 -1560 -9469 23491 -7010 -46472 -72953 -140241 -99952 -62212 -62013 -25206 -26008 21768 -2336
1261 -2336 -57489 -46949 56348 41988 28763 -37996 7954 -54037 -84630 -66078 -40345 -83717
1249 -83717 20565 -72630 -89189 12361 -40117 -21143 -30031 -38653 7175 22445 10759 95717
1237 95717 75870 25188 -5664 -50186 15559 -13453 -30932 -178 -50499 -25739 17410 -24424
1225 -24424 2077 8482 15492 1350 -24710 1899 -16971 13416 -47918 -68558 -6454 -32446
1213c2446k4018m290P655q516K4033m5573o316M715P002M7257j6788k9215J6065
1200f0435j6721M873q54N9433M8538m6254L5401o5347m0978n3209J9264O5435
1188e0854p757p795L084K3390M9245k7125N7805J3715j30517K8509L8200q792
1176a8892K3221n5017O6388J6697K6960m5936q2829P593J5426n3411l0299K9395
1164a00704K6475J7076o4595R1523K4615n9552n7058j2364R3198M507R684l9707
1152f6902P5506K2185l5153N7062n6625l2367N2946n66j8502p913J2751o147l0788
1139c4513l3001O515L6657q0328p7278n330L1449N1691M409n9520K3640J02360
1127c3249L509j4493K7970m4828M4882L0380L2l5531n6418K1835L5586M3946j5031
$$ plain form
1213 -32446 -56464 -60754 -53099 -61615 -37582 -83155 -89471 -84756 -77754 -30497 -47285 -76500 -60435
1200 -60435 -77156 -72283 -73137 -13704 34834 -11420 23981 -41366 -82344 -135553 -116289 -50854
1188 -50854 -58611 -66406 -63322 -39932 9313 -17812 39993 53708 -76809 -48300 -10100 -18892
1176 -18892 4329 -50688 15700 32397 59357 13421 -69408 -61815 -46389 -99800 -130099 -100704
1164 -100704 -74229 -57153 -121748 -30225 -5610 -65162 -122220 -134584 -41386 -36879 -27195 -66902
1152 -66902 8604 30789 -4364 52698 -3927 -36294 16652 16086 -2416 -10329 2422 -3725 -34513
1139 -34513 -67514 -60999 -24342 -104670 -181948 -187278 -155829 -104138 -99729 -159249 -135609 -33249
1127 -33249 -29740 -44233 -16263 -61091 -16209 14171 14203 -21328 -77746 -55911 -20325 23621 8590
1114H590j4372l830O2024J6146l6628j28932Q0153J9476j01401P2510m0015m1868
1102a08147K3870P4170j8312J0738M394L932n0851o8282Q3782J56018O39o5016
1090D6935m2982n6064K055O2939m3020K7397j4732O2882m8060n0891k3415q374
1078h5330L1593J2527j0247Q29K3842q483J957k9312J9829K8908m2502o405n8396
1065a21190r4822J07127M7372k1277R558J2978p754K2960M64k2874l608R7526
1053B6460L7703m4802j10717O5492Q038J1093O9703j800j9380N7218k5717n7539
1041A5752k3276L6638o5801p1895J00236P8689j17588m4486N638J6156N4395k5507
1029d1049l5526m1l0715O1311l2310l734P0629L2226l7447l9257L8236J6561j5718
$$ plain form
1114 8590 -5782 -9612 52412 68558 31930 -97002 -16849 2627 -98774 -26264 -66279 -108147
1102 -108147 -84277 -10107 -28419 -17681 -13287 -9355 -60206 -128488 -44706 111312 111951 46935
1090 46935 3953 -52111 -50056 12883 -30137 -2740 -17472 45410 -2650 -53541 -76956 -85330
1078 -85330 -53737 -41210 -51457 -50628 -26786 -35269 -33312 -62624 -42795 -13887 -56389 -62794 -121190
1065 -121190 -216012 -108885 -61513 -82790 -73232 -60254 -68008 -45048 -44584 -67458 -71066 26460
1053 26460 64163 19361 -91356 -25864 -17826 -6733 62970 61170 41790 99008 73291 15752
1041 15752 -7524 29114 -36687 -108582 -8346 70343 -47245 -91731 -86093 -69937 -15542 -41049
1029 -41049 -76575 -76616 -107331 -46020 -78330 -82064 -11435 20791 -16656 -55913 -17677 -1116 -16834
1016a6834j9354k3283P557L1785K3743L0377J1431r789n0107J8908m886m4352
1004d4804K4602k5634k3896L5519M358j3790P5850K79q0095J7606K5775J1951
992G721k4189J9724L3603j2818P175K7072j1670J7791M097n4044l1219N3399n939
979C0703j3634j25028M344L6026j045K035J6882j8649K0972J1197q491j8657J07963
966D4618mM2133K1152o7555k9584L2508K9521o5895o7761M8602R1924l7975m1680
953Dj6826j9025J7794n0406M5506l015n097k7125p9473K4940Q9382N0104J8372
940D5135m3475l2304J3727M3608N795p7448p7778j1174P4373n5558Q4955N0507
928B0363k5608J7940l0942k4100k222l0528L8843N1743l418l775L7349n8942J505
$$ plain form
1016 -16834 -36188 -59471 -51914 -20129 3614 33991 45422 35633 -14474 4434 -452 -44804
1004 -44804 -20202 -45836 -69732 -34213 -29855 -43645 32205 32484 -47611 -30005 -4230 7721
992 7721 -16468 3256 36859 24041 31216 58288 46618 64409 68506 14462 -16757 36642 30703
979 30703 17069 -107959 -103615 -67589 -68634 -66599 -49717 -68366 -47394 -36197 -44688 -63345 44618
966 44618 44614 86747 107899 40344 10760 43268 72789 6894 -60867 -12265 79659 41684 4
953 4 -16822 -35847 -18053 -68459 -22953 -25968 -31065 -58190 -137663 -112723 -23341 26763 45135
940 45135 1660 -30644 -16917 26691 32486 -44962 -122740 -133914 -59541 -115099 -30144 20363
928 20363 -5245 12695 -18247 -42347 -44569 -75097 -36254 15489 12071 8296 45645 -13297 -11792
915a1792K0273L4236q449J379K6037p5309M1722K7951k1498o8339P026N9112J4302
902D6651m1616j64k0218m6752J1534j621J5333l1523K434O5277k4828j943J419
889b6017l8690N1869Q1063R9233j7178o6129p4273p541k2926l1410K0503l27P8383
876D6560p3739M8407K6006o5655R1163o476j0778J2082j5132K8734Q5135j06272
864F0035M9692r2152o6964Q706J963M7801L7847n7164j399k5998R235O978J1969
851i451n1277O8192l497k2842L0599M2519K2379p6454p2001L8749L9604n2029
839d5509J23414k5509m6922J0961L0553l9255M9050o8676j2289M2854l8551L3551
827A3672O232O038k0677P521N9906q4271J24348P957p4789o7193j2168O9190k7471
$$ plain form
915 -11792 8481 42717 34268 35647 61684 -13625 28097 56048 34550 -33789 -26763 32349 46651
902 46651 5035 4871 -15347 -62099 -50565 -52186 -36853 -68376 -65942 -665 -25493 -27436 -26017
889 -26017 -64707 -12838 68225 167458 150280 84151 9878 2337 -20589 -51999 -31496 -31823 46560
876 46560 -27179 21228 47234 -18421 72742 66266 55488 67570 52438 81172 166307 60035
864 60035 109727 17575 -49389 -40683 -38720 9081 46928 -10236 -11635 -37633 -28398 -21420 -9451
851 -9451 -60728 7464 3967 -18875 11724 54243 76622 168 -71833 -33084 6520 -45509
839 -45509 77905 52396 5474 16435 46988 7733 56783 -11893 -24182 18672 -19879 13672
827 13672 19904 25942 5265 12786 72692 -11579 112769 120726 45937 -21256 -33424 35766 8295
814H295q650M2691j8332M6208j0134n7991l0186n084L7134J447K7008j1699K9676
801E0383r286k3427k479K127J1233n4746j1696K5854k5639M2594O9417m7584o2338
788c5587J7820O7575k1174p11j5674n744J0312n0727M9992n4005q979P2042l0099
775d959J1184r3003j2507J00422k6753l5108o3368Q3988j5372k3599Q0243n9888
763e8720Q511j4065L5637J31n0849K2519L7014M4311l4638N7757N024j5002m0354
750b724r734L7354k4011K8869j9780K9965P858n1529q598k6395K2259J0771N698
737Cm6483Q888o685L3593M0296o9083n146l9385k3940P494K6220R8030l9348O512
723i034L5471K2794j4983Q954N6741L7735q5359q0536O3962J731M5264K6188o4420
$$ plain form
814 8295 -355 42336 24004 70212 60078 2087 -28099 -33183 3951 5398 32406 20707 50383
801 50383 41097 17670 15191 17318 28551 -26195 -37891 -12037 -37676 4918 74335 26751 -35587
788 -35587 -17767 49808 28634 27923 12249 6505 16817 -33910 16082 -37923 -46902 25140 -4959
775 -4959 6225 -86778 -99285 1137 -25616 -60724 -124092 -40104 -55476 -79075 1168 -58720
763 -58720 -50209 -64274 -28637 -28506 -79355 -56836 -19822 24489 -10149 47608 52632 37630 -2724
750 -2724 -12458 24896 885 29754 9974 39939 47797 -3732 -12330 -38725 -16466 -5695 3
737 3 -46480 -37592 -44277 -10684 29612 -39471 -44617 -84002 -107942 -100448 -74228 23802 -15546 -9034
723 -9034 26437 49231 34248 43202 99943 137678 52319 -28217 35745 37476 82740 108928 44508
710D4508r375K8515J7961l0932n2685k0351K2950O0195o0530K2569j3229m1784
698c2188N8072R9780q8293j4192l2181M5866Q7297r0865r901Q4262l2804m1898
686C2955k8396O6872O0978M264j2326k5444j0311k2983q5089Q1899J2254J2660
674H7333j7419m6976L1970q684m5438l932J8309j33938R3111M6650p9416j1028
662f9458O4058J4173m5862L650O4555L335j2428l7463j1128L9974L4268n3550
650e876j5126J237J9782j7285l0456M7338K0558O7494q4430k3684O2354Q54k6732
637A6028m7880P2311k5845n5434J9000J5491o012K0820q259Q8092K7745l7863
625G8194m8875J892J00134l0995o8829Q258J6502J8750k9853m440N798p419l3420
$$ plain form
710 44508 35133 63648 81609 50677 -2008 -22359 591 60786 256 22825 9596 -32188
698 -32188 25884 125664 37371 23179 -9002 36864 124161 33296 23395 107657 74853 32955
686 32955 4559 71431 132409 136673 124347 98903 88592 65609 -19480 62419 74673 87333
674 87333 69914 22938 54908 46224 786 -3146 15163 -118775 -25664 20986 -58430 -69458
662 -69458 -5400 8773 -37089 -33439 31116 34451 22023 -15440 -26568 13406 47674 -5876
650 -5876 -21002 -19765 17 -17268 -47724 -386 20172 87666 3236 -20448 41906 42760 16028
637 16028 -31852 40459 14614 -40820 -21820 -6329 -12341 8479 220 88312 116057 78194
625 78194 29319 31211 131345 100350 31521 39779 56281 75031 45178 40738 46536 39117 5697
612E697M9061O860m7516K2997m3767P358J9032k268M0055j1021k8145k6185j6953
599b4795k8689K1970l590J18795o2899n8243P8947K5581l0840K2454O5339j9795
587A04235j9861n0983K9619l4418N5339p1934O582K6074J7187J1273l4061q4121
575d5069k9326L0874K5364M5466m0023q376K3571K2514R4025M1600j03379l1441
563B5800m5374M1161K8682J3309j2219K2508N001j26074k8982M9305j5533K0427
551b1989L8706m748R048M1691p3282J0539j3092r496K3503P6463j002k2057l7333
538A6951N4405K6534l7586k6418J8229m5333o9587O5670J02257j6593j2357N7382
526A33554j04078m7996l1784M805J05488M8685j46518M4964O1228n853L9603j1541
$$ plain form
612 5697 54758 61618 14102 37099 -6668 690 19722 17454 57509 46488 18343 -7842 -24795
599 -24795 -53484 -31514 -35104 83691 20792 -37451 41496 67077 36237 58691 124030 104235
587 104235 84374 33391 63010 28592 83931 11997 18579 44653 61840 73113 39052 -45069
575 -45069 -74395 -43521 -18157 27309 -12714 -21090 2481 24995 119020 160620 57241 25800
563 25800 -19574 21587 50269 63578 51359 73867 78868 -47206 -76188 -26883 -42416 -21989
551 -21989 16717 11969 21017 62708 -10574 -35 -13127 -22623 880 77343 76341 54284 16951
538 16951 71356 97890 60304 33886 52115 6782 -62805 2865 105122 88529 76172 133554
526 133554 29476 -18520 -50304 -45499 59989 108674 -37844 7120 68348 62495 102098 90557
514I0557j20912L6980J04802o4295n4839L9288K9853M6178K2127q0386q1429J16463
502H4387J2681l8870n1201q140j9075k2705k4453R9802N0709J5731q3520k5288
490i942M2694q511K3968m2763Q744K7562l4868l5208m180N7321l5082j1064k9713
477e1042R1302k2991L7954k471p0081m3074L2110L5312m0404j7619M5258L8508
465C2762J6910R400q0579L1382M9503J3633n80j4535N8333j3j1936J3924m078
452A14126K1666m1210L6896q3498l3269k365P1453J3467k500l7034J6719m0239
440C4212K5330q2223Q6966q841n2296P5843k2911l6393l6404M6775J4377k3757
428B0678O0855l1134o8935q941J3199L5360n868M5512J7646j10425M9500M1592
$$ plain form
514 90557 -30355 6625 111427 47132 -7707 31581 61434 107612 129739 49353 -32076 84387
502 84387 97068 58198 6997 -1143 -20218 -42923 -67376 32426 83135 98866 15346 -9942
490 -9942 32752 24241 48209 5446 14190 41752 6884 -28324 -32504 24817 -10265 -21329 -51042
477 -51042 40260 17269 55223 52752 -17329 -60403 -28293 7019 -33385 -51004 -5746 32762
465 32762 49672 59072 -21507 9875 59378 73011 72431 57896 116229 116216 104280 118204 114126
452 114126 135792 94582 131478 47980 14711 12346 83799 97266 94766 57732 74451 34212
440 34212 59542 -22681 64285 55444 3148 78991 56080 19687 -16717 30058 44435 20678
428 20678 81533 50399 -18536 -27477 -14278 21082 15214 60726 78372 -32053 17447 59039
416E9039j07428j5379R5946k3188R292k5720L6419K5444p4669N8998L9124m2211
404C5667m5318M0973r729L1698M7777l0260m1885P3087k5049R066N4971K7973
392A68971o7399j7891J3818r099k4222K0315l8629k6890K1228J1859M1806j16066
380b2199J6498J8878L9264P347m9451l4579M0564L4983P2386n0313m6087L1815
368E9106J4268m3987P0226k939q1244n0500Q9312M8000m5666N372o6719Q1216
356G6445o2303j3473P5472N3638M6156R293l1633r2662o3561l7741L3172L1239
344B4042L2594N5635N3514J016o1665K9734p1734o6798O1943j5057m455r220R947
331C9496J6642K347L6791L7806L7745p3803l4235n1285j2974l4599Q4498m0014
$$ plain form
416 59039 -48389 -63768 32178 8990 18282 -7438 28981 54425 -20244 38754 77878 35667
404 35667 -9651 31322 21593 53291 101068 70808 28923 102010 76961 86027 140998 168971
392 168971 101572 83681 97499 88400 64178 84493 45864 18974 40202 52061 93867 -22199
380 -22199 -5701 13177 52441 59788 10337 -24242 16322 51305 123691 73378 27291 59106
368 59106 73374 29387 99613 96674 15430 -35070 54242 102242 56576 61948 -4771 76445
356 76445 14142 669 76141 129779 175935 185228 153595 60933 -2628 -40369 -7197 24042
344 24042 56636 112271 165785 166801 105136 134870 63136 -3662 58281 43224 38769 29549 39496
331 39496 56138 58485 95276 133082 170827 97024 62789 11504 -1470 -36069 48429 8415
319H415k2495N0895N4101Q6893o690k2153n5690p5390l792K6629k9792l9159M0327
306A2099R7293K7219J2777O568j02821l2257L6637J6169n463k2053K8162J933
294G6263L5022k1364l7743N1839m9828O408P1475q3002L4853N282l3016k3216
282C2973J118P276k1003M2545J5193Q658q9774N1307n5875k8909J9477O540Q7812
269G7338M5084p7887N533l5681K7295k0549m8233J22078M5333j23676J3479L959
257C4073o8515J25736O5774j1790q1394K6533M1725n2734J700q4088N5113Q5792
245A37925p4171P043J9692O7124l2248J5539q3492m3930K1653O8164J9862o3906
233E9255l4731o4741N0299O2163O034K7048k5189l2377m7096K4184l2879M8054
$$ plain form
319 8415 -14080 36815 90916 177809 171119 148966 93276 17886 14094 40723 10931 -28228 12099
306 12099 109392 136611 149388 155956 53135 20878 57515 73684 68221 46168 74330 76263
294 76263 111285 89921 52178 104017 54189 60597 132072 49070 83923 89205 56189 32973
282 32973 34091 41367 20364 62909 78102 86760 -3014 48293 -7582 -36491 -17014 -10474 77338
269 77338 122422 44535 50068 14387 41682 21133 -27100 94978 140311 16635 30114 34073
257 34073 -34442 91294 157068 145278 63884 90417 132142 79408 81108 -2980 52133 137925
245 137925 63754 70797 90489 157613 125365 140904 57412 13482 35135 103299 123161 59255
233 59255 24524 -40217 10082 72245 78279 105327 80138 47761 665 24849 -8030 40024
221D0024R593m8861J10516n3441k0022K063N8238M5504q0615P5942K9563j10255
209E8249M7316j4193k0327O6366j01990k2610M9391Q0754m4269m6320j4651m1656
197c940J1616M5021K342l4754R922l3929r653J28550K236M2048K8564p5412q7252
184B5359L1726k0485j3241q766M4895L1326q1319o784Q2615P8172J9269k7766
172A55001n5313N0570r4831l4708K9318k354L3680j5689j7874K4610N682k281
160G5811m6621K7622L4203L4139j6800m6957l8322O6315N3683P938m4046N770
148A12735L7164o6152K8530j1707o5644k9064O3354N9913p8219m3249J2099J2786
136C2546L9678j9505J1788L6856J0760L6207r7717n6764L3017k8242q610J9809
$$ plain form
221 40024 49617 756 111272 57831 37809 39872 98110 143614 62999 138941 168504 58249
209 58249 105565 91372 71045 137411 35421 12811 62202 142956 98687 52367 37716 -3940
197 -3940 7676 52697 55039 20285 30207 -3722 -13375 115175 117411 159459 188023 112611 25359
184 25359 57085 36600 23359 14593 59488 90814 9495 2711 85326 163498 182767 155001
172 155001 99688 150258 55427 20719 50037 47683 81363 65674 47800 72410 78092 75811
160 75811 29190 56812 91015 125154 108354 61397 23075 89390 143073 151011 106965 112735
148 112735 149899 83747 112277 100570 34926 5862 69216 129129 50910 7661 19760 32546
136 32546 72224 52719 64507 101363 112123 148330 50613 -6151 26866 -1376 -9986 9823
124I823O0591O3498q051l4141N427J2386l0650p0668L2389m6238K9316O2405m3163
111D2924k1876J08408j186o6683M0738J5830l8455j4933k113l8864K0989M9080
99I3859l3812N5554P866p9227N1255K6161j5601l9927p169M5030O0854l9945J595
86A26493l3988l2982J727J3405R388l7249M6931K0606K0861P952L81r1374L9152
73I1303K9889p6285k9011j3193J9997j6507L4294m444N0655k3796K6256k5199
61F3959N4329j8147L0640M451o3517m3664J1811N349K7557R238o050N632J9L6170
47A17777l880k3619j7649O810k6256m690L5675J4017k2918l2985n5083O2416P5943
34A25558j4648k1598K2466m4849p377k3060k1363O460J2573K344O0451j813m5289
$$ plain form
124 9823 70414 133912 125861 91720 97147 109533 78883 8215 40604 -5634 23682 86087 42924
111 42924 21048 129456 128270 61587 102325 118155 79700 64767 62654 23790 44779 93859
99 93859 60047 115601 123467 44240 95495 121656 106055 66128 58959 103989 164843 124898 126493
86 126493 92505 59523 61250 74655 84043 46794 93725 114331 135192 143144 143525 52151 91303
73 91303 121192 44907 15896 2703 22700 6193 40487 36043 86698 62902 89158 63959
61 63959 118288 100141 130781 135232 71715 28051 39862 45211 72768 82006 75956 81588 81607 117777
47 117777 113897 90278 72629 79439 53183 48493 84168 98185 75267 42282 -12801 49615 125558
34 125558 110910 89312 111778 66929 59552 36492 15129 21589 34162 36506 96957 95144 49855
21D9855J7395l823P5583m1156k0215J7480p068k5354m000l7428J2011L1660Q211
8G3151N559k2418N0506J1807L1287L8508q6277J3645
0A15768
$$ plain form
21 49855 67250 63427 139010 97854 77639 95119 88051 62697 58697 21269 33280 64940 73151
8 73151 78710 56292 106798 118605 149892 188400 102123 115768
0 115768
$$ Imaginary data points
##PAGE= N=2
##DATA TABLE= (X++(I..I)), XYDATA
16383a811325M4605O6024O1566K6907O4340P039r302L9419p644O3937R058K5282
16371a420094p142l482M1561M1972N5013j8059J435O8044N3710l1545N2936n60
16359a166211l1746L0164r351j1261N5303O5821J5002J5412j8567N6369P3858
16348i25207M5805O853j8957O5048O3807j5196K2177K7110R6321q577m2446L5354
16336f47908M6666j9755N9051K73j1586P8194R9623j0082m3949q489Q4343M02
$$ plain form
16383 -1811325 -1766720 -1700696 -1639130 -1612223 -1547883 -1540844 -1550146 -1510727 -1518371 -1454434 -1445376 -1420094
16371 -1420094 -1427236 -1430718 -1389157 -1347185 -1292172 -1310231 -1308796 -1240752 -1187042 -1218587 -1165651 -1166211
16359 -1166211 -1197957 -1167793 -1177144 -1188405 -1133102 -1067281 -1052279 -1036867 -1055434 -999065 -925207
16348 -925207 -879402 -872549 -891506 -826458 -762651 -777847 -755670 -728560 -632239 -640816 -683262 -647908
16336 -647908 -601242 -620997 -561946 -561673 -573259 -495065 -395442 -405524 -449473 -457962 -373619 -373217
$$ [...]
##END NTUPLES=NMR SPECTRUM
##END=
