##TITLE=1H_47-2021
 DMSO-d6, 8 sc, 
 30.06.2021
##JCAMPDX= 6.0         $$ Bruker NMR JCAMP-DX V2.0
##DATA TYPE= NMR FID
##DATA CLASS= NTUPLES
##ORIGIN= UXNMR, Bruker Analytische Messtechnik GmbH
##OWNER= root
$$ XWIN-NMR		Version 3.5
$$ Wed Jun 30 09:05:09 2021 Russian Standard Time (UT+4h)  she@DPX200
##.OBSERVE FREQUENCY= 200.131506
##.OBSERVE NUCLEUS= ^1H
##.DELAY= (6, 6)
##.ACQUISITION MODE= SIMULTANEOUS
##.ACQUISITION SCHEME= undefined
##.AVERAGES= 8
##.DIGITISER RES= 18
##SPECTROMETER/DATA SYSTEM= spect
##.PULSE SEQUENCE= zg30
##.SOLVENT NAME= DMSO
##.SHIFT REFERENCE= (INTERNAL, DMSO, 0, 15.7039)
##AUDIT TRAIL= $$ (NUMBER, WHEN, WHO, WHERE, WHAT)
$$ ##TITLE= Audit trail, XWIN-NMR		Version 3.5
$$ ##JCAMPDX= 5.01
$$ ##ORIGIN= Bruker BioSpin GmbH
$$ ##OWNER= she
$$ F:/spectra/data/she/nmr/H-F/1/audita.txt
$$ ##AUDIT TRAIL=  $$ (NUMBER, WHEN, WHO, WHERE, WHAT)
(   1,<2021-06-30 09:04:01.62 +0400>,<she>,<DPX200>,
      <created by zg, POWCHK disabled, PULCHK disabled
       configuration hash MD5:
       00 E9 B6 7A A2 85 ED C7 34 08 36 98 17 FE 4E 26
       data hash MD5: 16K
       04 3C B7 DC 73 82 9D 4B 74 9C 2D FC 08 7A 59 1B>)
$$ ##END=
$$ 
$$ hash MD5
$$ F0 AE EA 88 CF 22 10 A9 ED 25 AF BF 3C CF FE 74
##$RELAX= 
##$RELAX= 
##$RELAX= 
##$RELAX= 
##$RELAX= 
##$RELAX= 
$$ Bruker specific parameters
$$ --------------------------
##$DU= <F:/spectra>
##$EXPNO= 1
##$NAME= <H-F>
##$PROCNO= 1
##$TYPE= <nmr>
##$USER= <she>
##$AMP= (0..31)
100 100 100 100 100 100 100 100 100 100 100 100 100 100 100 100 100 100 
100 100 100 100 100 100 100 100 100 100 100 100 100 100 
##$AQSEQ= 0
##$AQ_mod= 1
##$AUNM= <au_zg>
##$AUTOPOS= <>
##$BF1= 200.13
##$BF2= 200.13
##$BF3= 200.13
##$BF4= 200.13
##$BF5= 200.13
##$BF6= 200.13
##$BF7= 200.13
##$BF8= 200.13
##$BYTORDA= 1
##$CFDGTYP= 0
##$CFRGTYP= 5
##$CHEMSTR= <none>
##$CNST= (0..31)
1 1 145 1 1 1 1 1 1 1 1 1 1 1 1 1 1 1 1 1 1 1 1 1 1 1 1 1 1 1 1 1 
##$CPDPRG= <>
##$CPDPRG1= <>
##$CPDPRG2= <>
##$CPDPRG3= <>
##$CPDPRG4= <mlev>
##$CPDPRG5= <mlev>
##$CPDPRG6= <mlev>
##$CPDPRG7= <mlev>
##$CPDPRG8= <mlev>
##$CPDPRGB= <>
##$CPDPRGT= <>
##$D= (0..31)
0 1.2 0 0 0 0 0 0 0 0.06 0 0.03 0 0 0 0 0.0002 0 0 0 0 0 0 0 0 0 0 0 0 
0 0 0 
##$DATE= 1625029441
##$DBL= (0..7)
120 120 120 120 120 120 120 120 
##$DBP= (0..7)
150 150 150 150 150 150 150 150 
##$DBP07= 0
##$DBPNAM0= <>
##$DBPNAM1= <>
##$DBPNAM2= <>
##$DBPNAM3= <>
##$DBPNAM4= <>
##$DBPNAM5= <>
##$DBPNAM6= <>
##$DBPNAM7= <>
##$DBPOAL= (0..7)
0.5 0.5 0.5 0.5 0.5 0.5 0.5 0.5 
##$DBPOFFS= (0..7)
0 0 0 0 0 0 0 0 
##$DE= 6
##$DECBNUC= <off>
##$DECIM= 32
##$DECNUC= <off>
##$DECSTAT= 4
##$DIGMOD= 1
##$DIGTYP= 9
##$DL= (0..7)
0 120 120 120 120 120 120 120 
##$DP= (0..7)
150 150 150 150 150 150 150 150 
##$DP07= 0
##$DPNAME0= <>
##$DPNAME1= <>
##$DPNAME2= <>
##$DPNAME3= <>
##$DPNAME4= <>
##$DPNAME5= <>
##$DPNAME6= <>
##$DPNAME7= <>
##$DPOAL= (0..7)
0.5 0.5 0.5 0.5 0.5 0.5 0.5 0.5 
##$DPOFFS= (0..7)
0 0 0 0 0 0 0 0 
##$DQDMODE= 0
##$DR= 18
##$DS= 0
##$DSLIST= <SSSSSSSSSSSSSSS>
$$ [...]
##$SUBNAM2= <"">
##$SUBNAM3= <"">
##$SUBNAM4= <"">
##$SUBNAM5= <"">
##$SUBNAM6= <"">
##$SUBNAM7= <"">
##$SUBNAM8= <"">
##$SUBNAM9= <"">
##$SW= 20.0188882624521
##$SWIBOX= (0..15)
0 0 2 0 0 0 0 0 0 0 0 0 0 0 0 0 
##$SW_h= 4006.41025641026
##$TD= 16384
##$TD0= 1
##$TE= 0
##$TE2= 300
##$TE3= 300
##$TEG= 300
##$TL= (0..7)
0 120 120 120 120 120 120 120 
##$TP= (0..7)
150 150 150 150 150 150 150 150 
##$TP07= 0
##$TPNAME0= <>
##$TPNAME1= <>
##$TPNAME2= <>
##$TPNAME3= <>
##$TPNAME4= <>
##$TPNAME5= <>
##$TPNAME6= <>
##$TPNAME7= <>
##$TPOAL= (0..7)
0.5 0.5 0.5 0.5 0.5 0.5 0.5 0.5 
##$TPOFFS= (0..7)
0 0 0 0 0 0 0 0 
##$TUNHIN= 0
##$TUNHOUT= 0
##$TUNXOUT= 0
##$USERA1= <user>
##$USERA2= <user>
##$USERA3= <user>
##$USERA4= <user>
##$USERA5= <user>
##$V9= 5
##$VALIST= <valist>
##$VCLIST= <CCCCCCCCCCCCCCC>
##$VD= 0
##$VDLIST= <DDDDDDDDDDDDDDD>
##$VPLIST= <PPPPPPPPPPPPPPP>
##$VTLIST= <TTTTTTTTTTTTTTT>
##$WBST= 1024
##$WBSW= 4
##$XGAIN= (0..3)
0 0 0 0 
##$XL= 0
##$YL= 0
##$YMAX_a= 424151
##$YMIN_a= -485772
##$ZGOPTNS= <>
##$ZL1= 120
##$ZL2= 120
##$ZL3= 120
##$ZL4= 120
##$ABSF1= 10
##$ABSF2= 0
##$ABSG= 5
##$ABSL= 3
##$ALPHA= 0
##$AQORDER= 0
##$ASSFAC= 0
##$ASSFACI= 0
##$ASSFACX= 0
##$ASSWID= 0
##$AUNMP= <proc_1d>
##$AZFE= 0.1
##$AZFW= 0.1
##$BCFW= 1
##$BC_mod= 2
##$BYTORDP= 1
##$COROFFS= 0
##$CY= 11.3945322036743
##$DATMOD= 1
##$DC= 2
##$DFILT= <>
##$DTYPP= 0
##$F1P= 15.9154993809931
##$F2P= -4.1035820241983
##$FCOR= 0.5
##$FTSIZE= 0
##$FT_mod= 4
##$GAMMA= 1
##$GB= 0.15
##$INTBC= 1
##$INTSCL= 1
##$ISEN= 128
##$LB= 0.24
##$LEV0= 0
##$LPBIN= 0
##$MAXI= 10000
##$MC2= 0
##$MEAN= 0
##$ME_mod= 0
##$MI= 1.114404
##$NCOEF= 0
##$NC_proc= 0
##$NLEV= 6
##$NOISF1= 3.799351
##$NOISF2= 2.8
##$NSP= 1
##$NTH_PI= 0
##$NZP= 0
##$OFFSET= 15.70392
##$PC= 1
##$PHC0= -11918.85
##$PHC1= 11.60101
##$PH_mod= 1
##$PKNL= yes
##$PPARMOD= 0
##$PSCAL= 0
##$PSIGN= 0
##$REVERSE= no
##$SF= 200.130013532006
##$SI= 16384
##$SIGF1= 3
##$SIGF2= 2
##$SINO= 400
##$SIOLD= 16384
##$SREGLST= <1H.CDCl3>
##$SSB= 0
##$STSI= 0
##$STSR= 0
##$SW_p= 3612.71676300578
##$SYMM= 0
##$S_DEV= 0
##$TDeff= 0
##$TDoff= 0
##$TI= <>
##$TILT= no
##$TM1= 0
##$TM2= 0
##$TOPLEV= 0
##$USERP1= <user>
##$USERP2= <user>
##$USERP3= <user>
##$USERP4= <user>
##$USERP5= <user>
##$WDW= 1
##$XDIM= 8192
##$YMAX_p= 0
##$YMIN_p= 0
$$ End of Bruker specific parameters
$$ ---------------------------------
##NTUPLES= NMR FID
##VAR_NAME=  TIME,          FID/REAL,        FID/IMAG
##SYMBOL=    X,             R,               I
##VAR_TYPE=  INDEPENDENT,   DEPENDENT,       DEPENDENT
##VAR_FORM=  AFFN,          ASDF,            ASDF
##VAR_DIM=   8192,          8192,            8192
##UNITS=     SECONDS,       ARBITRARY UNITS, ARBITRARY UNITS
##FACTOR=    0.0002496,     1,               1
##FIRST=     0,             0,               0
##LAST=      2.0444736,     0,               0
##MIN=       0,             -485772,         0
##MAX=       2.0444736,     424151,          0
$$ Real data points
##PAGE= N=1
##DATA TABLE= (X++(R..R)), XYDATA
0 0 0 0 0 0 0 0 0 0 -8 8 -8 8 -16 16 -24 32 -32 40 -55 64 -74 88 -105 128 -152 176 -202 235 -270 310 -357
31 -357 406 -461 522 -590 665 -747 837 -934 1045 -1163 1293 -1433 1587 -1755 1941 -2141
47 -2141 2364 -2603 2867 -3158 3481 -3836 4231 -4674 5174 -5742 6390 -7149 8036 -9099
61 -9099 10400 -12033 14156 -17035 21184 -27729 39636 -68427 292777 209120 -82973 248411
73 248411 -87979 -95231 257529 206214 -7911 -35273 -343696 -188137 341363 80771 -379998
84 -379998 -20495 16096 -339727 -25265 268982 -77455 -175525 -125935 -168357 124156 195464
95 195464 -254937 -178979 121459 -216948 -280316 196524 20434 -391284 -205707 -93538
105 -93538 -149444 2142 -142319 -311661 -25354 -54362 -306627 49676 231957 -220720
115 -220720 -212544 174043 85567 6489 143320 19415 22414 182602 1357 34664 335355
126 335355 56181 -216875 158695 243620 -69967 23074 141376 -37910 6044 86503 -13221
137 -13221 124664 150358 -147107 -2083 298026 36620 -76572 201185 118128 -56893
147 -56893 100115 124827 39463 97832 -11762 -95951 129595 81383 -185726 -17514 99935
158 99935 -171597 -145068 58155 -65049 -131134 -54739 -119678 -69539 37407 -114980 -128065
169 -128065 80037 -31088 -173239 51887 92181 -110184 -42846 41049 -41163 8013 13357
180 13357 -85967 10292 42333 -124213 -46980 105909 -57767 -128866 46105 20596 -68048
191 -68048 23601 15238 -25827 59819 14015 -32362 111914 84566 -59829 50600 135763 3103
203 3103 5285 98413 30648 1374 51036 1711 11137 62361 -40407 -52030 66400 -2600
215 -2600 -82525 19809 24875 -63526 -20207 17044 -26092 -2378 4253 -46422 8668 41075
227 41075 -48900 -21336 54853 -25052 -51431 27680 3652 -38578 -5973 -14980 -30025 3736
239 3736 -18251 -45659 9644 5175 -55236 -3436 35830 -24839 -13385 30102 3858 8681 31577
252 31577 8735 21388 45458 10661 9539 57122 32813 -5757 35505 43604 1766 18442
264 18442 30655 6137 15338 14021 -3916 15922 17250 -13182 -2574 18875 -4986 -16589 7817
277 7817 1008 -18513 -5831 -7661 -15763 -4820 -18802 -27499 -7266 -16990 -35570 -20761 -14145
290 -14145 -32562 -35124 -20131 -24186 -33094 -25749 -26250 -26495 -19337 -27677 -24480 -10408 -19307 -22692 -8976
305 -8976 -6049 -9278 -8425 -1298 3344 1651 3590 7398 13086 15776 8173 16535 28265 18830 17847
320 17847 27881 28296 25661 24477 28769 31732 25697 25059 27730 28228 26444 19688 22094 26470 17206
335 17206 14538 17380 15658 13363 6430 7048 12158 3687 -1891 1418 1866 -4022 -10848 -5567 -4859 -15700
351 -15700 -14983 -12367 -16823 -17408 -22167 -22855 -17596 -23930 -28096 -22456 -20684 -25295 -27790 -20509 -19416 -24376
367 -24376 -19517 -18465 -17722 -11218 -17374 -14741 -1042 -9019 -12951 1815 2365 -6009 1231 8782 2598
382 2598 3770 12660 6293 8889 18246 6173 9658 25021 9253 6541 24844 15709 5923 18934
396 18934 18068 8435 15403 15479 5127 15995 16736 -3587 11760 21518 -7852 931 22452 -3519
410 -3519 -7234 13644 -30 -9084 6032 -4058 -12864 6304 -5392 -24743 4330 2336 -33011
423 -33011 -7783 7637 -27472 -16703 2340 -20142 -13332 830 -21479 -10167 13785 -18035
435 -18035 -19784 25328 1016 -27240 20113 19166 -18021 12328 19280 -8201 17064 16362 -16249
448 -16249 18106 29877 -22460 -2860 40844 -7792 -20789 30132 7669 -15716 19993 2326
460 2326 -8836 31091 -309 -23724 37672 22448 -35441 14867 39982 -22794 -10171 27710
472 27710 -12710 -10982 12699 -30215 -14195 23506 -42209 -44568 28792 -19705 -65835 4267
484 4267 4120 -49388 -14284 -588 -31309 3236 499 -44013 15764 34531 -50261 -9835 58179
497 58179 -18767 -32593 39596 7094 -20650 20163 -5357 -13820 37427 -9810 -44049 47381
509 47381 28540 -58502 17467 59712 -25024 -3032 48209 4920 19021 42007 -7421 28905
521 28905 74474 -11921 -10941 86915 23940 -41730 46739 42881 -29106 12267 14832 -24803 21244
534 21244 -393 -60730 17491 33358 -73476 -29315 53835 -32459 -55734 27479 -3392 -31558
546 -31558 13272 -21560 -22539 41096 -26249 -62967 44020 14563 -84204 -6280 34367 -55758
558 -55758 -39481 6447 -40022 -21535 -1881 -65394 -15460 41713 -61248 -52800 63937 -1103
570 -1103 -62308 35379 37840 -21909 22947 25392 -3679 52034 27796 -37252 51861 70878 -47649
583 -47649 -1019 82123 -9297 -29005 43979 8303 -7936 30172 -14062 -6583 62250 -6628
595 -6628 -45432 67367 46230 -52453 25436 67900 -15272 5669 39730 -5234 21633 29526
607 29526 -39066 6532 55408 -45686 -50148 48915 -9845 -72950 4564 937 -50332 -9935
619 -9935 -20456 -45781 16477 -11482 -71842 15571 36543 -64228 -23476 51774 -20074 -35734
631 -35734 26052 -6125 -15779 20793 -28032 -22261 44515 -22266 -59741 36672 16999 -62535
643 -62535 -952 30151 -29465 -8341 16580 -17819 15921 28650 -31602 13833 65577 -17643
655 -17643 -16700 67748 20621 -21620 37607 28644 -5286 26708 9929 -13718 35463 13390 -43030
668 -43030 19787 38293 -41783 -14576 37728 -15532 -20710 18330 -9015 -5913 20905 -18621
680 -18621 -11916 39834 -6099 -36274 32114 20389 -38017 4099 21216 -23641 -4232 5445
692 5445 -26691 1665 7986 -40575 -11104 24778 -30641 -33389 22418 -5300 -32193 9561 2622
705 2622 -16694 13003 -876 -16423 25179 10346 -26225 17309 28859 -19867 -1779 27963
717 27963 -5272 -6745 17045 -5309 -3545 18647 -11347 -11275 25754 -3170 -22767 18993 11373
730 11373 -18263 5936 13468 -8706 4567 9784 -9545 7297 14761 -14998 -300 22036 -10954
743 -10954 -11857 17072 -2523 -13676 7146 -2425 -11022 5341 -4511 -15215 6945 1250 -20701
756 -20701 942 9230 -16735 -6082 9740 -8930 -5426 6977 -6402 -2202 9025 -5039 -4283
769 -4283 12328 806 -7877 10913 7858 -6597 7215 8695 -3942 6172 7295 -4326 5688
782 5688 8755 -5239 1271 10048 -2333 -3661 8005 732 -4845 5437 1739 -4203 5409 1853
796 1853 -4187 5827 3237 -4320 3422 4639 -2987 -266 3767 -2877 -2678 1499 -4762 -5457 -64
811 -64 -6804 -8601 -1635 -7580 -10416 -3713 -5629 -9245 -4570 -3585 -6168 -3703 -820 -3617 -1612 2549
827 2549 -935 373 4721 873 1623 4816 1699 1856 3760 1303 671 1991 910 -701 1035 1527
843 1527 -1058 772 2364 -194 1600 4450 1777 4023 6188 4504 5757 6968 6405 6254 6426 6448
859 6448 4763 4672 4323 1695 2132 843 -1979 -1124 -2606 -5195 -3616 -4596 -6506 -5004 -4638 -5473 -4651
876 -4651 -3262 -3489 -3851 -920 -1377 -2944 825 -448 -1877 1119 -456 -1832 -273 -1650 -3557 -2462
892 -2462 -2695 -4617 -4257 -3069 -5457 -5074 -2084 -4979 -3626 364 -2984 -1528 3793 740 865 6061
908 6061 4905 2892 7049 7958 3552 6081 7828 2687 4996 6950 230 2389 5506 -1733 -791 3625
924 3625 -2124 -2630 2197 -970 -2952 2260 233 -2964 4113 2575 -3940 4742 5661 -4155 2727 6647
940 6647 -3440 -237 4178 -3282 -2317 2743 -5521 -6038 2217 -5879 -10676 1321 -3388 -12177 -777
955 -777 -888 -9566 -642 -333 -7924 1917 3052 -7619 1513 8926 -5176 -2502 10994 -361 -4773
970 -4773 8736 878 -4432 7585 -838 -6198 8776 898 -10610 5894 6406 -10465 -85 8917
984 8917 -5576 -1913 7846 -3905 578 10411 -5570 -1151 15173 -2833 -7259 14408 4063
997 4063 -9642 7467 6821 -7169 4403 4183 -9612 4867 6180 -15575 231 12381 -13912
1010 -13912 -8273 12482 -5937 -10182 6955 -2975 -6721 8127 -4163 -9458 13308 1506 -16477
1023 -16477 10927 11450 -15720 2322 13070 -8861 -1013 8664 -8630 1039 10501 -12872 -5881
1036 -5881 16922 -8066 -16401 14510 2852 -16961 6291 5420 -10749 6569 2574 -11893 10910
1049 10910 8845 -16909 5232 19122 -12722 -6480 18711 -3231 -9327 11453 -3496 -6548 12419
1062 12419 -8088 -13411 16789 -1765 -22968 10261 10297 -20130 -1599 12099 -10784 -1574 8704
1075 8704 -10798 3344 15636 -14954 -3287 24946 -7186 -14367 20053 5056 -14255 9477
1087 9477 5585 -9288 8836 1458 -15374 12102 9262 -23366 3165 20269 -17000 -8381 18501
1100 18501 -4697 -7259 11770 -3351 -2620 16580 -5601 -10239 22124 3504 -20441 13886 14162
1113 14162 -18089 1533 11581 -11714 119 5352 -15863 1503 11509 -20500 -8785 19524
1125 19524 -11021 -19572 15093 1613 -16733 7294 2356 -10634 10676 521 -15540 13719
1137 13719 9395 -21513 3234 18283 -15435 -8610 14423 -7047 -8518 9092 -8898 -5705 14494
1150 14494 -10502 -13180 19792 881 -19633 12956 12424 -13228 4936 12984 -6011 6424 11152
1163 11152 -9613 7117 17998 -12988 -2819 22348 -5555 -11589 15403 2037 -10500 7864
1175 7864 623 -7775 10168 363 -13934 11895 9267 -17751 4032 16462 -11671 -4025 12988
1188 12988 -5589 -3742 8454 -7939 -4532 11596 -8847 -12994 12450 -1566 -19177 5469
1200 5469 4646 -15433 -390 3417 -11728 1779 3355 -13112 2420 9916 -12679 -4662 14117
1213 14117 -5667 -9938 10846 341 -8701 7126 -557 -7674 9134 -136 -11457 8634 6599
1226 6599 -12283 2787 11511 -6595 -1316 10149 -2036 172 9824 -2794 74 12949 -1979
1239 -1979 -4631 13207 2261 -7971 7698 5115 -6806 2852 4121 -6358 2375 4104 -8422
1252 -8422 1115 7744 -8034 -3174 9351 -3644 -5454 6825 -340 -4423 4804 -529 -4716 4681
1266 4681 -343 -8085 3235 2152 -10202 -1221 3530 -8510 -3472 2285 -6691 -3372 2491 -5775
1280 -5775 -2984 5005 -2485 -4377 6254 1808 -4336 4826 4526 -2804 3616 3971 -2818 3053 3241
1295 3241 -3917 1145 3646 -3931 -1716 3524 -2344 -3097 3274 -552 -2415 3862 992 -1683 5358
1310 5358 2693 -1374 5163 4655 -671 3054 5020 -362 479 3057 -1360 -1728 1093 -3061 -4037 -152
1326 -152 -3802 -5235 -738 -3184 -4772 -850 -1455 -3233 -191 366 -1606 1173 2646 -579 1388 3577
1342 3577 -605 231 2992 -647 -1030 870 -1444 -2656 -744 -1947 -3488 -1700 -1289 -3109 -1224 30
1358 30 -1695 435 2101 307 2414 3966 2531 4038 4428 3419 3825 4366 3000 2012 3072 1866
1374 1866 -620 644 96 -2268 -1001 -1139 -3235 -2019 -1457 -2707 -1804 -884 -1083 -491 550 588 488
1391 488 2071 1488 899 2495 1269 -193 1578 164 -1299 -376 -1945 -3102 -2721 -3107 -4639 -4120 -3218
1408 -3218 -4334 -4152 -2085 -2914 -2800 -80 -737 -616 1697 1032 1529 3231 2524 2349 3472 2645 1426
1425 1426 2175 2245 140 511 1282 -1595 -581 212 -2336 -1108 563 -1846 -1074 1305 323 128 2574
1442 2574 2468 1488 3800 3885 1909 4378 4667 1064 3750 3595 -340 1251 1897 -1556 -723 89 -2943
1459 -2943 -2682 -743 -3899 -4371 10 -2769 -4518 457 -839 -3594 977 831 -2073 1771 2026 -1350
1475 -1350 1312 2691 -1569 -382 2659 -2093 -2822 1222 -2386 -4247 448 -2896 -4918 201 -2458
1490 -2458 -5207 893 -331 -4739 759 2607 -2720 553 4487 -996 1192 5317 -354 857 5968
1505 5968 -483 -921 5738 88 -2926 3287 1153 -3902 1394 1108 -3814 1223 1472 -4658 1591 3945
1521 3945 -4758 176 5905 -2236 -326 6142 240 -673 5612 601 -1582 5950 891 -4119 5018
1536 5018 2390 -6337 2045 3502 -5759 -590 2616 -5089 -999 2454 -5311 -1796 4520 -4140 -3753
1551 -3753 6222 -768 -5366 5456 1605 -4738 3999 1903 -4645 3890 2202 -6419 2342 4206 -6994
1566 -6994 -1749 5287 -5481 -4683 4193 -3781 -4900 3705 -3512 -4750 5187 -2354 -6857 5806 1953
1581 1953 -7242 3456 5043 -5191 1216 5299 -4343 1083 5812 -5111 -78 7708 -5067 -4080
1595 -4080 8313 -2010 -6298 5444 703 -5640 3538 1373 -5245 4833 2723 -6780 4535 6905
1609 6905 -6480 1221 9005 -3061 -937 7791 -1095 -807 7186 -1452 -2365 8021 -644 -6804 7146
1624 7146 2405 -8808 2894 4027 -7062 698 3437 -6398 1037 4323 -6876 -649 7184 -5265
1638 -5265 -4043 7856 -1328 -6173 5929 51 -5760 4148 -503 -6949 4302 826 -9295 2242
1652 2242 3922 -9633 -2027 5019 -6509 -4211 4232 -4826 -3537 5395 -4038 -3990 7519 -1591 -6123
1667 -6123 7294 2480 -6318 4309 4502 -4695 2797 4445 -4854 2208 5449 -6268 106 7403
1681 7403 -4954 -3315 7866 -1559 -4439 5960 903 -3503 5697 1833 -3844 6324 4024 -5342
1695 -5342 5024 6530 -5116 1544 6959 -3519 -289 5335 -3245 -1366 4794 -3843 -3952 5473
1709 5473 -2335 -6568 4497 441 -7230 2185 2179 -6032 1586 2107 -5430 1379 3471 -5471 -547 5030
1725 5030 -4530 -3310 4873 -2514 -5047 3170 -1709 -5046 2704 -1546 -5752 2971 282 -6322 2128
1740 2128 2694 -5242 230 4238 -2859 -385 4578 -2095 -382 5436 -1688 -1486 5814 -312 -3015
1755 -3015 4808 1425 -3594 2751 1969 -3423 1676 2331 -3261 1278 3745 -3201 629 4882 -1937
1770 -1937 -661 4946 -583 -1115 4147 106 -1724 3340 358 -3084 2662 727 -4210 1073 1829
1785 1829 -4078 -505 1885 -3405 -1084 1781 -3073 -1118 2418 -1717 -1753 2908 -672 -2158 2503
1800 2503 613 -2842 1833 789 -3003 944 965 -2886 334 1096 -3067 -702 1396 -2077 -1491 1847
1816 1847 -1052 -1528 2119 184 -1190 2704 912 -743 2815 1627 -1043 1846 1716 -621 920
1831 920 1326 -1116 25 1618 -1200 -996 1359 -1346 -1499 1546 -514 -1414 1345 -33 -1143 1142
1847 1142 818 -498 1078 1502 -621 210 1707 -742 90 888 -1017 -970 475 -1559 -1418 -41 -1436
1864 -1436 -1943 -36 -707 -1632 -98 -42 -923 566 1033 -715 623 1485 -98 906 1828 360 258
1881 258 1368 458 -239 935 -56 -960 143 -431 -1147 83 -165 -1209 -88 239 -619 330 960 38
1899 38 602 1230 572 683 1418 611 159 1063 297 -170 719 217 -775 -248 -454 -1316 -719 -1091 -1472 -1072
1919 -1072 -838 -1125 -861 15 -756 -662 406 -42 -15 842 230 -127 917 400 -303 603 63 -517 -93 365
1939 365 -1251 -1009 -396 -1212 -1339 -504 -1263 -922 -167 -580 -176 848 159 220 1313 1094 745 1379 1015
1958 1015 549 1383 1075 42 1105 905 -687 426 671 -828 -427 131 -1038 -880 255 -546 -654
1975 -654 526 -5 -361 1104 667 -555 1153 990 -318 1178 1027 -269 513 1003 -500 -243 435
1992 435 -1301 -935 532 -1301 -1811 73 -956 -1741 -62 -930 -1591 362 -138 -1267 747 905 -784
2009 -784 642 1472 -549 340 1641 -473 -150 1268 -912 -1020 1024 -1006 -1316 978 -773 -1733 700
2026 700 203 -1516 295 919 -1481 426 1318 -1403 737 2132 -760 385 2517 -72 -520 1785
2042 1785 249 -640 1902 -24 -1315 1462 196 -1898 972 473 -2508 381 1089 -2085 -78 1540
2058 1540 -1301 -115 1854 -571 -285 2442 -429 -1048 2556 211 -1729 1910 911 -1966 1218 436
2074 436 -2052 857 653 -2408 -24 1454 -2159 -1245 2048 -1738 -1560 2034 -846 -1527 2077 -676
2090 -676 -1873 2056 380 -2259 1832 1072 -2073 809 1757 -1677 -140 1965 -2278 -290 1873 -2173
2106 -2173 -1147 2499 -1563 -1949 2283 -675 -2127 1722 184 -2306 1774 1201 -2136 1589 1674 -2475
2122 -2475 663 2579 -2159 80 2840 -1327 -982 2520 -883 -1380 2419 -675 -2007 2136 -2
2137 -2 -2774 2116 1109 -2834 1151 1489 -2440 637 2097 -2144 388 2252 -1660 -470 3113 -1121
2153 -1121 -1589 3328 -255 -2402 2311 169 -2446 1541 525 -2892 1132 993 -2838 535 1946
2168 1946 -2652 -865 2273 -1927 -1064 2548 -1341 -1442 2567 -590 -1884 2538 141 -2575 1946
2183 1946 888 -2679 1061 1504 -2267 136 1805 -2432 -557 2153 -2306 -1138 2490 -1604 -1524 2494
2199 2494 -547 -1949 1844 190 -1854 1953 841 -2042 1716 1739 -2132 984 2482 -2105 -21
2214 -21 2378 -1497 -686 2029 -1310 -1215 2027 -819 -1639 2094 166 -2378 1823 802 -2220 1200
2230 1200 1298 -1878 664 1778 -1419 510 1768 -1523 -411 2179 -1334 -1377 1913 -796 -1971 1568
2246 1568 -113 -2221 1448 -36 -2190 1023 768 -2200 782 1742 -1845 -96 1824 -1239 -409 1912
2262 1912 -932 -592 1894 -526 -1051 1688 -351 -1473 1465 381 -1601 825 686 -1454 282 1284
2278 1284 -1379 287 1702 -1413 -461 1788 -778 -649 2009 -332 -852 1393 -57 -1139 1104 608
2294 608 -1279 874 844 -1780 597 1264 -1344 20 1152 -1106 -309 1306 -737 -501 1069 -559
2310 -559 -551 1001 -79 -1101 820 439 -1041 787 449 -1161 463 808 -1039 214 823 -1059 -206
2327 -206 1185 -547 -664 1119 -207 -1012 1087 -105 -804 760 149 -790 456 382 -694 523 981
2344 981 -692 170 659 -630 -372 755 -261 -594 842 -184 -622 628 -149 -656 454 280 -452
2361 -452 441 542 -340 -74 412 -598 -122 699 -461 -380 394 -311 -249 700 40 -646 393 79 -48 527
2381 527 200 -190 271 573 -440 247 494 -375 327 575 -552 -442 197 -329 -377 333 -101 -475 326 -17
2401 -17 -634 388 187 -687 137 307 -287 -42 357 -39 305 316 158 95 527 -246 -281 341 23 -352 92
2422 92 239 -174 29 -104 -339 -110 -49 -445 199 386 -74 -87 401 96 56 279 191 -107 158 -96 -321 177
2444 177 -63 -165 134 37 -503 -203 -138 -280 -245 163 -264 -305 214 -153 -262 363 -140 -54 594 148 -2 236
2466 236 250 -167 214 34 -17 120 137 -213 -83 402 -237 -75 225 -63 -47 122 58 135 40 256 -61 272
2488 272 354 -222 235 176 -81 -26 23 -221 374 149 -465 -128 162 -249 4 -178 -448 -300 193 -16 -432
2509 -432 240 -113 -375 357 19 -100 510 186 -366 61 164 -162 177 311 -388 -59 328 -345 -508 380
2529 380 -186 -375 176 -330 -508 214 32 -12 329 207 -228 175 447 -383 103 633 -287 218 677 -395
2549 -395 -144 760 -272 -328 395 -254 -655 490 151 -708 279 180 -757 358 516 -737 286 545 -745
2568 -745 111 782 -550 19 375 -196 -609 803 -311 -396 473 16 -684 633 -7 -784 248 167 -599
2587 -599 391 394 -840 118 523 -445 -274 789 -449 -403 867 -97 -531 817 -219 -873 677 -136 -846
2606 -846 531 399 -635 229 471 -663 47 813 -578 -67 936 -144 -428 864 -178 -311 961
2623 961 -365 -616 692 463 -642 405 557 -984 166 678 -633 25 535 -766 -118 674 -795
2640 -795 -476 844 -443 -561 939 -51 -974 702 -110 -880 565 321 -993 160 559 -1073 -23
2657 -23 768 -718 101 749 -636 -332 896 -428 -533 762 141 -690 754 341 -901 709 212 -1012
2675 -1012 381 822 -1050 160 668 -666 -88 981 -338 -364 1114 -207 -961 896 -61 -575 975
2692 975 388 -678 848 504 -827 390 626 -814 146 760 -874 -161 1023 -635 -613 962 -602
2709 -602 -599 1012 -137 -858 708 212 -562 520 338 -827 395 613 -677 336 754 -856 -102 962
2727 962 -524 -150 585 -341 -439 503 -290 -924 616 -100 -1152 568 220 -1066 105 670 -833 -96
2745 -96 511 -424 -16 883 -568 -389 1014 -334 -360 359 -374 -676 737 77 -1041 433 184 -1019
2763 -1019 30 174 -937 -115 591 -702 -10 883 -552 16 711 -236 -358 972 -98 -814 534
2780 534 166 -965 410 322 -1081 435 407 -613 -20 480 -427 -186 536 -587 18 698 -356 -190
2798 -190 913 -94 -503 472 332 -600 292 300 -592 482 167 -595 132 417 -545 -142 468 -598 -614 388
2818 388 -377 -426 528 -170 -527 543 37 -462 269 321 -755 262 488 -571 167 336 -444 -217 285
2837 285 -351 -372 562 -219 -321 331 -39 -781 269 47 -593 155 146 -474 233 341 -487 137 72 -205 72
2858 72 498 -249 35 496 -18 -123 531 -73 -272 584 68 -408 425 -31 -302 134 374 -256 68 212
2878 212 -354 -57 417 -272 -207 237 32 195 270 -122 -167 271 -65 65 134 28 -239 5 147 -107 -228
2899 -228 394 -560 -187 292 -472 -244 299 -291 -74 240 -457 95 337 293 -218 122 80 -50 -49 -7 28 5
2921 5 305 -25 -24 121 -389 73 110 42 -376 206 245 -167 96 243 14 97 27 -239 97 243 258 -74 50
2944 50 -37 128 76 151 -128 36 -165 -290 235 138 -244 126 -70 -165 107 -42 5 -48 -29 -198 198 -174 -145
2967 -145 -71 106 -77 39 332 -38 -12 473 97 -121 -63 -18 -145 48 -56 -15 20 -35 -277 -86 132 -56
2989 -56 -326 54 53 -168 342 -115 150 47 123 15 40 239 -53 117 258 -110 172 273 -38 -122 114 -104
3011 -104 125 47 -176 -152 295 -219 -225 130 22 -250 179 101 -229 166 7 -157 -179 343 -137 33 -26 -142
3033 -142 8 2 -199 -426 -81 -36 -335 208 -13 -102 239 -35 -442 -106 437 -474 343 418 14 160 229 -205
3055 -205 38 107 -331 124 -63 62 -61 -3 -166 -65 268 130 9 153 222 -384 164 34 -185 119 249
3076 249 -155 112 376 -461 13 222 -225 -126 341 -14 -547 201 103 -37 24 29 -371 54 169 -494 -153 84
3098 84 -471 -172 412 -242 -26 515 -343 -9 321 -68 -189 349 -151 -428 211 -89 -325 194 390 -504
3118 -504 -9 92 -697 -23 654 -337 -148 271 -241 -96 240 -296 -231 676 44 -465 169 172 -368 336 136
3139 136 -341 217 241 -419 235 447 -348 -125 283 -294 -181 387 -288 -287 686 -120 -262 330 -114 -235 151
3160 151 354 -344 209 358 -219 146 180 -240 -226 72 -559 -163 440 -202 -297 546 -284 -272 541 168 -95
3181 -95 315 268 -426 230 357 -460 -134 400 -389 -125 365 -181 -154 268 -58 -402 540 11 -497 214 230
3202 230 -584 477 405 -305 80 381 -424 57 300 -511 65 429 -169 -155 638 -136 -189 510 30 -406 223
3223 223 121 -295 273 137 -426 116 316 -522 59 542 -541 -341 475 -114 -367 325 -392 -128 409 -176
3243 -176 -470 132 12 -412 171 318 -398 231 261 -907 149 406 -439 83 578 -185 -287 410 24 -261
3263 -261 600 28 -291 270 183 -384 448 101 -655 105 367 -641 44 382 -538 -60 477 -475 -164 561
3283 561 -1 -299 547 22 -362 340 156 -283 298 24 -415 73 90 -469 198 155 -707 -81 482 -294 -373
3304 -373 297 -331 -339 149 66 -273 553 -134 -431 274 117 -96 194 222 -532 149 287 -144 -310 402 -108
3325 -108 -243 633 -172 -278 523 -137 -429 146 -86 -251 463 262 -220 303 479 -466 10 422 -285 -23
3345 -23 641 -162 -222 568 -154 -442 421 16 -183 187 -241 -645 63 134 -391 270 101 -379 65 221 -395
3366 -395 -118 468 -120 -84 108 -198 -339 363 -72 -156 412 27 -491 255 221 -473 253 -156 -387 183 279
3387 279 -13 -292 230 -77 -174 523 -150 -181 264 84 -106 406 -189 -369 295 15 -229 76 447 -178 197
3408 197 128 -274 -184 282 5 135 161 -170 21 157 -235 75 207 6 -21 151 1 56 0 543 -151 -115
3430 -115 -42 -233 -129 175 -229 -337 51 -51 -124 205 -3 -303 -39 192 -328 24 161 -336 24 275 -98
3451 -98 7 99 -224 -132 130 -136 -195 75 -200 -200 56 -267 -158 65 121 -247 26 174 -183 151 56 -196 -51
3474 -51 263 -203 -166 64 125 13 206 -34 290 48 38 -213 -54 78 -252 84 -221 -177 183 -93 -415 88
3496 88 -106 -250 -136 116 79 -290 307 -51 16 268 267 -177 264 109 42 133 170 -141 -190 -15 -151 95 82
3519 82 -293 -169 248 60 -3 -10 -70 -97 274 141 36 -3 102 26 134 273 -192 60 66 -319 9 183 -245
3542 -245 139 173 -288 -136 114 -196 -260 -162 86 -66 -55 109 -188 59 410 -223 29 83 -161 139 12 19
3564 19 -44 80 -198 -2 129 170 -18 233 16 -148 236 38 -286 302 -35 -337 -5 206 205 -38 262 -235
3586 -235 -56 -1 -128 43 313 -98 -15 267 194 -35 277 155 -180 15 64 -301 -48 252 -244 -88 196
3607 196 -264 -49 111 -341 -232 126 76 -103 251 -68 -115 122 -114 -20 238 52 -48 97 -158 -249 206
3628 206 120 -399 106 14 -313 -169 389 23 -315 256 -64 -300 379 119 -245 180 -30 -379 225 202 -168
3649 -168 251 399 -120 65 210 -225 44 488 -490 -472 446 -329 -71 402 -150 -72 341 -32 -353 355 147
3670 147 -325 237 347 -348 -55 152 -488 -138 519 -16 -128 401 -229 -188 443 54 -368 384 193 -164
3690 -164 190 152 -101 257 337 -504 2 110 -157 376 371 -43 149 221 -93 192 244 -256 -462 296 191 -257
3712 -257 257 39 -16 38 14 -348 28 306 -35 120 287 -227 -104 366 -303 -199 584 14 -137 448 -82
3733 -82 -169 238 10 -100 332 232 -119 163 219 -164 -102 338 -333 -258 343 -302 -210 409 -155 -195 293 91
3755 91 -569 152 231 -442 188 17 -277 72 276 -715 -17 227 -256 -37 192 -95 -181 386 10 -121 409
3776 409 32 -77 143 -30 -298 117 155 -395 90 498 -378 -30 348 -314 32 416 -384 -201 204 54
3796 54 -77 222 -118 -228 182 60 -515 204 381 -392 295 195 -221 123 170 -415 -229 651 31 -79 194
3817 194 -205 79 294 -108 -281 240 -54 -395 238 33 -244 316 350 -323 60 391 -339 30 149 -267
3837 -267 -83 393 -383 -427 364 139 -420 196 -151 -103 13 48 -249 75 313 -329 120 369 -620 -204 350
3858 350 -56 -232 353 -117 -277 502 -20 -31 268 55 -102 -69 -10 -102 3 143 -133 114 -79 -445 -55
3879 -55 135 138 76 336 -194 -275 290 39 -366 271 78 -251 295 478 19 -82 301 23 101 77 -442 -235
3901 -235 294 114 -93 184 128 -262 204 43 -117 303 73 -341 23 -258 -300 -95 194 -184 309 80 -82
3922 -82 -206 218 137 -321 163 140 -43 -2 134 -165 336 -175 -320 134 303 -389 275 33 -27 -25 124 26 44
3945 44 232 -343 -407 288 22 -182 106 103 -258 76 -67 192 -16 -140 -22 220 -135 -429 -41 221 124 -137
3967 -137 -9 -8 -126 33 8 -267 237 -179 34 114 -53 -319 209 -6 -325 87 179 -164 -117 244 -311 -44
3989 -44 119 4 -74 192 45 -3 284 93 -167 83 -84 -207 33 68 -290 -231 212 -46 -208 22 -79 30
4011 30 -49 -229 -227 133 -239 -56 197 59 -221 -105 90 -99 -123 124 -132 -151 267 -240 -143 -158 -210 48 75
4034 75 -247 -159 -179 -120 -141 242 -25 -119 126 -115 -30 138 194 -46 105 240 -199 17 233 73 -20 172 -31
4057 -31 -136 178 -376 24 100 -242 -16 50 -79 -157 129 219 -284 235 136 -376 182 -126 134 -65 150 69
4079 69 30 -37 -81 -204 -8 303 -46 -17 -79 179 239 -18 98 92 151 -397 -129 -51 134 52 257 237 29 389
4103 389 -189 -47 208 -80 -339 110 -11 -112 55 -5 113 69 162 30 45 -185 -17 -153 228 53 -92
4124 -92 105 13 -317 -149 154 -346 236 35 -114 78 271 -72 -108 110 -307 -5 269 63 40 293 81
4145 81 -111 86 -35 226 135 68 -148 -41 -133 -280 355 260 -223 327 -227 -309 -24 -47 -515 181 229 111 46
4168 46 245 -112 -186 22 -24 88 129 279 -176 104 6 -89 -144 -85 -230 181 52 -37 -47 11 -415 -25 443 -147
4192 -147 -295 301 -243 97 304 -357 -521 397 14 -228 -201 165 -507 55 140 -383 -209 105 -416 172 307
4213 307 -366 -1 308 11 -381 164 -148 -140 273 -22 -408 139 184 -331 34 229 -357 53 144 7 10 147
4235 147 -123 71 -60 -150 46 19 -71 -77 214 -123 -41 119 110 -347 343 185 -348 -110 212 -230 -65 444 -244
4258 -244 -82 456 -70 -317 573 -148 -285 345 -61 -162 66 -59 -116 111 174 -233 174 -15 -312 19 143
4279 143 -226 -156 245 -201 -93 196 -75 -332 195 14 -6 305 -30 -308 -41 250 -282 -87 211 -263 41
4300 41 208 -89 25 494 -162 -260 242 -24 -198 -32 -74 -175 93 180 -225 34 62 -342 56 -67 -174 146
4322 146 100 -259 -32 475 -145 -220 196 -41 21 350 110 -121 220 -99 -433 288 164 -288 65 230 -32
4343 -32 380 159 -62 -102 229 250 -203 188 194 -160 219 163 -190 136 -92 -173 191 121 -500 173 151 -180 -102
4366 -102 202 -208 -53 367 -275 -103 174 -200 -124 224 -75 -122 276 49 -487 156 -90 -160 30 -33 -298
4387 -298 -11 308 -428 -47 -232 -108 -209 271 -110 -307 80 -256 37 146 132 -388 -73 94 -120 42
4407 42 74 -238 121 118 -97 78 162 -118 118 331 -4 -295 26 148 -224 161 46 -82 354 79 -326 255
4429 255 58 -143 -206 98 -136 -89 252 -52 31 269 -95 51 82 -45 -275 -61 -262 -84 101 -90 -308
4450 -308 178 55 -150 69 134 -259 -332 100 -88 -172 65 -16 -320 69 39 -187 246 -15 -392 -90 4 45
4472 45 123 147 -214 -34 -33 -388 -295 -10 53 81 12 149 -18 44 52 -178 -74 177 -27 139 257 -158 -5 133
4496 133 -199 123 238 24 -41 168 -141 -86 385 -30 -43 68 192 -78 71 206 -125 -90 365 -258 -29
4517 -29 32 -204 -15 -35 -212 -285 161 3 -47 310 -88 -54 135 -51 -238 -33 -91 -44 215 103 51 108 46 -130
4541 -130 47 143 -157 -117 16 -268 137 -124 -92 99 -65 265 -81 37 15 105 217 182 -229 93 171 -194
4563 -194 -13 10 -32 -15 333 -84 -29 57 -190 -64 175 193 40 -27 -93 -98 114 -114 -256 -39 332 -176 45
4586 45 -19 152 71 175 92 -196 101 -21 -19 82 49 -68 159 -96 -369 -52 -68 -64 40 166 -16 -245 131
4609 131 -135 147 62 -36 -37 328 -219 -92 69 -27 -245 13 142 -115 -213 -149 -100 -49 5 28 -63 62 -312 -88
4633 -88 245 69 103 25 -91 2 270 -93 -182 66 228 -161 -68 -13 -340 -101 -63 49 273 239 -178 144 -179
4656 -179 134 -80 171 -235 -293 300 -129 -31 161 -32 -257 101 -27 -318 27 137 -85 2 126 -194 -44
4677 -44 -64 71 10 386 149 -381 99 -107 -206 122 -116 9 -254 19 -201 241 -27 -56 113 11 -23 50
4699 50 240 -79 -48 456 -45 -364 69 78 -169 116 -184 -47 85 129 -309 370 130 -218 12 30 -39 239
4721 239 129 -331 -168 219 -249 -9 258 -135 77 317 50 42 1 23 -345 -60 42 -246 243 107 -404
4742 -404 -92 99 -302 35 149 -134 118 164 -240 9 260 132 -220 122 -67 -230 114 133 -42 258 262
4763 262 -151 72 115 -178 -153 98 -259 -58 583 -134 -126 289 -216 -19 193 -194 -242 140 -151 -325 55 68
4785 68 -316 25 40 -293 -132 276 84 -10 247 -130 -309 249 -110 98 308 97 -241 92 27 -287 42
4806 42 278 -162 195 493 -262 240 224 -76 -66 251 33 -67 68 54 -162 59 85 -85 257 147 -458 590
4828 590 196 -298 283 266 -115 3 72 -203 -21 183 -268 54 281 102 -13 127 28 -394 69 39 -205
4849 -205 206 66 -202 298 -6 -100 162 217 -206 -173 99 97 323 -5 -459 -88 333 63 -108 196 -35 -261
4871 -261 -33 38 -244 259 40 -88 37 165 -308 183 118 -108 -203 112 -373 -70 211 -157 -159 179 21 100
4893 100 288 161 -336 42 358 -299 23 439 -67 56 29 -55 -42 529 -37 -162 43 82 -328 166 35
4914 35 -169 61 -112 -159 54 298 39 76 368 -115 151 284 -262 -84 53 -162 -93 117 -212 -225 138 -33
4936 -33 -149 100 3 -35 -80 101 -140 -120 197 -124 102 -59 -198 -134 290 -52 -2 112 -165 -151 -37 -143 -73
4959 -73 82 -165 -109 81 67 -223 -2 223 -37 -156 266 -24 -148 19 -187 -125 100 -6 -149 19 69 -271
4981 -271 190 -127 -51 84 7 -269 139 214 -72 -169 176 -186 -88 146 34 -83 66 90 -7 168 -221 -135 139
5004 139 61 -210 -196 156 -129 86 59 18 -19 147 210 118 278 -52 -115 246 231 51 126 -27 10 69 199 -160
5028 -160 -80 97 119 36 17 -167 -117 -32 -142 46 -24 -98 -88 78 -34 -113 65 -76 12 184 -66 3 -39 -58 193
5053 193 -54 144 -278 -128 189 -32 -78 37 61 -171 20 -114 -313 -28 -48 -53 209 187 -110 -220 30 -148
5075 -148 92 241 -134 319 379 -113 -2 -67 -129 78 141 -83 65 244 -18 103 160 -144 60 332 96 -49
5097 -49 -1 14 125 218 203 201 157 124 172 -70 -17 -75 29 -258 8 119 -12 -43 -106 15 -78 2 24 215 -393 253
5123 253 -147 -234 -15 -71 43 -106 123 -71 -388 46 -21 -227 -146 164 -10 32 -154 208 -73 -169 -140 -90 66
5146 66 140 -215 -17 -251 -125 11 -210 -24 91 -112 -61 -278 286 50 -63 103 -207 -34 69 -218 133
5167 133 -248 -236 40 199 152 -310 103 60 164 45 -47 82 250 108 8 71 292 34 133 -8 -178 191
5189 191 -110 16 -67 -111 126 43 236 82 -132 208 120 -66 -94 -189 -172 169 94 -102 10 137 -35 -80 -64
5212 -64 -294 -28 97 -197 32 207 -123 -45 -17 93 295 69 -289 -65 -57 -197 -289 14 36 -295 -139 41
5234 41 -57 -60 153 -308 -137 111 -285 197 -102 -350 -271 54 -54 -6 202 134 -210 74 125 -358 81 151 -364
5257 -364 144 186 -185 56 0 -58 -131 173 -116 -132 237 48 -184 -216 40 -59 281 104 -217 -245 -143 6 14
5280 14 108 -134 -296 156 -34 -52 -25 61 -73 42 -115 270 126 28 -119 -22 227 -173 207 414 -132 -55 264
5303 264 -129 127 51 -459 14 42 -81 -53 52 -31 -299 217 97 -290 -83 -71 -177 243 64 -268 -243 146
5325 146 -16 243 61 -199 7 89 203 -154 106 286 -74 -67 49 -141 273 54 -102 107 180 -147 -61 240
5347 240 80 -43 -66 133 -352 87 -33 14 405 -108 -234 141 184 -342 168 65 -88 109 113 -85 67 138
5369 138 63 89 71 34 -343 59 -191 -209 38 -45 -175 158 -135 -310 358 96 -143 81 116 -200 339 254 -112
5392 -112 -354 164 70 -52 356 -304 157 -73 178 -7 282 29 36 328 -31 36 55 -27 -101 -196 354 -344 -177
5415 -177 -52 39 -202 -134 -292 -16 178 37 -77 -188 192 -273 33 -52 62 7 -76 -171 16 9 -49 -260 32
5438 32 -173 267 83 -60 102 20 39 73 -60 -213 58 -52 17 -74 38 84 45 142 49 -23 116 -14 -178 221
5462 221 -27 121 -306 20 -68 -270 -178 -16 -172 -81 -45 80 -112 -58 69 -277 200 -218 -234 105 -163 171
5484 171 240 -83 119 -27 171 -198 -82 -123 -197 54 -8 -76 166 73 24 -118 86 4 -68 218 -151 11 121
5507 121 -106 144 12 -216 -45 71 -312 -65 346 -253 -303 -199 170 -122 -29 78 -228 124 39 -24 -20 95
5529 95 -73 44 66 -147 137 -16 166 -94 125 -124 -125 34 321 85 192 -39 52 -20 -156 -29 -222 -124
5551 -124 -110 142 -110 -102 -60 118 74 -107 179 -237 71 -99 7 110 91 98 -98 -36 5 190 -42 -18 -107 -20
5575 -20 -8 149 -57 292 -59 74 42 83 -147 -95 126 -144 -21 -193 -56 -12 -96 -124 110 255 -152 -65 251
5598 251 -302 -3 -16 -128 -177 -68 72 -166 123 96 -167 265 22 34 117 -261 69 -13 22 185 -49 -177
5620 -177 25 -38 219 239 -222 156 177 -175 191 -128 104 194 98 28 -13 45 -75 -107 8 -172 63 -44 80
5643 80 -77 -6 -51 -52 -32 93 -188 -56 59 15 33 193 199 -109 318 -94 -295 62 -93 -69 247 -230 -73 31
5667 31 105 2 121 135 78 -67 84 -55 -31 96 -157 90 294 -8 -113 123 4 -241 -127 110 -121 266
5689 266 -186 179 100 33 33 -92 127 -275 19 96 -200 172 -183 -257 10 21 -408 -160 271 -133 -309 87
5711 87 -18 -146 86 193 -50 -50 310 -109 268 65 -165 66 116 -9 -333 192 128 22 248 184 123 290
5733 290 -1 92 217 -42 64 -40 -134 196 75 145 -220 -51 234 -371 118 235 -155 -4 157 26 23 19
5755 19 -15 104 93 41 109 -54 -196 -237 -42 15 -155 29 -102 -44 73 52 86 78 65 54 236 -83 -195 -164 250
5780 250 4 -237 192 35 -133 -100 81 -49 75 -130 -129 34 -76 -221 -84 125 40 -186 161 52 -279
5801 -279 92 -23 -308 431 -229 -38 -43 -47 228 349 325 -186 -59 97 -284 -134 37 -170 29 -41 -8 -486
5823 -486 -54 40 -62 -147 -24 -292 99 -50 163 5 -177 58 129 244 -107 27 215 177 -224 56 -4 -55
5845 -55 207 -152 -287 168 -15 -96 24 15 -33 -69 75 -381 -6 6 -94 61 266 -105 29 26 187 33 27 -12
5869 -12 121 181 84 -79 -216 75 -326 -24 32 -110 109 -64 30 -155 149 -80 -75 -133 -163 63 60 -115 108 134
5893 134 -98 -15 152 2 -63 90 -115 -61 78 265 -125 -38 -146 -339 7 123 -14 111 -116 111 -165
5914 -165 143 54 11 63 136 6 -151 346 -176 156 -2 -14 -39 100 -16 -30 70 -184 400 -61 -66 -45 141
5937 141 -254 74 91 17 -267 261 100 -130 197 319 42 -191 10 -268 58 -159 -60 -191 318 174 -89
5958 -89 72 43 -336 191 -199 -19 137 -183 42 -108 -228 27 144 -54 104 -186 223 161 6 63 116 -138
5980 -138 63 130 65 -78 -91 -227 -112 -22 -77 115 77 91 -122 403 -121 -503 117 229 68 -40 -18 -128 -15
6003 -15 -4 373 186 104 58 -48 -260 99 54 162 108 -39 216 -204 -184 34 -224 -335 -90 -272 152 67 319
6026 319 -146 12 -69 -104 -20 -18 -166 133 88 -114 100 -47 -7 -69 381 261 -131 139 75 -59 160 104 -16
6049 -16 131 274 -162 0 92 -417 -171 -196 126 -30 -73 60 10 43 -44 63 -72 109 -201 95 -25 -120 242
6072 242 -87 -54 -118 1 -200 -284 115 187 -137 -202 14 7 46 -14 -274 316 -186 86 -5 -103 -207 82 17 -94
6096 -94 -5 -36 -60 166 124 119 -40 49 -15 -26 306 -168 -37 121 -41 18 94 212 -258 -148 -190 224 -57 25 -123
6121 -123 -296 -168 -265 -316 -212 93 -129 -196 -34 -34 -27 347 -456 -126 -41 -101 -111 28 119 216 174 -32 3 -157 -165
6146 -165 -186 -31 124 173 141 -3 50 183 210 93 -108 7 -122 -172 121 -12 154 20 -7 -155 26 -88
6168 -88 36 7 -116 -94 -43 -125 -27 -75 155 30 141 -9 -11 22 -163 -79 119 87 -129 35 139 -118 8 269
6192 269 173 79 207 118 -190 -138 9 109 102 -15 -161 138 -289 -71 -12 -32 -25 -139 -72 -20 69 182 -30 -124 -66
6217 -66 -3 -70 131 -7 -190 73 0 12 -40 -36 -298 2 -132 -171 -66 -8 18 162 407 117 -137 141 -185 -53
6241 -53 174 -75 178 72 49 -41 -214 22 302 -70 71 -18 282 260 34 -11 205 -51 -277 228 -204 -275
6263 -275 -170 -110 -127 77 -214 32 46 -92 -65 -117 201 -119 67 -131 160 -43 -85 -161 112 -112 160 7
6285 7 -163 -190 -57 1 -176 -38 56 71 43 -102 183 171 -144 -65 -123 231 -86 -295 24 172 -152 -53 108 -125
6309 -125 73 -57 -148 -251 396 -57 -229 250 -385 -113 216 -162 105 -15 -314 171 125 64 67 -113 284 -31
6331 -31 -17 -92 -125 44 -116 -77 70 -14 -162 -244 -5 -62 -24 127 -112 173 -121 -241 34 -17 -51 129 -124 103
6355 103 33 86 -284 211 -204 -195 -30 -147 69 106 233 112 80 -234 76 -13 -164 -72 -21 -403 110 -54 -210
6378 -210 -156 73 -142 -71 27 203 -145 105 83 -474 -32 -113 -121 98 -193 -133 -31 -33 -54 16 -27 -273 -83 148
6402 148 -141 174 -23 60 -59 33 -63 -160 -124 18 -225 196 -93 2 -98 126 47 34 175 -130 -278 156 107
6425 107 24 -200 -130 -23 74 -101 -176 118 -262 -121 67 175 -81 -81 -97 75 38 73 -154 200 146 -28 126
6448 126 154 -288 6 -132 -359 -55 156 165 -170 147 60 -2 -66 85 234 -80 144 188 177 247 22 -231 273
6471 273 -140 -352 153 -254 -99 81 78 -75 59 229 -83 232 25 272 110 45 -227 -233 88 -208 28 23
6493 23 -119 -184 88 5 -195 -117 149 -65 36 104 -41 45 83 -200 -22 -154 -179 89 -31 -128 -256 119 40
6516 40 135 -43 -120 -9 173 196 -89 151 223 -290 -1 174 -151 72 278 119 -247 143 -193 53 -256 82
6538 82 -128 40 255 -83 28 18 -48 38 -16 -145 330 -124 -129 56 211 -111 -5 50 49 -63 -167 105 17 -149
6562 -149 -106 -25 44 63 181 -39 -74 3 -172 -73 -25 83 13 -95 17 378 144 20 52 -195 161 -71 -201
6585 -201 -158 103 95 -164 -306 54 250 23 287 -185 -82 75 -99 -227 -164 -95 10 -134 -49 -24 88 -159
6607 -159 -146 113 -139 -35 106 65 -33 -124 -98 -30 -118 137 23 -61 155 81 57 168 -179 22 62 -113 18 -418
6631 -418 -57 80 40 31 89 67 56 -168 55 -46 -55 -185 27 62 -253 -112 179 -14 16 -18 -197 148 -161 58
6655 58 69 4 -68 32 154 -233 -105 -125 -13 -49 123 26 -274 -90 -19 -19 62 33 -60 79 108 -55 50 -14 35
6680 35 -104 -176 -12 -14 117 -185 19 92 -47 -182 95 -1 -155 -199 -276 -157 -81 -130 -53 -195 -27 -51 86 185
6704 185 -289 121 207 -128 -57 347 139 44 -144 64 -46 -263 -90 197 -89 -52 -195 225 -93 11 16 4
6726 4 -75 153 -41 -119 -84 -32 9 -258 265 4 8 -89 -34 -25 135 307 -146 163 241 -92 -200 -236 -142 15 -371
6751 -371 -124 -299 106 68 -100 24 -160 -120 233 49 -53 42 9 -90 49 130 70 165 -199 -91 276 -4 -68
6774 -68 -80 -43 6 153 95 -133 -170 220 -188 -179 -117 -41 -135 162 -4 44 31 -28 -88 -97 203 -16 320 6 -157 -17
6800 -17 125 -123 -152 121 -171 -109 156 -210 -139 106 -19 -11 118 226 529 144 -35 9 -75 -3 -13 35 -74 -189
6824 -189 -36 156 61 -312 -126 -113 -66 -95 -175 -8 0 82 -232 169 -7 -48 -3 24 256 -26 123 -128 -74 -42
6848 -42 -130 -163 118 -315 -41 226 110 163 -41 165 -108 50 164 56 -194 57 -144 -10 241 -29 95
6869 95 299 -81 132 14 -175 66 -108 174 -70 280 168 -190 -201 53 241 164 -119 59 -116 -16 -314
6890 -314 -118 34 48 -257 128 105 -270 34 2 -90 157 -87 115 105 21 42 -83 -22 -46 22 313 84 133 -118
6914 -118 22 -146 -127 -198 124 180 -222 -160 20 35 81 -186 -136 276 87 -56 -164 -50 24 -28 0 -20 0 -95
6938 -95 154 -47 -80 -185 117 -58 131 187 -57 300 -67 -304 155 147 -20 -401 99 -64 28 121 56 -94 90
6961 90 -32 -144 36 221 -9 -91 -162 -208 29 -113 -308 -43 -105 139 -29 -69 237 -114 2 112 -55 -140
6983 -140 -12 -85 22 280 180 205 57 -50 387 134 130 53 -90 58 -166 -36 -4 71 -92 -122 86 73 121
7006 121 137 190 4 -142 -159 -97 -31 -19 47 -164 80 -229 -108 -6 115 -317 -198 -22 -83 -81 49 183 140 -85
7030 -85 -190 163 35 -131 -144 277 -119 116 -10 87 57 -86 291 -172 63 29 -9 -70 280 -11 -105 27 45
7053 45 138 -76 195 -17 -109 7 -206 55 55 -423 65 94 201 -247 -89 66 -237 166 38 -22 110 -287
7075 -287 6 -22 112 229 -26 35 -340 -82 -88 -3 -114 -32 -173 4 115 211 23 229 150 -45 350 62 138
7098 138 7 -35 159 174 25 -65 -23 -159 97 135 -31 123 -71 -6 -123 171 304 -55 -15 -66 5 -224 127
7121 127 155 72 -71 -68 3 -15 -83 64 -2 -92 121 57 211 -236 24 79 83 214 -33 64 -79 -36 -50 10 -154 240
7147 240 -77 -66 -70 -4 201 -73 42 127 64 -7 284 111 -264 82 39 -162 -22 -141 239 -224 -62 0 -139
7170 -139 154 210 2 -71 20 35 202 -147 -70 119 64 32 -171 201 -437 216 -24 -144 48 120 -255 17 -166
7193 -166 -26 -46 -1 55 174 250 62 -38 -83 324 37 68 92 -174 -52 -146 -66 -128 -318 -149 87 115 75 103
7217 103 42 131 -36 95 109 -27 65 -111 187 275 -41 -91 87 37 244 281 -16 -76 -334 -39 -87 -93 192 333
7241 333 -213 -84 121 175 -19 299 -277 294 26 -146 303 291 30 -170 -111 -133 55 -119 184 57 70 272
7263 272 43 -33 131 -17 107 14 10 -91 190 -74 8 250 13 -58 -135 -129 -16 73 62 168 -107 -32 -4 -196
7287 -196 -96 -14 -50 -183 -242 75 -205 157 18 25 -77 -144 -44 -183 -137 -28 -25 -288 -176 -16 -56 -68 -122 -83
7311 -83 5 198 20 -124 138 22 -43 -22 53 -17 99 -110 -121 90 -76 47 65 -258 80 -96 30 -3 -50
7334 -50 35 -13 -119 8 126 -387 -26 110 -28 -65 -162 72 107 -84 377 59 -26 -273 -136 0 79 140 -14
7357 -14 216 77 199 123 148 59 -77 7 85 -8 -114 -214 -97 178 60 369 -147 -41 143 -129 284 -55
7379 -55 -83 9 4 -139 114 267 102 72 30 44 -224 174 192 -81 112 6 13 63 11 -303 228 93 -147 146
7403 146 -89 -106 57 185 -119 33 -47 -146 -192 170 -89 122 85 12 -22 200 -230 222 -322 294 -169 -69
7425 -69 -79 -163 90 53 5 97 99 185 -56 17 -214 -340 -16 -115 -89 -75 -90 157 116 -85 -92 -200 -168 -141 220 -73
7451 -73 38 30 269 -84 -131 -104 -105 -115 -106 -55 -147 243 54 -123 219 64 38 -63 -242 163 -44 35 81 114 -33
7476 -33 375 16 240 -197 45 411 -3 27 76 84 -15 -23 155 -10 170 -93 -330 116 126 -267 -179 24 193
7499 193 310 -2 147 -84 -155 46 390 192 -40 -198 -34 69 -152 -63 20 -357 -264 90 127 217 0 92
7521 92 -138 -4 -240 -371 65 -2 38 -144 -218 -172 -174 162 -210 -283 226 -114 113 -96 -66 -315 112 86 -12 -34
7545 -34 117 9 45 -24 -140 -17 -87 62 -3 312 -162 148 -213 46 -3 51 -82 -165 -156 28 -131 185 152 -5
7569 -5 -15 -199 -207 101 56 -128 -85 86 -108 174 70 -188 77 137 -15 -268 -49 51 62 76 -52 -229 69
7592 69 -56 -68 -12 100 159 -250 107 -55 18 -62 151 -32 261 -57 139 4 -58 -236 -26 -30 -134 100 89
7615 89 -236 0 -11 -59 138 107 -55 -193 -17 -160 -5 336 -17 -300 163 99 -252 59 -46 -2 -194 236
7637 236 -210 -106 49 43 111 89 -268 5 -120 115 -128 47 143 -238 319 346 132 218 -141 51 101 191 32
7660 32 23 9 -296 289 83 40 132 169 422 -76 -72 -10 47 132 -243 137 151 55 323 148 314 -102 64 20 -138
7685 -138 94 -98 91 -13 -28 -128 -5 -73 -147 -18 177 176 141 -242 -79 -539 -27 -81 -220 36 -1 -119 -3
7708 -3 95 -120 -502 -49 42 142 155 8 140 -18 1 -139 74 -26 52 -28 160 43 290 -16 342 -117 81
7731 81 36 -51 -65 -79 96 56 19 -82 -67 -86 286 156 124 -104 -129 3 85 251 -18 46 183 100 64 -59 111
7756 111 83 -112 133 -13 -7 -49 -26 86 -50 -207 133 200 -83 -207 178 24 -110 155 -75 -62 -127 -68 211
7779 211 -87 -116 -54 -73 72 76 -4 271 280 -268 -116 -86 15 -47 83 -84 118 69 146 350 -223 -288 168 63
7803 63 243 32 250 -115 50 326 105 -147 -36 -29 -91 -71 269 -19 129 208 28 37 58 -70 -179 -26 -4
7826 -4 233 200 103 122 59 -58 150 -82 -2 -40 173 -26 11 31 108 -141 41 14 76 -41 -15 20 -113 107 -92
7851 -92 47 -80 31 -55 -24 -218 -35 143 -161 37 -96 -47 197 33 182 -83 -43 -29 -193 -126 24 137
7873 137 -166 158 -172 -95 31 -124 -52 -95 88 1 6 -329 -43 -230 -112 -87 -88 -13 148 -235 166 -157 7
7896 7 -17 57 82 -319 82 -88 -33 106 -223 -189 68 -53 -85 257 -21 3 140 -151 -43 170 71 -104 -87 35
7920 35 156 31 -84 -25 111 13 -64 141 -165 232 50 63 31 -168 -203 -39 -92 204 231 63 -177 -94 251
7943 251 5 -176 -66 -189 36 286 86 -3 -171 173 -16 -170 -62 65 105 -7 -13 -384 130 255 -27
7964 -27 -28 224 79 -93 84 -53 145 9 -159 -102 -63 34 -57 -204 -20 -24 337 -47 -76 67 -13 -203 150 227
7988 227 -75 -38 26 14 64 -119 153 -247 -2 188 -202 307 359 181 152 -127 150 100 -201 98 3 133 -255
8011 -255 9 -88 -120 -25 -214 76 141 252 -191 -158 -32 -50 -134 150 69 -209 -96 -115 -389 70 93 -5 -10 -199
8035 -199 -188 -222 115 192 -79 -44 -204 93 248 -31 56 -18 45 23 34 -27 42 30 25 82 134 -56 -134 -95 80 -110
8061 -110 -87 2 49 -284 -308 -59 122 48 151 78 128 -241 93 -176 -55 217 109 -207 -37 -155 -402 -256
8083 -256 -74 -76 -95 60 -134 21 167 153 243 -79 -54 112 22 71 -91 75 -291 50 141 280 -225 -216 -200 32
8107 32 -79 0 -196 119 130 109 106 -160 81 -87 45 -9 138 239 9 -87 -47 -8 27 -68 -43 253 26 14 69
8132 69 128 -120 -78 280 -29 -104 119 -148 56 -72 0 -39 106 66 -117 107 -101 8 111 -16 -345 247
8154 247 -18 86 -84 166 -282 293 -18 151 -143 -104 -116 -6 -82 269 -12 126 246 8 25 34 183 177 55
8177 55 -38 127 -205 -182 -97 131 128 176 -147 -5 4 172 77 134
8191A34
$$ Imaginary data points
##PAGE= N=2
##DATA TABLE= (X++(I..I)), XYDATA
0 0 0 0 0 0 0 0 0 0 0 0 8 -8 8 -8 16 -16 24 -24 32 -40 46 -56 64 -77 88 -104 120 -138 159 -182 207 -237
32 -237 269 -301 343 -387 432 -483 539 -601 669 -743 822 -909 1004 -1111 1225 -1350 1486
49 1486 -1641 1807 -1990 2194 -2423 2677 -2969 3300 -3684 4130 -4661 5304 -6099 7113 -8459
64 -8459 10323 -13095 17639 -26324 48711 -223768 -334448 358068 46713 -485772 -346271
75 -346271 -200880 -165536 89621 -112202 -350592 -92366 -151551 -370205 157237 315770
85 315770 -334335 -348209 99900 -7203 -27533 110857 -118228 -155279 -4409 -187356 -46880
96 -46880 293758 -118004 -452096 36353 159521 -166977 7546 123310 -131362 -40939
106 -40939 87810 32177 250618 214453 -175422 57632 424151 105245 2756 330494
116 330494 167552 -67195 163270 208583 105691 166749 -27216 -116011 220578 130804 -189587
127 -189587 71777 177494 -190787 -107413 186754 31425 -63478 20488 -70460 15339 157058
138 157058 -73085 -74469 186875 -38034 -213772 119947 125683 -165826 -85412 -3084 -109620
149 -109620 -43380 -50405 -178659 -47447 -28709 -259925 -107072 111204 -147383 -220626 32769
160 32769 -20973 -115854 17727 -4824 -45729 54789 -23216 -59431 145459 81729 -131014
171 -131014 39513 152218 -53189 -25683 108030 -5854 -27878 37675 -29209 25666 90843
182 90843 -67729 -52855 131183 26195 -80897 93058 101160 -43838 36502 93581 23819
193 23819 72730 57194 -29421 76486 98510 -54860 7037 109337 -32749 -74872 50828
204 50828 9790 -63388 -10148 -33758 -56617 10902 -43161 -83601 28241 -4982 -105052 -1640
216 -1640 48992 -52276 -33410 29580 -15375 -11783 22876 -20683 -2692 40486 -35659 -34923 58587
229 58587 -1790 -61389 21040 20366 -38054 224 15476 -13800 10099 10162 -17673 28321 44232
242 44232 -18933 9227 65210 9219 -641 55613 28656 6036 33704 17597 11896 35490
254 35490 4825 -14250 26006 14086 -32281 -728 19173 -30238 -26054 2701 -21397 -22425
266 -22425 -11674 -30656 -19138 -7843 -32902 -27849 -2404 -21879 -39683 -12936 -8492 -32315
278 -32315 -21791 -13555 -25883 -16244 -16953 -27894 -8576 -9154 -28723 -12796 2568 -12252 -15520
291 -15520 2771 4252 -5425 4223 11227 8012 14711 12675 11907 27267 22723 14107 27830 31080
305 31080 24141 24816 30395 32428 26942 25701 28751 29896 29991 21863 22000 30817 20372 12437 21189 18566
321 18566 9824 7117 8016 8970 1037 -3268 -1072 -3837 -7221 -12583 -12869 -8462 -17072 -21839 -16371 -17631
337 -17631 -20660 -24030 -24316 -18136 -23553 -29255 -22857 -20562 -24767 -28520 -23044 -17377 -25459 -24783 -16382
352 -16382 -19150 -18504 -16719 -16103 -8425 -9916 -13009 -4249 169 -2332 -2371 5137 9314 4749 8771 14042
368 14042 12047 17215 14960 12865 25186 20175 11005 23814 25535 13715 17125 24963 17468 13106
382 13106 20710 16227 11437 19729 10602 5469 19674 7894 -3463 14233 9133 -7039 3882
395 3882 6951 -6342 -3308 1271 -9792 -5645 664 -16788 -10746 6071 -18913 -20534 7273 -12657
409 -12657 -26263 -589 -7101 -23125 -6811 -7448 -20705 -4408 -4661 -25689 -3573 7938 -26239
422 -26239 -10653 17954 -14191 -14624 16442 -1560 -5899 16063 850 -251 25936 4774 -9621
435 -9621 31513 21029 -19149 19035 33724 -13664 4183 26762 -7156 3390 17589 -16192
447 -16192 1566 25505 -21226 -18239 32511 -3807 -34647 18824 13024 -27463 5909 8172 -19419
460 -19419 13241 3049 -34000 14973 19441 -45666 -11817 31207 -30549 -37622 15669 -15158
472 -15158 -34813 2071 -22986 -29140 17424 -24292 -46350 30868 7858 -53740 12736 37974
484 37974 -25687 -2351 35189 -1293 12713 31163 -12687 19562 56396 -21204 -11988 70067
496 70067 6067 -37812 42341 28934 -24715 17110 16724 -12557 30574 12578 -35307 38821
508 38821 49895 -45672 5653 75080 -11789 -20669 52074 12005 -7801 29540 -9382 -7029
520 -7029 44022 -23332 -52293 42581 6265 -83597 -4221 25324 -63264 -36192 2584 -45184
532 -45184 -18489 -5046 -63790 -9775 34670 -61972 -46266 56880 -11123 -65324 27348 20960
544 20960 -38703 6769 1562 -27492 28037 -5397 -62815 29890 35428 -74177 -16405 58253
556 58253 -30968 -39850 35845 611 -10883 31825 -11175 4400 75200 -2756 -29553 89925
568 89925 51956 -41806 46467 76967 -8591 15897 46836 730 28383 32378 -37965 18140
580 18140 63996 -49104 -37267 68840 -6796 -60286 28852 16102 -31421 12974 -3050 -22616
592 -22616 40560 2072 -58271 37324 47481 -66375 -14761 57871 -31873 -42198 19171 -22460
604 -22460 -28005 2694 -52281 -35620 28682 -48682 -78315 28990 1443 -82838 -6268 25921
616 25921 -42277 -11763 12769 -24352 19216 22848 -43210 18804 64606 -34914 -23961 69002
628 69002 7794 -39463 32419 19782 -19448 20605 -1674 -21733 42352 5888 -51236 37099
640 37099 47590 -45283 885 60485 -4549 -6436 40599 8156 13115 41605 -10317 3798
652 3798 64547 -5163 -35087 52830 23729 -45379 11124 24314 -28260 -5247 2552 -30910
664 -30910 4223 6927 -50960 -6475 35433 -40762 -35368 36589 -7457 -35836 15861 1674
676 1674 -17088 14718 -8722 -21614 27604 399 -45006 15383 24832 -43893 -14239 25473
688 25473 -23184 -19767 10663 -18837 -7753 15819 -25168 -12499 34602 -9056 -28626 32169
700 32169 19188 -23703 15294 25308 -7706 13965 16642 -10106 20097 21165 -22460 8323
712 8323 33130 -16987 -13777 26971 -1941 -18236 12784 -24 -12470 12883 -4475 -17028
724 -17028 19653 4581 -26066 12352 18146 -20300 -2176 17371 -8714 -4812 9990 -8681
736 -8681 -3098 12203 -13850 -10980 17578 -8912 -21366 11959 1061 -19861 2935 2807 -12790
749 -12790 2130 2254 -12545 5035 9000 -14370 246 17405 -8341 -5964 17229 545 -4959
762 -4959 12268 2519 -1768 12083 1988 -3885 12768 6193 -7813 8057 10924 -7732 1275
775 1275 9802 -5389 -657 6539 -6293 -1372 6449 -6962 -5100 6852 -3468 -8793 3954 896
789 896 -8430 1248 1984 -7008 375 1750 -7259 490 1757 -7860 -2345 1703 -6747 -5461 68 -5089
805 -5089 -6895 -1737 -4966 -7804 -1149 -4114 -7776 585 -975 -5820 2075 2901 -1674 2663 5633
820 5633 2460 4128 7512 4762 4373 8266 5182 3225 7610 4229 1483 5286 2474 226 3036
835 3036 920 -439 1423 1041 -286 1160 2259 567 1408 4251 1758 1851 5311 2372 2195 4582
851 4582 1937 1254 2138 319 -1091 -1933 -2149 -4296 -5248 -4947 -7013 -7122 -6306 -8677 -7296 -6304 -7858
868 -7858 -5684 -4071 -5265 -2900 -1508 -1769 -493 1134 1250 228 2302 2707 -64 2000 2609 -814
884 -814 1064 1141 -1986 -278 -577 -2592 -869 -259 -1733 -559 1732 1036 926 4631 3663 2916 7280
901 7280 5528 4029 9163 6485 3469 8095 6336 2147 4431 5275 253 122 2678 -2317 -2744 489
917 489 -4854 -4939 271 -5455 -6130 547 -3327 -5777 432 -826 -3749 847 1210 -3154 1356 2930
933 2930 -4797 158 4309 -6122 -3287 3769 -5845 -6257 1434 -5255 -6881 -420 -4724 -7726 1328
948 1328 -2277 -9110 2230 3505 -7622 1485 7423 -3417 2838 7922 -1201 4241 9206 -2005
962 -2005 2390 11782 -782 -3632 10891 2982 -7189 6374 4110 -6807 4082 2295 -7756
975 -7756 5227 4176 -10108 2816 9579 -8110 -2549 11643 -1993 -4701 8840 16 -3341
988 -3341 9195 -2338 -6191 11709 -834 -12525 8619 5150 -14107 381 6671 -10155 -3395
1001 -3395 4132 -9840 -2214 6806 -12877 -5375 13385 -8837 -12088 13529 506 -12407 7715
1014 7715 3797 -7265 7109 2902 -8717 10129 7197 -14936 5578 15528 -13880 -5130 15667
1027 15667 -6996 -7815 9271 -5387 -5471 10001 -7741 -9663 15512 -1053 -17894 12318 10435
1040 10435 -16814 3214 13099 -8804 2011 8980 -9110 5574 12561 -14106 -1543 19924
1052 19924 -9457 -14101 16376 680 -16153 7487 1976 -11838 7383 -1444 -15939 11977
1064 11977 5861 -21623 6504 18137 -15698 -4870 18731 -3838 -5465 13301 -3035 -1771
1076 -1771 16899 -7422 -9251 22385 -925 -20405 15167 9978 -19127 2283 9803 -11984 837
1089 837 5755 -14283 4274 13281 -19242 -3590 23688 -10814 -14582 20313 1879 -13291 10389
1102 10389 2776 -8149 11423 -1525 -15142 13928 6176 -24585 3608 16072 -20079 -9084
1114 -9084 13273 -11123 -8879 7236 -11448 -4528 13438 -12648 -12074 21152 -952 -20337 15043
1127 15043 12176 -16527 5282 11801 -9196 6097 7781 -13590 7923 14238 -18584 -2712 21502
1140 21502 -9941 -14046 16522 821 -11859 10232 1109 -6987 15227 235 -12943 18904
1152 18904 10256 -18251 9710 19773 -11999 -1154 16408 -4612 -1997 10912 -8241 -2889
1164 -2889 14947 -11325 -12294 17726 -3321 -20101 9620 5449 -15885 2113 4485 -10653 3841
1177 3841 3737 -14348 4654 11813 -16954 -4343 17325 -10050 -12423 11852 -3512 -11432 6033
1190 6033 -4510 -9926 8233 -4209 -15673 9383 4866 -18344 2857 11898 -12177 -2323 11465
1203 11465 -5710 54 9989 -6715 804 14530 -6256 -6158 16399 1326 -11231 10481 6774
1216 6774 -9459 5884 5996 -7141 6521 5903 -9741 6466 11398 -9453 110 14168 -3457
1229 -3457 -4818 11071 682 -4474 7886 -636 -5326 9026 -1075 -10524 7580 2548 -13115
1242 -13115 1319 5142 -9286 -3079 4170 -6793 -2568 4118 -7442 -3194 8155 -5794 -7237
1255 -7237 8966 -1087 -8895 5023 1289 -7445 2156 596 -7297 1354 1121 -8735 -21 4442
1269 4442 -8360 -3045 6719 -4754 -3643 6264 -1069 -1581 6742 555 -836 7728 2603 -2635 6670
1284 6670 5298 -3892 3527 5931 -3540 527 4057 -3641 -438 3317 -4196 -1674 3780 -3152 -3079
1299 -3079 4073 256 -3045 3485 2141 -2136 3650 2931 -1805 3457 2877 -3139 1792 2476 -3843 -1961
1315 -1961 1430 -3894 -4561 -371 -3928 -5259 -971 -3445 -5111 -367 -1581 -4118 1432 765 -1812
1330 -1812 2147 2994 389 2387 3775 954 1776 3259 619 414 2612 -629 -1972 1154 -1160 -3006
1346 -3006 302 -1104 -2602 -74 -254 -1050 685 1981 476 1975 3969 2270 3150 4981 2878 2588
1362 2588 4393 2143 1407 2659 94 -644 -26 -1895 -2840 -2400 -2763 -4400 -3409 -2314 -4223 -3054 -1522
1379 -1522 -3174 -1540 20 -782 -146 1351 1158 1062 1707 1456 338 939 741 -1110 -425 -578 -2412 -1494
1397 -1494 -1987 -3983 -2117 -2559 -3619 -2198 -1488 -2101 -935 766 557 777 3152 2654 2042 4572 4068
1414 4068 2807 4797 4031 2613 3715 2621 1501 1797 1245 -420 -465 -243 -1740 -1274 -110 -2104 -1679
1431 -1679 735 -912 -966 2251 453 146 3183 2153 871 2991 2519 651 1830 2212 -1154 -16
1447 -16 548 -3232 -2216 -374 -4335 -4172 -1757 -4769 -4788 -1488 -4128 -3881 -657 -2270 -3062 819 485
1464 485 -2271 1928 2761 -1026 1903 3347 -1044 1346 2764 -1393 -208 2084 -2350 -2267 1646 -1917
1480 -1917 -3926 890 -828 -3984 1263 432 -2958 2359 2159 -1774 3541 4202 -767 2969 6098 350
1496 350 1350 5988 980 -327 5194 407 -1620 4197 -842 -3946 3181 -123 -5424 950 1198
1511 1198 -4748 -317 1950 -3120 43 3235 -3063 210 5562 -2241 -1075 6447 -640 -2753 5148
1526 5148 537 -3602 2918 389 -4706 1865 93 -6775 620 1907 -7805 -1644 3864 -5950 -3557
1541 -3557 3776 -3408 -2544 3852 -2476 -2441 5234 -1026 -4143 5895 2017 -5776 3801 4147 -5426 1545
1557 1545 3470 -5372 673 3379 -6330 -891 4829 -6102 -3851 5972 -2710 -5915 5076 445
1571 445 -4764 4502 1022 -4458 5760 2561 -5424 5540 6006 -5688 2002 7589 -3927 -817
1585 -817 6642 -2189 -1639 6009 -3423 -3164 6985 -2458 -6292 6835 1134 -7523 4538 4151 -5443
1600 -5443 2068 4487 -4054 2917 5634 -5345 1436 8492 -5042 -2439 8867 -2197 -5209 5985
1614 5985 -648 -5348 3871 -1338 -6457 4031 -107 -9353 2662 3935 -9765 -1063 5629 -6782
1628 -6782 -2941 5037 -4325 -2341 5284 -4358 -3199 7494 -2532 -6347 6967 937 -8340 3308
1642 3308 2583 -7342 1439 2258 -7416 1666 3222 -8112 53 6496 -6607 -3247 8101 -2142
1656 -2142 -4275 6932 714 -3069 6992 1241 -3641 7831 2795 -5786 6375 5737 -6133 2004
1670 2004 6605 -4321 -391 5635 -3755 -920 5871 -4075 -2664 7821 -2586 -5353 7361 1260
1684 1260 -6152 4974 3324 -4590 3456 3362 -4976 2750 4352 -6673 293 5934 -6220 -3811 5516
1699 5516 -4124 -5637 3370 -3071 -5305 3235 -2753 -6319 3954 -275 -7562 2983 3096 -6735 742
1714 742 4987 -4723 -220 4742 -4002 -642 4806 -4329 -2491 5564 -2591 -5234 4887 382 -5614
1729 -5614 3046 1526 -4722 2575 2201 -4352 3158 4134 -4133 2168 6365 -2444 -6 6488 -562
1744 -562 -1316 5377 1 -1967 5111 -125 -3464 4292 886 -4843 2801 2419 -4520 887 2968 -3275
1760 -3275 -160 3514 -2657 -421 3962 -2341 -1689 4757 -1481 -3061 3919 -448 -3729 2322 -176
1775 -176 -3907 1204 207 -4449 203 998 -4468 -974 2278 -3667 -1839 2934 -1884 -1806 2992 -1158
1791 -1158 -1582 2712 -328 -1846 2658 837 -2565 1682 1591 -2934 621 1401 -2981 35 1791 -2495
1807 -2495 -454 2315 -1415 -443 2620 -328 -1289 2747 973 -1096 2734 1838 -1153 2187 1944 -1796
1823 -1796 1392 1805 -1883 8 1255 -2017 -855 1200 -1732 -1500 1180 -1196 -2040 1273 -497 -1485
1839 -1485 1820 624 -1214 1370 1049 -1024 780 1264 -970 108 1405 -1060 -881 950 -1445 -1605
1855 -1605 391 -1056 -1801 246 -966 -1341 408 -76 -788 861 1203 -358 752 1528 66 1014 1982
1872 1982 119 771 2011 -222 -43 1368 -187 -682 307 -238 -1222 -203 -360 -830 -131 -91 -872 -132
1890 -132 768 -447 169 1173 162 609 1656 294 335 970 409 -254 225 -250 -1278 -251 -610 -1718
1908 -1718 -1006 -508 -1713 -919 -734 -1187 -755 -379 -536 -301 333 124 134 1030 654 312 1204 1091 293 1046
1928 1046 447 -140 706 -46 -417 -68 -309 -826 -519 -28 -848 -742 277 -298 -202 885 500 89 1397
1947 1397 585 737 1819 1019 496 1471 1125 365 607 630 -299 -43 211 -1098 -190 10 -1507 -1057 35
1966 35 -1007 -1176 212 -703 -825 425 448 -465 794 890 -293 884 1061 -685 659 916 -962 -244
1984 -244 488 -1107 -669 30 -1576 -1174 -152 -1321 -1507 121 -580 -1707 763 236 -1093 998 1072
2001 1072 -787 929 1246 -219 950 1489 -311 137 1799 -433 -537 1067 -623 -1267 1148 -602
2017 -602 -1109 849 -481 -1408 816 382 -1263 797 1263 -1161 695 1933 -274 354 2211 -400
2033 -400 -19 2229 -277 -888 1945 -382 -1568 1122 -90 -1891 559 67 -1882 284 482 -2286
2049 -2286 -67 1251 -2257 -229 1906 -1305 -385 2026 -508 -630 1811 -255 -1346 1865 -58
2064 -58 -2019 1482 778 -2320 522 1120 -2432 66 1073 -2364 -374 1169 -1917 -661 2100 -1457
2080 -1457 -1536 2190 -161 -1744 2158 658 -1848 1810 958 -1950 1714 1358 -2014 864 1923 -2018
2096 -2018 -337 2117 -1576 -1061 2131 -1189 -1483 2097 -916 -1652 2343 -184 -2266 2247 847 -2374
2112 -2374 1647 1746 -2047 851 2190 -1984 199 2689 -1652 -730 2907 -1552 -1744 2619 -990 -2017
2128 -2017 2226 -98 -2566 1444 241 -2476 1541 1111 -3144 822 2109 -2830 125 2514 -1938
2143 -1938 -183 2731 -1192 -815 2639 -834 -1809 2602 -261 -2644 1944 206 -2985 1247 1180 -2967
2159 -2967 560 1413 -2774 -44 1882 -2379 -587 2648 -1678 -1417 2596 -527 -1899 2445 343
2174 343 -1949 2481 417 -2615 2193 813 -2789 1270 1798 -2717 111 2319 -2201 -915 2518
2189 2518 -1555 -1174 2560 -1003 -1459 2709 -42 -2103 2638 818 -1846 1922 1351 -1959 1183 1549
2205 1549 -1879 372 2198 -2149 -495 2217 -1708 -1463 2143 -1206 -1777 1727 -327 -1932 1795
2220 1795 68 -2222 1481 1262 -2071 1214 1875 -2038 493 2073 -1536 -179 1965 -1654 -744 1705
2236 1705 -1263 -1383 1897 -572 -2348 1299 368 -2333 957 907 -2203 930 1234 -2120 472 1747
2252 1747 -1671 24 2169 -863 -582 1764 -500 -1439 1758 -33 -1541 1746 -51 -1739 1382
2267 1382 542 -1899 770 1031 -1749 218 1522 -1134 -225 1743 -993 -465 1664 -563 -887 1873
2283 1873 -151 -1191 1686 390 -1396 987 608 -1304 431 699 -1571 522 998 -1309 -222 1265
2299 1265 -1036 -804 1386 -697 -860 1403 -280 -1081 837 89 -1023 986 516 -1400 576 844
2315 844 -1247 145 862 -1065 -138 740 -853 -620 939 -568 -678 948 -193 -1046 722 251 -1119
2332 -1119 777 263 -905 122 473 -960 285 684 -843 110 796 -616 -245 729 -323 -657 798
2349 798 200 -834 681 40 -688 852 132 -692 406 302 -532 90 218 -499 -158 383 -179 -290 615
2368 615 -252 -577 800 -463 -502 792 89 -556 411 149 -127 170 395 -327 -179 381 -146 -93 369 -649
2388 -649 -94 312 -323 -304 445 -269 -507 193 85 -183 -40 410 -212 146 335 -456 144 470 -194 -270 328
2409 328 86 -37 151 -75 -355 334 -24 -492 126 31 -462 12 -26 -242 11 148 -81 -72 234 -380 203
2430 203 106 429 -129 227 146 -480 132 166 -496 -44 -199 -424 -25 -40 -242 -70 -121 -442 69 315 -195 75
2452 75 531 229 -167 266 140 -196 491 70 146 259 137 -123 -15 83 -271 179 233 -180 136 169 -151 -292
2474 -292 164 -554 249 324 81 -96 520 -203 -85 132 396 -92 469 391 -384 -62 187 -684 -152 292 -664
2495 -664 -68 128 -328 -362 402 -192 3 -95 -442 -223 223 165 -323 216 515 -378 331 322 -313 106 144 -157
2517 -157 146 192 -401 -152 208 81 -346 481 -52 -491 275 8 -398 454 261 -529 598 358 -330 228
2537 228 117 -308 98 538 -443 -168 327 -495 -384 725 -75 -492 516 -285 -734 460 -81 -257 22
2556 22 141 -614 199 228 -508 186 536 -297 -103 572 -390 -266 446 -258 -349 506 37 -356 416 59 -411
2577 -411 423 348 -543 312 732 -454 -54 595 -338 -110 676 -319 -437 527 -319 -510 777 -118 -585 584
2597 584 202 -643 400 -74 -575 473 544 -970 455 807 -462 143 863 -385 -428 743 -98 -406
2615 -406 825 -101 -512 691 21 -954 685 78 -1003 274 784 -691 1 610 -808 -84 669 -487
2633 -487 -533 977 -371 -416 961 -103 -681 748 109 -964 463 357 -1176 306 386 -1171 -11
2650 -11 586 -918 -196 1001 -976 -188 1041 -272 -450 1025 -445 -393 864 27 -735 754 264 -1067
2668 -1067 634 661 -648 200 839 -882 -12 820 -675 -263 693 -567 -484 756 -171 -782 719 163
2686 163 -642 730 60 -895 555 634 -939 95 714 -943 25 860 -576 -490 810 -307 -424 725
2704 725 -268 -873 856 122 -943 885 397 -1081 637 767 -818 103 956 -875 204 929 -730
2721 -730 -349 842 -541 -724 894 -337 -703 888 -117 -912 558 38 -1024 539 422 -913 382
2738 382 760 -673 -25 975 -454 28 856 -441 -417 651 -313 -321 565 -191 -867 490 167 -876 118
2757 118 200 -827 242 618 -643 -53 625 -510 -217 614 -146 -259 752 152 -208 534 -16 -822 574
2776 574 98 -519 560 589 -1014 280 681 -610 -178 622 -461 -94 836 -129 -332 767 -284 -707
2794 -707 668 -51 -462 739 220 -520 465 442 -613 -269 92 -475 -104 416 -683 -167 501 -404 -163
2813 -163 595 -390 -541 688 52 -212 220 411 -570 202 319 -536 220 270 -422 102 528 -468 -326 657
2833 657 -269 -386 414 -62 -380 510 111 -592 388 110 -726 204 224 -565 177 226 -315 132 661 -260 -173
2854 -173 385 -38 121 623 242 -285 358 272 -616 38 49 -343 390 90 -176 170 215 -172 -233 403 -305
2875 -305 -113 582 182 -161 356 -253 -402 86 248 -551 344 169 -540 228 279 -352 245 -32 -458 -107
2895 -107 5 -417 -318 53 -277 -392 256 83 -258 154 4 -147 84 99 165 -42 167 -213 -294 200 -107
2916 -107 -20 203 -200 -345 254 -35 -12 15 -87 34 -63 111 -405 69 130 -511 103 225 -139 -52 143 -84
2938 -84 -192 -6 -194 -178 28 -57 99 75 -51 -481 174 -121 -342 18 217 -184 -116 -239 -112 86 -28 -247
2960 -247 -40 161 115 -165 137 199 -143 -123 319 -276 -53 -105 -254 268 38 -180 -8 53 81 -232 120 -205
2982 -205 44 2 -145 -52 22 -249 -192 193 352 43 128 -43 -216 -70 215 -319 23 30 -43 -70 110 -92 -120
3005 -120 -401 -95 36 66 -224 -443 136 -92 -204 104 -150 -8 349 -6 -141 -96 397 -170 -31 172 -67
3026 -67 -20 76 -156 -219 -20 -290 -127 100 108 -298 -4 -152 -69 -63 5 37 -56 7 -322 357 278 -352 262 90 -199
3051 -199 96 80 18 -148 176 6 -368 257 -133 -346 205 142 -528 24 102 -70 -54 85 -44 79 336 -1
3073 -1 69 105 -572 -234 511 -30 -254 62 -312 -221 144 -10 -334 73 136 -384 -183 308 -301 -199 2 -322
3095 -322 -177 190 -246 87 393 -118 -94 228 186 -82 -42 -39 -296 -136 469 -343 140 320 -270 298 487 -239
3117 -239 0 217 -288 47 455 -404 -109 272 -6 -46 353 277 -443 194 57 -282 413 220 -449 100 140
3138 140 -285 -55 199 -533 -198 161 88 -221 389 195 -421 561 -40 -470 199 285 -466 -52 303 -527 -138
3159 -138 205 -335 -203 125 -313 -250 496 -263 -116 458 -257 -290 419 18 -448 47 167 -281 429 187 -514
3180 -514 371 616 -236 -122 392 -121 -259 217 -346 -197 344 95 -202 279 111 -379 587 76 -462 250
3200 250 -5 -700 105 315 -470 -37 420 -164 -377 447 -458 -186 525 -13 -404 387 -81 -336 377 24
3220 24 -656 493 270 -318 120 307 -336 94 448 -525 -56 531 79 -237 550 -29 -431 400 -193 -396
3240 -396 278 178 -558 81 256 -412 137 617 -388 -6 275 -290 56 474 -329 -251 800 -183 -385 556
3260 556 218 -453 451 245 -593 493 415 -290 194 113 -547 -172 468 -430 -132 478 -49 39 662 -44 -225
3281 -225 318 -233 -501 370 224 -546 409 310 -549 -34 74 -666 -72 412 -277 -197 361 -87 -272 317 -55
3302 -55 -406 377 86 -754 256 85 -188 263 464 -397 215 256 -532 10 425 -228 -200 344 -497 -156 390
3323 390 -26 -522 666 107 -329 194 101 -168 13 548 -204 187 246 156 -24 7 -316 -280 422 -237 -49
3344 -49 330 -120 -147 168 -360 -274 218 -58 -429 145 -71 -388 148 295 -435 -129 333 -306 25 377 -123
3365 -123 -249 239 -121 -222 275 -188 -232 164 236 -316 -64 103 -311 113 201 -24 -18 -273 -267 -193 213 72 -261
3388 -261 239 125 -261 131 -97 -220 507 163 -472 375 114 -318 99 -83 -71 -52 -27 -70 -337 245 -84
3409 -84 117 125 -2 -91 117 -395 -68 48 22 -43 98 69 -300 -7 118 -53 37 223 -198 -28 124 -370 -466
3432 -466 233 186 -309 229 114 -237 231 128 -387 52 318 222 -29 84 146 -286 -290 82 36 193 -53 25
3454 25 184 -55 0 82 124 -94 226 107 -259 134 19 -376 -321 -165 -18 -62 84 -202 -169 269 -165 -88 -32
3477 -32 -65 65 212 -76 -37 230 44 -139 144 100 -53 -352 -55 8 -26 241 -163 -57 171 -2 -315 37
3499 37 150 -29 24 -210 101 -3 -54 -130 -157 163 -67 254 -87 -272 -74 120 -152 -43 293 -68 -180 154
3521 154 57 -218 31 169 -426 65 -52 -80 39 112 140 48 161 -118 -182 240 -157 -145 308 -169 -257 82 11
3544 11 -28 -78 -101 -451 -57 84 -265 28 241 -311 282 343 -142 259 244 -64 -141 274 -99 15 -14 -341 -14
3567 -14 133 67 -282 63 55 -185 160 173 -170 35 210 -131 -106 298 17 -99 192 9 -56 325 -120 -143 140
3590 140 152 -239 161 164 -357 82 233 57 -340 4 -49 -6 97 -219 38 197 -129 131 402 -30 -57 546
3612 546 -65 -8 -35 476 -88 28 49 -163 -164 -2 -137 99 184 -363 -141 -7 -222 -193 162 233 238 265 -14 -504
3636 -504 276 15 -165 332 159 -228 113 185 -424 -44 25 -376 -322 120 -366 -76 -16 -383 -35 273 -139
3657 -139 -402 -60 -210 -63 313 155 -282 331 154 -272 158 349 -299 138 211 -211 -117 225 -197 -253 295
3678 295 233 -66 157 111 -146 258 -39 -304 213 200 -212 105 35 -361 107 548 -278 -271 342 -87 -150 451
3700 451 -119 -446 178 -174 -546 18 184 -405 78 212 -284 205 233 -88 -62 444 -313 -169 334 -138 -68
3721 -68 378 -108 -119 452 -148 -466 300 -198 -487 37 132 -318 64 331 -192 -98 -84 -205 -78 381 -93 -86
3743 -86 469 -104 160 432 -27 -401 395 -61 -356 79 145 -377 96 130 -478 -40 232 -547 59 661 -159
3764 -159 -553 262 -213 -181 409 -118 -341 136 104 -655 391 50 -196 109 27 -287 93 470 -403 -111 492
3785 492 -179 -227 292 -335 -333 466 -250 -339 335 -144 -227 121 123 -309 135 179 -297 103 63 -303 -91 378 -390
3808 -390 81 423 -184 -235 333 -220 -322 136 129 -111 236 315 -460 -24 354 -545 -158 386 -272 117 -9
3829 -9 -120 -34 333 -93 -68 163 -9 -590 215 -4 -416 87 156 -127 321 104 -244 -143 203 -114 -16 59
3851 59 -274 -205 325 -83 -413 441 -167 -386 419 88 -294 120 147 -489 -4 228 -708 -52 226 -418 98
3872 98 391 -158 -201 342 -187 -65 330 -112 -244 387 -127 -289 277 16 -120 139 279 -176 276 264 -389
3893 -389 117 347 -303 37 333 -318 -250 122 -36 -116 396 54 -81 -78 -56 -331 281 305 -266 -20 481 -298
3915 -298 -1 484 -25 4 -18 51 -160 -13 -144 -335 319 170 -306 88 122 -339 170 150 -255 287 -241 -210
3937 -210 -149 -57 -316 -13 321 -103 -378 165 -192 -27 -29 33 -159 114 110 -380 39 -6 -146 -41 339 -213 106
3960 106 99 -211 -66 44 -49 -135 -97 -96 -106 157 69 -81 -316 -149 -23 7 -197 -138 -62 7 -152 148 195 -12 -163
3985 -163 52 209 107 151 191 146 155 328 -56 -77 152 -130 -47 208 -364 32 210 -160 132 297 100 -166
4007 -166 485 1 -214 175 281 -141 184 148 87 -69 487 -274 76 58 -118 215 218 -139 -204 165 -54 14
4029 14 498 -15 -249 101 -175 -80 22 43 -58 35 -147 -173 20 -65 -364 126 154 123 185 231 136 -65 85 -22
4053 -22 -190 283 -145 2 -108 253 225 133 -99 -157 187 280 -99 98 94 24 9 141 -236 -51 -17 -86 -186 58
4077 58 -201 -170 -7 99 -81 -151 293 -181 327 -13 -60 96 347 -266 161 232 11 214 5 -157 -38 192
4099 192 -139 -165 222 -150 -163 247 -139 -98 -47 63 -114 97 161 113 -106 212 -10 -158 -178 -125 -72 185 -43
4122 -43 21 83 52 -49 204 -159 -106 -221 162 -274 101 55 -238 -33 0 11 -192 128 -15 -187 224 -27 -215
4145 -215 138 6 68 218 31 34 309 175 -130 108 250 -235 38 463 -397 268 620 -181 -43 246 -279
4166 -279 43 141 124 -69 135 120 -43 93 34 -208 33 163 -277 285 328 -162 68 81 -119 -281 198 160
4188 160 -201 192 27 -269 137 -131 49 -100 220 -116 189 -31 -378 -83 571 -200 149 383 -119 -72
4208 -72 47 8 10 345 -240 -103 422 -280 -271 73 270 -154 -1 105 -131 192 121 -247 -70 -25 -474 28 333
4231 333 57 -47 197 -131 -242 287 19 -367 162 -63 -218 335 293 -343 -35 220 -109 -123 219 -164 31
4252 31 325 -214 -90 167 88 -266 103 326 -381 233 173 -242 199 69 -419 210 104 -231 283 313 -220
4273 -220 -143 348 -166 72 257 5 -35 364 -181 -222 318 -157 -126 148 6 -190 266 258 -109 15 342 -237
4295 -237 -185 350 -184 15 319 -108 -50 111 -254 -158 385 95 96 310 71 -372 174 226 -446 -65 434 -8
4317 -8 -114 273 19 -5 177 -16 -201 -21 -14 -99 91 -166 -509 118 219 -230 -46 406 -230 86 263 -162
4339 -162 -16 137 -178 95 122 137 -243 214 18 -86 35 -90 -408 242 -33 -294 229 32 -222 0 204
4360 204 33 -19 407 -240 -101 242 -84 -238 173 -127 -106 307 51 -452 24 145 -284 217 341 -45 205
4381 205 -147 -191 11 601 -436 258 148 -124 147 49 -25 -233 326 -76 88 211 32 -110 155 67 -322
4402 -322 334 110 -391 -193 358 -344 135 356 6 -402 262 -107 -289 38 95 -441 75 94 -248 286 89
4423 89 12 298 -219 30 62 68 -305 -304 134 -103 -162 179 -19 -119 204 53 -307 9 180 -366 367 -53 -141
4446 -141 5 72 22 -110 32 -3 -49 116 -219 -201 377 -231 -129 -76 245 145 18 97 -139 99 -20 77 120
4469 120 -129 -258 -71 116 -191 -235 379 7 -282 349 73 15 151 -30 -214 -182 -208 -193 84 33 -252 -47
4491 -47 327 -166 -141 251 -246 -156 -89 46 18 -1 47 52 -46 -217 -83 46 41 -99 83 -212 -203 -146 -30 -59 38 -8
4517 -8 192 -80 36 -178 -18 209 42 -132 210 122 -155 142 19 -152 -93 -37 -90 13 212 -82 243 14
4539 14 64 -137 56 -96 -80 217 200 -77 -77 258 -186 44 -70 27 -70 201 -47 28 241 -247 205 421 118
4562 118 -182 45 22 -7 111 -5 -193 -69 91 -34 -206 -44 -185 -45 223 -111 4 144 5 82 -91
4583 -91 -342 18 54 163 49 344 305 -140 118 -37 -291 -313 -119 -38 -168 9 -312 -36 147 -184 -25 50
4605 50 -90 -119 119 -361 -195 343 96 -80 83 428 -5 151 68 -14 230 237 -96 -77 -93 162 -13 275 -111
4628 -111 -168 10 -13 -42 -69 162 13 255 -111 34 187 -30 -265 -212 205 -132 -87 108 -227 25 69 -373
4650 -373 -41 313 229 -129 297 -299 226 43 -208 -70 207 -46 -36 75 143 -137 76 208 26 -4 208
4671 208 -341 -112 263 66 -137 126 28 -61 187 27 -66 36 -20 -177 108 87 -301 -68 -49 25 -8 12 -99
4694 -99 65 162 -158 261 40 -293 -368 194 -107 -60 108 45 -72 204 11 -304 84 -83 -210 180 86 -191
4716 -191 -38 85 -7 179 191 -55 -229 216 85 -70 111 -195 -33 146 -79 -283 152 -40 90 -14 204
4737 204 180 51 238 -208 117 61 -231 89 465 100 -84 305 -298 -176 128 -39 41 116 244 -58 -15 317
4759 317 -419 -101 358 -152 188 301 -270 -66 68 51 146 269 -128 -244 384 80 -482 187 40 -370 -49
4780 -49 73 -478 323 192 -237 264 55 -272 -51 141 118 -41 367 -58 -146 -64 -65 -16 208 -47 -294 79
4802 79 303 -204 57 393 1 10 192 97 -168 320 -260 -330 -5 -178 29 289 90 54 177 230 -360 107
4824 107 350 -163 368 138 -158 -209 145 -93 -154 402 -246 -117 18 52 -212 65 27 -171 211 -33 -207
4845 -207 40 -52 -4 -55 363 -197 38 96 -206 91 211 36 72 220 72 -29 283 302 -128 250 74 -405
4867 -405 127 -286 -248 -15 125 -211 95 6 128 135 202 -63 -35 249 -197 -48 111 -66 -9 377 285 -10 156
4890 156 56 -170 106 69 -217 -113 130 -151 -222 64 -176 -32 -30 -107 -52 185 85 -266 169 -39 -157 -36
4912 -36 326 -127 112 201 -129 19 513 -70 21 -13 81 -86 176 52 -360 -21 -141 -230 57 53 -169 29 85
4935 85 -253 138 182 -234 -149 33 -278 -44 -8 23 -63 -108 -150 136 478 45 -211 202 207 -260 57 -36 -313 -92
4959 -92 26 -15 -147 -68 60 -130 75 -6 -201 344 62 48 -125 14 -43 -39 -17 2 40 26 -32 208 21 24 -76
4984 -76 83 -168 -35 -25 -113 -235 96 -134 -78 101 79 -72 -132 127 -57 34 39 -14 175 67 20 89 273 -44
5008 -44 -45 51 -199 131 97 -23 -201 391 -130 -527 -111 -12 153 57 13 -391 11 229 -116 79 164 -48 47
5031 47 101 -125 -156 50 -6 -162 -143 47 -241 -193 261 -93 241 113 -321 183 30 -129 -46 -30 232 -162 14
5054 14 148 170 204 25 -82 352 -72 -289 184 114 -192 281 312 -52 48 153 19 46 -66 -53 -4 141 -136
5077 -136 -165 44 26 -208 155 -179 -53 252 111 15 105 73 63 0 -77 -57 -65 54 21 115 41 117 97 50 -44 116
5103 116 173 8 -104 5 -1 -214 47 86 -136 -281 130 -106 24 205 89 62 272 -125 171 92 156 165 -123
5126 -123 260 -52 2 -4 20 138 -86 -221 66 -42 113 7 162 45 -153 34 -123 -14 290 -107 -267
5147 -267 11 42 -190 88 55 -259 -1 -123 -295 -64 -57 -164 -165 -51 -109 170 237 -29 81 103 -11 -93 254
5170 254 -237 -23 208 49 24 -104 108 40 356 57 -45 120 -97 72 61 -20 -1 -43 232 -33 -68 264
5192 264 16 29 190 -21 -15 219 -80 -266 -52 95 -355 36 -14 94 78 -70 -125 71 -90 -100 -192 60 -443
5215 -443 -128 122 11 -449 27 -8 -363 70 -82 -94 154 331 -179 72 -138 -229 -21 105 -74 -215 49
5236 49 -25 -176 -15 -67 -128 -298 54 -14 122 238 -131 -205 41 -184 86 -41 -21 -5 -101 -183 0 31 77 148
5260 148 69 -110 -202 178 -171 133 -32 -103 -330 138 -73 -200 110 278 46 -68 28 132 -261 128 16
5281 16 16 -8 89 -75 -86 127 -148 332 43 79 -92 113 -123 239 113 -198 143 -70 38 24 255 47 -153
5304 -153 141 -166 36 -101 162 99 -309 129 126 -89 18 124 77 200 -210 0 -7 -283 -16 26 -214 205
5326 205 114 270 65 151 -67 -116 136 172 -327 269 -63 -188 56 170 -374 -34 64 -210 162 17 -103 -214
5348 -214 173 -81 -140 5 23 -11 -144 297 -96 -133 -261 -52 357 93 34 -231 227 -42 117 162 60 3
5370 3 145 -238 -37 303 -77 -169 -4 -205 -6 -94 -112 -136 110 118 -68 17 238 -127 -88 39 -45 -45 94 -241
5394 -241 -91 215 183 63 -5 -114 -224 469 184 39 -104 169 -100 -101 172 16 -142 78 -77 -411 168
5415 168 -420 34 128 -12 -54 179 -139 -156 76 155 -124 -123 284 -188 -295 -17 254 156 80 -355 168 156 -136
5438 -136 -157 -71 -4 29 143 40 -119 104 -42 -432 29 -192 -164 -61 230 77 -103 362 -25 5 174 -188
5460 -188 -183 31 -37 -206 216 288 -254 216 42 -63 -27 -91 -192 -184 24 65 -40 417 168 -72 128 -10 181
5483 181 162 107 71 -70 -320 -71 54 -104 7 27 -13 2 -137 215 -124 -45 -122 -13 -123 241 -162 -61 56
5506 56 -20 -198 -95 -133 240 -88 -8 25 65 162 -62 206 38 21 -209 -11 -133 28 -14 -99 -237 9 154
5529 154 153 414 -140 -66 -150 8 -92 -62 176 80 83 218 85 -6 199 -341 -6 347 -146 33 -74 30 -144
5552 -144 3 174 -56 253 168 -47 73 -7 -108 2 93 21 -184 -285 7 27 -20 -186 -443 79 -80 26
5574 26 157 -43 -178 14 134 211 61 -2 40 -240 -39 -241 -26 75 74 -194 298 24 47 -38 -174 -163 273
5597 273 49 70 264 -60 64 -143 20 -222 -40 103 -98 -123 372 62 -160 166 -8 -186 139 -141 88
5618 88 134 -5 136 148 54 -44 -3 -64 -95 -44 85 -10 191 -60 119 -89 50 -360 -121 150 240 -131 210 -9
5642 -9 -6 414 -245 -133 304 151 -152 116 -37 38 67 49 -35 175 86 -7 25 22 -85 159 168 114 199 -57 205 10
5668 10 19 -145 -186 -80 -48 -118 -218 -12 -137 20 -82 -121 124 -93 -469 -225 140 -103 -47 141 19 292 -38
5691 -38 39 118 -329 86 83 -64 -157 107 -219 290 -180 -123 190 -143 51 229 34 -103 25 -97 161 12
5713 12 244 -196 52 -204 15 -161 18 1 -83 73 6 -179 -108 -71 -144 9 -81 -140 -135 -165 -408 -51 -181 -12
5737 -12 116 140 16 433 161 -147 56 364 -21 71 374 91 94 32 55 21 23 -98 0 -62 -23 -273 241 -143
5761 -143 5 60 -56 -16 109 -131 -96 63 463 109 335 168 -119 -177 17 52 21 139 312 -84 -64 -219
5783 -219 99 306 180 -97 109 159 -284 -30 67 321 -159 69 -72 -145 40 46 -318 362 61 -130 -92 177
5805 177 -80 12 45 -196 131 -10 -86 -197 137 -393 -70 117 -291 -185 24 170 -83 -250 192 -285 125
5826 125 137 -345 -99 72 -114 -12 -101 92 -13 -77 63 20 277 -201 36 -145 -84 -15 123 -147 -194 175
5848 175 104 -223 60 332 -245 27 66 -73 62 118 55 250 226 -132 -133 258 -52 -71 -27 -183 -143 -225 -314 -14
5872 -14 124 120 -246 -42 409 -86 94 276 105 -49 -190 131 -54 82 -112 -59 5 -164 -127 -29 162 -246
5894 -246 215 240 -16 117 177 22 -82 -41 -61 450 -105 27 -58 15 87 -289 158 185 34 151 -191 -131 187
5917 187 -260 -201 -49 21 -140 143 200 77 14 -52 -14 -65 9 -88 189 214 8 106 100 -164 -127 85 91 -233 146
5942 146 139 -180 140 162 -309 -61 138 -222 -22 303 -251 46 405 2 6 -129 -212 36 127 26 -35 -5 -65
5965 -65 -25 -189 14 18 16 -50 -233 -101 213 -12 -97 49 -94 -102 193 92 -112 111 264 -235 108 -60 -57 -245
5989 -245 33 36 -58 38 -49 160 116 -295 -144 104 -75 72 61 -3 49 -185 71 -75 92 39 -156 -88 175 -81
6013 -81 -74 147 -85 68 224 -188 135 205 94 -73 94 39 -115 96 406 217 273 94 -219 183 135 -41
6035 -41 33 319 89 -45 179 -101 119 80 -136 -86 15 6 -273 74 -241 -41 286 183 -81 204 153 -263
6057 -263 -63 -19 47 -11 -145 -116 -116 54 52 21 229 -63 -51 10 49 -256 -30 157 223 66 -65 -21 -209 130 -259
6082 -259 -78 87 103 -17 43 -251 -73 10 251 -13 96 152 -11 230 20 106 -72 182 -346 179 262 52
6104 52 134 50 235 -146 -17 -77 54 66 169 -267 125 48 -401 -47 -215 -129 251 174 -312 -73 81 86 79 63
6128 63 -198 -18 68 63 -117 -47 92 -236 -31 -22 -244 -33 207 -274 -32 22 -50 -24 79 20 -29 -99 66 -136
6152 -136 -38 52 158 110 55 -208 121 157 -46 283 172 -182 90 -51 -193 -107 352 -55 -308 108 -201 18
6174 18 -98 -65 -306 9 0 -53 -77 -141 238 213 -94 107 -94 56 139 -132 197 82 19 111 -20 -28 -65 83 -31
6199 -31 -83 117 52 -25 17 -51 84 -82 -195 -86 126 -34 87 149 -261 44 -234 4 -128 135 -56 99
6221 99 158 32 -121 -141 38 -21 -94 102 113 -190 8 125 -40 -42 -7 -106 -28 -45 -143 181 -234 -92 262 256 50
6246 50 106 -16 -74 55 50 -38 182 -186 75 75 91 -42 -240 -79 -192 -117 -154 36 -166 145 -58 -141 98 91 46
6271 46 -145 93 -213 143 -135 78 172 -162 56 82 -110 72 92 -159 14 -27 -99 -150 217 62 189 107 -58
6294 -58 -83 6 99 75 -49 130 46 28 277 243 -137 9 83 -140 -86 67 -214 -97 -126 -32 -133 60 220 158
6318 158 43 93 204 -70 189 -28 89 -312 -15 -65 -107 150 -123 -20 -144 144 30 -135 9 270 -60
6339 -60 -20 93 234 42 -224 -256 -106 18 43 94 -145 131 -63 -207 333 138 -234 25 147 -253 -101 104
6361 104 -144 218 189 -7 -227 -357 147 178 80 -156 -55 264 -377 89 18 -207 -45 -52 -85 133 20 -94
6383 -94 -124 84 168 228 -53 -166 1 -118 84 -45 -161 -92 134 -206 -1 -254 -12 278 -44 -232 47 -79
6405 -79 54 120 26 213 -40 225 126 108 257 -92 152 119 255 -210 23 243 -361 71 -21 -238 100 -168
6427 -168 -62 81 -153 116 162 4 -126 -320 137 -53 102 262 48 44 76 -181 -171 91 137 -100 225 219 -212
6450 -212 -4 279 -113 29 235 -96 28 119 128 -275 114 -142 97 149 -113 -57 38 -205 -170 -330 -133 181
6472 181 -287 -176 -32 201 91 167 27 67 -185 -125 393 -42 -40 -35 -290 -247 122 12 25 180 -25 176 158
6495 158 65 54 37 196 60 121 -14 196 90 100 158 134 142 51 -7 139 228 -23 -23 -2 -63 5 339 -268 37 158
6521 158 -355 -181 213 -155 7 -271 -162 -150 96 -144 172 103 45 -268 -123 312 -119 143 77 73 37 55 248
6544 248 0 158 -257 212 371 -139 72 -53 14 -29 156 -280 12 -202 51 -223 276 -303 -82 -132 -267
6565 -267 32 20 -216 -14 -79 -68 141 -325 63 141 169 -208 5 9 15 -155 -1 24 27 -84 105 -179 12 89
6589 89 87 -31 -84 -141 -80 -108 -86 192 -252 -73 -220 -154 -23 7 119 41 -136 -89 -279 21 185 -310 -133 -239
6613 -239 104 116 39 -7 -14 3 -145 92 -98 -32 49 257 -242 -255 35 -88 197 -85 130 -50 -42 156 -20 -59
6637 -59 398 69 26 -18 -17 158 230 -95 -68 3 -249 90 -38 18 -65 -84 -368 68 -139 44 -83 63 173 99
6661 99 66 -340 92 -36 118 -147 29 -17 199 -59 -122 -401 82 291 -11 1 55 -119 152 162 56 -230
6683 -230 206 -236 47 119 -284 -16 -121 325 168 155 -7 134 -149 27 109 138 26 70 84 295 -39 123
6705 123 41 -123 105 54 -58 -306 316 -22 -70 387 -390 167 291 31 -135 -247 214 -27 -316 185 -20
6726 -20 94 77 -46 95 -164 -81 -249 70 123 -76 -76 53 -95 -54 -84 -203 -164 -279 155 -39 179 9 -80
6749 -80 -10 51 -65 181 -104 -131 -160 -56 -304 398 50 -217 170 -73 -65 -243 196 268 -18 69 -213 -23 144
6772 144 -175 114 22 55 263 116 -300 222 87 57 -79 103 8 -159 -154 7 -5 174 473 -112 99 -78
6794 -78 -71 -71 -45 -314 -48 131 -130 45 -102 -62 -27 54 -13 -281 -33 14 -133 394 -153 -32 -194 6 -13 97
6818 97 113 81 -75 -70 37 -255 123 142 21 97 209 -77 68 64 -301 -5 67 -71 18 -142 -7 -205 -209 129
6842 129 -104 -125 -42 -262 306 140 -45 -131 141 -73 87 264 136 51 -116 -54 75 95 -53 -5 -23 167 -277
6865 -277 301 -176 -192 135 192 -54 60 32 -25 25 24 -20 -286 -50 -90 74 -34 -13 232 -82 -131 168 67 -277
6889 -277 101 41 -101 86 43 18 -126 -51 24 -75 116 -123 -123 -24 84 -20 101 -117 -89 33 173 209 31 21
6913 21 -132 -103 294 -15 -23 393 -124 -202 -14 146 -466 43 80 -38 78 -146 26 28 174 -66 -164 166 -27
6936 -27 -242 -85 144 30 334 -28 -98 -21 3 -226 -58 -63 62 -112 -90 -99 -84 15 28 -145 202 -195 -205 147
6960 147 -2 -107 88 211 178 63 -17 47 27 210 -131 227 67 -29 -58 67 -7 -31 50 -33 20 127 5 -52
6984 -52 174 -50 16 107 66 -289 10 134 -64 -201 94 -120 -194 -16 -167 -73 -81 -68 -38 150 -4 18 76 -1
7008 -1 -148 -8 28 -45 -127 -3 8 45 -81 41 -203 47 -177 -113 163 -117 -46 -13 45 -32 5 44 49 117 97 32
7034 32 172 -71 -62 -49 135 19 -51 -65 45 88 12 -2 -183 -107 -183 62 -28 20 -16 -157 11 198 165 105 -116
7059 -116 -62 55 -25 25 239 186 -6 -52 -14 -258 264 293 132 398 -75 -192 21 -18 -127 2 176 -62 212
7082 212 76 -154 179 -199 -95 -43 55 286 -175 133 192 -48 -76 -186 -234 92 189 45 178 -12 -275 20
7104 20 33 -73 110 347 -59 349 48 71 54 59 -97 -155 -41 -34 -50 -103 -3 -4 -2 110 121 -152 253 -208 224
7129 224 76 195 -88 70 47 132 -6 2 -51 42 106 9 166 175 -212 22 212 -5 29 -113 -92 -16 121 304
7153 304 20 -67 324 -158 210 37 7 47 98 72 43 -44 24 90 -88 -77 190 -72 215 -101 51 22 -126 42
7177 42 73 -161 127 -19 1 202 -102 -195 185 -46 -131 128 0 -90 249 293 -14 -218 3 54 -201 -91 52
7200 52 -182 -170 35 121 80 51 187 10 24 -159 163 152 208 -67 232 -34 126 38 -268 -184 -45 152 147 56
7224 56 11 -220 124 -157 -112 -19 -91 -179 73 137 -143 292 150 -134 124 -186 -173 46 18 67 -61 42 -102
7247 -102 28 259 -156 -210 148 137 288 100 184 -302 150 -118 154 -111 -125 72 -49 22 -279 -166 -59 36
7269 36 -194 -83 25 -34 167 -63 -250 156 -2 -165 43 59 28 15 4 -294 -102 351 -146 130 33 203
7291 203 25 71 -28 -156 165 -87 -40 1 53 -46 54 -17 35 81 70 -326 157 -122 31 -210 -17 -18 188 19
7315 19 -10 -207 75 -86 -155 20 143 -54 -265 39 -68 63 139 -1 -373 83 -204 -85 114 -37 -31 238
7337 238 -156 20 23 -154 71 85 -88 -251 -240 147 137 -18 -68 -59 -64 -27 -199 143 83 -42 -291 307 -36 -113
7361 -113 266 292 -47 130 -87 -154 -78 -41 84 201 139 -271 173 112 -117 283 103 54 185 -6 -94 -40 27
7384 27 194 -87 95 48 259 -246 -25 -414 51 -79 -267 -153 217 116 -78 -65 -194 -25 269 -177 -41
7405 -41 70 -302 163 61 214 185 -189 -136 88 -70 38 -165 -49 172 46 111 -14 -226 -12 38 -8 104
7427 104 23 26 -25 -86 75 -196 -33 96 36 303 -430 -53 99 138 61 -262 -34 100 37 70 177 -35 -223
7450 -223 -113 -172 -103 -91 -330 -2 -95 126 -79 -14 -122 -105 -134 94 15 216 251 -171 23 -178 128 342 63
7473 63 -10 246 113 105 125 60 38 118 -261 223 36 -120 220 285 299 -7 -13 81 -99 -182 -151 9 -207 -81 -89 12
7499 12 3 162 -74 305 14 -235 117 -101 48 276 28 8 -70 -125 -274 118 59 227 287 139 -180 -52 36
7522 36 -112 137 214 145 156 -385 61 -135 195 132 27 -51 -54 314 -277 -295 -1 -40 -11 63 -26 -87 -102 79 142
7547 142 -9 206 26 80 12 46 -46 -121 -171 -99 -184 155 -1 -205 190 223 100 -35 120 -66 117 343 202
7570 202 -72 -169 -99 182 219 -168 -12 146 -32 241 -3 1 -152 -269 -85 -4 74 148 -23 -177 33 242 -24
7593 -24 -116 172 260 -229 10 -109 -3 -28 -9 -222 124 288 -55 -2 -66 158 73 -25 -26 153 -60 -40 216 -136
7617 -136 -74 58 156 -346 -110 126 151 300 41 -268 128 -237 -44 -64 25 101 -198 38 -217 -159 -139 -54 -97
7640 -97 -238 -109 -232 -23 96 130 75 -14 198 -34 30 84 -84 22 -8 -211 -237 -11 -240 15 -26 -23 124 397
7664 397 -87 -346 220 57 -36 100 -16 -65 60 -29 -404 76 -221 44 -31 186 1 -1 -54 82 11 66 183
7687 183 69 314 0 108 -132 123 -107 -11 214 -310 20 -24 -60 110 -317 -94 -99 96 -93 -171 -130 -184 -158
7710 -158 119 98 70 11 27 -118 9 -103 63 89 -4 -5 8 168 -148 7 71 84 -13 -140 -276 114 -34 -290
7734 -290 -249 143 67 -89 -82 12 247 33 -50 145 -141 32 24 41 83 -53 72 -73 -4 -120 281 62 38 -20
7758 -20 -204 66 263 102 -134 64 132 120 84 -36 -160 25 101 99 -208 88 -9 -13 -170 68 266 41 265
7781 265 -59 35 50 69 121 -10 -20 -24 -162 -21 -149 -11 -140 205 -145 -33 26 169 211 130 328 -5 60 -243
7805 -243 0 118 158 88 -99 80 -16 -214 354 156 -14 221 -156 -18 -124 -15 -92 -134 -6 101 110 64 -256
7828 -256 -87 85 55 -65 -47 101 -180 130 120 -163 152 -63 -105 13 -35 151 -150 -32 46 -124 -59 -120 -45
7851 -45 -153 138 -3 -32 -63 -74 3 -41 -176 -208 -181 -74 79 225 127 12 -222 -270 -106 -178 -270 -209 -172 213 -82
7876 -82 109 -394 -5 164 371 10 35 269 -108 -71 167 170 -77 -79 202 -175 -97 -124 -39 -64 -98 -136 274 11
7900 11 119 94 111 -6 5 -102 -128 153 8 -24 68 91 -363 57 79 -7 169 -157 29 -24 139 2 163 31
7924 31 -192 -112 247 69 60 71 -46 -39 19 18 49 -99 29 -247 -93 239 -122 -250 -42 -20 -35 -19 -76 -110 -90 -150
7950 -150 -83 24 -19 -237 117 -62 -69 152 42 142 251 123 -320 -125 101 21 -34 -22 -77 18 -7 -333 139
7973 139 321 7 -346 -79 -148 -5 15 10 -49 129 196 -28 -113 73 26 -72 -4 32 -53 87 -141 -217 114 246
7997 246 -146 45 10 -375 -87 -124 -117 -30 27 -76 -200 92 -33 -27 -328 -268 -31 184 -15 151 278 233 -156
8020 -156 -107 -68 -6 -171 144 32 -126 153 33 124 -9 -199 14 -147 -122 -21 291 -51 98 24 127 -31
8042 -31 19 -35 -9 74 12 12 -24 140 -215 99 48 130 207 -287 -117 20 330 -180 -17 -42 36 -365 71 138 -269
8067 -269 13 78 26 73 156 -45 14 -122 -106 -96 158 -69 -3 148 105 -156 -9 290 -119 -32 32 -235 -61 -229
8091 -229 207 -333 91 -382 -66 -38 61 81 32 -87 -37 22 -297 99 66 -128 74 -106 178 -34 101 77 148
8114 148 44 144 -11 91 -7 -218 -185 -11 -241 70 -57 -66 294 67 -80 101 -126 79 -143 -228 -5 -161
8136 -161 222 128 -145 -80 108 203 -8 -7 -88 -125 88 -106 53 -197 181 159 39 277 36 22 212 103 83
8159 83 -95 -149 98 58 -56 32 -180 -174 235 -64 20 -410 158 -66 -55 -230 40 -205 -79 -196 -18 131 235
8182 235 -139 -12 108 -28 -18 -182 13 -5 -60
8191f0
##END NTUPLES=NMR FID
##END=
