##TITLE=1H_46-2024
 CDCl3
 8 sc, 
 27.6.2024
##JCAMPDX= 6.0         $$ Bruker NMR JCAMP-DX V2.0
##DATA TYPE= NMR FID
##DATA CLASS= NTUPLES
##ORIGIN= UXNMR, Bruker Analytische Messtechnik GmbH
##OWNER= root
$$ XWIN-NMR		Version 3.5
$$ Thu Jun 27 14:49:57 2024 Russian Standard Time (UT+4h)  she@DPX200
##.OBSERVE FREQUENCY= 200.1313
##.OBSERVE NUCLEUS= ^1H
##.DELAY= (6, 6)
##.ACQUISITION MODE= SIMULTANEOUS
##.ACQUISITION SCHEME= undefined
##.AVERAGES= 8
##.DIGITISER RES= 18
##SPECTROMETER/DATA SYSTEM= spect
##.PULSE SEQUENCE= zg30
##.SOLVENT NAME= CDCl3
##.SHIFT REFERENCE= (INTERNAL, CDCl3, 0, 15.7039)
##AUDIT TRAIL= $$ (NUMBER, WHEN, WHO, WHERE, WHAT)
$$ ##TITLE= Audit trail, XWIN-NMR		Version 3.5
$$ ##JCAMPDX= 5.01
$$ ##ORIGIN= Bruker BioSpin GmbH
$$ ##OWNER= she
$$ F:/spectra/data/she/nmr/H-F/1/audita.txt
$$ ##AUDIT TRAIL=  $$ (NUMBER, WHEN, WHO, WHERE, WHAT)
(   1,<2024-06-27 14:43:33.95 +0400>,<she>,<DPX200>,
      <created by zg, POWCHK disabled, PULCHK disabled
       configuration hash MD5:
       00 E9 B6 7A A2 85 ED C7 34 08 36 98 17 FE 4E 26
       data hash MD5: 16K
       1E 1F AB 49 36 16 12 D1 E6 1B F6 16 C5 3D 18 E1>)
$$ ##END=
$$ 
$$ hash MD5
$$ 75 3B 95 15 15 3F 00 3C 1C 43 F5 BE 7F 55 6A C4
##$RELAX= 
##$RELAX= 
##$RELAX= 
##$RELAX= 
##$RELAX= 
##$RELAX= 
$$ Bruker specific parameters
$$ --------------------------
##$DU= <F:/spectra>
##$EXPNO= 1
##$NAME= <H-F>
##$PROCNO= 1
##$TYPE= <nmr>
##$USER= <she>
##$AMP= (0..31)
100 100 100 100 100 100 100 100 100 100 100 100 100 100 100 100 100 100 
100 100 100 100 100 100 100 100 100 100 100 100 100 100 
##$AQSEQ= 0
##$AQ_mod= 1
##$AUNM= <au_zg>
##$AUTOPOS= <>
##$BF1= 200.13
##$BF2= 200.13
##$BF3= 200.13
##$BF4= 200.13
##$BF5= 200.13
##$BF6= 200.13
##$BF7= 200.13
##$BF8= 200.13
##$BYTORDA= 1
##$CFDGTYP= 0
##$CFRGTYP= 5
##$CHEMSTR= <none>
##$CNST= (0..31)
1 1 145 1 1 1 1 1 1 1 1 1 1 1 1 1 1 1 1 1 1 1 1 1 1 1 1 1 1 1 1 1 
##$CPDPRG= <>
##$CPDPRG1= <>
##$CPDPRG2= <>
##$CPDPRG3= <>
##$CPDPRG4= <mlev>
##$CPDPRG5= <mlev>
##$CPDPRG6= <mlev>
##$CPDPRG7= <mlev>
##$CPDPRG8= <mlev>
##$CPDPRGB= <>
##$CPDPRGT= <>
##$D= (0..31)
0 1.2 0 0 0 0 0 0 0 0.06 0 0.03 0 0 0 0 0.0002 0 0 0 0 0 0 0 0 0 0 0 0 
0 0 0 
##$DATE= 1719485013
##$DBL= (0..7)
120 120 120 120 120 120 120 120 
##$DBP= (0..7)
150 150 150 150 150 150 150 150 
##$DBP07= 0
##$DBPNAM0= <>
##$DBPNAM1= <>
##$DBPNAM2= <>
##$DBPNAM3= <>
##$DBPNAM4= <>
##$DBPNAM5= <>
##$DBPNAM6= <>
##$DBPNAM7= <>
##$DBPOAL= (0..7)
0.5 0.5 0.5 0.5 0.5 0.5 0.5 0.5 
##$DBPOFFS= (0..7)
0 0 0 0 0 0 0 0 
##$DE= 6
##$DECBNUC= <off>
##$DECIM= 32
##$DECNUC= <off>
##$DECSTAT= 4
##$DIGMOD= 1
##$DIGTYP= 9
##$DL= (0..7)
0 120 120 120 120 120 120 120 
##$DP= (0..7)
150 150 150 150 150 150 150 150 
##$DP07= 0
##$DPNAME0= <>
##$DPNAME1= <>
##$DPNAME2= <>
##$DPNAME3= <>
##$DPNAME4= <>
##$DPNAME5= <>
##$DPNAME6= <>
##$DPNAME7= <>
##$DPOAL= (0..7)
0.5 0.5 0.5 0.5 0.5 0.5 0.5 0.5 
##$DPOFFS= (0..7)
0 0 0 0 0 0 0 0 
##$DQDMODE= 0
##$DR= 18
##$DS= 0
##$DSLIST= <SSSSSSSSSSSSSSS>
$$ [...]
##$SUBNAM2= <"">
##$SUBNAM3= <"">
##$SUBNAM4= <"">
##$SUBNAM5= <"">
##$SUBNAM6= <"">
##$SUBNAM7= <"">
##$SUBNAM8= <"">
##$SUBNAM9= <"">
##$SW= 18.0517328524113
##$SWIBOX= (0..15)
0 0 2 0 0 0 0 0 0 0 0 0 0 0 0 0 
##$SW_h= 3612.71676300578
##$TD= 16384
##$TD0= 1
##$TE= 0
##$TE2= 300
##$TE3= 300
##$TEG= 300
##$TL= (0..7)
0 120 120 120 120 120 120 120 
##$TP= (0..7)
150 150 150 150 150 150 150 150 
##$TP07= 0
##$TPNAME0= <>
##$TPNAME1= <>
##$TPNAME2= <>
##$TPNAME3= <>
##$TPNAME4= <>
##$TPNAME5= <>
##$TPNAME6= <>
##$TPNAME7= <>
##$TPOAL= (0..7)
0.5 0.5 0.5 0.5 0.5 0.5 0.5 0.5 
##$TPOFFS= (0..7)
0 0 0 0 0 0 0 0 
##$TUNHIN= 0
##$TUNHOUT= 0
##$TUNXOUT= 0
##$USERA1= <user>
##$USERA2= <user>
##$USERA3= <user>
##$USERA4= <user>
##$USERA5= <user>
##$V9= 5
##$VALIST= <valist>
##$VCLIST= <CCCCCCCCCCCCCCC>
##$VD= 0
##$VDLIST= <DDDDDDDDDDDDDDD>
##$VPLIST= <PPPPPPPPPPPPPPP>
##$VTLIST= <TTTTTTTTTTTTTTT>
##$WBST= 1024
##$WBSW= 4
##$XGAIN= (0..3)
0 0 0 0 
##$XL= 0
##$YL= 0
##$YMAX_a= 447960
##$YMIN_a= -473794
##$ZGOPTNS= <>
##$ZL1= 120
##$ZL2= 120
##$ZL3= 120
##$ZL4= 120
##$ABSF1= 10
##$ABSF2= 0
##$ABSG= 5
##$ABSL= 3
##$ALPHA= 0
##$AQORDER= 0
##$ASSFAC= 0
##$ASSFACI= 0
##$ASSFACX= 0
##$ASSWID= 0
##$AUNMP= <proc_1d>
##$AZFE= 0.1
##$AZFW= 0.1
##$BCFW= 1
##$BC_mod= 2
##$BYTORDP= 1
##$COROFFS= 0
##$CY= 11.3945322036743
##$DATMOD= 1
##$DC= 2
##$DFILT= <>
##$DTYPP= 0
##$F1P= 15.6554695791079
##$F2P= 12.8336369535428
##$FCOR= 0.5
##$FTSIZE= 0
##$FT_mod= 4
##$GAMMA= 1
##$GB= 0.15
##$INTBC= 1
##$INTSCL= 1
##$ISEN= 128
##$LB= 0.24
##$LEV0= 0
##$LPBIN= 0
##$MAXI= 10000
##$MC2= 0
##$MEAN= 0
##$ME_mod= 0
##$MI= 1.114404
##$NCOEF= 0
##$NC_proc= 0
##$NLEV= 6
##$NOISF1= 3.799351
##$NOISF2= 2.8
##$NSP= 1
##$NTH_PI= 0
##$NZP= 0
##$OFFSET= 15.70392
##$PC= 1
##$PHC0= -25477.89
##$PHC1= 14.38748
##$PH_mod= 1
##$PKNL= yes
##$PPARMOD= 0
##$PSCAL= 0
##$PSIGN= 0
##$REVERSE= no
##$SF= 200.130013532006
##$SI= 16384
##$SIGF1= 3
##$SIGF2= 2
##$SINO= 400
##$SIOLD= 16384
##$SREGLST= <1H.CDCl3>
##$SSB= 0
##$STSI= 0
##$STSR= 0
##$SW_p= 3612.71676300578
##$SYMM= 0
##$S_DEV= 0
##$TDeff= 0
##$TDoff= 0
##$TI= <>
##$TILT= no
##$TM1= 0
##$TM2= 0
##$TOPLEV= 0
##$USERP1= <user>
##$USERP2= <user>
##$USERP3= <user>
##$USERP4= <user>
##$USERP5= <user>
##$WDW= 1
##$XDIM= 8192
##$YMAX_p= 0
##$YMIN_p= 0
$$ End of Bruker specific parameters
$$ ---------------------------------
##NTUPLES= NMR FID
##VAR_NAME=  TIME,          FID/REAL,        FID/IMAG
##SYMBOL=    X,             R,               I
##VAR_TYPE=  INDEPENDENT,   DEPENDENT,       DEPENDENT
##VAR_FORM=  AFFN,          ASDF,            ASDF
##VAR_DIM=   8192,          8192,            8192
##UNITS=     SECONDS,       ARBITRARY UNITS, ARBITRARY UNITS
##FACTOR=    0.0002768,     1,               1
##FIRST=     0,             0,               0
##LAST=      2.2672688,     0,               0
##MIN=       0,             -473794,         0
##MAX=       2.2672688,     447960,          0
$$ Real data points
##PAGE= N=1
##DATA TABLE= (X++(R..R)), XYDATA
0@%%%%%%%%%%%%%%%%%%%%%kOj2J6j6J8k2K5k9L5l9M8n7O3p3Q3r5J08j19J34j53
$$ 0 0 0 0 0 0 0 0 0 0 0 0 0 0 0 0 0 0 0 0 0 0 -2 4 -8 8 -8 10 -12 13 -16 19 -20 28 -29 34 -39 44 -51 57 -62 72 -81
42h1J72j91K12k36K64k95L25l58L92m31M77n22N71o28O86p45Q10q78R48j016J070
$$ -81 91 -100 112 -124 140 -155 170 -188 204 -227 250 -272 299 -329 357 -388 422 -456 492 -524 546
63E46j095J055q57K54J556q239O5272L89468l98917l12110L58923j47592m22058
$$ 546 -549 506 -351 -97 1459 -6780 58492 447960 49043 -263067 95856 -51736 -473794
76d73794L00094L79291k09174Q166K13690l51171k53800M54388J27745l44586
$$ -473794 -173700 205591 -3583 4583 218273 -132898 -386698 67690 195435 -149151
86a49151K27948L36289m69033l45885M30518J62662l25426J40809K86707l04704
$$ -149151 78797 415086 -53947 -399832 30686 193348 -132078 8731 295438 -9266
96i266k09410K44365m6672j52071L04955R1501l96466J5462L25579k25013k38422
$$ -9266 -218676 25689 -20983 -173054 131901 223402 -173064 -157602 167977 -57036 -295458
107b95458M07261J62110m12458j275L16079j68935j78014K62136M2221k29748
$$ -295458 111803 273913 -138545 -139820 176259 7324 -170690 91446 133667 -96081
117i6081J07975J21954k48298P98L03601j39821k61493K63957J57286l14758j3434
$$ -96081 11894 133848 -114450 -113652 189949 50128 -211365 52592 209878 -104880 -118314
128a18314L08441r9902k37844J66479J10333j95573L1862J65035j57598r1617
$$ -118314 190127 90225 -147619 18860 129193 -66380 -34518 130517 -27081 -118698
138a18698J95935m8603j91334J77366J59983k32486p7216K33047m2153k03691
$$ -118698 77237 28634 -162700 14666 174649 -57837 -135053 97994 55841 -147850
148a47850J45880J45453j72930l8115J35463q9753r2041J51705K8977j42810O8388
$$ -147850 -1970 143483 -29447 -67562 67901 -21852 -113893 37812 66789 -76021 -7633
159g633J11646j58929p2431J88808N410j51952Q6475J01253j39143n2056J24863
$$ -7633 104013 -54916 -127347 61461 66871 -85081 1394 102647 -36496 -88552 36311
170C6311j5539q3143Q9969M7389j22261K496J01188p1931n7806J21369J8256j15139
$$ 36311 20772 -62371 27598 74987 -47274 -44778 56410 -15521 -73327 48042 66298 -48841
182d8841K6632P7306p6355m1717J04479N602q9235M7069N0779r0605j3914R0756
$$ -48841 -22209 55097 -21258 -62975 41504 47106 -42129 4940 55719 -34886 -48800 41956
194D1956k1126o0689N2014K7673p0949j991O1812k9565k7510O4047m999o5578
$$ 41956 20830 -39859 12155 39828 -31121 -33112 28700 -865 -28375 35672 30673 -34905
206c4905L6571M3883n6559j5364O9185k444o5710J7573M2988l7489j8528L5881
$$ -34905 1666 45549 -11010 -26374 42811 40367 -25343 -7770 35218 -2271 -20799 15082
218A5082q899j8886J9996j3173l0026K8407K4227m4265j5421N7522J590n9468
$$ 15082 6183 -12703 7293 -5880 -35906 -7499 16728 -27537 -42958 14564 16154 -43314
230d3314J7984N3646j8427k6929K0516J7949m917p484o478r3J8879J845l9695
$$ -43314 -25330 28316 9889 -17040 3476 21425 16508 9024 2546 2453 21332 23177 -16518
243a6518k493M7088j2639n1631J7585M4226j6384l7793J2699L3973q312k6517
$$ -16518 -19011 28077 15438 -36193 -18608 25618 9234 -28559 -15860 18113 9801 -16716
255a6716J94J7538J3046j6365k7601K0531L4250k2572l3500K3830L9057j7965
$$ -16716 -16522 1016 14062 -2303 -29904 -9373 24877 2305 -31195 -7365 31692 13727
267A3727l8468K0256L7176j6602l1728N386K7615L615l2566j2417L2686J6281
$$ 13727 -24741 -4485 32691 16089 -15639 -10253 17362 20977 -11589 -24006 8680 24961
279B4961k9616k1376K9838L0468k9512l1472K8996K8383k4713l2213J1881L1650
$$ 24961 -4655 -26031 3807 34275 4763 -26709 2287 30670 5957 -26256 -14375 17275
291A7275j1100l7804M677L4741L152l1991q417L9175J7853l5136j3696L4842J9331
$$ 17275 6175 -31629 -26952 7789 10941 -21050 -29467 9708 27561 -7575 -21271 13571 32902
304C2902k7066k5054K3391K7408k3062k9439J4939K8638p987l3787L183L6482
$$ 32902 5836 -19218 4173 31581 8519 -20920 -5981 22657 14670 -19117 -15934 20548
316B0548k143l5105k960K9881P689l1829j4896K9302J4386k5671j6336K0831K4611
$$ 20548 18405 -16700 -19660 10221 17910 -13919 -28815 487 14873 -10798 -27134 -6303 18308
329A8308j3945k5162J7509K9510j0814k5996N734K7645k677l1971j460K6381O80
$$ 18308 4363 -20799 -3290 26220 15406 -10590 -4856 22789 20112 -11859 -13319 13062 13742
342A3742k4545q756K1418J4034k1073j4497K0319J6881j3935j9747J1334K3230
$$ 13742 -10803 -19559 1859 15893 -5180 -19677 642 17523 3588 -16159 -4825 18405
354A8405j2202k3669R651J9499n218j8984P40K0761K258j7609k351J4877Q481
$$ 18405 6203 -17466 -7815 11684 6466 -12518 -11778 8983 11241 -6368 -8719 6158 14639
367A4639j2330j3512J3426J3457j5527j3657J1056J2549q968j4126Q660J2347
$$ 14639 2309 -11203 2223 15680 153 -13504 -2448 10101 1133 -12993 -4333 8014
379H014p466p528L203O792L674q811p268R179N977r508p633R857R628j2146p408
$$ 8014 548 -6980 -3777 3015 6689 -2122 -9390 -211 5766 -3742 -11375 -1518 8110 -4036 -11444
394a1444J3636L178p729L037M425j085q56j016k451K09N584k025r701N033N693
$$ -11444 2192 5370 -2359 678 5103 4018 3162 2146 -305 -96 5488 3463 -6238 -1205 4488
409D488j2306j619J1804k606p370N798M612q449j376J2819j946r541J1195O168
$$ 4488 -7818 -9437 2367 -239 -7609 -1811 2801 -5648 -7024 5795 3849 -5692 5503 11671
423A1671j1550J542Q354m838k379O656j840q218O273M237j7843j688J9464q202
$$ 11671 121 1663 10017 5179 2800 9456 7616 -602 5671 9908 -7935 -9623 9841 1639
437A639j6882J4560J0193j7963p807J5552M540q456O514M680j0220M182M527j5119
$$ 1639 -15243 -683 9510 -8453 -16260 -708 3832 -4624 1890 6570 -3650 532 5059 -10060
451a0060O661K5417j0671k5327J2520J5897k3987j1290L1634O783k6463n13P540
$$ -10060 -3399 22018 11347 -13980 -1460 14437 -9550 -20840 10794 17577 -8886 -9399 -1859
464a859j1225L414J2076o640K080J6696j5697k9212K3150L0412k6909j3133L5802
$$ -1859 -13084 -9670 2406 -4234 -2154 14542 -1155 -30367 -7217 23195 -3714 -16847 18955
477A8955k006l8891M151K5759m121n327J0608o408r222J3181n711j9678K7255
$$ 18955 16949 -21942 -17791 7968 3847 -1480 9128 2720 -6502 6679 968 -18710 8545
490H545K5092l6520j8602L6118K090l8957P338L6293j2084k3651J4352M330j2422
$$ 8545 33637 -2883 -21485 14633 16723 -22234 -14896 21397 9313 -14338 14 4344 -8078
503h078J0932K091j5345J7989J9876l0568j6844L8119N439m5126Q039M5299j8119
$$ -8078 2854 4945 -10400 7589 27465 -3103 -19947 18172 23611 -21515 -13476 31823 13704
516A3704l3119K0316J0407k1957K227J3331q126M889J4325k5774k0539L6178J0676
$$ 13704 -19415 901 11308 -10649 -8422 4909 -3217 1672 15997 -9777 -30316 5862 16538
529A6538m0301J1946M5244k4774m1252K4766K4294k2480j596K4850j0158j5781
$$ 16538 -23763 -11817 33427 8653 -32599 -7833 16461 -6019 -7615 17235 7077 -8704
541h704J0496j2087j4129L3600J2877l8220J095L5951k1648l7006L4456L4792
$$ -8704 1792 -10295 -24424 9176 22053 -16167 -15072 20879 -769 -37775 -3319 31473
553C1473l0157j2059K6825j0557k2118J5914N756j1675J6984Q170l4056n886L4581
$$ 31473 1316 -10743 16082 5525 -16593 -679 5077 -6598 10386 18556 -15500 -21386 13195
566A3195j0816l1263L2909K9983l7637j7202L1191j480k2650J6242J7353j5254
$$ 13195 2379 -28884 4025 34008 -3629 -20831 10360 8880 -13770 2472 19825 4571
578D571j212R730k1804p304L1735k639k7978K0149K0662l5395j8511L3601P531
$$ 4571 3359 13089 -8715 -16019 15716 13077 -14901 5248 25910 -9485 -27996 5605 13136
591A3136k6113J0494K0776k1205j2471J6915m963o794K3316K499k5965N547J9033
$$ 13136 -12977 -2483 18293 -2912 -15383 1532 -3431 -10225 13091 15590 -10375 -4828 14205
604A4205k1589j4630L3139R028l1537K686J9960j8595j2109K2637M899j3983Q827
$$ 14205 -7384 -22014 11125 20153 -11384 -8698 11262 -7333 -19442 3195 8094 -5889 2938
617B938O550k0380J50K2616r637j4050K2929N010k8691J144K1509j0428j3152
$$ 2938 9488 -10892 -10742 11874 2237 -11813 11116 16126 -12565 -11421 10088 -340 -13492
630a3492J8420N887k0307K491J3794j2795l996J8894l530j4152J1829P335j7199
$$ -13492 4928 10815 -9492 -7001 6793 -6002 -9998 8896 5366 -8786 3043 10378 -6821
643f821o44J8904n671j4460J3808P108j8071N96J4470q618q645J2852K881j3157
$$ -6821 -7465 11439 5768 -8692 5116 12224 -5847 -5251 9219 601 -8044 4808 7689 -5468
657e468K269R635r399n081J3405r02j0546Q306N255j3117r27J2869l256r764R089
$$ -5468 -3199 6436 -2963 -8044 5361 4459 -6087 2219 7474 -5643 -6570 6299 3043 -6721 2368
672B368O375j3837k964J1977k985o618P801K282q012J044M595n517n08J0717k310
$$ 2368 8743 -5094 -8058 3919 934 -5684 2117 4399 -3613 -2569 2026 -3491 -3999 6718 4408
687D408j0864O998O691j1449k168J2572o9r802J823N501m860k701M997q98j812
$$ 4408 -6456 542 7233 -4216 -6384 6188 6119 -3683 -1860 3641 -1219 -3920 1077 179 -1633
702a633M563l413o211O664N082p863k341R636R60j0191P89Q957k464n434L009
$$ -1633 2930 -483 -6694 -30 5052 -2811 -5152 4484 5444 -4747 -3958 4999 2535 -2899 110
717A10J979j387l75j574p26L539J687n508j838P799N66r191J504Q500k291o547
$$ 110 2089 702 327 -1247 -1973 1566 3253 -2255 -4093 3706 4272 -4919 -3415 5085 2794 -3753
733c753J965N049j274m097N06K277R81p57l860L88N717j726o625K243O613k231
$$ -3753 -1788 3261 1987 -2110 -1604 673 1654 897 -2963 -2575 3142 1416 -5209 -2966 3647 1416
749A416o670K350O775k546m966K510L758k61k680j463L138K794l005l643K345
$$ 1416 -5254 -2904 3871 1325 -3641 -1131 2627 2366 -314 -1777 1361 4155 1150 -2493 -148
764a48M468k998n640L444N053l755m361K586L787j275l889Q21L892o2l166j311
$$ -148 4320 1322 -4318 -874 4179 424 -3937 -1351 2436 1161 -2728 -1907 1985 1923 -1243 -2554
780b554L250K735l797l044L971K611l471k885K719L675k602l534K379L056j219
$$ -2554 696 3431 -366 -3410 561 3172 -299 -3184 -465 3210 608 -2926 -547 2509 1290
795A290k882K57L697J78l908j90L249Q26l075j840L071J903l522j879K480J742
$$ 1290 -1592 -1335 2362 2540 -1368 -1558 1691 2517 -558 -2398 673 2576 -946 -2825 -345 1397
811A397j733k641J492L006j492k566J285K448P6k570l4L110J30k445l39J890J012
$$ 1397 -336 -2977 -1485 1521 29 -2537 -1252 1196 1272 -1298 -1332 1778 1908 -537 -876 1014 2026
828B026j970j695K141J137k010j168R67J625q85j983J141J683o23j220N6J640
$$ 2026 56 -1639 502 1639 -371 -1539 -572 1053 168 -1815 -674 1009 386 -834 -778 862
844H62M40j923j12J750J1j274n30R48P79j291p46R85L66m53o73J03J244l43j032
$$ 862 1302 -621 -733 1017 1028 -246 -776 172 951 -340 -1086 -101 265 -188 -861 -758 486 143 -889
863h89O65Q77j64o90O5J034k86p95P04J8l09Q1l55j27M03j69l30m8M01n1o85N31
$$ -889 -224 653 489 -201 -136 898 612 -183 521 539 230 311 -44 -171 232 63 -267 -315 86 35 -650 -119
885a19O31r76J96R30o50m76P39L22o35k85R79j62j043O40K17p94N34J59q10L82
$$ -119 512 -464 -268 662 12 -464 275 597 -38 -323 656 494 -549 91 308 -486 48 207 -603 -221
905b21O69p00q38J260R00j715k27K150o96j572R93P57o58k40N10l98k91O19o05
$$ -221 448 -252 -1090 170 1070 -645 -872 1278 582 -990 3 760 102 -138 372 -26 -317 302 -303
924c03j131J688Q36k533Q6K257q07j916J172J888j106j075J273lp92Q92Mp64J336
$$ -303 -1434 254 1090 -1443 -1357 900 93 -1823 -651 1237 131 -944 329 326 -466 426 430 -334 1002
943A002L27k281p9K217l39k419J359K276k252j664K130L13j205P09O83p12R2N82
$$ 1002 1329 -952 -1031 1186 847 -1572 -213 2063 -189 -1853 277 590 -615 94 777 65 157 739
961G39j382k37K491k63k744J429J985k689j476K673P91k003J48J336j041o91J223
$$ 739 -643 -880 1611 1348 -1396 33 2018 -671 -2147 526 1317 -686 -538 798 -243 -934 289
978B89n02l31K081n60k329J325J687k051j093K749O27k824J3J769j290q25J474
$$ 289 -213 -544 1537 977 -1352 -27 1660 -391 -1484 1265 1892 -932 -919 850 -440 -1265 209
995B09j43o74R14l46j599R19J840j321r48K531J18k817M76K015j002q57J424N8
$$ 209 66 -608 306 -40 -1639 -720 1120 -201 -1149 1382 1500 -1317 -841 1174 172 -685 739 797
1013G97j434J79L32j040O62J529j269r22J758k55j898R08K095j034j075J439J71
$$ 797 -637 -458 -126 -1166 -504 1025 -244 -1166 592 337 -1561 -653 1442 408 -667 772 943
1030I43j611M82J023q69J24R21j111q14J233j31j361P53J567j374r63J620J0j525
$$ 943 -668 -186 837 -32 92 1013 -98 -912 321 190 -1171 -418 1149 -225 -1188 432 442 -1083
1048a083Q43J122q23M5Q49q05p90J003M8j060R62J032j638p23J293m03j016J313
$$ -1083 -240 882 59 104 953 148 -642 361 409 -651 311 1343 -295 -1018 275 -128 -1144 169
1066A69J011j193n02P68o31m18J452L72j006M36J35j530rJ644j63r38P78L7j716
$$ 169 1180 -13 -515 253 -378 -796 656 1028 22 458 593 -937 -946 698 535 -403 375 412 -1304
1085a304M8J461j81l01J022m72j310M21Q72l97L52J096r31j277R06L77j055Q76
$$ -1304 -1256 205 24 -277 745 273 -1037 -616 256 -141 211 1307 376 -901 5 382 -673 203
1103B03J124j167j044Q59J2p77Q72P58j039l85Q55p01l24J387J32j162L49P34
$$ 203 1327 160 -884 -25 -13 -790 82 840 -199 -584 271 -430 -754 633 765 -397 -48 686
1121F86j058l70J451O6j415N54O00j072J3J148m29o60P30q8r11Q31Q17j091k80
$$ 686 -372 -742 709 775 -640 -86 514 -558 -545 603 174 -486 244 156 -755 76 893 -198 -478
1140d78J376o72j137J069Q20j172j70Q53o07n70P65J68p50N93L53j328K26J370
$$ -478 898 226 -911 158 978 -194 -364 489 -118 -688 77 245 -505 88 441 -887 -661 709
1158G09o81p77J127M84j474k0J289l33p50O92J45q36M29J95p88M86R46r64p82
$$ 709 28 -749 378 862 -612 -632 657 324 -426 266 411 -425 4 199 -589 -103 843 -121 -903
1177i03J231M19j499L44J515o82j037Q68K45n87K42K75n86K45N67r70n62J483
$$ -903 328 747 -752 -408 1107 425 -612 256 501 -86 156 431 -155 90 657 -313 -875 608
1195F08Qj688N27J526j162r45J173N57q78L7N99l91P3O20q31j76J291m34j532
$$ 608 616 -1072 -545 981 -181 -1126 47 604 -274 -237 362 -29 44 664 -167 -343 948 514 -1018
1214a018Q39J245j169j152J348O06j399l0R65l83j89M11m72O1R04l93j000R51
$$ -1018 -179 1066 -103 -1255 93 699 -700 -730 235 -148 -337 74 -398 -337 567 174 -826 125
1232A25J146j377r81J685L79j573J04J007l55o04J51Q1K9L54k83p81R84Q64j422
$$ 125 1271 -106 -1087 598 977 -596 -492 515 160 -444 -293 -212 -183 171 -112 -893 91 955 -467
1251d67l28J719N1j365J17J195j34j004L21N58l67p2k51l55O89J37j121m0J175
$$ -467 -795 924 975 -390 -273 922 788 -216 105 663 296 224 -27 -382 307 444 -677 -717 458
1270D58mj370K41J304l88j039O54O52k87k31l5J37L90k10n42P1P01j19j167L11
$$ 458 454 -916 -675 629 241 -798 -144 508 221 -10 -45 92 482 272 -270 -199 502 383 -784 -473
1290d73J120p56p41O52N29l76m45K72M93j99j63q2O7N62l93o95N35N71o37m24
$$ -473 647 -109 -850 -198 331 -45 -490 -218 275 76 -87 -169 -102 460 67 -628 -93 478 -159 -583
1310e83M50M67n13n17N99L29l72p4M0L17J42l35J3L70O3k67k09L00L24n88j74
$$ -583 -133 334 -179 -696 -97 232 -140 -214 -174 143 285 -50 -37 333 396 129 -80 220 544 -44 -218
1331b18N20j89j58j22J37J74k11j20K67l9O9j10j15L35p4k82J86J34j24j22l0
$$ -218 302 113 -45 -167 -30 144 -67 -187 80 41 110 0 -115 220 146 -136 50 184 60 -62 -92
1352i2L14k13l00L01L9j81J03L8%J97j92P1J27j4q7k03L27J40o88J27N22m28k69
$$ -92 222 9 -291 10 49 -132 -29 9 9 206 14 85 212 198 111 -92 235 375 -313 -186 336 -92 -361
1375c61J58J80%l20J70J73j23J90j90k5N53r6p20M47O20m66o10M19N56q00m17
$$ -361 -203 -23 -23 -343 -173 0 -123 67 -123 -148 405 309 -411 36 656 190 -420 -1 555 -245 -662
1396f62P74q0l12K29j95m7M10j73m20M05Q57n59r87J061P14j396l9J267m70q34
$$ -662 112 32 -280 -51 -246 -293 117 -56 -476 -71 786 227 -760 301 1015 -381 -420 847 377 -457
1416d57K42J73k54J07K78n99rR78q98r51J729P22j613l5J516l18j428P90J235
$$ -457 -215 -42 -296 -189 89 -510 -519 459 -439 -1390 339 1061 -552 -587 929 611 -817 -27 1208
1435A208q71k87P12q67k53J051o11r25J431N83k096m54K240k29k094J457J440
$$ 1208 337 50 762 -105 -358 693 82 -843 588 1171 -925 -1379 861 632 -1462 -5 1435
1452A435j760m75J407m79n26J132j35j281J004J035k221l99K795q16k549J820
$$ 1435 -325 -800 607 128 -398 734 599 -682 322 1357 -864 -1263 1532 716 -1833 -13
1468a3J447k195n42J930k04j449J198O65j671P19J486k154m61K839o65k645J716
$$ -13 1434 -761 -1303 627 423 -1026 172 837 -834 -115 1371 -783 -1244 1595 930 -1715 1
1485AJ846k556j164K870l5k508J460J147k262L61J972j691p93K551j50k885J396
$$ 1 1847 -709 -1873 997 962 -1546 -86 1061 -1201 -840 1132 -559 -1352 1199 1049 -1836 -440
1502d40K609k723j406L607k26l043J636J806k525l83K340r33j710K381N80l334
$$ -440 2169 -554 -1960 1647 1421 -1622 14 1820 -705 -1088 1252 319 -1391 990 1570 -1764
1518a764R79K884k783j366L790n2l447J232K276k527j042L433l63k763K058P55
$$ -1764 -785 2099 -684 -2050 1740 1688 -1759 -527 1749 -778 -1820 1613 1250 -1513 545 1300
1534A300l421R53L402k051j791L163O0m221J313L671k628j326L819j064l683K137
$$ 1300 -2121 -1168 2234 183 -1608 1555 1615 -2606 -1293 2378 -250 -1576 2243 1179 -2504 -367
1550c67J862k748N25L230k122k932L007Q28l724J804L762l167k095L254k69l235
$$ -367 1495 -1253 -728 2502 380 -2552 455 1283 -2441 -637 3125 -42 -2137 1117 848 -2387
1566b387K181K858k960j171L198j422k970L236J594l566P49K982k708k259L557
$$ -2387 -206 2652 -308 -1479 1719 297 -2673 563 2157 -1409 -660 2322 -386 -2645 912
1581I12Q30l535J350L161l362j671L938p20l064K632J824l524k23L375j849k585
$$ 912 1742 -1793 -443 2718 -644 -2315 1623 903 -2161 471 2295 -1229 -1452 1923 74 -2511
1597b511L532R79m152J238L437l197j771L897p4l478J844K558l172r92L662j190
$$ -2511 1021 2000 -2152 -914 2523 -674 -2445 1452 1378 -2100 -256 2302 -870 -1862 1800 610
1613F10k891L150J110l760Q23L208k496k229L608P00l883J367K991k917j436L599
$$ 610 -2281 869 1979 -1781 -958 2250 -246 -2475 1133 1833 -2050 -683 2308 -609 -2045 1554
1629A554o62k769K353J480l045L6L099j819k353L348R35l948J065L039k717j680
$$ 1554 892 -1877 476 1956 -1089 -1053 2046 227 -2126 1222 2157 -1791 -726 2313 -404 -2084
1645b084L154R0k685J348J830k629m48L017j329k095K842P75l323N94K840j785
$$ -2084 1070 1160 -1525 -177 1653 -976 -1424 1593 264 -1831 1011 1786 -1537 -943 1897 112
1661A12j849K706P58l071N34K273k088p06K573p72k146J812R73k581J68K891j306
$$ 112 -1737 969 1727 -1344 -810 1463 -625 -1331 1242 470 -1676 136 1109 -1472 -1304 1587 281
1678B81k274K459J001k938O19K358j476j122J819r8j894J186J389k029l00K444
$$ 281 -1993 466 1467 -1471 -852 1506 30 -1092 727 629 -1265 -79 1310 -719 -1019 1425
1694A425j264k048K265J046k406K21J954r67j479J761N25j727P16J275j866j32
$$ 1425 161 -1887 378 1424 -982 -761 1193 226 -1253 508 1033 -694 22 1297 -569 -701
1710g01J931q46j357J587O47j931l10J973n25j449J428N15j736L56R65q34l4J197
$$ -701 1230 384 -973 614 1261 -670 -980 993 468 -981 447 962 -774 -418 547 -287 -321 876
1728H76l52j324P60R96j488p1J797o02j578R19M69r77P6J002l12p73O05Oq88P54
$$ 876 524 -800 -40 956 -532 -603 1194 592 -986 -67 402 -575 -499 503 191 -582 23 29 -859 -105
1748a05Q90j080j19R15m83r11P61P74o46n21P89k06q75P30M02p26M29L14p13k1
$$ -105 785 -295 -414 501 18 -893 -132 642 -4 -525 264 58 -817 -87 315 -411 18 332 -381 -402
1768d02N83J21o51L30O03p21l75R16j04n15M50K2l49MK89j47k30L81M0o51M07
$$ -402 181 302 -349 -19 584 -137 -512 404 300 -215 235 257 -92 -88 201 54 -176 205 245 -406 1
1789AM25n41m7N01j17l31O6K71o7k72L69j27l54K73%j80J67R4k37q0J62J76k23
$$ 1 426 -115 -162 339 222 -109 -43 228 161 -111 258 131 -223 50 50 -130 37 131 -106 -186 -24 152 -71
1812g1J4M19k92j55K44J1j57L9p8J5m8j23R0j32J09Q5k88J24K01k49Q7J74J4J8
$$ -71 -57 362 70 -85 159 170 13 52 -26 -11 -59 -182 -92 -224 -115 -30 -318 -194 7 -242 -155 19 33 51
1836E1j69K20N5k76K40L6j58R5l7j10J64j39k4n2L4P3j56n2K85p3j65K44j1L6
$$ 51 -118 102 157 -119 121 157 -1 94 57 -53 111 -28 -52 -104 -70 3 -153 -205 80 7 -158 86 75 111
1860A11j3n4J67j02q1R6j55J01k8k62J79J06k47P6N5L0M6k05J59J34j41J56J7
$$ 111 98 44 211 109 28 124 -31 70 42 -220 -41 65 -182 -106 -51 -21 25 -180 -21 113 -28 128 145
1883A45k8J34j74n2J78n9j26r5P0J84m08M5K45j76j3R7r9R0J02j05OM8O0J1k13
$$ 145 117 251 77 25 203 144 18 -77 -7 177 -231 -186 59 -117 -130 -33 -132 -42 60 -45 -39 9 69 80 -133
1908a33L19L1l40Q6K43j69p1J0P1p0p2R0o1M8J30j98j27L60o3r7K7J33q7l14J99
$$ -133 186 217 -123 -37 206 37 -34 -24 47 -23 -95 -5 -66 -18 112 -86 -213 147 84 -13 14 147 60 -254 -55
1933e5L14l37N8K11l39R4J21k48LL06p8j44r0K92j03k92M32J40l66J09Q4j91M5
$$ -55 259 -78 -20 191 -148 -54 67 -181 -178 128 50 -94 -184 108 5 -287 145 285 -81 28 112 -79 -34
1956c4J16K4j36P1L8l31K5M61k49j38L24r4l03J40J39N0j20J04J28l93J04P9j69
$$ -34 82 106 -30 41 79 -252 -227 234 -15 -153 171 77 -226 -86 53 103 -17 87 215 -178 -74 5 -164
1979a64J48K54l50q1K08k5p9n9L65j09k77K54q6j67K86J31j61ON2j51k23J98K39
$$ -164 -16 238 -112 -193 15 -10 -89 -148 217 108 -169 85 -1 -168 118 249 88 94 146 -5 -228 -30 209
2002B09l89P7L58l66j97L85n6j37J12N0j27p7K25N1k67L75rl48J53J99k58n4K49
$$ 209 -180 -103 255 -111 -308 77 21 -116 -4 46 -81 -158 67 118 -149 226 217 -131 22 221 -37 -91 158
2025A58j07k68Q0L58l20r7M05k41k68L82Mj92K61Q4k50j69K06R2l08K93K66n28
$$ 158 51 -217 -137 221 -99 -196 209 -32 -300 82 86 -106 155 239 -11 -180 26 118 -190 103 369 -159
2047a59n2L14l75J4M65n5l11q5J89j69j06O07Mm61K96l1l55J25L89L4k80N7O4
$$ -159 -211 103 -272 -258 207 152 -159 -244 -55 -224 -330 277 281 -180 116 85 -270 -145 244 278 -2 55 119
2070A19n30J83N08l05o7L25k90m08K11L81r5m3M09k15n11L03K37l80K45M56m81
$$ 119 -411 -228 280 -25 -92 233 -57 -465 -254 127 32 -11 398 183 -328 -25 212 -168 77 533 52
2091E2k94K97N3l50K36M42m51l17N17k02l77N40K07m95M2L38k66j51M58J38o73
$$ 52 -242 55 108 -242 -6 436 -15 -332 185 -17 -394 146 353 -142 -100 238 -28 -179 279 417 -256
2112b56J65L96m76q3O65k53m65K38J42l49L5N93j43n36K77J26m39L10N29m06k26
$$ -256 -91 305 -171 -254 411 158 -307 -69 73 -276 -241 352 209 -327 -50 76 -363 -53 476 70 -156
2133a56K56j87k83K84N63l61l54M26k95n08N37N06l78j17J95k94l39N05M32m38
$$ -156 100 -87 -370 -86 477 116 -238 188 -107 -615 -78 428 50 -67 128 -166 -505 0 432 -6
2153fO0L33n75k32M91J86k45J49J45l97l93N17J13m01M36J14n70PM91j43j38L68
$$ -6 54 387 -188 -420 71 257 12 161 306 -91 -484 33 146 -255 181 295 -275 -268 223 80 -58 310
2175C10Q4n77LM87l07k38N18k2n94K25K48k29j01L84q8m35K61L17m07P5M16l07
$$ 310 394 -183 -180 307 0 -238 280 258 -336 -111 137 -92 -193 191 103 -332 -71 246 -161 -86 330 23
2197B3k83K39J02j96J00K52k40l52L48P1l51L40K21m41p2K04K3j30J70K66l05
$$ 23 -260 -21 81 -115 -15 237 -3 -355 -7 64 -287 53 274 -167 -239 -35 -12 -142 28 294 -11
2218a1j83L01j08j59L15Q9l01L5Rr0j13K39J70k36o7J76k02o0L40l9j82J42R6
$$ -11 -194 107 -1 -160 155 244 -57 -22 -13 -103 -216 23 193 -43 -110 66 -136 -196 144 105 -77 65 161
2241A61j72j40K37K7j60J86K7k35K4R6r6J4N8J39j93j28K05j25n2K65j3j52P6
$$ 161 -11 -151 86 113 -47 139 166 -69 -45 51 -45 -31 27 166 -27 -155 50 -75 -127 138 125 -27 49
2264D9L1o3j9N6N5j10j1P1j70K5R4n8n1J30m2j13nJ71K2j28J29J1j13M6N8j5q
$$ 49 80 17 -2 54 109 -1 -12 59 -111 -86 8 -50 -101 29 -13 -126 -131 40 62 -66 63 74 -39 7 65 50 42
2291D2M5J1j19q6J55l9j65J34K4j46P3J3l5M2O8J3l5k7R4k1LM7o5q0M2N9n8L1
$$ 42 87 98 -21 -107 48 9 -156 -22 2 -144 -71 -58 -93 -51 17 30 -5 -32 62 41 44 91 26 -54 -12 47 -11 20
2319B0ll5n3P9l2rmP1l1L1k9K2PJ5m9O0l1k4L0j46J29Kr7M0l9LL7OL5p1j7R5l5
$$ 20 17 -18 -71 8 -24 -33 -37 34 3 34 5 27 34 49 0 60 29 5 35 -111 18 20 -77 -37 -76 -73 -36 -30 5 -66 -83 12 -23
2352b3mN5k5o0J19k7N9p0l1M4r4K9L3k7n9J52r1j5J3mL5pk4R2o5M3L2n1O3l8j2
$$ -23 -27 28 3 -57 62 35 94 24 -7 37 -57 -28 5 -22 -81 71 -20 -35 -22 -26 9 2 -22 70 5 48 80 29 92 54 42
2383D2jq4P9Kp6O4j03L1L5o8J5P9K6q2K7oK9j9nJ06j32O1on9M7K5k7n5L3lK2r5
$$ 42 41 -43 36 38 -38 26 -77 -46 -11 -79 -64 15 41 -41 -14 -20 9 -10 -15 91 -41 20 14 -45 2 27 0 -55 -22 -25 -3 -98
2415i8R7kp7J34l4l6jO7o2N8L7jn9j9M5n4J1n1P3q0K9l3J4M0L8j2K4m2j8p2N7
$$ -98 -1 -3 -80 54 20 -16 -17 50 -12 46 83 82 23 4 49 -5 6 -45 28 -52 -23 -56 -42 -2 36 24 48 6 -12 -84 -27
2446b7Q4m3q0J28j6o5KM8qr9J15l4j37J27Q7j25N7J0M9p6l9J68j13kQ3l2r5J2
$$ -27 57 14 -66 62 46 -19 -17 31 23 -76 39 5 -132 -5 82 -43 14 24 73 -3 -42 126 13 11 94 62 -33 -21
2474b1P7r9LkJ7q1J41pr2oJ40j10M9R3Mj55J25qk4m6K6l4n7N2J5r7K1R8p7l1R4
$$ -21 56 -43 -40 -42 -25 -106 35 28 -64 -70 70 -40 9 102 106 -49 76 68 44 -2 24 -10 -67 -15 0 -97 -76 22 -55 -86 8
2505HJ06j15k7L3J0m5P9om0L7mj4l7O0K0j48O2L3j41N8LN5J5l1O3ll5K4rl4J13
$$ 8 114 -1 -28 5 15 -30 49 43 3 40 36 22 -15 45 65 -83 -21 12 -129 -71 -68 -13 2 -29 34 31 -4 20 11 -23 90
2536I0j1o8J3O6q3j0Nk9J4l9J3K3n4J01l2m6o7J20K1l0N8m4K3pN1l1q1N1J05j32
$$ 90 79 11 24 90 7 -3 2 -27 -13 -52 -39 -16 -70 31 -1 -47 -114 6 27 -3 55 11 34 27 78 47 -34 17 122 -10
2566a0m7Q2j12p0J45k2q8P3J6k4K6Q9j6q1O7M2l7j4M9pp1K3L1p7j08R9O9j07R1
$$ -10 -57 25 -87 -157 -12 -34 -122 -49 -33 -57 -31 58 42 -39 28 70 33 19 68 61 -10 13 44 -33 -141 -42 27 -80 11
2595A1j9o7J8J02k6l1Q4Kj08J8J38p7o3Q6Mj24O2Lm8l1O7J6q4J8M4l6j6P3k7p0
$$ 11 -8 -75 -57 45 19 -12 72 74 -34 -16 122 45 -18 68 72 -52 10 13 -35 -66 1 17 -67 -49 -5 -41 -57 16 -11 -81
2625h1P8P6j18L6N4n8m3J12L4j12qJ20j50m8J00K5n2P1Qj00M8O4qq6Q6l3J4q0
$$ -81 -3 73 -45 -9 45 -13 -56 56 90 -22 -30 90 -60 -108 -8 17 -35 36 44 -56 -8 56 48 -38 48 15 29 -51
2653e1J66q5r8R8j5j04M7J05q1OQ8m6r9N9O2p4RJ21r0j00J59M8j18K6N4o4j09
$$ -51 115 30 -68 30 15 -89 -42 63 -18 -12 76 30 -69 -10 52 -22 -13 108 18 -82 77 125 7 33 87 23 -86
2680h6NJ12o1oR6j1j39J35R0j45M4J22j36m0P3j3o7K2O4o8l0K7k4p5R8N6j44N1
$$ -86 -81 31 -30 -36 60 49 -90 45 135 -10 34 156 20 -20 53 40 -27 -5 59 -9 -39 -12 -36 -111 -13 43 -101 -50
2708e0J25n9p9J06Q2r6L6Rn1r1J15L2q4j2O6n9j01J17N0j05QJ12j02o7J27O8j33
$$ -50 75 16 -63 43 125 29 65 74 23 -68 47 79 -5 -17 49 -10 -111 6 56 -49 -41 71 -31 -98 29 97 -36
2735c6R2Pl1MM5n9l6J6Q6j27n6J52p9o0N5O2n0k2P0l6n7O1M2m6rJ06l4o8P6o8
$$ -36 56 63 32 36 81 22 -14 2 88 -39 -95 57 -22 -82 -27 35 -15 -37 33 -3 -60 1 43 -3 -12 94 60 -8 68 0
2765@j8J8N5p1o7P4O0j37L2J21j10j5P9l2M2j3J3PK6k0M1q1mL7l8l7M7K1l3Km1
$$ 0 -18 0 55 -16 -83 -9 51 -86 -54 67 -43 -58 21 -11 31 18 31 38 64 44 85 4 0 37 -1 -38 9 30 -3 -1 -42
2796d2K7r6J17qn2R8l5o1R7KO2j18JL6Np3Q5r8M5Lon2M6M3K4j37N4M5q8O2K7L4
$$ -42 -15 -111 6 -2 -54 44 9 -52 45 47 109 -9 -8 28 33 -40 45 -53 -8 -5 -11 -63 -17 26 50 -87 -33 12 -76 -14 13 47
2828D7l2mm2Q9m2K7n0m7Q2p5o0J02rl8O9l0k0J6j2J14j00j2N6o5J0K1%j0l1J0
$$ 47 15 11 -31 58 16 43 -7 -54 28 -47 -107 -5 -14 -52 17 -13 -33 -17 -29 85 -15 -27 29 -36 -26 -5 -5 -15 -46 -36
2858c6RN3n0P4n9L8Pn9M7K0n7P1j16R6k2k8P0m9n8J07n8pNrj5l6J00kq8L9Q7j12
$$ -36 -27 26 -24 50 -9 29 36 -23 24 44 -13 58 -58 38 16 -12 58 9 -49 58 0 -7 -2 -11 -26 -62 38 36 -52 -13 74 -38
2890c8M3O6j15L0O9QJq2lM5j3nKj6nK8n8Q6J0r7J03p5K0l1M2J9n4j1R4l7M4j26
$$ -38 5 71 -44 -14 55 63 64 -18 -21 24 11 6 8 -8 -13 15 -43 43 53 -44 59 -16 4 -27 15 34 -20 -31 63 26 70 -56
2922e6P5m5L1l3J8j7K2L5q0j1K8O4l0kM8jq3J05l0n0M6L2r8qJ03j43OQ9j8o2l4
$$ -56 19 -26 5 -28 -10 -27 -5 30 -50 -61 -33 31 1 -1 47 46 -37 68 38 -12 34 66 -32 -40 63 -80 -74 15 -3 -65 -99
2953i9J82j02q0J11%j03J46j9o1M6P7or9R4Mj22M8P9j40j13K20p1q5PP6k2J7J22
$$ -99 83 -19 -99 12 12 -91 55 36 -25 21 98 92 -7 87 91 -31 17 96 -44 -157 63 -8 -93 -86 -10 -32 -15 107
2981A07j3j46J41N6k18P2J46j09j00J34j3j36lK13j91q6J62J0j58J12L7n6j2J03
$$ 107 94 -52 89 145 -73 -1 145 36 -64 70 57 -79 -82 131 -60 -146 16 26 -132 -20 17 -39 -51 52
3005E2Oj64J11J83j91k6J80j43j34J46J00j33m1J60j18j96K25O6k53J25J77k43
$$ 52 58 -106 5 188 -3 -29 151 8 -126 20 120 -13 -54 106 -12 -208 17 83 -170 -45 132 -111
3027a11l4K46k6j38L6K11k00j49L78j30k00K21nk92R9J87k9j64J08J16k55L1K62
$$ -111 -145 101 75 -63 -27 184 -16 -165 213 83 -117 104 99 -193 -94 93 64 -100 8 124 -131 -100 162
3050A62k15o3K47l9k04R1J56j66p9L20r2l02J69J97k57j9K37j19k00K22J08k26
$$ 162 -53 -116 131 92 -112 -21 135 -31 -110 210 118 -184 -15 182 -75 -94 143 24 -176 46 154 -72
3072g2l1L30j89k50K91N1k85J37J91k52j12K68Rk90J58K53k67j29L68j63j69K00
$$ -72 -103 227 38 -212 79 130 -155 -18 173 -79 -191 77 86 -204 -46 207 -60 -189 179 16 -153 47
3094D7Q1j76m7K27j26k07L37O3l10L1L21l71l8K32P9k14lK98k92j81L65J9k86
$$ 47 128 -48 -95 132 6 -201 136 199 -111 -80 241 -130 -168 64 143 -71 -74 224 -68 -249 116 135 -151
3117a51K70P8k64j00L54j60j65K20Q9l04RK52j82j45L40l8k38J11J97j98j80L15
$$ -151 119 197 -67 -167 187 27 -138 82 171 -133 -124 128 -54 -199 141 103 -135 -24 173 -25 -205 110
3139A10R5l83J02K44k95L4K43j06k47J98J82k93o7L63j95k07L01L2k09J5K75k00
$$ 110 205 -178 -76 168 -127 -93 150 44 -203 -5 177 -116 -183 180 -15 -222 79 111 -98 -83 192 -8
3161hk27L55L7k67J17K35k93j27L19o5k46K04P4k30n5K54j07j92L35R3l43k4K87
$$ -8 -235 120 157 -110 7 242 -51 -178 141 76 -170 34 108 -122 -177 77 -30 -222 113 206 -137 -161 126
3184A26k06l3K89N0l45K0K45k20j22M12j44k45J84Q8k61J9L34p3k03N9J17k82
$$ 126 -80 -113 176 226 -119 -99 146 -74 -196 216 72 -173 11 99 -162 -143 191 118 -85 -26 91 -191
3206a91O1K96j59j42K19K8k17N5J93j10j69K42k7l01J82K05k19j7J71n9k11J46
$$ -191 -130 166 7 -135 84 112 -105 -50 143 33 -136 106 79 -222 -40 165 -54 -71 100 41 -170 -24
3228b4K03j78r8K63j43j74K27M8k11J22O4r2j42K01N6k02L3J62j59j38K54jj16
$$ -24 179 1 -97 166 23 -151 76 124 -87 35 99 7 -135 66 122 -80 -47 115 -44 -182 72 71 -45
3251d5P6J14k16p7K23N3k11J62K2k20k1K34r7j12J30L8p4j01J41j2n5J79p8j12
$$ -45 31 145 -71 -148 75 128 -83 79 101 -119 -140 94 -3 -115 15 53 -21 -122 19 7 -48 131 53 -59
3275e9oJ29j15k2J62o4o1N6P4j48o0J84L3j64N8L1j33L5N2N0p5O4J39j97OQ3n8
$$ -59 -65 64 -51 -73 89 25 -36 20 94 -54 -114 70 103 -61 -3 28 -105 -70 -18 32 -43 21 160 -37 -31 52 -6
3302fk9R3m2p1oM1N4r8J16Mq0N8K2j48N1L3mlM2j2k7p4J49n4q5J01Kj08Q1j8K5
$$ -6 -35 58 16 -55 -61 -20 34 -64 52 56 -24 34 56 -92 -41 -8 -12 -15 27 15 -12 -86 63 9 -76 25 27 -81 0 -18 7
3333Gn6Q9Nj44R4P4j34O0J15j18l4K9K7k4rK3ln6R5l0l5pR8o4k1K8k1Pj5O1J1
$$ 7 -49 40 45 -99 -5 69 -65 -5 110 -8 -42 -13 14 -10 -19 4 1 -55 40 10 -25 -32 66 2 -19 9 -12 -5 -20 41 52
3364E2q5J62o6q1Q2l7l5j5k0J40r6K5P4j27n0O2m0L9k6PK3NK0n8k0J21K5j45Q8
$$ 52 -33 129 63 -18 64 27 -8 -23 -43 97 1 26 100 -27 -77 -15 -55 -16 -42 -35 -12 -7 13 -45 -65 56 81 -64 24
3393B4k8n0L6O1m4N7o3pO2j12N6Lj4L2j0L3n5j0N5K5m4N0j54J19P2j01%PL3k6
$$ 24 -4 -54 -18 43 -1 56 -7 -14 48 -64 -8 -5 -19 13 3 36 -19 -29 26 51 7 57 -97 22 94 -7 -7 0 33 7
3423GmM2q4K7N3l7r1J03M7o1K6J4m1qj3M6n2k0J40q8q6J49q8J7J4J6k5k8O5ql9
$$ 7 3 45 -39 -12 41 4 -87 16 63 2 28 42 1 -7 -20 26 -26 -46 94 6 -80 69 -19 -2 12 28 3 -25 40 32 -7
3454gO2K6j38N2M8om7K1Kl6L8ql7o6R3pK1j6l6m5O9M8m8k0M7Q2j13J7N6o7j5P2
$$ -7 55 81 -57 -5 43 37 -10 11 13 -23 15 7 -30 -96 -3 -10 11 -5 -41 -86 -17 31 -17 -37 10 92 -21 -4 52 -15 -30 42
3486D2m7p4J29J7q7RK8L1j06L8O8j03L5R0r2k0R1L1q1k0J04j05n0J30k0j09J0
$$ 42 -5 -79 50 67 -20 -11 17 48 -58 -20 48 -55 -20 70 -22 -42 49 80 -1 -21 83 -22 -72 58 38 -71 -61
3513f1O9j12N6N1p0k3R6J07j16r2J79l4j17J33k5o9j7J25j25l4J45N4k58R7J06
$$ -61 8 -104 -48 3 -67 -90 6 113 -3 -95 84 50 -67 66 41 -28 -45 80 -45 -79 66 120 -138 -41 65
3538F5j32K7J8M7r6J00J3j3j16J17Nj13R7R0j20lQ2j09m2J00Rp3J4J08j07j16
$$ 65 -67 -40 -22 25 -71 29 42 29 -87 30 35 -78 19 109 -11 -14 68 -41 -83 17 26 -47 -33 75 -32 -148
3564a48J60n7JO6J08j35o0J00pr6L0J86k23K7P3r6n0K09rj39MP4l0j00J46R9k29
$$ -148 12 -45 -44 22 130 -5 -65 35 28 -68 -38 148 -75 -48 25 -71 -121 88 79 -60 -56 18 -12 -112 34 133 -96
3591i6N9J11j19m0R7R2j56J6J46j21l4J04p0r2J78K2k02M6J24q3q1J26N1j51L1
$$ -96 -37 74 -45 -85 12 104 -52 -36 110 -11 -45 59 -11 -103 75 97 -105 -59 65 -18 -99 27 78 -73 -42
3616d2J07j02l9M3L7n2RJ48j70m9J22Jp5J12J25j74l2N4m1m4P1J34j42j1N6j39
$$ -42 65 -37 -76 -33 4 -48 -39 109 -61 -110 12 13 -62 50 175 1 -31 23 -18 -62 9 143 1 -10 46 -93
3642i3j16K30M2n5MK1j29o5J57J08o5M4J5j57n6K13j13L4N9o7q3l2P0K0K4J18
$$ -93 -209 21 63 8 12 33 -96 -161 -4 104 39 83 98 -59 -115 98 -15 19 78 11 -72 -104 -34 -14 10 128
3668A28q5j49NR3j2PO6Oq7K8L5j22R5Q1r3n2Q7Oq1rJ17q8q8J27o9o8J15P4o2m8
$$ 128 43 -106 -101 -8 -20 -13 53 59 -28 0 35 -87 8 89 -4 -56 31 37 -44 -53 64 -24 -112 15 -54 -122 -7 67 5 -43
3698d3M5M6j12J12pq3L8n%j3J22n2j10K7J1k2N8L2o9m2pN7o0K7J08o1OM5q5LL2
$$ -43 2 48 -64 48 41 -42 -4 -9 -9 -22 100 48 -62 -35 -24 -46 12 44 -25 -67 -74 -17 -77 -50 58 -3 3 48 -37 -34 -2
3729bO3l3n8N0l5q2M9Q2n9L0l1j4n8O5N2p1L9K4j0k4K3M8j12J10Pj08J19l8J9
$$ -2 61 28 -30 20 -15 -97 -48 34 -25 5 -26 -40 -98 -33 19 -52 -13 11 1 -23 0 48 -64 46 53 -55 64 26 45
3758D5l3K8Jo8%J8k1j4P5Ol2m2P7p4LK3l0L8L6Kn4J0Mj1m3R4l7o3P0pj4K4M9q0
$$ 45 12 40 41 -27 -27 -9 -30 -44 31 37 5 -37 40 -34 -31 -8 -38 0 36 38 -16 -6 -2 -13 -56 38 1 -62 8 1 -13 11 60 -20
3792b0J1kj9j2lL4J0k1M5J6n4J7M0j2K4opm4KM5l9k9L4J4n8Oql1N9k5l0R9n8k1
$$ -20 -9 -11 -30 -42 -45 -11 -1 -22 23 39 -15 2 42 30 54 48 41 -3 -1 44 5 -24 10 24 -34 -28 -36 -67 -8 -33 -63 36 -22 -43
3826d3k2J21l2l0l0Q8j18R5k2J7n7L7m1lMn0Q3k3Lj4K2k0J9mK1k0Q7o2KK4l2L9
$$ -43 -65 56 24 -6 -36 52 -66 29 7 24 -33 4 -37 -40 -36 -86 -3 -26 -23 -37 -15 -35 -16 -20 1 -19 68 6 8 32 0 39
3858C9k3M9pk9L5o7pM8o0n4L3J04r2jN5l9K8m6O9k4j6m2N7J2J3l4K5Nj0p7Q3l9
$$ 39 16 65 58 29 64 -3 -10 38 -22 -76 -43 61 -31 -32 23 -16 12 -34 35 11 -5 -47 10 22 35 1 26 31 21 -56 27 -12
3890a2J5o2O9n5J4m3M3J8n0Q1n8K8L3Rk1o5K7P9j3qm4l3N2QJ1k1k4L3o7N8l5o
$$ -12 3 -59 10 -45 -31 -74 -31 -13 -63 18 -40 -12 21 30 9 -56 -29 50 37 29 -15 -48 4 12 23 2 -22 11 -56 2 -33 -39
3922c9K5mm7J18l8n0O6k4J6K8n4K7Rk2l6L3m1J4n3M3K0L8n2rL6k3K6k6M3k8M2
$$ -39 -14 -18 -65 53 15 -35 31 7 23 51 -3 24 33 11 -25 8 -33 -19 -72 -29 -9 29 -23 -32 4 -19 7 -19 24 -4 38
3953C8MJ4j4l6nJ8l6M3j4m3N3pq5K5N1Om5K6j8M8J5k4k5J7N4j1m2N8l2k5K9lJ1
$$ 38 42 56 42 6 1 19 -17 26 12 -31 22 15 -70 -45 6 12 -33 -7 -25 23 38 14 -11 6 60 49 7 65 33 8 37 34 45
3986D5r7N5nK9q4J01p8MK8l8j2M0Oj9K9J6lp7Q8N3j09P4j8J4n4Q7m8p2P2ol4m7
$$ 45 -52 3 -2 27 -57 44 -34 -30 -2 -40 -52 -12 -6 -25 4 20 17 -60 28 81 -28 46 28 42 -12 75 27 -45 27 21 -13 -60
4018f0J20p5l9J4n9M0P3N4r0k6N5J1k8N3J2j06J9N3n1m5R5j1Rj11N2J2p0J68j0
$$ -60 60 -15 -54 -40 -99 -59 14 68 -22 -48 7 18 -10 43 55 -51 -32 21 -30 -75 20 9 18 -93 -41 -29 -99 69 59
4047E9j49J10L3j74R7O0k7pk8J01j49RJ74r1j08J43l3j39O8J23n7j25J91l1j28
$$ 59 -90 20 53 -121 -24 36 9 2 -26 75 -74 -65 109 18 -90 53 20 -119 -51 72 15 -110 81 50 -78
4072g8P4Q3j79L7J42q1j00J13N8j76K5K35j18j49K46q4j03K8Q6j48k1K51j10k38
$$ -78 -4 79 -100 -63 79 -2 -102 11 69 -107 -82 153 35 -114 132 48 -55 -27 59 -89 -110 141 31 -207
4096b07K37R2k42M6K74k10j20K20J2j85N5K35j87j12K69o0l05K14J34k50K2K30
$$ -207 30 122 -120 -74 200 -10 -130 90 102 -83 -28 207 20 -92 177 117 -188 26 160 -90 -68 162
4118A62k14k04K87N6k28J41J50k05j49L23j3k44J76J73k49j29K20m0j61J93J65
$$ 162 -52 -256 31 87 -141 0 150 -55 -204 119 106 -138 38 211 -38 -167 53 13 -148 45 210
4139B10m18J03L18k60j61K86O0k83R3K06j92j81M12j32j92K10R5k08m4K52j20
$$ 210 -208 -105 213 -47 -208 78 138 -145 -52 154 -38 -219 193 61 -131 79 174 -34 -78 174 54
4160E4k48K75Q5k91J1L04k46j65L06J5k82J97K09l12l8K53n1k67K08J84l15j04
$$ 54 -194 81 166 -125 -114 190 -56 -221 85 100 -182 15 224 -88 -126 127 76 -191 17 201 -114 -218
4182b18L46j40j46K95K1k90O0K31j56k11L15M7k98Q7J97k89j4L37p8k60K31O8
$$ -218 128 -12 -158 137 158 -132 -72 159 3 -208 107 154 -144 -57 140 -149 -163 174 96 -164 67 135
4204A35l03K7L37j76j75L23l2l27J41J70j76q6K94l2l70K34J64k64kK59p8k29
$$ 135 -168 -141 196 20 -155 168 136 -191 -50 120 -56 -142 152 120 -250 -16 148 -116 -118 141 63 -166
4226a66J74J11k11KK65j79j78L14r8j79J71J46k67k6J60K0k09J84J20k23o4K66
$$ -166 8 119 -92 -90 175 -4 -182 132 34 -145 26 172 -95 -121 39 59 -150 34 154 -69 -133 133
4248A33j25j40K56o5j30mJ87j43j08K62j9k44J17J47k45O9J51r9j33J25N6j68
$$ 133 8 -132 124 59 -71 -75 112 -31 -139 123 104 -140 -23 124 -121 -52 99 0 -133 -8 48 -120
4270a20L3K01j57j07K61j03j05J07R0j48K8M0M8j62N3J22p3k8J91j96r4J51j8
$$ -120 -87 114 -43 -150 111 8 -97 10 100 -48 -20 20 68 -94 -41 81 8 -20 171 -25 -119 32 14
4293A4rr0R0N6j91J27K2j43J59K6j22j1J09k0o8J41l0j16L5Q9m9p3R4K0r1K6R9
$$ 14 5 -85 5 61 -130 -3 19 -124 35 61 -61 -72 37 17 -51 90 60 -56 -21 68 19 -54 40 60 -31 -5 94
4320I4j28j4k2P2l0N0P8j51kJ07o0q8J99l9j16kR3n7k1P7Oj64M1J03j10O3j6K3
$$ 94 -34 -48 -70 2 -28 22 100 -51 -53 54 -6 -94 105 66 -50 -52 41 -16 -37 40 46 -118 -77 26 -84 -21 -37 -14
4348a4Pl8N8K1l6M2o6n5J29J8j18R4R0o4m2k8O7p8K1M3p8PL0l9L0K3K1Rp9L6P
$$ -14 -7 -45 13 34 -2 40 -26 -81 48 66 -52 42 132 68 26 -2 65 -13 8 51 -27 -20 10 -29 1 24 45 54 -25 11 18
4379A8m2M0O4q6K0J7o8LJ9M5nn6M5k6p7J85r6m1P2j01P6M4k3k3K7j7j5OM6J2n5
$$ 18 -24 16 80 -6 14 31 -37 -34 -15 30 25 -31 14 -12 -89 96 0 -41 31 -70 6 50 27 4 31 14 -1 5 51 63 8
4410Hl1Q4j43O7qk1O7j14Q8K6o6J2K7l7K7Jj2K4l4kQ1l8L2q7L2O4j4j7L4l9N6
$$ 8 -23 61 -82 -15 -23 -44 23 -91 -3 23 -43 -31 -4 -41 -14 -13 -25 -1 -35 -37 44 6 38 -49 -17 47 33 16 50 11 67
4441F7Oq6m9L3L3mp7R2M8j17pO3nL8K5p5jN6Lj7o3N5J1q1O1Nn6O0l5J6l7j4J08
$$ 67 73 -13 -62 -29 4 0 -77 15 63 -54 -61 2 -3 35 60 -15 -16 40 43 26 -37 18 29 -52 9 14 -42 18 -17 -1 -38 -52 56
4474E6p3l3R6q2K8RloJ8j0j5n1O0j6k6R2%q9K9O7j25K6J05p7OOk4k5J4J16Oj43
$$ 56 -17 -50 46 -36 -8 1 -2 -8 10 0 -15 -66 -6 -22 -48 44 44 -45 -16 51 -74 -48 57 -20 -14 -8 -32 -57 -43 73 79 -64
4506f4J25p4n6J01K7q3NO6no3L6J10k24R3J07j36n9J85j09j9K9J48j43j11J85
$$ -64 61 -13 -69 32 59 -24 -19 47 42 -21 15 125 -99 -6 101 -35 -94 91 -18 -37 -8 140 -3 -114 71
4531G1j3j92K11J4j87R2N6o1o7J25N1j37M7J29j55j04J84k7j02J06nr6l3R4Qj79
$$ 71 58 -134 77 91 -96 -4 52 -9 -76 49 100 -37 10 139 -16 -120 64 37 -65 41 36 -60 -93 1 9 -170
4557a70J95J45l17O5J67j45m0K05J1k15N5K03k07j13K21N7k34K47j7j83q0K32
$$ -170 25 170 -147 -82 85 -60 -100 105 116 -99 -44 159 -48 -161 60 117 -117 130 113 -70 -150 82
4579H2o2j44J67J63l40O5J94j86j05K55L5k64J28J40j74n8K27n8k47K17O7k63
$$ 82 20 -124 43 206 -134 -69 125 -61 -166 89 124 -140 -12 128 -46 -104 123 65 -182 35 102 -161
4601a61R3K41j60j57K11J05k99M1K40k14j46L39l4k48J92J47l02l7K93q0k25K55
$$ -161 -68 173 13 -144 67 172 -127 -86 154 -60 -206 133 99 -149 43 190 -112 -149 144 64 -161 94
4623I4J36l52J6K71j54j98L89j13k38Q8J95j62j54L26J8l70K22J00l18K9L86q7
$$ 94 230 -122 -106 165 11 -187 202 89 -149 -61 134 -28 -182 144 162 -208 14 114 -204 -175 211 124
4645A24k57J39L9k58J05L10k02r6K74j19l20K47J70k08j9L08j47l17K08J39k12
$$ 124 -133 6 45 -213 -108 202 0 -96 178 59 -261 -14 156 -52 -71 237 90 -227 -19 120 -92
4666i2Q9K27j87k65K68L2k59J73K39j82k47K50m4k82L34K24k71p7J65j98j29K27
$$ -92 -3 224 37 -228 40 72 -187 -14 225 43 -204 46 2 -280 54 278 7 -70 95 -103 -232 -5
4688eJ80k13J4K00k14k21L63Jk64K21J26k47j10K44j7j85J45J94l49K0K19j32
$$ -5 175 -38 -24 176 -38 -259 104 105 -159 62 188 -59 -169 75 58 -127 18 212 -137 -117 102 -30
4710c0j73K57J14k91RK82j87j38K42J5k37J74P2j64qJ67m6p9N9J02j97m8J88j46
$$ -30 -203 54 168 -123 -114 168 -19 -157 85 100 -137 37 109 -55 -63 104 58 -21 38 140 -57 -105 83 -63
4734f3l5J54Q5l05J39J84k01p2K16n3j07P9J11k19L5K09j70j00K10N8k06K4J64
$$ -63 -98 56 141 -164 -25 159 -42 -114 102 49 -58 21 132 -87 -52 157 -13 -113 97 155 -51 -27 137
4757A37j52j28J95%j99J66R3j94J5J22kj30R6P2j48J2R1o7rR0L1j24N6O0r3r2
$$ 137 -15 -143 52 52 -147 19 112 -82 -67 55 53 -77 19 91 -57 -45 46 -21 -30 60 91 -33 23 83 -10 -102
4783a02J83m4j30P2J40j97K3J40p4o6R9M7j60K0R9lj05J11j0j09K1J08j06N4p
$$ -102 81 37 -93 -21 119 -78 -55 85 11 -55 44 91 -69 -49 50 47 -58 53 43 -66 -45 63 -43 11 4
4808Do5M0l8Q6r5O2O4j04q8J47K1q8O3P0o2m5K3M1q0M7M5j13O0N3k3l7kN0rj01
$$ 4 -61 -21 -59 27 -68 -6 58 -46 -134 13 34 -54 9 79 17 -28 -5 36 -44 3 48 -65 -5 48 25 -12 -14 36 27 -74
4838g4R2l6o7Q8O6r6J01p4m4K8OQ7o4k3P2q3j4J34j20J1J5m6L8J8j6l0l4L6L6
$$ -74 18 -18 -85 3 69 -27 74 0 -44 -16 -10 77 13 -10 62 -21 -35 99 -21 -10 5 -41 -3 15 -1 -31 -65 -29 7
4867Gl4P1n2j2O9jp1Pj7N6Kj3J4m0N1l3%j1P3r9N6j6Pl6k1K5M3l9nM5Ppn0N3n5
$$ 7 -27 44 -8 -20 49 48 -23 -16 -33 23 25 12 26 -14 37 4 4 -7 66 -33 23 7 14 -22 -43 -18 25 -14 -19 26 33 26 -24 29 -26
4902b6j1M2Lo5J24q3K0Mk7QJ7J2L5k4n9qP6l9L6l7J9M2r1M9O2q2N0jm8j0rk2Q5
$$ -26 -37 5 8 -57 67 -16 4 8 -19 -11 6 18 53 29 -30 -38 38 -1 35 -2 17 59 -32 17 79 -3 47 46 -2 -12 -21 -43 42
4935D2q2L5L7q5J00l2M4l7J9m4J1k3N9Mm8l0O9n5K3j5l4P0k6K8n1LK4k8j4P3n
$$ 42 -40 -5 32 -53 47 15 59 22 41 -3 8 -15 44 48 0 -30 39 -16 7 -8 -42 28 2 30 -21 -18 6 -22 -36 37 32
4966C2o8K7j4N6l2l3Q5n5l7L8m3Q8K0l9n2L0L2M4j17J01j4q9Q6k0l9J0N6l0l9
$$ 32 -36 -9 -23 33 1 -32 53 -2 -39 -1 -44 44 64 25 -27 3 35 79 -38 63 49 -40 46 26 -13 -3 53 23 -16
4995a6K2l3L4K9m2K0m2P9j5j7ql8J3OL3j4l6j5J2M4q3R0j8l5R3n7n3N2j8L8q1
$$ -16 6 -27 7 36 -6 14 -28 51 36 19 11 -27 -14 -8 25 11 -25 -40 -28 16 -67 23 5 -30 63 6 -47 5 -13 25 -56
5026e6O7l6poQ8q7K4J8k1J5p6J49r6l3J08j4o9j0J3lL8Q0q1N4m2L2p8N8Qp0N5
$$ -56 11 -25 -32 -38 50 -37 -13 5 -16 -1 -77 72 -24 -57 51 37 -32 -42 -29 -32 6 86 5 59 17 49 -29 29 37 -33 22
5057B2N2n5l3L1M5m6o8L8Ml7nN4l5Q0K1r1LM3o9K8K8M5o3n3J18j04J9j1Q4p3N1
$$ 22 74 19 -14 17 62 16 -52 -14 -10 -47 -52 2 -33 47 68 -23 -20 23 -46 -18 10 55 -8 -61 57 -47 -28 -39 45 -28 23
5088B3mq6MP8mp5J02J4j03M2O4j2r6M9Q8q4k4N1m0l0M7N0p1Nk9L4j9N1Mj09QJ67
$$ 23 19 -67 -63 15 11 -64 38 52 -51 -9 55 43 -53 -4 84 0 -24 27 -13 -43 4 54 -17 -12 -41 -7 -26 25 29 -80 -72 95
5120I5j19m4J25o6p7R8Q5j37J4P1k3q0P1M6p2K6J5K1n1Kj3l1K6O4r7KR8k9q6O4
$$ 95 -24 -68 57 -9 -86 12 97 -40 -26 45 22 -58 13 59 -13 13 28 49 -2 0 -13 -44 -18 46 -51 -49 49 20 -66 -2
5150bP1j02j5R5m1p8Q9L1q6N5nKl9Q7o0n9Q5K6p0QM2nr9J17N4j92K5R2p1M1M8
$$ -2 69 -33 -48 47 6 -72 17 48 -38 17 12 14 -25 62 2 -57 28 54 -16 -8 34 29 -70 47 101 -91 -66 26 -45 -4 44
5181D4jk4p3Q1m5o3J63m6j02J18o2kn4Q5l7K2j0N1j07L7J12j10pL8J1j29K0L6
$$ 44 43 19 -54 27 -18 -81 82 36 -66 52 -10 -12 -66 19 -18 4 -6 45 -62 -25 87 -23 -30 8 19 -110 -90 -54
5209e4P1p0J47o9j48J11O9k7P9r6pk9L0J6l3j1N5kj17R2m8j6Q4O1r4k1M3M6j02
$$ -54 17 -53 94 25 -123 -12 57 30 109 13 6 -23 7 23 -10 -21 34 32 -85 7 -41 -57 27 88 -6 -27 16 62 -40
5238d0L3J6r2J02K1j7p2Q5j2k9J4O6j20N1J5l3k2K3J7m4J2R2m2p8N8Qp6N2N0q5
$$ -40 -7 9 -83 19 40 23 -49 36 24 -5 9 75 -45 6 21 -12 -34 -11 6 -38 -26 66 24 -54 4 12 -64 -12 38 -47
5268d7J7N5J7j5J3kn4J2L5Oq2M9kM1kj6K8n5O2j3p6J7L6o3rN1N3j01N3j5j1J1
$$ -47 -30 25 42 27 40 38 -16 -4 31 37 -45 4 2 43 41 25 53 -2 60 47 -29 -12 24 -39 -48 3 56 -45 8 -7 -18 -7
5300gm0J5j8O2l0j7j8P7N3m6n6O6j4p2Q9l3j8jj1LM1n8K8k4qJ5l9O5j5N1n9J9
$$ -7 -47 -32 -50 12 -18 -35 -53 24 77 31 -25 41 27 -45 44 11 -7 -8 -19 -16 25 -33 -5 -29 -37 -22 -61 4 -11 40 -19 0
5332@o0L9L9o8j6K3P8l0k3K2kO8l0j3o3O3k1L0RJ3r5j0P7l5M9o6NL1m0J05j46
$$ 0 -60 -21 18 -50 -66 -43 35 5 -18 4 2 70 40 27 -36 27 6 36 45 58 -37 -47 30 -5 44 -22 -17 14 -26 79 -67
5363f7K3J5N3k9l9P4o0L9j4n7J7%L2K0K6l3rK7j7Nm2j5K3P8o9j2L5n8P0m9P8q2
$$ -67 -44 -29 24 -5 -44 30 -30 9 -5 -62 -45 -45 -13 7 33 0 -9 18 1 6 -36 -51 -28 50 -19 -31 4 -54 16 -33 45 -37
5395c7M1j1m9O4m3k8J07m5nl1P1K7n2Ql6N1o3K6Rj0j5nM9k7O1k3j8k4k9O2o0N6
$$ -37 4 -7 -56 8 -35 -63 44 -1 -6 -37 34 61 9 17 -19 32 -31 -5 4 -6 -21 -26 23 -4 57 34 16 -8 -37 25 -35 21
5427B1l1L2n8K9oMLJ2LK4J0l3K1l1K1j5Jj7LJ4M6o8LQl0PM1lOk6L7p4j3N0j8k
$$ 21 -10 22 -36 -7 -13 -9 -6 6 9 33 43 10 31 0 21 6 7 -10 -7 7 53 -15 -12 -4 -34 -27 14 11 17 -9 28 -46 -59 -9 -27 -29
5463b9ON7j0n4L1K4l7OOj8K3PMk4M3Po5oR7p4M9m8j1L2N2l2o8O8k9j9o5R0rK3
$$ -29 -23 34 24 -30 1 25 -12 -6 0 -18 5 12 16 -8 35 42 -23 -29 68 -6 43 -5 -16 16 68 36 -32 36 7 -12 -77 13 4 27
5497B7o1J5Q8q3NroKMM7o3M9n1lL9jK8m7J2L4jk4k2N9p1K4j5oL7l9Q6q5L0J4l6
$$ 27 -34 -19 69 -14 -9 -18 -24 -22 -18 29 -34 15 -36 -39 0 -1 27 -20 -8 26 25 1 -21 38 -33 -9 -24 -30 7 -32 54 -31 -1 13 -23
5532b3N1p2L4Rl5M1M7p9O4m9n1MN9QM6r4N5mm1k8J11l5k1J1J2k6mO2n2l5k0J08
$$ -23 28 -44 -10 -1 -36 5 52 -27 37 -12 -63 -59 0 8 54 -40 15 11 -30 -58 53 18 -3 8 20 -6 -10 52 0 -35 -55 53
5564E3k4p9K9j0pN9l2No8R4k7k8N7nl6Pk1L4m4L8OK1k7L6q4K5L7n9JN5Mp7O7P5
$$ 53 29 -50 -21 -31 -38 21 -11 -6 -74 20 -7 -35 22 17 -19 -12 -33 1 -43 -5 1 22 -5 31 -53 -28 9 -50 -49 6 10 -67 0 75
5598G5p9Lk5R4p9K2q6J02l3j9jO4lk8p5N4j6K5LL4j3k4K6%k9l8P3j14Q7M2J1q0
$$ 75 -4 -1 -26 68 -11 11 -75 27 -6 -25 -26 38 35 7 -68 -14 -30 -5 -2 32 19 -5 21 21 -8 -46 27 -87 0 42 53 -27
5630b7Q3j1j58J14k7J3M2o0O7k8J3j2j0m5J09k5p6P2Kl1J7k7jl9M7L5r6M2Q7q3
$$ -27 56 45 -113 1 -26 -13 29 -31 36 8 21 9 -1 -46 63 38 -38 34 36 5 22 -5 -6 -45 2 37 -59 -17 70 -13
5660a3j2N4M7j27L9J4j2PN5n0p4L5L4jk7L4l3j7J21m5p5K8P8r3o7J39k0l6K8n
$$ -13 -25 29 76 -51 -12 2 -10 -3 52 2 -72 -37 -3 -4 -31 3 -30 -47 74 29 -46 -18 60 -33 -100 39 19 -17 11 6
5690Fj3m8L7NkL7J9r3M3k0N5J3N4j27o8J40j7k2p1O9K7j02R4P4j54N7P0j7j1O
$$ 6 -7 -55 -18 -13 -15 22 41 -52 -9 -29 26 39 93 -34 -102 38 21 -1 -72 -3 24 -78 16 90 -64 -7 63 46 35 41
5720D1Kj11R8Mm4n6Q8L4r3J5M2k4NMM4r2J27Nj40J1J12n3m7R3n2l0l9R9r4k0J33
$$ 41 43 -68 30 34 -10 -66 22 56 -37 -22 20 -4 1 5 49 -43 84 89 -51 -40 72 19 -28 65 13 -17 -56 43 -51 -71 62
5751F2J5n4K3m5k6J7L8o1l4K9J10j28K9J37j47JP4l3o9O4O9j11LQ5r4l1O8L8o5
$$ 62 77 23 46 1 -25 -8 30 -31 -65 -36 74 -54 -25 112 -35 -34 40 7 -62 2 71 -40 -37 48 -46 -77 -9 29 -36
5780c6K2N2l6m6R7j9r7L7N3k8p5Q5k9m0R8J5r7K8J1Lk7J6L5j51O2P0k7j8L4L0
$$ -36 -14 38 2 -44 53 34 -63 -26 27 -1 -76 9 -20 -60 38 53 -44 -16 -5 -2 -29 -13 22 -129 -67 3 -24 -42 -8 22
5810B2n6K0K7ll6Q0l0j13J24Km0j3L2l3L6qPkl6P6Nj33J04m0m5R3l4k7j1P0pr3
$$ 22 -34 -14 13 10 -26 54 24 -89 35 37 -3 -16 16 -17 19 11 18 16 -20 56 61 -72 32 -8 -53 40 6 -21 -32 38 31 -62
5842f2Q1L5l1m3L6k4p0J10l1n6P7l1L7q1Q1l5l9O8j4K1l9J21j26j4k1R3j1k9J2
$$ -62 19 54 23 -20 16 -8 -78 32 1 -55 22 -9 28 -53 28 -7 -46 22 8 29 -10 111 -15 -29 -50 43 32 3 15
5871A5J5k4J2n0L7o4N6J1Jj4m2O3JOj36P4Q0r8kR5m8PJ0l5O7r3J08o4ko2Q3j4
$$ 15 30 6 18 -32 5 -59 -3 8 9 -5 -47 16 17 23 -113 -39 41 -57 -59 36 -12 -5 5 -30 37 -56 52 -12 -14 -76 7 -7
5903gL8j10J34n9J8ql6K1M4l3J4Rm8J9rLK7m5K5ql7P8Ml0rl9N2ro3lK3PL6j6j9
$$ -7 31 -79 55 -4 14 6 -30 -9 35 2 16 25 -23 -4 -13 -10 17 -28 -3 -11 -48 30 34 4 -5 -44 8 -1 -64 -67 -44 -37 -1 -17 -36
5938c6Oj3L3K5j4p1L9P6p1L6KJ3K0r1R6Mo0L9n9k0K8l1J02j01K5L2l5L9L7l2j9
$$ -36 -30 -43 -10 15 1 -70 -31 45 -26 10 12 25 45 -46 50 54 -6 33 -26 -46 -18 -49 53 -48 -23 9 -26 13 50 18 -1
5969aoM9Or8K8q4J71q4Jo4L9Q1J5k7n8O5k4j0ORPo3L4k0NQ%JO4o8m4O1L1l3OJ2
$$ -1 -7 42 48 -50 -22 -106 65 -19 -18 -82 -43 38 53 26 -32 33 9 -1 5 14 21 -42 -8 -28 -23 -15 -15 -14 50 -18 -62 -1 30 -3 3 15
6005A5k4J1K2o0K4RK3pl3O1n7M3l2J9NK2n0k9K5J4pp%j8M7p4O3K1m0J0M7mk0J6
$$ 15 -9 2 24 -36 -12 -3 20 13 -20 41 -16 27 -5 14 19 41 -9 -38 -13 1 -6 -13 -13 -31 16 -58 5 26 -14 -4 43 39 19 35
6039C5Pl7l7K3J3rk9P4j6m3j5K6l9J5J23j23J2L1k2k0K1k7M5lj9j8kO7p0M1m2
$$ 35 42 5 -32 -9 4 -5 -34 40 24 -19 -34 -8 -47 -32 91 -32 -20 11 -11 -31 -10 -37 8 5 -14 -32 -34 33 -37 4 -38
6070c8Q5l0m9j1N7N5p6M8J3k5m8m1Q7n6L3M2r5%N7k1M8J6l0o8M8Jk2j4Q2j9q1
$$ -38 47 17 -32 -43 14 69 -7 41 54 29 -19 -60 27 -29 4 46 -49 -49 8 -13 35 51 21 -47 1 2 -20 -34 48 29 -52
6101e2Q7j05M8j6Q6n8n7N4qN2m4Kn0N7k4K6Lj4M8k2Pj5jJ3Rp9N0lL0l4j9K2k5
$$ -52 35 -70 -22 -38 48 -10 -67 -13 -21 31 -13 -11 -61 -4 -28 -2 1 -13 35 13 20 5 4 17 26 -53 -3 -6 24 -10 -29 -7 -32
6134c2K5j2P3m8k3M2k7Ol5%J21m3m6j4MJ9m0N9Jr2M7L4l3k7K3m7L2L2N1q5K9L7
$$ -32 -7 -19 54 6 -17 25 -2 4 -31 -31 90 47 1 -13 -9 10 -30 29 30 -62 -15 19 -14 -41 -18 -65 -33 -1 50 -35 -6 31
6166C1lk6l4lLL0K2k9K6m1Q4l7k6K7j4l4l8LP7o3L2M0l8J6pJ3n4M8K6m8L8P3j17
$$ 31 28 2 -32 -35 -32 -2 20 -9 17 -24 60 23 -3 24 10 -24 -62 -59 18 -45 -13 27 -11 5 -2 11 -43 5 31 -17 21 94 -23
6199b3J5J8OrJ5po1M0rj7P3k8p4P4J8j6l4OJ7j2L3l2J2qK9n4j6L8M6n3J0O5k1
$$ -23 -8 10 16 7 22 15 -46 -6 -15 -32 41 13 -61 13 31 15 -19 -13 4 -8 25 -7 5 -3 26 -28 -44 -6 40 -13 -3 62 41
6232D1p8M4Po9j4R7m7K7l2LL9l8L1l8J9j5M8pl9L5kl1M1p5L0J0O7m8J9k2lj8k1
$$ 41 -37 7 14 -55 -69 28 -19 8 -24 -21 18 -20 11 -27 -8 -23 25 18 -21 14 12 -19 22 -53 -23 -13 54 6 25 3 0 -18 -39
6265c9O9m1K1Orj4Pm3M9j6l4O4j9N0p6K6J6qq9K3R3q6Q7j0L3j09L3L8J0j0K6q2
$$ -39 30 -11 10 16 7 -7 0 -43 6 -10 -44 20 1 51 -25 1 17 9 -80 -57 36 -50 37 27 60 -49 -16 22 32 22 48 -34
6297c4L3J6L8Nk6pl9l1N1L3qj1k3j5j0P3rl9pO4q6j5R2l9l3P4k6K3K1%J4l9k6
$$ -34 -1 15 53 58 32 25 -14 -45 6 39 31 20 -3 -18 -28 45 36 -3 -10 54 -32 -47 45 6 -27 47 21 44 65 65 79 40 14
6330A4jj%j6m6L9K0k0l2J08n4J0p4O8Qj1m2M5jL9n6k5M1pK2o1JP5l3J6Orp0L8
$$ 14 13 12 12 -4 -50 -11 9 -11 -43 65 11 21 -53 15 23 12 -30 15 14 53 -3 -28 13 6 28 -33 -32 43 10 26 32 23 -47 -9
6364iJ8j3K5m0l2L8j7k3J7N9k0K3p3L6k4L6J1k2o6R5pj4Kqk8L0kj8L7k7K5j3r6
$$ -9 9 -4 21 -19 -51 -13 -30 -53 -36 23 3 26 -47 -11 -35 1 12 -10 -76 19 12 -2 0 -8 -36 -6 -8 -26 11 -16 9 -4 -100
6397a00M9P1K3l1k4M5l8N8Qo5m1J1P4j3m7O5p0L3qp6J15j1m4k0P1m6M4m9K7jP
$$ -100 -51 20 43 12 -12 33 -5 53 61 -4 -45 -34 40 27 -20 45 -25 8 0 -76 39 28 -16 -36 35 -11 33 -16 11 10 17
6428A7Km8OK0k1l0M7j8L6mM8j03N7M0qn6N7o8Qj6M0k4Jk0M9O4q8K4qL5Pk3l6J0
$$ 17 19 -29 -23 -3 -24 -54 -7 -25 11 7 55 -48 9 49 41 -15 42 -26 -18 -34 6 -18 -17 -37 12 76 -12 12 4 39 46 23 -13 -3
6462cm4P9J3j1m4k1K2j5Q8j16Q6m1l0J6K2J8nOJ2l7N6q7M6mNj1m4R3q2N8n8K9
$$ -3 -47 32 45 34 -10 -31 -9 -24 64 -52 34 -7 -37 -21 1 19 14 20 32 -5 51 -36 10 6 11 0 -44 49 -33 25 -33 -4
6494dKl2KK1K2l2J3k3N3j8M3l9l5J2j2M3L3j9o9M9J2m3J0l7N6J5o0O6n0N5o6L5
$$ -4 -2 -34 -32 -11 11 -21 -8 -31 22 4 47 8 -27 -15 -27 16 49 30 -39 10 22 -21 -11 -48 8 23 -37 29 -21 34 -32 3
6526CK2j1l8PK2m9O8o5M6J9l0O5n1k3k3N5k5%po7R9j3J4J3o7P1n5K4PkPrJ1l7
$$ 3 25 14 -24 -17 5 -44 24 -41 5 24 -6 59 8 -15 -38 17 -8 -8 -15 -82 17 4 18 31 -36 35 -20 4 11 9 16 7 18 -19
6560a9j3NK1J5Rm2j8Q4l4j4j6N2k4m6M9m2l8N5N6m1K6mlj6QK3Pq7J08o3l8k7J7
$$ -19 -32 -27 -6 9 18 -24 -42 42 8 -6 -22 30 6 -40 9 -33 -71 -16 40 -1 25 21 18 2 10 33 40 -47 61 -2 -40 -67 -50
6593e0J2N5j4L6o7K4K4l3j0N1m7j0P5o3L6K8k4l1J2j3J8k9lO3q5J8N7o8j3L8L7
$$ -50 -38 17 3 39 -28 -4 20 -13 -23 28 -19 -29 46 -17 19 47 23 -8 4 -9 9 -20 -23 40 -45 -27 30 -38 -51 -13 24
6624B4k4K8k2k1ONL0n9O5K3p8m2R2J0o5J5L4r4P7O7o1r8Q9l1m2R6Nm0NJ4N4q3
$$ 24 0 28 6 -15 -9 -4 26 -33 32 55 -23 -65 27 37 -28 -13 21 -73 4 71 10 -88 1 -30 -72 24 29 -11 -6 8 62 -21
6656b1L9nj3j0K7l1k2N1k3p9J06rn7K9P1m6r8J30J4o2J6K5L0j12M6N7j01j1R3
$$ -21 18 13 0 -10 17 -14 -36 15 -8 -87 19 10 -47 -18 53 7 -91 39 53 -9 7 32 62 -50 -4 53 -48 -59 34
6685C4l3l5M1o1qR8qn6o3J02l0k1K8M7r7k9L9O2p0K3N9qn2Q4nj02O4R1j28L2R2
$$ 34 1 -34 7 -54 -62 36 28 -28 -91 11 -19 -40 -12 35 -62 -91 -52 10 -60 -37 22 14 -38 46 41 -61 3 94 -34 -2 90
6716I0j37L7N3l5r1J13J3k8n9Q8q8L5O8n1j2k1O8n1l1M9qn4O1J4o4J8P0j03N0
$$ 90 -47 -10 43 8 -83 30 43 15 -44 44 -44 -9 59 8 -4 -25 43 -8 -39 10 2 -52 9 23 -41 -23 47 -56 -6
6745fK4j2o8j6O6lo0J63l9q4O4Ml4l0N8Po4K4M7o8LQ7n3r0R0L1j00k3J18k1j7
$$ -6 18 6 -62 -78 -12 -15 -75 88 49 -35 29 33 -1 -31 27 34 -30 -6 41 -27 -24 63 10 -80 10 41 -59 -82 36 15 -2
6776bo2J67j17P0j3j08R9k3j0q9J00J6n3J4j4K5L7Kk7r3M0K1pl1J13m1n7N8M4
$$ -2 -64 103 -14 56 43 -65 34 11 1 -88 12 28 -25 -11 -25 0 37 39 12 -81 -41 -20 -27 -58 55 14 -43 15 59
6805E9j20O8L8j0j6LJ7q7M2Q4j41K6R0Jj10N0R9j15JQ9o1n5L6P2o2l3R0q3RN0
$$ 59 -61 7 45 35 19 22 39 -48 -6 78 -63 -37 53 54 -56 -6 93 -22 -21 68 7 -48 -12 60 -2 -35 55 -28 -19 31
6835C1Qo0K7l4N9k6kM4n7jM3Mp0K5J2j3K1J4j0J7J7o7Pj9R3q9O4O1r5J5l6P4n9
$$ 31 39 -21 6 -28 31 5 3 47 -10 -11 32 36 -34 -9 3 -10 11 25 15 32 49 -18 -11 -30 63 -26 38 99 4 19 -17 57 -2
6868bK3rj0l0K6J4m1K8j0J0J9l4M4k7Qk2oN2r8R2rj0okQ4q5J1l7N2p7N4K7j5N4
$$ -2 21 12 2 -28 -2 12 -29 -1 -11 -1 18 -16 28 1 9 -13 -19 33 -65 27 18 8 2 0 84 -1 10 -27 25 -52 2 29 14 68
6902F8j02L9M1l6k3O3n8mmL9Rmp4P3l7rL2rJn4O2k7K3L5r4k9J04q3J8j2J09m2
$$ 68 -34 5 46 10 -13 50 -8 -12 -16 23 32 28 -46 27 -10 -19 13 4 5 -49 13 -14 9 44 -50 -79 25 -58 -40 -52 57 15
6934A5l3Pj1j4P1n5L6Ok1Pmk6jO7n9Jkj7L5J7p7K3O6J9l7l5J7k0K4K2n7M3oNp0
$$ 15 -18 -11 -22 -36 35 -20 16 22 1 8 4 -22 -23 44 -15 -14 -16 -33 2 19 -58 -35 31 50 13 -22 -5 -25 -1 21 -36 7 1 6 -64
6969f4P6K7o8J5J6kkL0mm5N7RJ3j05O7%K4n9K0k6L4j3m2L9l6LO6q5O7J9p6J3K7
$$ -64 12 39 -29 -14 2 0 -2 28 24 -21 36 45 58 -47 20 20 44 -15 5 -21 13 0 -42 -3 -39 -36 30 -55 12 31 -45 -32 -5
7002ej7PN1q3N6Jm7QNP2m1m7P4kj4lJ1n6M3L6l5j3jK9rMl3qrO2o3j8R0k9l4J2
$$ -5 -22 -15 36 -47 9 10 -37 -29 -24 48 7 -40 34 32 18 15 26 -30 13 49 14 1 0 29 20 24 -9 -17 -26 36 -27 -45 45 16 -18 -6
7038fj8MM0J3j9n4O4j8PMm3K1l1n4J03n2J7M5n1j9K7RN1r5N9j8k8N0Po4N7j3K1
$$ -6 -24 -20 20 33 14 -40 24 6 13 17 -26 -5 -36 -90 13 -39 -22 23 -28 -47 -20 -11 40 -55 4 -14 -42 8 15 -49 8 -5 16
7071A6k9J8oJ7n3mN8n0O6j0j38J25N9q7J3M9k3m2M9j2n1N9K6m6Mm5M8k6k4N0Q1
$$ 16 -13 5 -1 16 -37 -41 17 -33 33 23 -115 10 69 -18 -5 44 21 -21 28 16 -35 24 50 4 8 -37 11 -15 -39 11 92
7102I2o0nOj13N3N6m8j0J7M5n9Q4J4p2O4K2n0n4J8rk1L0L3m2l7M3l3m1O9L7m4
$$ 92 32 27 33 -80 -27 29 -19 -29 -12 33 -26 58 72 0 64 86 36 -18 0 -9 -30 0 33 -9 -46 -3 -36 -77 -8 29 -15
7133a5L7L2l8o8O5K0m2K0O1n8j9K1qmJ8k6n2J6L9L4q7N7L1p1O4J5k3o3N3K9j05
$$ -15 22 54 16 -52 13 33 -9 11 72 14 -5 16 8 4 22 -4 -56 -40 -1 33 -54 3 34 -37 27 42 19 -44 9 38 -67
7164f7J07k2J0o5P4mr5Q9m4k0KQ6p8m2J04k6K9j2m1M6j09J24j7j17J07L7o9J9
$$ -67 40 18 28 -37 37 33 -62 27 -17 -37 -35 51 -27 -69 35 9 38 26 -15 31 -78 46 29 -88 19 56 -13 6
7192Fl2K9k5P8lq4P1k5n3k6J07j4k5k3J7jm4L2O5q4M3L1n9j3J09j28K5M6J1j04
$$ 6 -26 3 -22 56 53 -31 40 15 -38 -64 43 29 4 -19 -2 -3 -47 -15 50 -34 9 40 -19 -32 77 -51 -26 20 31 -73
7222g3P1N1o8KN6m1k4j9Q5m1k4K1k6MJ8j6oJ8R2o1n4L2M0n3J4L8q1K5L8Lk8m1
$$ -73 -2 49 -19 -17 39 -2 -26 -45 40 -1 -25 -4 -30 -26 -8 -24 -30 -12 80 19 -35 -3 37 -16 -2 36 -45 -20 18 21 -7 -48
7254d8N2j7J0J5l8N2J8nm3LOQn6N5k2k2O7l5L0j08J12k4q2Q5M3o1L3K5l8n3N3
$$ -48 4 -13 -3 12 -26 26 44 39 -4 -1 5 13 -43 12 -10 -32 35 0 30 -78 34 10 -72 13 56 -5 28 53 15 -38 15
7285A5n1%J00l5n2oJ6J3PJ9o0L2M6Rk5m3L9Or0R5p8O7o7j3P1l5%M0qLJ6l4j0o
$$ 15 -36 -36 64 29 -23 -29 -13 0 7 26 -34 -2 44 53 28 -15 24 30 -60 35 -43 24 -43 -56 15 -20 -20 20 12 15 31 -3 -13 -19
7319a9J1M9o4J4Km3Q2L1j25P6K3m9K7k8P1m5Qo6O6l8P8Nm8l8j7nM6nk9P0o2l9
$$ -19 -8 41 -23 -9 -7 -50 32 63 -62 14 37 -12 15 -13 58 13 21 -45 21 -17 61 66 18 -20 -37 -42 4 -1 -30 40 -22 -61
7351f1L3Mj9N4Pk4k4k7Q9k9PQJ5m8J2J9mL2p2O3p4N0Jm1j6O7k0k3L8qnl3M2Kn7
$$ -61 -28 -24 -43 11 18 -6 -30 -57 32 3 10 18 33 -15 -3 16 12 44 -28 35 -39 11 12 -29 -45 22 2 -21 17 9 4 -29 13 15 -42
7386d2M2n9K6J0k2Q8r9K2j9J36n2k4K0p8P6j6LpJ8k2m7L8J0J6J2nJ9J7l8L4m5
$$ -42 0 -59 -33 -23 -45 43 -56 -34 -53 83 31 7 27 -51 25 9 12 5 23 1 -46 -8 2 18 30 25 44 61 23 57 12
7417A2M5k0o9Q1l6j9M2mo7M7k2k0L9n7P1n5J8J8j5L6l3j6l5J11j9l3M1j6n2k3
$$ 12 57 37 -32 49 13 -6 36 32 -35 12 -10 -30 9 -48 23 -32 -14 4 -11 25 -8 -24 -59 52 33 0 41 25 -27 -50
7447e0N6J2%p8Q6k1qj2K0j2J1M1j6r0O0K7oK1l3N8o8J5J5mLm6K1J2k9k6M8J5m2
$$ -50 6 18 18 -60 26 5 -3 -15 5 -7 4 45 29 -61 -1 26 20 41 8 66 -2 13 28 24 27 -19 2 14 -15 -41 7 22 -20
7480b0l1M9L4n3l8O9j8J4L5n3M0n5mO6r9P4MJ0m1K7l2j0P5rj9qJPk2J1nj8L5o8
$$ -20 -51 -2 32 -21 -59 10 -8 6 41 -12 28 -27 -31 35 -64 10 14 24 -17 10 -22 -32 43 34 15 7 8 15 -7 4 -1 -19 16 -52
7514e2J10j11N8k3l4L3N9m2mL4k4L0%mk7J8k6l5J9k3O6l1l0R0k6J3mo4J7j4rK1
$$ -52 58 -53 5 -18 -52 -19 40 -2 -6 28 4 34 34 30 3 21 -5 -40 -21 -44 22 -9 -39 51 25 38 34 -30 -13 -27 -36 -15
7546a5J1j0m2O1J1J3mk6m7N0JlNj3K2l5J5oJ4J5l2O9j12Q2J3m2J5JK1k6Ql5N3
$$ -15 -4 -14 -56 5 16 29 25 -1 -48 2 3 0 5 -8 14 -21 -6 -12 2 17 -15 54 -58 24 37 -5 10 11 32 6 14 -21 32
7579C2j02P5L2n8k4N0N3m6k0J1N0q7L2n5O9pj9K5k5P9p2K8J4L4p6QJm8M4j1n4
$$ 32 -70 5 37 -21 -45 5 58 12 -8 3 53 -34 -2 -57 12 5 -14 11 -14 65 -7 21 35 69 -7 1 2 -46 -2 -13 -67
7610f7k6J13Ok1P9k9k2j7k9N7p6J5J2J0j2J7m5j6J5L5j2Q7ol2r6O7q3K3J11j12
$$ -67 -93 20 26 5 84 55 33 16 -13 44 -32 -17 -5 5 -7 10 -35 -51 -36 -1 -13 74 68 36 -60 7 -76 -53 58 -54
7640e4J08k8j2j1L5jJ4j1l8K5qm8PO4lm8nk0qP1j6j2k1M0p4K5O5o3J1O4k9oJ6
$$ -54 54 26 14 3 38 37 51 40 2 27 19 -29 -22 42 39 -9 -14 -34 -42 29 13 1 -20 20 -54 -29 36 -27 -16 48 19 13 29
7673B9ok6j4Q4o0k2J8k1Nj8J3L0j1oJ2q4K8M2O5p2L1Ql3j6P0p6lM2k9oQ1n1k1
$$ 29 23 -3 -17 67 7 -15 3 -18 -13 -31 -18 12 1 -5 7 -77 -49 -7 58 -14 17 25 -8 -24 46 -30 -33 9 -20 -26 55 4 -17
7706a7mj4K6J5pm5PN7Po2k5R1Jrn4R5pq9P0Nm5qol4N9J5l6kRjK8k9L1j6k7N2n3
$$ -17 -21 -35 -9 6 -1 -46 -39 18 25 -37 -62 29 30 21 -33 62 55 -34 36 41 -4 -12 -18 -52 7 22 -14 -16 -7 -8 20 -9 22 6 -21 31 -22
7743b2J3J4P1j7p1N9k2n4j2L7m1M5L1l9j9M1jj8j6l3N7k4j1K0K9m0L7o8Q1jJ9
$$ -22 -9 5 76 59 -12 47 25 -29 -41 -4 -45 0 31 -8 -27 14 13 -5 -21 -54 3 -21 -32 -12 17 -23 14 -54 27 26 45
7774D5r8P4J0l4RM9o5K2m7M6Jn8O5k4n1N2K0k0K9J0m1k6P4m4P2o4K7rRlqqMNJ5
$$ 45 -53 21 31 -3 6 55 -10 12 -35 11 12 -46 19 -5 -56 -4 16 -4 25 35 -6 -32 42 -2 70 6 33 24 33 30 22 14 18 23 38
7809C8l4l9P4o1K9M8m9j1J8n5M7j2Njl3N5l9K9L7kl7K4j1K5k4p6J4O3L4r5LP5
$$ 38 4 -35 39 -22 7 55 6 -5 13 -42 5 -7 -2 -3 -36 19 -20 9 46 44 7 31 20 45 21 -55 -41 22 56 -39 -36 39
7841C9nk6Km6Q5p8O5J4j02Q5k4K9l0K3m2QP1j8j0m0K7q5Q5m2MQ1m6L8l2l6M1l3
$$ 39 34 8 10 -36 49 -29 36 50 -52 33 9 38 8 31 -11 -3 68 50 40 0 27 -58 27 -15 -11 70 24 62 30 -6 35 2
7873Bo1P5Jm8P7k5k7j8KJ2j6J8Oj8k4Q9m2LKn7J6Q5n6j7O2o6J19o6l7M0o3J1K7
$$ 2 -59 16 17 -31 46 21 -6 -24 -22 -10 -26 -8 -2 -20 -44 45 3 6 8 -49 -33 52 -4 -21 41 -25 94 28 -9 31 -32 -21 6
7906FL1j8m6O3n8K9L6k9j8k6rL3J4P0m6l7Oj9OJJ1k0K0L2k1oL6q7K6K6j2J4j1
$$ 6 37 19 -27 36 -22 7 43 14 -4 -30 -39 -6 8 78 32 -5 1 -18 -12 -11 0 -20 0 32 11 5 41 -46 -20 6 -6 8 -3
7939cL0p0L9JRm1O0k3K1lJRo4N7m9J6l3L7Ln1M0k1P5m0k7K7N4j7m8OO8Oj37O1
$$ -3 27 -43 -4 -3 6 -35 25 2 23 20 21 30 -34 23 -26 -10 -43 -6 -3 -54 -14 -35 40 0 -27 0 54 37 -11 -5 63 69 -68 -7
7973gK7O9o4m1j9O7k2M8o8L9k2l2J5l3J3K5j0PkqLJ5J0J0m9O9j8nm0J6M0j5K7
$$ -7 20 89 25 -16 -35 32 10 58 -10 29 7 -25 -10 -43 -30 -5 -15 -8 -10 -18 -15 0 10 20 -29 40 22 17 -23 -7 33 18 45
8006D5m4l3M3o6K2N7J6k1K2r3O5l9Q2l3l8K9j2l3j0O0m7L7K6o9l1P6j1K5jk3m3
$$ 45 1 -32 11 -55 -33 24 40 19 41 -52 13 -26 56 23 -15 14 2 -31 -41 19 -28 9 35 -34 -65 11 0 25 24 1 -42
8037d2P2o1L2j0L4Ll4M8k1j3j9j0J6J9Qj3K0Mo5RP4o1oj8j3L7J6l0N8jl5J7j3
$$ -42 30 -31 1 -9 25 28 -6 42 21 8 -11 -21 -5 14 22 9 29 33 -32 -23 51 -10 -16 -34 -47 -10 6 -24 34 33 -2 15 2
8070Bk0M9o5PN7o5mP0k4l0p2M7K6lM8p7K0M0q9R2mJ7l8rJ7j8K5J8Lk2MKN0J0n2
$$ 2 -18 31 -34 -27 30 -35 -39 31 7 -23 -95 -48 -22 -25 23 -54 -34 6 -83 9 5 22 -16 -25 -8 -26 -1 17 20 -2 2 4 54 64 12
8105A2k2M6ro6Q4l4j2k4KO3j21R6j1jJ1l4k3N9p6P7o1O3l0lo6N1J3LRJ0Pk1k9
$$ 12 -10 36 27 -39 45 11 -1 -25 -23 40 -81 15 4 3 14 -20 -43 16 -60 17 -44 19 -11 -14 -80 -29 -16 -13 -4 6 13 -8 -37
8138c7Q5l7L3n7OK5m9P8J1o8O6n3Jn5J07k7k5K3l4lOK7m2K1J0m0L2j06J44m8n3
$$ -37 48 11 44 -13 -7 18 -31 47 58 -10 56 3 4 -51 56 29 4 27 -7 -10 -4 23 -19 2 12 -28 4 -102 42 -6 -59
8169e9J02n8K2l8L7oM9q0N3l3j9Q0j13O8J8K3m3l9L0O2n0m7
$$ -59 43 -15 7 -31 6 0 49 -31 22 -11 -30 50 -63 5 23 46 3 -36 -6 56 6 -41
8191d1
$$ Imaginary data points
##PAGE= N=2
##DATA TABLE= (X++(I..I)), XYDATA
0@%%%%%%%%qJ6j6J6k4L2m0M8n6P2q8J12j36J60j92K28k68L12l68M28m92N65o45
$$ 0 0 0 0 0 0 0 0 0 -8 8 -8 8 -16 16 -24 24 -32 40 -48 64 -72 88 -104 124 -144 168 -200 228 -264 301 -344
31c44P37q38R50j075J212j364J528j708J908k125K364k624K907l218L558l928
$$ -344 393 -445 505 -570 642 -722 806 -902 1006 -1119 1245 -1379 1528 -1690 1868 -2060
47b060M330m772N257n793O383p033P758q567R478j0512J1692j3055J4655j6562
$$ -2060 2270 -2502 2755 -3038 3345 -3688 4070 -4497 4981 -5531 6161 -6894 7761 -8801
61h801J8878k1765K5483l0469L7541m8429O7512j10502L78112k6745n93093M10135
$$ -8801 10077 -11688 13795 -16674 20867 -27562 39950 -70552 307560 280815 -312278 97857
73I7857p212l70397K14758M44226l02970k06386J67537j92248k52202M59378K25055
$$ 97857 90645 -279752 -64994 379232 76262 -130124 37413 -154835 -407037 52341 277396
84B77396l82597M1506L41111l82153l41910M75311K91264l74040l572K96761k48432
$$ 277396 -105201 -63695 277416 -104737 -446647 28664 319928 -54112 -57684 239077 -9355
95i355k68691K97305R6725j90102J86254J19729l83201n6246L62810j18815k86631
$$ -9355 -278046 19259 115984 -74118 112136 231865 -151336 -207582 155228 36413 -250218
106b50218L26860J99990m32738r1856L75097q4427k41232K37265J18044k54498
$$ -250218 76642 276632 -156106 -247962 127135 42708 -198524 38741 156785 -97713
116i7713L5038J81763j84789o4871K85178p3834k97337K04613K14486k98342q3357
$$ -97713 -62675 119088 -65701 -130572 154606 80772 -216565 -11952 202534 -95808 -179165
127a79165L23592m2761k73686J46161J85975j81394l6356J87673j03656j39474
$$ -179165 144427 101666 -172020 -25859 160116 -21278 -57634 130039 26383 -113091
137a13091J81605K0854k02395J14586J75910k17334j26496K38090K1854k18303
$$ -113091 68514 89368 -113027 1559 177469 -39865 -166361 71729 93583 -124720
147a24720J04111J83031j67912r6797J58376k9789j15554J29367O2011j55975
$$ -124720 -20609 162422 -5490 -102287 56089 26300 -89254 40113 102124 -53851
157e3851J4235J25845j19541r4386J84012M4437j74711M1623J26521j20902p7761
$$ -53851 -39616 86229 -33312 -127698 56314 100751 -73960 -32337 94184 -26718 -104479
168a04479J38636K0642j04562N4404O4560j13684k5810J17385l6068p9365J02914
$$ -104479 34157 54799 -49763 4641 69201 -44483 -70293 47092 11024 -68341 34573
179C4573L7789j25024K685R7263n2413n8639R5269K5593j01243K0076P1977p1665
$$ 34573 72362 -52662 -49977 47286 -5127 -63766 31503 57096 -44147 -24071 47906 -23759
191b3759l0810R7255l330p7708L6578M1895o5810j6414O8565j4139m7320M8044
$$ -23759 -54569 42686 39356 -38352 -1774 40121 -25689 -42103 26462 12323 -34997 13047
203A3047J0536o8794K2709N8253m5650k6446O6645P586o7678J1272N7556k6842
$$ 13047 23583 -45211 -22502 35751 -9899 -36345 30300 37886 -29792 -18520 39036 12194
215A2194k9672M0664M547k9236J5638J725k7151K0234K5785l9432k4242M7352
$$ 12194 -17478 23186 27733 -1503 14135 15860 -11291 8943 34728 -4704 -28946 18406
227A8406N061o3975N725N6174k0830m0476K1874K3578r904q488L551P830J5962
$$ 18406 23467 -40508 -34783 21391 561 -39915 -18041 5537 -4367 -12855 -9304 -1474 14488
240A4488M529k7478k647M4320n804n2374J4226M6496j9664m2019J3754L5765j0489
$$ 14488 19017 -8461 -11108 33212 27408 -24966 -10740 35756 16092 -25927 -12173 23592 13103
253A3103l0342N596K1856N837j6545k2126J6497L0186k3982l5481K2639L5517
$$ 13103 -17239 -11643 10213 16050 -495 -22621 -6124 24062 80 -35401 -12762 22755
265B2755k0289l8174K0655M0673j6938l2232J3512L0112l6k9993r639L1942J2811
$$ 22755 2466 -35708 -15053 25620 8682 -23550 -10038 20074 20038 -9955 -19594 12348 25159
278B5159l2915j9331K8944K6547k8325k9954L2107L2443k5342k8005J8951L1632
$$ 25159 -7756 -27087 1857 28404 79 -29875 2232 34675 9333 -18672 279 31911
290C1911j2230l7418M976L2945m954l6418q813L3306J2868l7672j4697L7631J8453
$$ 31911 19681 -17737 -12761 20184 15230 -21188 -30001 3305 16173 -21499 -36196 1435 19888
303A9888k8028j9404K7219K8596k2332k8151J9589K8337j1789l1289M702L5701
$$ 19888 -8140 -27544 -325 28271 5939 -22212 -2623 25714 13925 -17364 -12662 23039
315B3039k102l5631Q43L2948N502l0461j2544K9554J2972l0558j7501K0656J7933
$$ 23039 20937 -14694 -13851 19097 24599 -5862 -18406 11148 24120 -6438 -23939 -3283 14650
328A4650j8505k6196J5787K8875j2853k5010J1041K9443j214k8104J680L0255
$$ 14650 -3855 -30051 -14264 14611 1758 -23252 -12211 17232 16018 -12086 -10406 19849
340A9849L24k6472n802K0700J0150k2737j5787K0690J5553j6785j7268J3106K2690
$$ 19849 20173 -6299 -12101 8599 18749 -3988 -19775 915 16468 -317 -17585 -4479 18211
353A8211j0787k3716J1291K1124q505j9742J529J8908M60j9905j951J6901O009
$$ 18211 7424 -16292 -5001 16123 7618 -12124 -10595 8313 8773 -11132 -13083 3818 9827
366I827j1917j0083J3793J5032j4300j3308J3484J2288j0444j4390P623J3082
$$ 9827 -2090 -12173 1620 16652 2352 -10956 2528 14816 4372 -10018 -2395 10687
378A0687q994j0061N954O972J006p139n648R669O809r661p036Q471P702j2021
$$ 10687 1693 -8368 -2414 4558 5564 -1575 -7223 2446 9255 -406 -7442 1029 8731 -3290
392c290j0122J2685N030j1136Q36O557j780j341J056O80J993M703r8q036K923
$$ -3290 -13412 -727 4303 -6833 -5997 560 -1220 -2561 -1505 -825 1168 5871 5773 -2263 660
407F60P978r615m516J1986j777j0784L206M574p834l894J0459j79j1986O753Q469
$$ 660 8638 -977 -5493 6493 4716 -6068 -2862 1712 -6122 -10016 443 264 -11722 -4969 3500
422C500j1697j348J1639k112l631P675J708o223M675P302j1410l329J9549l678
$$ 3500 -8197 -9545 2094 -18 -3649 4026 5734 -489 4186 11488 78 -3251 16298 12620
436A2620j9908J0427J1914j8425j0056J6357N950j2631L37O463r681n18R285q498
$$ 12620 -7288 3139 15053 -3372 -13428 2929 8879 -3752 -3415 3048 -6633 -7151 2134 -6364
450f364K307K2021q625k5942J1705K1703j6896j2517K9251Q980l1741n090J6400
$$ -6364 -4057 17964 9339 -16603 -4898 16805 -91 -12608 16643 25623 -6118 -11208 5192
463E192o622j633J2626o149p078R796j0279k3584K0405L2572k4145k2603L1449
$$ 5192 -1430 -3063 9563 3414 -3664 6132 -4147 -27731 -7326 25246 1101 -21502 9947
476I947M381l8901M270L3921l817j5725O566k226j1954J0056L816j5574J8054
$$ 9947 14328 -24573 -20303 13618 9801 -5924 642 -1584 -13538 -3482 334 -15240 2814
489B814K4224l2584k2582L7438J1069l6980L554L8328j0958l2485J2169J3034
$$ 2814 27038 -5546 -28128 9310 20379 -16601 -13047 25281 14323 -18162 -5993 7041
501G041j5325L830Q389j3782Q249J8516k4420j8414L5884J3279m0721K432M7267
$$ 7041 -8284 -4454 3935 -9847 -1598 16918 -7502 -25916 9968 23247 -17474 -15042 32225
514C2225j3554m0732J9646K1605k1733k710J8878n805n620J0253j6675j9024L1680
$$ 32225 18671 -22061 -2415 19190 -2543 -5253 13625 7820 2200 12453 -4222 -23246 8434
527H434J7265l9155k78M2396k0868m5076K5961L4708k2265j1460K4563n317k2146
$$ 8434 25699 -13456 -13734 28662 7794 -37282 -11321 23387 1122 -10338 14225 8908 -13238
540a3238J1127L141j2121K4256J3902l8977r067L5587j2550l6895K9605L7831
$$ -13238 -2111 1030 -11091 13165 27067 -11910 -20977 14610 2060 -34835 -5230 32601
552C2601l2998k4532K9190N04k4165J6852J6561j3506N709Q945k7887r136L4625
$$ 32601 -397 -24929 4261 4765 -19400 -2548 14013 507 6216 15161 -12726 -21862 12763
565A2763j644l3890K1804L0342l8189k5319L5348Q694k5606J1424K1544j6363
$$ 12763 11119 -22771 -967 29375 -8814 -34133 1215 9909 -15697 -4273 17271 908
577I08r994J3128r967q018K9571M052l0777J0948K3781k9455j9925L6072J4115
$$ 908 -9086 4042 -5925 -13943 15628 19680 -11097 -149 23632 -5823 -25748 10324 24439
590B4439l0262O80K2617j8370j8326K0169M511j1542J5292M506k6268J019K3411
$$ 24439 -5823 -5143 17474 -896 -19222 947 5458 -6084 9208 13714 -12554 -11535 11876
603A1876j2313j5787K9114J2641l4198m584K5490j1837j6217K1829Q354j9730
$$ 11876 -437 -16224 12890 25531 -8667 -13251 12239 402 -15815 6014 14368 -5362
615e362R30R490j5440l094K3573l577j8342J7125R648k6948j663K6374n480j7306
$$ -5362 -4432 5058 -10382 -13476 10097 6520 -11822 5303 14951 -11997 -13660 12714 7234 -10072
629a0072J4483Q863k1075k682J7238q130r264J6762j30j7581P751J0837j4640
$$ -10072 4411 13274 -7801 -10483 6755 -1375 -10639 6123 5993 -11588 -3837 7000 -7640
642g640l586J9201j899j6713J0149J1280j6436k928J7324m587j1505J1241N572
$$ -7640 -11226 7975 6076 -10637 -488 10792 -5644 -8572 8752 4165 -7340 3901 9473
655I473j3563q40J1503o031p803J1946K268j2802M638P873j1202k702J3811p67
$$ 9473 -4090 -4930 6573 542 -7261 4685 6953 -5849 -1211 6662 -4540 -7242 6569 5802
669E802j1357O087Q092j1952n017J3630P2r626N545L945q784q79O444l209k419
$$ 5802 -5555 532 8624 -3328 -8345 5285 5357 -4269 1276 5221 -3563 -4442 2002 -1207 -3626
684c626Q360r03j1396M579R308r274l977J2831J091j1417J043P630l321l945N359
$$ -3626 4734 3831 -7565 -2986 6322 -2952 -6929 5902 6993 -4424 -3381 4249 928 -3017 2342
699B342Q42m014K653j158o072N078N874p524l822Q610J607j0008n4J0136j495
$$ 2342 3184 -830 1823 665 -5407 -329 5545 -1979 -5801 2809 4416 -5592 -5646 4490 2995
714B995p135L170L674k387r35j20j67K682J045m526k059O631J355q749N05R105
$$ 2995 -4140 -970 2704 317 -618 -738 -905 1777 2822 -1704 -3763 2868 4223 -4526 -4021 5084
730E084k003p481K295N806j538m598J129L322R2j368k288L35M829j035o489J992
$$ 5084 3081 -4400 -2105 3701 2163 -2435 -1306 2016 2108 740 -1548 -1213 3616 2581 -3908 -1916
746a916O432k593o807K018O580k614o178K610M307j412k883n47L158K556k900
$$ -1916 4516 1923 -4884 -2866 3714 1100 -5078 -2468 1839 427 -2456 -3003 155 2711 -189
761a89k892K912M195k342n182L156N513l994m845L132L873k047l952Q64L934n21
$$ -189 -3081 -169 4026 1684 -3498 -342 5171 1177 -3668 -536 3337 1290 -2662 -1798 2136 1615
777A615l556m29L140K152l409k944M019K822l833k730L047L212k686l797K502
$$ 1615 -1941 -2370 770 2922 -487 -3431 588 3410 -423 -3153 -106 3106 420 -3377 -875
792h75L386k058k747P66L299K41l859r6L758O17k952j258L141J994l324j973K979
$$ -875 2511 453 -2294 -1528 1771 2012 -1847 -1943 1815 2432 -520 -1778 1363 3357 33 -1940 1039
809A039J697k199k408J380K748j820k951J270K336o75k464q1K861K80k637l9K368
$$ 1039 2736 537 -1871 -491 2257 437 -2514 -1244 1092 417 -2047 -2128 733 1013 -1624 -1663 705
826G05Q33j733j305K177J534k159j245J523J231j050j985Q77J858j124j469L61
$$ 705 1538 -195 -1500 677 2211 52 -1193 330 1561 511 -1474 -597 1261 137 -1332 -971
842i71J372L59j674k38J979L9j297j08R97P72j115r09J254L70p93n82J21Q27k36
$$ -971 401 760 -914 -1152 827 866 -431 -539 458 1230 115 -794 460 830 37 -545 -424 403 167
861A67j260M84Q65m21o01J1R96L0r24N97M82m73K11K2j22M20q1l57L9K20No62
$$ 167 -1093 -609 256 -165 -766 -755 241 271 -653 -56 426 -47 164 186 64 484 403 46 85 305 310 -352
883c52J81P61q41l16R89n50o27P83L76n78k57Q49J32j035N81O45p73J45M32p82
$$ -352 -171 590 -251 -567 422 -128 -755 28 404 -174 -431 418 550 -485 96 741 -32 113 545 -237
903b37J32P00o37q41R55R54j560o82K025j62j929J081J229q62k93N41j07k89N24
$$ -237 -105 595 -42 -883 72 1026 -534 -1216 809 647 -1282 -201 1028 166 -127 414 307 18 542
922E42j07r75J151R70k334n15K344n25k191J026J801j181j624J212N45j028N34
$$ 542 435 -540 611 1581 -753 -1268 1076 551 -1640 -614 1187 6 -1618 -406 139 -889 -355
939c55N74q36Q27N20j697k13K330ok278P85K331j930k137K255R26j668K11R02
$$ -355 219 -617 210 730 -967 -1180 1150 1144 -1134 -349 1982 52 -2085 170 1096 -572 -361 541
957E41q01k91O25o46k94K092J18k682Q40K416k164j648K847J055k455k99J534
$$ 541 -260 -551 74 -572 -866 1226 1344 -1338 -498 1918 -246 -1894 953 2008 -447 -746 788
974G88p65j077J191O5p76J351j87k335J073K104j520j265K499R01k816l16K364
$$ 788 23 -1054 137 202 -574 777 590 -1745 -672 1432 -88 -1353 1146 2047 -769 -1085 1279
991A279o19j388J563K54j384M14R8j442N78J841j203j408J915N33k743L17K702
$$ 1279 660 -728 835 1089 -295 119 217 -1225 -647 1194 -9 -1417 498 1031 -1712 -1395 1307
1008A307p78j226J333L90j532J06Q80o47O8J304j032j486J431K56j954O44K183
$$ 1307 529 -697 636 1026 -506 -400 480 -167 -99 1205 173 -1313 118 374 -1580 -936 1247
1025A247j074j552J184O83j434L15J465n65l96R81p30r45J185M82j431M42J438
$$ 1247 173 -1379 -195 488 -946 -631 834 269 -127 854 124 -821 364 846 -585 -143 1295
1042A295j158j400J343M20j579M64J358p92n50Q91m29p89J002O07r23M40J127
$$ 1295 137 -1263 80 500 -1079 -615 743 -49 -599 292 -137 -926 76 683 -240 200 1327
1059A327j469r72J484J91j219R00R87j384r53R87j13n21J287M68j250k4O35r70
$$ 1327 -142 -1114 370 561 -658 242 1229 -155 -1108 -121 -234 -755 532 1000 -250 -274 361 -609
1077f09P1J768p7j252L06M13j466L7J736j35j067M99k38j262N43J126l88j73Q06
$$ -609 -538 1230 1153 -99 207 620 -846 -809 927 792 -275 224 -14 -1276 -733 393 5 -168 638
1096F38p55j165R72R76q25K69J091j080j151J035N44q08M92O61j016p61R70j71
$$ 638 -117 -1282 -310 666 -159 110 1201 121 -1030 5 549 -259 233 894 -122 -883 87 -84
1114h4n09J002L49j383P4R36o44l84J280K52j468J88J040q53k82J151l95q66O21
$$ -84 -593 409 758 -625 -551 385 -259 -643 637 889 -579 -391 649 -204 -486 665 270 -596 25
1133B5J81q26L78J022r22o95J340j78j215R11J121j219m39J000j54p77P16M19
$$ 25 206 -620 -242 780 -142 -837 503 325 -890 21 1142 -77 -516 484 330 -447 269 688
1151F88q93J09N86j034j29J442n19j166R52N75j296k21J428N0j096N69M50q53
$$ 688 -205 -96 490 -544 -673 769 250 -916 36 611 -685 -906 522 572 -524 45 495 -358
1169c58K29N19o15J15Q19p34r41J054N92j371j17J646n64j295Q54O89p21M0N68
$$ -358 -129 390 -225 -110 709 -25 -966 88 680 -691 -808 838 274 -1021 -167 522 -199 -159 409
1188D09l52j11O48n35o45J265L55j727K10J554r54j204J124P17j080k50P47j94
$$ 409 57 -54 594 59 -586 679 1034 -693 -483 1071 117 -1087 37 754 -326 -576 171 -23
1206b3k80N80m11l23J143r1j459P08J477j026j203J273Q70j518l48J178l23o50
$$ -23 -303 277 -134 -457 686 595 -864 -156 1321 295 -908 365 1235 -283 -631 547 224 -426
1224d26M18l15j30O93k19r54O69J145j126j033J668P39j738l7J356k52p84J56
$$ -426 -8 -323 -453 240 21 -933 -264 881 -245 -1278 390 1129 -609 -646 710 458 -326 -170
1242a70L07j03Q8k50o42N27Q25j208o44J633K56j572P3J482p3j101L77Q35l33
$$ -170 137 34 122 -128 -770 -243 582 -626 -1270 363 619 -953 -880 602 529 -572 -195 640 307
1261C07k23K01k90N52K65j003j41J036m6j258J4J262l00j288N30Q56n29l81K58
$$ 307 84 285 -5 547 812 -191 -332 704 658 -600 -586 676 376 -912 -382 474 -55 -436 -178
1280a78J50L52j50l26N6O98k4r64K49J094o46r17O46N44n32m83K68M27j28m12
$$ -178 -28 324 174 -152 -96 602 578 -386 -137 957 311 -606 40 584 52 -431 -163 264 136 -276
1300b76J12J18L49j33o59N35N82o25n11M65N14m71n46M62K89n29j56K42R5J02
$$ -276 -164 -46 303 170 -489 46 628 3 -508 -43 471 0 -546 -84 205 -324 -480 -238 -143 -41
1320d1l56n7M27J15l46m9L21L87m55j84N82j4l57%J14J51k34j89K39j0j38k4m5
$$ -41 -397 -454 -27 88 -258 -307 14 401 -54 -238 344 330 -27 -27 87 238 4 -185 54 44 -94 -118 -163
1343a63K70M7l85K20K84k21q7M8J24L7l64K34J63l55R8L9j09J19j63L9J75k8l2
$$ -163 107 154 -231 -11 273 52 -35 13 137 174 -190 44 207 -148 -50 -11 -120 -1 -164 -125 50 22 -10
1366a0n6J76L02m67k5O47l49l51J88J86j11k92Q4J38j56j1j7k45N04k6o19M25
$$ -10 -66 110 412 -55 -80 567 218 -133 55 241 130 -162 -78 60 -96 -107 -124 -369 135 109 -510 -85
1388h5O60m71m40M09O22n47n90P79J84o53J09K1k95L81j10m39K46O05m97q53Q40
$$ -85 575 104 -336 73 695 148 -442 337 521 -132 -23 -2 -297 84 -26 -465 -219 386 -111 -964 -124
1409a24J011j250k94J425j05j053K88N89k30l9J38l86l24P59n17j116J338P86
$$ -124 887 -363 -657 768 663 -390 -102 487 257 218 356 -30 -354 405 -112 -1228 110 896
1427H96j688m60J539j05j354N82J488p15p83Q68k41m84J227k44j054J024P20j841
$$ 896 -792 -1252 287 182 -1172 -590 898 183 -600 268 27 -457 770 526 -528 496 1216 -625
1445f25n77K061J59k230P18J890j804r91J720Qr70R33K62j188N37J276j546q24
$$ -625 -1202 859 1018 -1212 -494 1396 -408 -1399 321 329 -641 292 554 -634 -97 1179 -367 -1191
1463a191K670j16k822J277K056k136j121K147J05j772O95J058j575N4J704j408
$$ -1191 1479 1363 -1459 -182 1874 -262 -1383 764 869 -903 -208 850 -725 -671 1033 -375
1479c75r84K636p2k868J293K293k099j593K823N92k872Q41J869k069m40K091j103
$$ -375 -1359 1277 1205 -1663 -370 1923 -176 -1769 1054 1646 -1226 -385 1484 -585 -1025 1066 -37
1496c7j378K074L31k808P27K929k071k132L405O44l542J066K466k102r80K436
$$ -37 -1415 659 990 -1818 -1091 1838 -233 -2365 1040 1684 -1858 -792 1674 -428 -1408 1028
1512A028j64k102J667J174l048K42L237j959k141L417O05l822O21L025j851j729
$$ 1028 864 -1238 429 1603 -1445 -1203 2034 75 -2066 1351 1956 -1866 -1245 1780 -71 -1800
1528a800L139M37l411J248J849k977K22L619j539k699K596Q64l894P53M183j827
$$ -1800 1339 1776 -1635 -387 1462 -1515 -1293 2326 787 -1912 684 1548 -2346 -1593 2590 763
1544G63k711L258J22l982J725L041k434o24K994j549l278K630K036l423N20L863
$$ 763 -1948 1310 1432 -2550 -825 2216 -218 -842 2152 603 -2675 -45 1991 -1432 -912 2951
1560B951k698l130L323Q88l185J392L101k646k124L065j32l124K506K443l548
$$ 2951 253 -2877 446 1334 -1851 -459 2642 -4 -2128 937 805 -2319 187 2630 -918
1575i18m87L299j837k699L225J762l715K26L502k496k540L787N72l590J772K537
$$ -918 -1405 1894 57 -2642 583 2345 -1370 -1144 2358 -138 -2678 1109 1681 -1909 -137 2400
1591B400l201j067L543p61l041K717J974m104Q7L867k295k759L647Q69l736R69
$$ 2400 -801 -1868 1675 914 -2127 590 2564 -1540 -1453 2414 119 -2640 1007 1876 -1860 -891
1607h91L067k624j854L649j54l383K282K200l632j95L620j779k781L186J435l812
$$ -891 2176 -448 -2302 1347 1193 -2190 92 2292 -1340 -1535 2085 306 -2475 711 2146 -1666
1623a666K12L637k274k397L406L97l256J688K144k872p70L301r06k809K754J757
$$ -1666 -1454 2183 -91 -2488 918 1315 -1941 -253 1891 -981 -1751 1550 644 -2165 589 2346
1639B346l757P3L569j876k425L060Q20l069O09K362k108j274K964l73k779K169
$$ 2346 -1411 -1338 2231 355 -2070 990 1810 -1259 -650 1712 -396 -1670 1294 921 -1858 311
1655C11J531l266P9L169j235k381K394J413l086m4K736j369j532K531q4k613J422
$$ 311 1842 -1424 -1345 1824 589 -1792 602 2015 -1071 -1115 1621 252 -1280 1251 1167 -1446 -24
1672b4J512k299m37K759o68k819J934J620k800r8K760j077j816J744N54j852N98
$$ -24 1488 -811 -1248 1511 843 -1976 -42 1578 -1222 -1320 1440 363 -1453 291 845 -1007 -409
1689d09J758j658r06K365n84k345J823J527k477l58K165o50j651J362J038j744
$$ -409 1349 -309 -1215 1150 566 -1779 44 1571 -906 -1264 901 251 -1400 -38 1000 -744
1705g44L1J588j294o88J971k84j613J217J002j806n06K071m4j765R02J061j740
$$ -744 -713 875 -419 -1107 864 580 -1033 184 1186 -620 -1126 945 901 -864 38 1099 -641
1722f41j08J438o32n19J067j91j295N83J160j011m36J680l09j699Q27J014r67
$$ -641 -749 689 57 -462 605 414 -881 -298 862 -149 -585 1095 786 -913 -86 928 -39
1739c9j61R91k52j023L93M20q03M31R64j016o25J097j34r62P03Q11o11q09Q15
$$ -39 -200 791 539 -484 -91 329 -474 -43 921 -95 -720 377 243 -719 -16 795 184 -625 190
1758A90J51r21N02O30p28m8M75o29j98P76J23p13J07O84n91m96R26J13p47L31
$$ 190 341 -580 -78 552 -176 -224 251 -378 -576 200 323 -390 -283 401 -190 -686 240 353 -394 -63
1778f3K38l68J7L30q4j94J59J80o11J18O10m42j78M78j53l40J75K94L3k97J45
$$ -63 175 -193 -176 154 70 -124 35 215 -396 -278 332 -110 -288 190 37 -303 -128 166 199 -98 47
1799D7J95l99J99J94k94J98J20l37p2J72M4j79n6L41j57k47M24p3j29J80j1pR
$$ 47 242 -157 42 236 -58 140 260 -77 -149 23 67 -112 -168 173 16 -231 193 120 -9 171 160 153 162
1822A62r2P9l1p1J56k87mJ72k65pJ34j17Q3j41M1K23j99J5K66k32J67O9j53J72
$$ 162 70 149 118 47 203 -84 -88 84 -181 -188 -54 -171 -88 -229 -188 35 -164 -149 117 -115 52 121 -32 140
1846A40j4p0l1l4J2%j91K82r8k45K01J1o9mJ1J39l0r6J48j9P3N3j82Q6J27k65
$$ 140 126 56 25 -9 3 3 -188 94 -4 -249 -48 -37 -106 -110 -99 40 10 -86 62 43 116 169 -13 73 200 -65
1872f5J2O9n0Rk40J08J79k40N8N6oJ39k4j70L28m6j21N5M1J95j86j31K75j10k86
$$ -65 -53 16 -34 -25 -265 -157 22 -218 -160 -104 -110 29 5 -165 163 117 -4 51 92 287 101 -30 245 135 -151
1897a51K19j21J5L8j51J1N0N9J2j71K55J81l99J01K74j95j24J30P3Lj34R6L1k71
$$ -151 68 -53 -38 0 -151 -140 -90 -31 -19 -190 65 246 -153 -52 222 27 -97 33 106 109 -25 71 102 -169
1921a69J80r0j90M05L3l57J37J59m9k44J17L63k23j50K71j48j98L27j79m3K16
$$ -169 11 -79 -269 136 169 -188 -51 108 59 -185 -68 295 72 -78 193 45 -153 174 -5 -48 168
1942A68j14j67q8K20N1l46K63K81m66P2J45j40R5J62Mj41k7J28j65p8M11j74l33
$$ 168 54 -113 -201 19 70 -276 -13 268 -198 -126 19 -121 -26 136 140 -1 -28 100 -65 -143 268 94 -239
1965b39L04%l42J51J78M5j19j8R7j96K3K68j66K8L16l33k14K20Q6j72j7K76o7
$$ -239 65 65 -277 -126 52 97 -22 -40 57 -139 -116 152 -14 14 330 -3 -217 3 89 -83 -100 176 109
1988A09m15J68J63k49K35K10k75K9N9p7p4J49K57k36r9L76l13l26M84J6k96J26
$$ 109 -306 -138 25 -224 11 221 -54 -25 34 -43 -117 32 289 53 -46 330 17 -309 175 191 -105 21
2010B1M4j19j92K53M4k59K26J62m13J12L70k39p2K05P2l50O0L12j17k59K80n7
$$ 21 65 -54 -246 7 51 -208 18 180 -233 -121 249 10 -62 143 215 -135 -75 237 120 -139 141 84
2032H4l78L79N1l10J98J09k35r7K09K18j84L6L02m60k07M30m5j76L17n6l20j05
$$ 84 -294 85 136 -174 24 133 -102 -199 10 228 44 80 382 -78 -285 145 100 -76 241 185 -135 -240
2054b40J78m8j35M46P8n82R4K28l13J75M13l7k96kJ43k90J1N49j06l69K91j10
$$ -240 -62 -110 -245 201 279 -303 -209 19 -294 -119 294 257 -39 -41 102 -188 -177 372 266 -103 188 78
2076G8m98K43M14j66k11K56j13n31K80N14l34k6M33m02l26M11J85k14J22K86m10
$$ 78 -420 -177 237 71 -140 116 3 -528 -248 266 -68 -94 339 -63 -389 22 207 -7 115 401 -9
2097im41N66Q4n84M28L29o02r3M13n3k77L34K71n53l3N71l31k44P18j91o25K23
$$ -9 -450 116 200 -384 44 373 -229 -322 91 38 -239 95 366 -187 -220 351 20 -224 494 303 -322 -99
2119i9L98k67j71M67j03o56K43L91m64J71N12m02m10L34Q5k68K08N51m03n18M28
$$ -99 299 32 -139 328 225 -431 -188 203 -261 -90 422 20 -390 -56 29 -239 -31 520 117 -401 27
2140B7N6m99N15L97m73k95K78j65k37L49N29m98k47L92l29k50O06K65m39L6J67
$$ 27 83 -416 99 496 23 -272 6 -159 -396 -47 482 -16 -263 129 -200 -450 156 421 -18 18 185
2161A85m11k28N77K64n20Q6L22n92n2O14j49k87L53km24r2O15j18l45M64j1n24
$$ 185 -226 -454 123 387 -133 -47 275 -317 -369 245 96 -191 162 160 -264 -356 259 141 -204 260 249 -275
2183b75J46M21k77j09K41M7m40J34L87l46j60N21k18l58K89K22k21p9K37r8l14
$$ -275 -129 292 15 -94 147 194 -246 -112 275 -71 -231 290 72 -286 3 225 4 -75 162 64 -250
2204b50K40L27m06J23L11m20k32L78m0j09P4R7j84j77K59J10k88K74J20l37L5
$$ -250 -10 317 -89 34 345 -75 -307 71 31 -78 -4 93 -91 -268 -9 101 -187 87 207 -130 -95
2225i5J42o2o6J87P9k38j12K49j90r9K89L4k51k3J71p2j51K06J26j32k0K32k85
$$ -95 47 -15 -81 106 185 -53 -165 84 -106 -205 84 118 -133 -156 15 -57 -208 -2 124 -8 -28 204 -81
2248h1m4K12o3K6K7M6j63r5J69l2j36J88L8k58R5J19j61O3J27M8j50j4J36j21
$$ -81 -125 87 24 50 77 123 -40 -135 34 2 -134 54 92 -166 -71 48 -113 -50 77 125 -25 -39 97 -24
2272b4j14K39k8j07O7J3p1j00J45N2j02j6Q3j86M4R6N3k3K7Mr4l3J30P9j43M8
$$ -24 -138 101 73 -34 33 46 -25 -125 20 72 -30 -46 37 -149 -105 -9 44 21 48 52 -42 -75 55 134 -9 39
2298C9P7j88M5Q6j57M1Q0l8r3MM7J8j15K07l7q2R4j1j6M7k2k3J6o4N4km0J11q5
$$ 39 116 -72 -27 59 -98 -57 23 -15 -108 -104 -57 -39 -154 53 16 -66 28 17 1 48 26 3 19 -45 9 7 -33 78 -7
2327gj15J49k4k8N0mpl9L1O0q0Q7j6l9O0k4o9M1n1jQ1q8l5M4oMN1j30J20n0OJ3
$$ -7 -122 27 3 -25 25 21 14 -25 6 66 -14 73 57 18 78 54 -15 26 -25 -26 55 -33 -68 -24 -30 -26 25 -105 15 -35 -29 -16
2359a6%N3l0K7K9n5J2M5o7L3K1m0k0l8P1Nq3L2O4o1M0L6p7L4K4J9pk6JJr7K1K7
$$ -16 -16 37 7 34 63 8 20 65 -2 31 52 12 -8 -46 25 30 -53 -21 43 -18 22 58 -19 15 39 58 51 25 26 27 -70 -49 -22
2392b2k7K9L3p7L7k3M9q2R2N1j7l7M7kn9Q4n2m1Q5j8M1n4j4rq3N0J3m6J5J5j3
$$ -22 -49 -20 13 -64 -27 -50 -1 -83 9 60 43 6 53 51 -8 76 24 -17 68 50 91 37 23 14 -69 -19 -6 -52 -37 -22 -35
2423c5N1L0m2j5j5P3nj20J10k8l0K8J4o1N7Rk7o5m4J49r0jJ49j08o6P9N6q9M1
$$ -35 16 46 4 -11 -26 47 42 -78 32 4 -26 2 16 -45 12 21 -6 -71 -115 34 -56 -57 92 -16 -82 -3 53 -36 5
2452EL8Qr1L9L4j05M1P5r4jN3L6j47Q0M1k1k9O7K1m6K1J07r2j01J37k4m2m5M5
$$ 5 43 51 -40 -1 33 -72 -31 44 -50 -51 2 38 -109 -29 12 -9 -38 29 50 4 25 132 40 -61 76 52 10 -35 10
2481A0n3o0J20p7k8Q0L2o7P5o2K1j8N8Pn2P4M6j14RO2o8n6L3O6j48l7J49O2j46
$$ 10 -43 -103 17 -60 -88 -8 24 -43 32 -30 -9 -27 31 38 -14 60 106 -8 1 63 -5 -61 -28 38 -110 -147 2 64 -82
2510h2P3M7j18J1J08j4l6O5O7j31J7N7q7KO4o3n0KJ4rm7R6j2MK3Nj1j4L1K0QM8
$$ -82 -9 38 -80 -69 39 25 -11 54 121 -10 7 64 -23 -21 43 -20 -70 -68 -54 -63 -110 -14 -26 -22 1 6 -5 -19 12 32 40 88
2542H8P2j04j8L1ml2kJ3q0k5M9J0n1O6j1o3k7J13l1OL3J00r8m3J0n7O2mK3j00
$$ 88 160 56 38 69 65 33 31 44 -36 -61 -12 -2 -53 13 2 -61 -88 25 -6 0 33 133 35 -8 2 -55 7 3 26 -74
2572g4oN7j3l3P2k8l0Lj3K6N8JM6n8L1Q4r0n5J29j02L7r3R9o9n1J17q4m1Q1Kk1
$$ -74 -80 -23 -36 -69 3 -25 -55 -52 -65 -39 19 20 66 8 39 123 33 -22 107 5 42 -51 48 -21 -72 45 -39 -80 1 3 -18
2603a8n1J33j06j6R1Pj6J5Q0q9r6J15%r3R1K3j32l2O1l7ML6O4m8rR1o2l2P8J9
$$ -18 -69 64 -42 -58 33 40 24 39 119 30 -66 49 49 -44 47 70 -62 -94 -33 -70 -66 -30 34 -14 -23 68 6 -26 52 71
2633G1n7J0L7j8j16N7J22j51kJ28j35KQ6mp3lR4o5lM6N1j24J1O7l9n5P2K2j02
$$ 71 14 24 61 43 -73 -16 106 -45 -47 81 -54 -52 34 30 -43 -46 48 -17 -20 26 77 -47 -36 31 -8 -63 9 31 -71
2662g1M0K8p8M4P7o6l4J04Lj47L3J75r6q4J28m3q7R4N3q9kM8pj45J30K3r9O4L3
$$ -71 -31 -3 -81 -37 40 -26 -60 44 47 -100 -67 108 12 -72 56 13 -74 20 73 -16 -18 30 23 -122 8 31 -68 -4 29
2691B9k8j20J64lq2O6J9k6n8P2k3o0j1O4n2p6Q6m4nR1Qj3m2N8M2j35J06M3o0n2
$$ 29 1 -119 45 42 -40 26 45 19 -39 33 10 -50 -61 3 -49 -125 -39 -83 -88 3 11 -2 -44 14 56 -79 27 70 10 -42
2721d2J23k7r6R3K5p3k0M9J3j22KJ20j29K2J00j09K0J02n9Mn8J19Lj41R5J45k04
$$ -42 81 54 -42 51 76 3 -17 32 45 -77 -75 45 -84 -62 38 -71 -51 51 -8 -4 -62 57 60 -81 14 159 -45
2748d5J5P6q8kO5m8p5M8J03q4l6J45p9m1L6K1J5rO7ql6l7O3j8r1J39m9r6M4o4
$$ -45 -30 46 -42 -44 21 -27 -102 -54 49 -35 -71 74 -5 -46 -10 11 26 17 84 76 40 3 66 48 -43 96 47 -49 -5 -69
2778f9M5p8L8L6m1RP8j30J07J1JJ3K3M8o0j0k6M5n6P9n7o3O7mq6PM4K7j1p8J23
$$ -69 -24 -102 -64 -28 -69 -60 18 -112 -5 6 7 20 43 91 31 21 -5 40 -16 63 6 -57 10 6 -80 -73 -29 -2 -13 -91 32
2809C2j2k1P4k1q0L3l1M0k5j0N5n3K3j6o3N8O1j20O6K5k4j6PL9j2l5k1J27p8p
$$ 32 20 -1 73 52 -28 5 -26 14 -11 -21 34 -19 4 -12 -75 -17 44 -76 -10 15 -9 -25 -18 21 9 -26 -47 80 2 -5
2839eO9j17M2J5J6l6J5K3l4qN1rl0M3pm7J9j2K4l0K1j3j7mR3j37Q0k0nJ3mK1j3
$$ -5 64 -53 -11 4 20 -16 -1 22 -12 -20 31 22 -8 35 28 -19 0 -12 12 -18 3 -10 -27 -31 62 -75 5 -15 -20 -7 -11 10 -3
2872cm6J9J03p8l5R4j7K8j08L2J9l3j3L6o1J9L7m5L9%JL9r2N6K5K2j2p4M8Q0K5
$$ -3 -49 -30 73 -5 -40 54 37 65 -43 -11 8 -25 -38 -2 -63 -44 -7 -52 -13 -13 -12 27 -65 -9 16 38 26 -48 0 80 105
2903A05p0Qp9j3N3n8J8J0L7k5j7M1K3q3Q3j2l7N3RK6o3K1p4P4j03R2l9l9R3J2
$$ 105 35 43 -36 -49 4 -54 -36 -26 11 -14 -31 10 33 -50 33 21 -16 37 46 72 9 30 -44 30 -73 19 -20 -59 34 46
2933D6j24O1L6m5rJ7J0o1M2P9j00N6O3o4J1P4p2p4qJ73j22j01J99q6j66J38P4
$$ 46 -78 -17 19 -26 -35 -18 -8 -69 -27 52 -48 8 71 7 18 92 20 -54 -62 111 -11 -112 87 1 -165 -27 47
2960D7j19O8K4l0r3Q1J20r4k3J36n4p4J35j2k00Q2N5l8q3Q3j6j19M2J95j22j6
$$ 47 -72 -4 20 -10 -103 -22 98 4 -19 117 63 -11 124 112 -88 -6 49 11 -72 11 -5 -124 -82 113 -9 -25
2986b5J26j09n7O1J28j01j8P5ok09K18j6k07J07J08j35j14J31M1j20K6K23k16
$$ -25 101 -8 -65 -4 124 23 5 80 74 -135 83 67 -140 -33 75 -60 -174 -43 -2 -122 -96 127 -89
3009h9l5K20m6k37K60J04j98l4K13j15k15K11J73k31o0J83j64j54K66Q0k71K2
$$ -89 -124 96 50 -187 73 177 -21 -55 158 43 -172 39 212 -19 -79 104 -60 -214 52 132 -139 -117
3031a17K01j30j55L14K8k34R9J52k18o9J88J2j64J08J73l08o2L50j61j66K51J6
$$ -117 84 -46 -201 113 141 -93 6 158 -60 -129 59 71 -93 15 188 -120 -182 168 7 -159 92 108
3053A08k89O3K68j69r9K35N5l63J20L27l11l4K68j29k29J55K12k22m7K34p6k78
$$ 108 -181 -118 150 -19 -118 117 172 -191 -71 256 -55 -89 179 50 -179 -24 188 -34 -81 153 77 -201
3075b01J74K37l25Q6J96j80j96K20J45l06P8K96k45k71L78J0k76K54J25k64r1
$$ -201 -27 210 -115 -29 167 -13 -209 11 156 -150 -72 224 -21 -292 86 96 -180 74 199 -65 -156
3096a56K78n3k74K75K15l85m3K94j55k06L46K9j83p3K34k22j78L78O2l73J98J97
$$ -156 122 69 -205 70 285 -100 -143 151 -4 -210 136 165 -18 -91 143 -79 -257 121 183 -190 8 205
3118B05l47oL06rk50J51J76l13j18L86r2k48K93N3l27K4J80r5j49K41R5l69J16
$$ 205 -142 -148 158 149 -101 50 226 -87 -205 181 89 -159 134 187 -140 -116 64 -31 -180 61 156 -213 -97
3141i7L36l15r4L65r0k62J46K48k60j79M15q4l54K63J78l89P8K58j77j78K43J53
$$ -97 239 -76 -170 195 105 -157 -11 237 -23 -202 213 129 -225 38 216 -173 -95 163 -14 -192 51 204
3163B04k91l2L25k39j61L28K6k87J27J69k70j01L22J2k64J20J56l26m0L09p0j58
$$ 204 -87 -119 206 -33 -194 134 160 -127 0 169 -101 -202 120 132 -132 -12 144 -182 -222 87 17 -141
3185a41K01J43l66k2K91j04j76L31R2l20K0J53j74m7L36o6k43J8J67k19l5K59
$$ -141 60 203 -163 -185 106 2 -174 157 249 -71 -51 102 -72 -119 217 151 -92 -74 93 -126 -161 98
3207I8pk68J74M3j97J17J93r4j96J22J58k75N5K65j36j96K37o8j84J07K15j83
$$ 98 91 -177 -3 40 -157 -40 153 59 -137 -15 143 -132 -77 188 52 -144 93 25 -159 -52 163 -20
3229b0j79K82j2k91K07K59k98m2J68p0j12J63J38j82j01K21j17j68K21O9j86N0
$$ -20 -199 83 71 -220 -13 246 -52 -94 74 4 -108 55 193 11 -90 131 14 -154 67 136 -50 0
3251@P9j58l4J52R1k29Q8Q3j74j9K46r2p7Q5Pj37k8J42O5j78J36O9k38pK54j33
$$ 0 79 -79 -113 39 130 -99 -11 72 -102 -121 125 33 -44 41 48 -89 -117 25 90 -88 48 117 -121 -128 126 -7
3277gm9J32L3j34q4K03m0j60K80p7j41P4J8o7k9J12k4q7R2J9j87L2J95j03q4J17
$$ -7 -56 76 109 -25 -109 94 54 -106 174 97 -44 30 48 -19 -48 64 40 -47 45 64 -123 -91 104 1 -83 34
3303C4l4j4M3Nl4jP4k5j68P6J22j23MM0kq8R6M4j00L2J09j29k6R0rj6O8m0j5J0
$$ 34 0 -14 29 34 0 -1 73 48 -120 -44 78 -45 -41 -1 -3 -91 5 49 -51 -19 90 -39 -65 25 16 0 68 28 13 23
3333B3o2J05q9LP6q3l7N8j%j1J2L8j01J12pq1K2J00j20O0km0jJ9K6j6n0RR9p8
$$ 23 -39 66 -23 -20 56 -27 -64 -6 -7 -7 -18 -6 32 -69 43 36 -45 -23 77 -43 17 15 -25 -26 -7 19 3 -47 -38 61 -17
3364a7J2O4j19L9j9K7qK6k0M8o6N6m7K9mRl6K8PJ0Jp8P3q3M0Q5r1L4k6lK8M5n7
$$ -17 -5 59 -60 -21 -40 -13 -21 5 -15 33 -33 23 -24 5 1 10 -26 2 9 19 20 -58 15 -68 -28 57 -34 0 -26 -29 -1 44 -13
3397a3P2j23J22o8J3Q1j05m7J03k8Ok9Ppk9Q4m4l6J3M5J4q3O1%%j5J9k7j3O4j1
$$ -13 59 -64 58 -10 3 84 -21 -68 35 7 13 -16 -9 -16 -45 39 -5 -41 -28 17 31 -52 9 9 9 -6 13 -14 -27 37 26
3428B6j18O0O3n9j9O3k2n4R3k6k9oQ0l1m9O0l6j5J8J5m1n5N1L0j5RO7q9k0J26
$$ 26 -92 -32 31 -28 -47 16 -6 -60 33 7 -22 -28 52 21 -28 32 -4 -19 -1 14 -27 -82 -31 -1 -16 -7 60 -29 -49 77
3458G7o0p3J19k8j4L1n4O7l0L5o4j19J01L2p8P0J6l1o1Q1k4l5nJ35p3m3P4Po5
$$ 77 17 -56 63 35 21 52 -2 65 35 70 6 -113 -12 20 -58 12 28 -3 -64 17 -7 -42 -47 88 15 -28 46 53 -12
3487a2J1O3p8j0P9J2q4M0K6r1PJ17j31k7J23m0r1R5L2J0r1P7J13j47J1O4j18r3
$$ -12 -1 62 -16 -26 53 65 -19 21 47 -44 -37 80 -51 -78 45 5 -86 9 41 51 -40 37 150 3 14 78 -40 -133
3515a33J51J5j21Q1O6o5j05J22qj16J80K5r8l0J08j11L9L2J31j14n9J02r0k8Q9
$$ -133 18 33 -88 -7 59 -6 -111 11 3 -113 67 92 -6 -36 72 -39 0 32 163 49 -10 92 2 -26 63
3540F3J8j73O1J07j47K0R4jr0L9J13j56j2J22L9q9j0J30j63j00J29pj06R3J23
$$ 63 81 -92 -31 76 -71 -51 43 42 -48 -9 104 -52 -64 58 97 8 -2 128 -35 -135 -6 -13 -119 -26 97
3565I7j39K5pj2p5J55j2o0K6Q7j13n2J66m7r8O7J68j99kO7q1l4L9J22j21m0Q4
$$ 97 -42 -17 -24 -36 -111 44 32 -28 -2 85 -28 -80 86 39 -59 8 176 -23 -25 42 -39 -73 -34 88 -33 -73 11
3592A1l9p1J65l2n0JN8l0q8J31o0j03J10J21j37J0L5K0j90K10N7k19R6J16j64
$$ 11 -28 -99 66 34 -16 -15 43 13 -75 56 -4 -107 3 124 -13 -3 32 52 -138 72 129 -90 6 122 -42
3617d2m5J07L8l9K0L5j07q3J11J22j70Q6K8q5j05J43l3nN4Q7m3j39Qj4J7R6J51
$$ -42 -87 20 58 19 39 74 -33 -116 -5 117 -53 33 61 -24 -129 14 -19 -24 30 117 74 -65 -57 -71 -54 42 193
3644A93j97k9N3j01m8J67N1r6K7k2q7l8K22m7j9M3L3j33m4J20J7n1M2K5j52QQ3
$$ 193 -4 -33 20 -81 -129 38 89 -7 20 -2 -89 -127 95 48 29 72 105 -28 -72 48 65 14 56 81 -71 -63 20
3671B0k1%N8l1j10M1N0m1l8J71m9j23J29M5j44N3M9q5J8N4k7j4m6Q7p9qQ2J2r5
$$ 20 -1 -1 57 26 -84 -43 7 -34 -72 99 50 -73 56 101 -43 10 59 -26 -8 46 19 5 -41 46 -33 -41 41 53 -42
3700d2j2Q3q6j2Q8m4J7L3K9j23O2J01n8K4MJ9j06qN2ko5N6m3m0R6k1k4j9M2J8
$$ -42 -54 29 -57 -69 19 -25 -8 25 54 -69 -7 94 36 60 64 83 -23 -31 21 19 -46 10 -33 -73 23 2 -22 -41 1 19
3730A9j01P2L0j03P9OM0p6J16j31kJ8N9j9mK8n3q3J22%k6O3k7k8n5J64j01J5J1
$$ 19 -82 -10 20 -83 -4 2 42 -34 82 -49 -51 -33 26 7 3 31 -22 -105 17 17 -9 54 27 -1 -56 108 7 22 33
3759C3M4q1pJ17j08%Q6l8j30J47n2o2M5Nj3o3Q0Oo1k3J16Kr2J03J3j00L6ll7j4
$$ 33 77 -4 -11 106 -2 -2 84 46 -84 63 11 -51 -6 -1 -14 -77 3 9 -52 -75 41 43 -49 54 67 -33 3 0 -37 -51
3789e1Q1or4Q6L5r0J2P5o0PL2o0l1Q2J3k2qL8jo2N0K1p8L7N3q3l2R7rnl8k7k0
$$ -51 30 24 -70 16 51 -39 -27 48 -12 -5 27 -33 -64 18 31 9 1 39 38 -24 26 47 -31 6 59 -24 -56 41 32 27 -11 -38 -58
3822e8K0MM8n6J1L5oRL8q2P7n1M6k9mN8n0J7rJ3m9M2L2j08QK1QJ9p1J17j07M4
$$ -58 -38 -34 14 -42 -31 4 -2 7 45 -37 40 -11 35 6 2 60 10 27 18 31 -18 24 56 -52 -44 -23 -15 4 -67 50 -57 -13
3854a3k8K1j6M1M5j5l1Ok5K9oK4r4J9K1K1j0j8J5l8J3O3k2k6M4%p9O1M4m5L1k5
$$ -13 -41 -20 -36 5 50 35 4 10 -15 14 8 32 -62 -43 -22 -1 -11 -29 -14 -52 -39 24 2 -24 20 20 -59 2 46 1 32 7
3886GM7nl5Pm6j1J03L2j13lK8r%j2n0J3K8J0On4R3o1j1M3M3j06Q5RmJpNrl1l5
$$ 7 54 49 14 21 -25 -36 67 99 -14 -17 11 2 2 -10 -60 -47 -19 -9 -3 -57 36 -25 -36 7 50 -56 29 38 34 35 28 33 24 -7 -42
3921d2P2o4N8J9q3NJ8J2M0L5r8J05n7j8L7k8O8m5J4p9L4NNl9k5L6J4j03P0Rj1
$$ -42 30 -34 24 43 -40 -35 -17 -5 35 70 -28 77 20 2 39 11 79 34 48 -31 3 8 13 -26 -51 -15 -1 -104 -34 -25 -36
3952c6L8n7M5L1k0J5K4mJ3l7j6O0l8k6P8k4o3J7Rm7P5p1m3M7m5O4l2j7J7O7J1
$$ -36 2 -55 -10 21 1 16 40 36 49 12 -4 56 18 -8 70 46 -17 0 9 -38 37 -34 -77 -30 -75 -11 -43 -60 -43 24 35
3983C5l6Jk4K2m5N4n1R8m2o1N5o4J1K9o1J29m4q7O5%k6Q6r0Q6L0n8j16J57m4n9
$$ 35 -1 0 -24 -2 -47 7 -44 54 12 -49 6 -58 -47 -18 -79 50 6 -81 -16 -16 -42 44 -46 40 70 12 -104 53 9 -50
4013e0O5K6m0RL9q3j7N5K8o7M3P0l6j45J05Kn1J4J06j29m7J16Nl2K2K6q0QO2o1
$$ -50 15 41 1 10 49 -34 -51 4 32 -35 8 78 42 -103 2 4 -47 -33 73 -56 -103 13 18 -14 8 34 -46 -38 24 -37
4043c7m9J15O5k00N7J29j42J3J39o7k5k1P7o1k0J00qj17J27Lj44N9R3j20k2J54
$$ -37 -86 29 94 -106 -49 80 -62 -49 90 23 -2 -23 54 -7 -27 73 65 -52 75 78 -66 -7 86 -34 -56 98
4069I8j7j93N6J99j70p9J94o7j13J30M5j63nR5l2j33K15O3k48J05J62j61j8J27
$$ 98 81 -112 -56 143 -27 -106 88 21 -92 38 83 -80 -85 10 -22 -155 60 123 -125 -20 142 -19 -37 90
4093I0k8j77R4J16k07KK57r7k16J85J15k62M0K57j20j75J93P2k94J06K41j96q5
$$ 90 62 -115 -21 95 -112 -110 147 50 -166 19 134 -128 -88 169 49 -126 67 139 -155 -49 192 -4 -89
4116h9K72j29k39J75J13j69p7K66j85j75K57J44l25J37J95k27j03K67n1j44J65
$$ -89 183 54 -185 -10 103 -66 -143 123 -62 -237 20 164 -161 -24 171 -56 -159 108 57 -87 78
4137G8J64k96o3K72j43j89K93Q1l28L5K64j76k15L16L2k56J09J93k90m7L66j61
$$ 78 242 -54 -117 155 12 -177 116 197 -131 -96 168 -8 -223 93 125 -131 -22 171 -119 -166 200 39
4159C9k76L03J08k31j23M16j68k81K93J39l21k0K88j79j99K64J09l22J79K06k91
$$ 39 -237 66 174 -57 -180 236 68 -213 80 219 -102 -122 166 -13 -212 52 161 -161 18 224 -67
4180f7j65M15o5l10L12Q9l13m2L01j09j89K75Ql06O8K64l04n2L91o3k53M8K23
$$ -67 -232 183 118 -192 120 209 -104 -146 155 46 -143 132 140 -166 -98 166 -138 -190 201 138 -115 -67 156
4203A56l68K7L08k8k27J48J12l23J01L00k07j48K44N4l59J38K04j69p8L16j68
$$ 156 -212 -185 123 95 -132 16 128 -195 -94 206 -1 -149 95 149 -210 -72 132 -37 -115 201 33
4224C3k45K29J11j65j52L58q1k44K04J30k96K1K98k38j07K08K6j61O5J40k19r2
$$ 33 -212 17 128 -37 -189 169 88 -156 48 178 -118 -97 201 -37 -144 64 90 -71 -6 134 -85 -177
4246a77K78r5j61J78L5j46j6J75o6j20J90O6k58M2K37k00p9K78o1j40L8J11j20
$$ -177 101 6 -155 23 58 -88 -104 71 5 -115 75 141 -117 -75 162 -38 -117 161 100 -40 -2 109 -11
4269a1k3J81l4k35J58N0k13M1K12j97n1J23Q8j71L3J67p9j61K09k5k19J89N3j23
$$ -11 -34 147 113 -122 36 86 -127 -86 126 -71 -122 1 89 -82 -49 118 39 -122 87 62 -157 32 85 -38
4293c8K5O5o9j17J21R8j22l0J60j15o7J48j01o6N6J38k5j56J72p2j20J85j0j18
$$ -38 -13 52 -17 -134 -13 85 -37 -67 93 -22 -89 59 -42 -108 -52 86 61 -95 77 5 -115 70 60 -58
4317e8M2M7Ko9P4nl3m7J32j14k7J65o5o1L1K8q7N1N3n7m2O9mm0m2M8k2lM7m2j1
$$ -58 -16 31 33 -36 38 33 0 -47 85 -29 -56 109 44 -17 14 42 -45 6 59 2 -40 29 25 -15 -57 -9 -31 -34 13 -29 -40
4348d0kL2Nl9L0k5k9N1Nk8R1k9Rkk1%J7n4O2j07L7R7q6j3Q2m6n7K8j2N0l2O2k5
$$ -40 -42 -10 -5 -44 -14 -39 -68 -17 -12 -40 51 22 31 29 8 8 25 -29 33 -74 -37 60 -26 -39 43 -3 -60 -32 -44 6 -26 36 11
4381A1k7K4n9R9j9l6L4j2j1rk1l8J31m7k3m5O4QN2l8o8R8q9j1j8M9Qj5L0M4j4
$$ 11 -16 8 -51 48 29 -7 27 15 4 -5 -26 -64 67 20 -3 -48 16 24 76 38 -30 68 -21 -32 -50 -1 7 -8 22 66 52
4412E2n8M4m8J9Mo8O7l8k2N1m1N8j7p5M1kj2K0J6l1N9p0Q5m2j2P6o7l3J03l6r
$$ 52 -6 38 -10 9 13 -55 12 -26 -48 3 -38 20 3 -72 -31 -33 -45 -25 -9 -40 19 -51 34 -8 -20 56 -11 -44 59 23 14
4443A4M4j30J06l9l5R6n4l5N9k1m9MJ6j0K6lL6q1P9m1o6J28J5j06LM7j8J3j1N1
$$ 14 58 -72 34 -5 -40 56 2 -33 26 5 -44 -40 -24 -34 -8 -11 25 -56 23 -18 -84 44 59 -47 -44 3 -15 -2 -13 38
4473C8p1k3Q6m4pP4n4o0R3L1o5K0Lk8J5LJ4n7m9K10j36m6J17o4l1N0M0j63P0R3
$$ 38 -33 -56 30 -14 -21 53 -1 -61 32 63 -2 18 21 -7 8 11 25 -32 -81 129 -7 -53 64 0 -31 19 59 -104 -34 59
4503E9o2j71K37lj22L1P8p5P8n2L3j07L7J44j10r7K00n4j43J50qn5l1J10k6j36
$$ 59 -3 -174 63 60 -62 -31 47 -28 50 -2 31 -76 -39 105 -5 -102 98 44 -99 51 43 -12 -43 67 41 -95
4529i5J01P4k02J14J08r2r1J17Lj14N8P7j08jJ58o5j78J84N8j45L7O7r0p3J15
$$ -95 6 80 -122 -8 100 8 -83 34 37 -77 -19 58 -50 -51 107 42 -136 48 106 -39 -2 65 -25 -98 17
4554A7Q2j95K0K39k33o5K78j42j25K51m0j86M0J49r9j33K08R5k26J04J30k17p4
$$ 17 99 -96 -76 163 -70 -135 143 1 -124 127 87 -99 -59 90 -9 -142 66 161 -65 39 169 -48 -122
4577a22K07K1j96J32Q2k29m0L85k32j64K59pk84N5K89j44j11J92O3k92P8K08k61
$$ -122 85 106 -90 42 124 -105 -145 240 8 -156 103 96 -188 -133 156 12 -99 93 156 -136 -58 150 -111
4600a11pK96j60j66K18R5k58j4K51j02k24K65O2k85Q0K56k27m6K34l6k78J43J88
$$ -111 -118 178 18 -148 70 165 -93 -107 144 42 -182 83 145 -140 -60 196 -31 -77 157 121 -157 -14 174
4623A74l08k1L35j03k24K75J7l41P9K60j59p9K48m3k82P4K60k76n4L63p9k78J73
$$ 174 -134 -155 180 77 -147 128 145 -196 -117 143 -16 -95 153 110 -172 -98 162 -114 -168 195 116 -162 11
$$ [...]
8191B8
##END NTUPLES=NMR FID
##END=
