##TITLE=1H_46-2023
 CDCl3
 8 sc, 
 7.8.2023
##JCAMPDX= 6.0         $$ Bruker NMR JCAMP-DX V2.0
##DATA TYPE= NMR FID
##DATA CLASS= NTUPLES
##ORIGIN= UXNMR, Bruker Analytische Messtechnik GmbH
##OWNER= root
$$ XWIN-NMR		Version 3.5
$$ Mon Aug  7 13:46:35 2023 Russian Standard Time (UT+4h)  she@DPX200
##.OBSERVE FREQUENCY= 200.13135
##.OBSERVE NUCLEUS= ^1H
##.DELAY= (6, 6)
##.ACQUISITION MODE= SIMULTANEOUS
##.ACQUISITION SCHEME= undefined
##.AVERAGES= 8
##.DIGITISER RES= 18
##SPECTROMETER/DATA SYSTEM= spect
##.PULSE SEQUENCE= zg30
##.SOLVENT NAME= CDCl3
##.SHIFT REFERENCE= (INTERNAL, CDCl3, 0, 15.7039)
##AUDIT TRAIL= $$ (NUMBER, WHEN, WHO, WHERE, WHAT)
$$ ##TITLE= Audit trail, XWIN-NMR		Version 3.5
$$ ##JCAMPDX= 5.01
$$ ##ORIGIN= Bruker BioSpin GmbH
$$ ##OWNER= she
$$ F:/spectra/data/she/nmr/H-F/1/audita.txt
$$ ##AUDIT TRAIL=  $$ (NUMBER, WHEN, WHO, WHERE, WHAT)
(   1,<2023-08-07 13:45:25.82 +0400>,<she>,<DPX200>,
      <created by zg, POWCHK disabled, PULCHK disabled
       configuration hash MD5:
       00 E9 B6 7A A2 85 ED C7 34 08 36 98 17 FE 4E 26
       data hash MD5: 16K
       54 96 56 80 04 56 80 3E 76 8E 7E 49 02 DE C2 18>)
$$ ##END=
$$ 
$$ hash MD5
$$ 59 79 D6 6C 1B CF 99 5A 46 EB B1 58 71 97 76 2E
##$RELAX= 
##$RELAX= 
##$RELAX= 
##$RELAX= 
##$RELAX= 
##$RELAX= 
$$ Bruker specific parameters
$$ --------------------------
##$DU= <F:/spectra>
##$EXPNO= 1
##$NAME= <H-F>
##$PROCNO= 1
##$TYPE= <nmr>
##$USER= <she>
##$AMP= (0..31)
100 100 100 100 100 100 100 100 100 100 100 100 100 100 100 100 100 100 
100 100 100 100 100 100 100 100 100 100 100 100 100 100 
##$AQSEQ= 0
##$AQ_mod= 1
##$AUNM= <au_zg>
##$AUTOPOS= <>
##$BF1= 200.13
##$BF2= 200.13
##$BF3= 200.13
##$BF4= 200.13
##$BF5= 200.13
##$BF6= 200.13
##$BF7= 200.13
##$BF8= 200.13
##$BYTORDA= 1
##$CFDGTYP= 0
##$CFRGTYP= 5
##$CHEMSTR= <none>
##$CNST= (0..31)
1 1 145 1 1 1 1 1 1 1 1 1 1 1 1 1 1 1 1 1 1 1 1 1 1 1 1 1 1 1 1 1 
##$CPDPRG= <>
##$CPDPRG1= <>
##$CPDPRG2= <>
##$CPDPRG3= <>
##$CPDPRG4= <mlev>
##$CPDPRG5= <mlev>
##$CPDPRG6= <mlev>
##$CPDPRG7= <mlev>
##$CPDPRG8= <mlev>
##$CPDPRGB= <>
##$CPDPRGT= <>
##$D= (0..31)
0 1.2 0 0 0 0 0 0 0 0.06 0 0.03 0 0 0 0 0.0002 0 0 0 0 0 0 0 0 0 0 0 0 
0 0 0 
##$DATE= 1691401525
##$DBL= (0..7)
120 120 120 120 120 120 120 120 
##$DBP= (0..7)
150 150 150 150 150 150 150 150 
##$DBP07= 0
##$DBPNAM0= <>
##$DBPNAM1= <>
##$DBPNAM2= <>
##$DBPNAM3= <>
##$DBPNAM4= <>
##$DBPNAM5= <>
##$DBPNAM6= <>
##$DBPNAM7= <>
##$DBPOAL= (0..7)
0.5 0.5 0.5 0.5 0.5 0.5 0.5 0.5 
##$DBPOFFS= (0..7)
0 0 0 0 0 0 0 0 
##$DE= 6
##$DECBNUC= <off>
##$DECIM= 32
##$DECNUC= <off>
##$DECSTAT= 4
##$DIGMOD= 1
##$DIGTYP= 9
##$DL= (0..7)
0 120 120 120 120 120 120 120 
##$DP= (0..7)
150 150 150 150 150 150 150 150 
##$DP07= 0
##$DPNAME0= <>
##$DPNAME1= <>
##$DPNAME2= <>
##$DPNAME3= <>
##$DPNAME4= <>
##$DPNAME5= <>
##$DPNAME6= <>
##$DPNAME7= <>
##$DPOAL= (0..7)
0.5 0.5 0.5 0.5 0.5 0.5 0.5 0.5 
##$DPOFFS= (0..7)
0 0 0 0 0 0 0 0 
##$DQDMODE= 0
##$DR= 18
##$DS= 0
##$DSLIST= <SSSSSSSSSSSSSSS>
$$ [...]
##$SUBNAM2= <"">
##$SUBNAM3= <"">
##$SUBNAM4= <"">
##$SUBNAM5= <"">
##$SUBNAM6= <"">
##$SUBNAM7= <"">
##$SUBNAM8= <"">
##$SUBNAM9= <"">
##$SW= 18.05172834244
##$SWIBOX= (0..15)
0 0 2 0 0 0 0 0 0 0 0 0 0 0 0 0 
##$SW_h= 3612.71676300578
##$TD= 16384
##$TD0= 1
##$TE= 0
##$TE2= 300
##$TE3= 300
##$TEG= 300
##$TL= (0..7)
0 120 120 120 120 120 120 120 
##$TP= (0..7)
150 150 150 150 150 150 150 150 
##$TP07= 0
##$TPNAME0= <>
##$TPNAME1= <>
##$TPNAME2= <>
##$TPNAME3= <>
##$TPNAME4= <>
##$TPNAME5= <>
##$TPNAME6= <>
##$TPNAME7= <>
##$TPOAL= (0..7)
0.5 0.5 0.5 0.5 0.5 0.5 0.5 0.5 
##$TPOFFS= (0..7)
0 0 0 0 0 0 0 0 
##$TUNHIN= 0
##$TUNHOUT= 0
##$TUNXOUT= 0
##$USERA1= <user>
##$USERA2= <user>
##$USERA3= <user>
##$USERA4= <user>
##$USERA5= <user>
##$V9= 5
##$VALIST= <valist>
##$VCLIST= <CCCCCCCCCCCCCCC>
##$VD= 0
##$VDLIST= <DDDDDDDDDDDDDDD>
##$VPLIST= <PPPPPPPPPPPPPPP>
##$VTLIST= <TTTTTTTTTTTTTTT>
##$WBST= 1024
##$WBSW= 4
##$XGAIN= (0..3)
0 0 0 0 
##$XL= 0
##$YL= 0
##$YMAX_a= 636735
##$YMIN_a= -535493
##$ZGOPTNS= <>
##$ZL1= 120
##$ZL2= 120
##$ZL3= 120
##$ZL4= 120
##$ABSF1= 10
##$ABSF2= 0
##$ABSG= 5
##$ABSL= 3
##$ALPHA= 0
##$AQORDER= 0
##$ASSFAC= 0
##$ASSFACI= 0
##$ASSFACX= 0
##$ASSWID= 0
##$AUNMP= <proc_1d>
##$AZFE= 0.1
##$AZFW= 0.1
##$BCFW= 1
##$BC_mod= 2
##$BYTORDP= 1
##$COROFFS= 0
##$CY= 11.3945322036743
##$DATMOD= 1
##$DC= 2
##$DFILT= <>
##$DTYPP= 0
##$F1P= 15.7292609196834
##$F2P= 12.9074282941183
##$FCOR= 0.5
##$FTSIZE= 0
##$FT_mod= 4
##$GAMMA= 1
##$GB= 0.15
##$INTBC= 1
##$INTSCL= 1
##$ISEN= 128
##$LB= 0.24
##$LEV0= 0
##$LPBIN= 0
##$MAXI= 10000
##$MC2= 0
##$MEAN= 0
##$ME_mod= 0
##$MI= 1.114404
##$NCOEF= 0
##$NC_proc= 0
##$NLEV= 6
##$NOISF1= 3.799351
##$NOISF2= 2.8
##$NSP= 1
##$NTH_PI= 0
##$NZP= 0
##$OFFSET= 15.70392
##$PC= 1
##$PHC0= -21044.46
##$PHC1= 11.25272
##$PH_mod= 1
##$PKNL= yes
##$PPARMOD= 0
##$PSCAL= 0
##$PSIGN= 0
##$REVERSE= no
##$SF= 200.130013532006
##$SI= 16384
##$SIGF1= 3
##$SIGF2= 2
##$SINO= 400
##$SIOLD= 16384
##$SREGLST= <1H.CDCl3>
##$SSB= 0
##$STSI= 0
##$STSR= 0
##$SW_p= 3612.71676300578
##$SYMM= 0
##$S_DEV= 0
##$TDeff= 0
##$TDoff= 0
##$TI= <>
##$TILT= no
##$TM1= 0
##$TM2= 0
##$TOPLEV= 0
##$USERP1= <user>
##$USERP2= <user>
##$USERP3= <user>
##$USERP4= <user>
##$USERP5= <user>
##$WDW= 1
##$XDIM= 8192
##$YMAX_p= 0
##$YMIN_p= 0
$$ End of Bruker specific parameters
$$ ---------------------------------
##NTUPLES= NMR FID
##VAR_NAME=  TIME,          FID/REAL,        FID/IMAG
##SYMBOL=    X,             R,               I
##VAR_TYPE=  INDEPENDENT,   DEPENDENT,       DEPENDENT
##VAR_FORM=  AFFN,          ASDF,            ASDF
##VAR_DIM=   8192,          8192,            8192
##UNITS=     SECONDS,       ARBITRARY UNITS, ARBITRARY UNITS
##FACTOR=    0.0002768,     1,               1
##FIRST=     0,             0,               0
##LAST=      2.2672688,     0,               0
##MIN=       0,             -535493,         0
##MAX=       2.2672688,     636735,          0
$$ Real data points
##PAGE= N=1
##DATA TABLE= (X++(R..R)), XYDATA
0@%%%%%%Qj6J6j6J6k4M0m8N6p2Q8j12J36j60J93k33K80l31L87m53N29o12P04q09
30d33R29j060J204j364J542j736J949k187K445k727L036l373L745m149M589n071
46b661N597o173O803p493Q253r092J0020j1052J2207j3508J4984j6674J8632k0934
60a1091K3683k7036L1227l6633M3907n4262P0245r8274J61008n32009J08068R57902
72F36735r22836R1896M95912m84046n1547O32357k25985m51685K78989K83925
82B83715l23220R3810P3642k76831K24888R7198k71604J62883r5581l1714K67426
93B04612k88583o1497L16272k11403k9488J49853j56475n483J40432j4920j62387
104a19067M784K04677j28263l4655J46386k13141R5110K11239k48148N9004R2900
$$ y = [0, 0, 0, 0, 0, 0, 0, 8, -8, 8, -8, 8, -16, 24, -24, 32, -40, 48, -64, 72, -88, 105, -128, 152, -179, 208, -245, 284, -328, 376, -433, 496, -564, 640, -724, 818, -918, 1031, -1156, 1289, -1438, 1598, -1775, 1970, -2179, 2410, -2661, 2936, -3237, 3566, -3927, 4326, -4766, 5254, -5798, 6409, -7099, 7885, -8789, 9843, -11091, 12592, -14444, 16783, -19850, 24057, -30205, 40040, -58234, 102774, -429235, -321167, 636735, -286101, -194205, 301707, -182339, -233886, 398471, 172486, -279199, -210, 283715, -39505, 54305, 127947, -148884, 76004, 173202, -98402, 64481, -31100, -62814, 204612, -83971, -145468, 170804, -40599, -70087, 79766, -76709, -82192, 58240, 43320, -119067, -114283, 90394, -37869, -72524, 73862, -139279, -44169, 167070, -81078, -22074, 70826]
115G0826j42259J48399J942j09775N0534m2293Q8072m486j35058J10619l5800
126G21m5837J07894r0981J3836K2717o6545J23507o1593o2421J20227q7950K2503
138c922M9932q9814Q7978n4461m1266J32719j28062J6326R8587j48137Q5508M2643
150D8031j17017R4450j8552m0885N7314l7113M0266l5271k8358J00944r6758J5839
162a7110Q2080j28730P9149K0818j03320J28049o0353o3031J31871q6286k549
173a9412O5425p3139M6893j7045j7128O1915q2168L8567K7728q0236R0565m8204
185f239m4710J11237r8646J1588Q0228j04253N3825R818m9503P6419p0080J5107
197a5209O1979r9988P0938J1508p8877Q9526m8034j7532P5304q0257L2951K1075
$$ y = [70826, -71433, 76966, 78908, -30867, 19667, -22626, 65446, 60960, -74098, 36521, 721, -45116, 62778, -28203, -14367, 8350, -58195, 65312, 3719, -58702, 61525, -26425, -3922, 46010, -43804, 44174, -10287, -51553, 81166, -46896, -30570, 68017, -80120, 5388, 48031, -68986, 25464, 6912, -33973, 23341, -13772, 26494, -8777, -37135, 63809, -32949, -17110, 64970, -63760, 15389, 36207, -67113, 60936, 583, -62448, 69423, -16863, -19412, 46013, -27126, 19767, 2722, -14406, 47509, -34659, 3908, 31636, -48600, 41965, -6239, -50949, 60288, -38358, -26770, 53458, -50795, 3030, 12848, -36655, 39764, -30316, -15209, 46770, -53218, 17720, 29228, -49649, 39877, -8157, -25689, 49615, -30642, 2309, 23384]
209B3384n3605O4907m9109J622N8088r3175O3486K0735r1119R1237l6383l6340
221c6272Q8968q6442K0622N6931q8261N6331J787m2653N3556m8365K7110K0338
233B3650o9862P6529k6522m1389Q5042p5591J8420N8657r8522O7769J2253p5679
245d5245Q0111l6316j6908N2094o5352M6441L097n7791P3541m3629r700N5988
257C6331p4823M9640J1498p0637Q3175l6499l1140P1719o7076K8877K6460p0248
269d2723P1703k2865l9405P1112n6779J5336L1002o3010O3158k1854l8894P4360
281D1141n9189Q258M2056o8579N7353j0368m8750P5813n1755m789N1717o5318
293c2410M4133K5m9111P2811m7677j1073O0043o6054L5513J2009n1935O7528m0733
$$ y = [23384, -30221, 34686, -14423, -12801, 45287, -47888, 15598, 36333, -54786, 36451, 68, -36272, 52696, -33746, -13124, 43807, -44454, 11877, 13664, -28989, 24567, -23798, 3312, 23650, -46212, 30317, 3795, -37594, 47448, -28143, -9723, 48934, -49588, 18181, 30434, -45245, 34866, -1450, -18358, 33736, -31616, 14825, 17922, -39869, 33672, -9957, -19657, 36331, -38492, 11148, 22646, -47991, 35184, -1315, -32455, 39264, -27812, 1065, 27525, -42723, 28980, 6115, -33290, 37822, -18957, -3621, 27381, -35629, 27529, 5675, -33219, 41141, -18048, -9790, 32266, -36313, 21040, 10672, -38078, 37735, -14020, -18809, 32908, -32410, 11723, 11748, -37363, 35448, -12229, -23302, 36741, -29313, 6200, 18209, -33726, 33802, -6931]
306f931j4992O3111o7757L0394K2046n9425O3028l0893k4609O6334o4805J8553
318e946L2904o0721N3931k0916k7954O4495o1063J5856M0142o6391N0897o923
330H311l7513O2895n1701P289M4498o5524M4313J119m2165O0829m5571K00M9771
343C6751o6671L8151J2624n0713N7309l3980r409M9532o2777L4154J6672n6390
355c4747N6639k5517j8015N1928n9184K8238K4152n9142N5621j8919k5079N6907
367C2882n5253K0435L0769o3347N4297q368l8429N6098m3136R200L1352n7874
379c1374M7450o352l7752N8001m5006M522L9615o1759M5109K736m9729O1359l3103
392f283j1197M4980n3402L3251Q779m7408N6358k7232j5250M6625n1023K8090
$$ y = [-6931, -21923, 41188, -26569, 3825, 25871, -33554, 29474, -1419, -26028, 40306, -24499, -5946, 26958, -33763, 20168, -748, -28702, 35793, -25270, -9414, 30728, -35663, 15234, 8311, -29202, 33693, -18008, -10719, 33779, -31745, 12568, 13687, -28478, 32351, -13220, -13020, 36751, -29920, 8231, 20855, -29858, 27451, -6529, -15938, 33594, -29183, 4971, 21643, -34747, 21892, -3625, -21640, 30288, -28896, -658, 23494, -35648, 19973, 1054, -24025, 32882, -22371, -1936, 28833, -34514, 19783, 11415, -27014, 29084, -14052, -4852, 26500, -31374, 16076, 9724, -28028, 29973, -15033, -10511, 29104, -32655, 12454, 15190, -34539, 26820, -6283, -17480, 27500, -25902, 7349, 16128, -31280, 25078, -2154, -17404, 29221, -21802, 6288]
404F288J3887m9417N5095k5585k2241N3950n0539J7744K1650n2516N2531j7427
416C420l0737N6009m6244R861L1292n2826M4080r601l3533N7551m1849J053L6503
429B4979n0436L7046l023l3021N2770l9654J283L8729n4521M0307J51m5687O2873
442C1796l6363j6748N5900n5296J5200K4200m1726L7793j9550j1241L7465m3590
454b2160K7077Q463m3615N5216k8622j7772N8692n9288J5372L8613n9724M0638
466A2890L81l6440M6838l0541L10K7781m0184L1281q309k1317M4943m4311J1190
479e488L2970n9307M3820K341m7400N6153l1219j2783M7465m9648K0160J6613
491A3677l8151M1339k2043p454L7554m7953K8953J5140m7850M7071j7974j9243
$$ y = [6288, 20175, -29242, 25853, 268, -21973, 31977, -18562, -818, 20832, -31684, 20847, 3420, -27317, 28692, -17552, -7691, 23601, -29225, 14855, 5254, -28279, 29272, -12577, -11524, 24979, -25457, 11589, 8566, -24455, 28315, -11339, -10056, 28673, -25848, 14459, 14610, -31077, 31796, -4567, -21315, 34585, -20711, -5511, 18689, -23037, 14756, -4794, -16035, 21430, -22160, 4917, 13380, -30235, 24981, -3641, -21413, 37279, -22009, -6637, 31976, -27748, 12890, 13271, -23169, 23669, -6872, -6562, 21219, -18965, 12316, 4007, -17310, 27633, -16678, -5488, 27482, -31825, 11995, 14336, -33064, 23089, -8130, -20913, 26552, -23096, -2936, 13677, -24474, 16865, -5178, -12632, 24922, -23031, 5922, 21062, -26788, 20283, 2309, -16934]
503a6934M4286m4227J7831J8889m7822M6052j3637k5398M6946m2565J1760K8915
515B4096n0887M0292m206l5322M8882l0477l111K9646m0882K8946p55k7369M1162
528B0015l3471N048L0929m8614L7303J301m1947N4879k8752j4086M6068m8671
540a9998J9028K0803m4059L8364j1155j9259L3866l1100J7867O529l4019M5445
552B2312k5209j4636M8757m9204J5275K7480n1446M2088o174l4355M9386l2142
564g868l317L1232l8793K5611k423k2982L8892l2662N628K6532m5925L6264l46
577I843l6428M8785l0072r089M0791m2227J9316J1296l4439M0504k0878j0762
589a3360L8155m0909J8952J5737l8817L8971j6257j7113M0735l8687J1310K0917
$$ y = [-16934, 27352, -16875, 956, 19845, -27977, 18075, 4438, -20960, 25986, -16579, -4819, 24096, -26791, 13501, 9295, -26027, 22855, -7622, -10733, 18913, -21969, 6977, 6222, -21147, 20015, -13456, -8408, 22521, -26093, 11210, 12511, -29436, 25443, -3309, -17395, 28673, -19998, -970, 19833, -24226, 14138, 2983, -16276, 17590, -13510, 4357, 10886, -23133, 22312, -2897, -17533, 31224, -17980, -2705, 24775, -26671, 15417, 9243, -25112, 24274, -7868, -11185, 20047, -18746, 6865, 4442, -18540, 20352, -12310, -6682, 19850, -26075, 10189, 9843, -26585, 22200, -7872, -16961, 23830, -18397, 919, 12215, -22224, 18280, -2598, -13360, 24795, -16114, 2838, 18575, -20242, 18729, 2472, -14641, 26094, -12593, -1283, 19634]
601A9634l9069L3237j1117j8104L8900l8708J2067K3117m5654L8671o155l1503
613b4684M6484l2002k500L4299m2197K2843O475k7879L5055k4411J131K6082l9666
626b0970L0381J201l3165M4931k6985p803L8963m4939K0674J6332m1803L8603
638A5420j2867j8473L6175l3399J1511J6746l4701L1684j1767j5067L4088l4551
650a5201J4646J6502m0254L8158r790k5453M4051l3455K828K9406m1672K7741
662G507L351k9842L6851k2633l026K5768l4861K4851K76k7715L8908k6820l656
675a1041L1890m1327K4785Q052l6789M1357j8942j4495L7153l5803J4303J5289
687A4432l4800L3835j2226j5731L4182l1981J2143J4889l4069L4449j2530j9532
$$ y = [19634, -19435, 13802, 2685, -15419, 23481, -15227, -3160, 19957, -25697, 12974, 6819, -24684, 21800, -10202, -12702, 21597, -20600, 2243, 8718, -19161, 15894, -8517, -7386, 18696, -20970, 9411, 10612, -22553, 22378, -4607, -12410, 26553, -18386, 2288, 18620, -23183, 15420, 2553, -15920, 20255, -13144, -1633, 15113, -19588, 12096, 329, -14738, 19350, -15201, -555, 15947, -24307, 13851, 4061, -21392, 22659, -10796, -7968, 21438, -20234, 7507, 10858, -18984, 17867, -4766, -7792, 17976, -16885, 7966, 8242, -19473, 19435, -7385, -11041, 20849, -20478, 4307, 12359, -24430, 16927, -2015, -16510, 20643, -15160, -857, 14432, -20368, 13467, 1241, -14490, 19692, -12289, -146, 14743, -19326, 15123, 2593, -16939]
699a6939L9609l3864O523K4306l9587K9152j944k5938L7034k6667n29K6000l5222
712a8066K4763l53k6212L7527k4915l358K9824l6614K1340O671k9190L5676k0432
725c339p292L1650l6273J8450J0736l2957L5032j5982j3720L4605l3961J1834
737a217J5557l4028L1774j0889j7047L4285l1901R740J9472l5976L0085o811k0033
750a6989L6251k9420M167K3854l6371K7051l60k5648L5538k3770j701K6296l4945
763a6047K2137L828k7035L3705k1353m711K8196l5317J9721Q351l1524L4130j6478
776b397j1238L1304l2318J4100J2687l2085L1991j1401j4579L2753l1163J1084
788a262J7408l4057K9998p945j8896L3773k7348M972J9615l4172K7534l581k2492
$$ y = [-16939, 22670, -11194, -4671, 19635, -19952, 9200, 7256, -18682, 18352, -8315, -8844, 17156, -18066, 6697, 6344, -19868, 17659, -7256, -10614, 19210, -17404, 3936, 10607, -18583, 17093, -3339, -10631, 21019, -15254, 3196, 13932, -19025, 16007, 25, -13695, 20910, -13051, -1217, 14340, -19688, 12086, 1197, -15850, 18435, -13466, -3726, 15746, -20230, 9855, 3044, -16989, 19262, -10158, -5991, 17863, -18508, 8543, 8183, -17465, 18073, -5697, -7398, 18898, -16047, 6090, 9918, -17117, 16588, -4765, -9476, 18720, -16597, 3124, 11475, -20049, 14081, -2397, -13635, 17669, -14649, -549, 12138, -19947, 12044, 643, -13936, 18817, -12346, -1262, 16146, -17911, 12087, 4142, -14754, 19019, -8329, -3357, 16258, -17914, 9620, 6039, -16453]
801a6453L4043k5632P39K4324l4856K3666J270k5734L3999k1266l802K6180l3355
814a6877K0400N869k8203L3805j7427q821K9009l0554J5577R598k9296L1642j4555
827A67j1853L1469l1484J1394J4593l1768K8961q821j7527L1756k7169O469J7814
840A4001l1504K6025n591j8543L2931k6703L312K1734l2885K4585j165k3229L3202
853A6170k2436j552K5256l2385K0347M032k5899L2272j9141n456K6242l1149J6958
866C259O729k7064L0876j6948q907K9501l1903J3756J2673l0385K9263j0302j3819
879a3271K9588k6952Q827J5168k9459K6687p931j5808L0759k6761N377J9527l2064
892a6313K4482j928k0945L0437k2090R73K0908l0523K1244N95k3250L1553k1005
$$ y = [-16453, 17590, -8042, -7303, 17021, -17835, 5831, 7101, -18633, 15366, -5900, -9702, 16478, -16877, 3523, 9392, -18811, 14994, -2433, -11254, 17755, -12799, 2778, 12376, -16920, 14722, 167, -11686, 19783, -11701, -307, 14286, -17482, 11479, 2658, -14869, 16887, -10282, -3813, 14001, -17503, 8522, 2931, -15612, 17319, -9384, -6072, 15662, -17223, 7362, 6197, -17032, 16170, -6266, -7818, 17438, -14947, 5400, 9432, -16467, 15805, -3336, -8792, 17450, -13699, 3259, 9988, -17076, 13800, -3148, -12055, 17446, -14457, -701, 11972, -18413, 10850, 548, -13271, 16317, -10635, -1808, 13360, -16099, 10588, 2657, -13151, 17608, -9153, -3776, 15751, -16313, 8169, 6241, -14704, 15733, -6357, -5384, 15524, -14999, 6245, 6840, -16410, 15143, -5862]
905e862k734K4411l1398J8530N844k6442L0534j5655p548K6558k8465J3993R017
918A0783k6220K8707j3306r734K7063k8936J2830J2297l1059K8922q997j6432
930a4082L0724k6400N060J8158k9450K3156l641j7665K7909k2152L904J7349k9450
943a6580K4171l043k1068L2549k1932k008K4579l0626J7891N911k4187K8061j5562
956a844n521K3363k7208J5286N570k5169K8767j4887r097K6714k8543J2209J1285
969A0925k7625K6605r891j3111K8007k5148P860J4324k8053K5439o685j5841K8852
982A5658k4033M399J8067k8948K2707k671j9307K9495k0990k16K0871k8976J8812
995D868J200k0175K7780j9492k151K2704k9777J8090N580k5685K8431j3359q289
$$ y = [-5862, -8596, 15815, -15583, 2947, 8791, -17651, 12883, -2772, -10320, 16238, -12227, 1766, 10783, -15437, 13270, -36, -9770, 17293, -11643, 1187, 13484, -17575, 11347, 2350, -14082, 16642, -9758, -4698, 13460, -15990, 7166, 3525, -14140, 13769, -8383, -4479, 12870, -16580, 7591, 4548, -16520, 16029, -5903, -7911, 16668, -13958, 3933, 9844, -14343, 13718, -1844, -7365, 15998, -11210, 4076, 9646, -15523, 13244, -1643, -10740, 15974, -12569, -360, 10925, -16700, 9905, 14, -13097, 14910, -10238, -2378, 11946, -16107, 9332, 2647, -13194, 15658, -8375, -3976, 14091, -14857, 7850, 5179, -14128, 15367, -5623, -5839, 15032, -13944, 4868, 6068, -14107, 13673, -5819, -7970, 14734, -15043, 3047, 8627, -17058, 11373, -1986, -10275]
1008a0275K5059k5935J1739R205k3203K4931j1356r310K5094k5690J0560J1632
1020A2451k7058K5193q503j4048K8110k4934N414J6734k8604K2178k294j8687
1032a4048K6990k0340J838J7884k6496J9452j537j8191K7880k0246M57K0718k8832
1045a4471J9240L645k2757K7823j5394n539K3311k6486J3996O980k4637K6254
1057A1965j2048r480K4592k5413J0065J0126k4119K3978j0253j0678K5257k4455
1069a0463Q774J3498k7465K3566n044j6086K7511k1199K431J7268k5902J9457
1081F346j026j7529K5247j7927Q09J7418k5944J8781m62j9285K7435j8380l471
1094g988K2296k6970J4658O116k2591K4732j2541o887K2286k4258J2078P491k3062
$$ y = [-10275, 14784, -11151, 588, 9793, -13410, 11521, 165, -9145, 15949, -9741, 819, 12451, -14607, 10586, 2083, -11965, 16145, -8789, -3375, 13359, -15245, 6933, 4639, -14048, 12942, -7398, -5560, 12324, -14172, 5280, 3743, -14448, 13432, -6814, -6357, 14361, -14471, 4769, 8414, -14343, 13480, -1914, -7453, 15858, -10628, 3368, 10348, -14289, 11965, -83, -9563, 15029, -10384, -319, 9807, -14312, 9666, -587, -11265, 13992, -10463, -1689, 11809, -15656, 7910, 2866, -13220, 14291, -6908, -4477, 12791, -13111, 6346, 5320, -12209, 13038, -4889, -4080, 13338, -12606, 6175, 5713, -13572, 13863, -4517, -7988, 14308, -12662, 1996, 8112, -14479, 10253, -2288, -9175, 13111, -11147, 931, 8422, -14640]
1107a4640K5389j1026r643K4934k4337Q843J1720k4495K2628p169j2720K4937
1119A4421k2072N696J3915k5359K0890m160j5856K5888k0328J648J7613k5903
1131a3607J7757R74j8696K4386j5914j481J8432k3590J5182K309j8663K5506j5714
1144c119m156K1920k6033J3712Q049k3799K4099j0008r428K1964k1779Q964Q733
1157I119k2354K2492r247j0224K3409k2900P764J2394k4684K1610n050j4786K5080
1170A2623j9688L392J5613k4767J8669j217j5868K3809j7734J045J6601k4387
1182a1909J7513R98j9401K4739j5153l273J9750k3913J2885M897j9642K2439j2194
1195b264o144K0168k2493J1675O904k1556K2884r562r493K2979k1431P015J1475
$$ y = [-14640, 10749, -277, -9920, 15014, -9323, -480, 11240, -13255, 9373, 2204, -10516, 14421, -7651, -1955, 11960, -13399, 7491, 3331, -12525, 13363, -6965, -5317, 12296, -13607, 4150, 5124, -13572, 10814, -5100, -6581, 11851, -11739, 3443, 5752, -12911, 12595, -3119, -7275, 14645, -11388, 2324, 10373, -13426, 10673, 665, -8763, 13201, -8578, 386, 9119, -13235, 9257, 10, -10214, 13195, -9705, -1941, 10453, -14231, 7379, 2329, -12457, 12623, -7065, -3673, 11940, -12827, 5842, 4625, -11243, 12566, -5168, -4123, 12478, -11909, 5604, 6602, -12799, 11940, -3213, -6486, 13264, -10649, 2236, 7133, -12509, 9930, -2264, -8408, 11760, -10733, 942, 7846, -13710, 9174, -388, -9881, 13098, -8333, -1318, 10157]
1208A0157k2081J9785n439j1428K1552j9270N337J2346k3055J9536m137j4629
1220a1326K4150j8465J020J6242k3836J6556O84j7239K2438j4860j585J7029k2121
1233a1313J4258K467j7788K2510j3078m384J9529k2580J2549O166k0519K2377
1245A0194r888q342K1272k0482P258R100k0299J9228p005j0000K0775j9784O136
1258a837J1197k1892J9113m451j3315K2453j7608K563J4126k2061J6602q31j4764
1271a0705K1624j5531J36J5690k1863J5093J288j6936K2221j3609k971J7730k1645
1284i478J1996M138j7977K0743j1363n620J9096k1107R828P410k0146K0173q250
1297e57q097J9976j9598P184R798k0088J8528n170j0629J9937j6941L989J1534
$$ y = [10157, -11924, 7861, 2422, -9006, 12546, -6724, -1387, 10959, -12096, 7440, 3303, -11326, 12824, -5641, -4621, 11621, -12215, 4341, 5025, -12214, 10224, -4636, -6221, 10808, -11313, 2945, 5412, -12376, 10134, -2944, -7328, 12201, -10379, 2170, 8336, -12183, 10194, 306, -8036, 13236, -7246, 12, 9112, -11187, 8041, 1036, -8964, 11811, -7973, -1837, 9360, -12532, 6581, 2130, -11185, 11268, -6340, -3777, 10349, -11712, 4890, 4059, -10705, 10919, -4612, -4476, 11214, -10649, 4444, 5732, -11204, 11017, -2592, -5563, 12167, -9478, 2518, 6656, -11321, 9422, -1941, -7561, 11535, -9572, 256, 7666, -12480, 7693, -557, -8654, 11322, -8276, -1092, 8706, -11382, 7146, 1976, -8653, 11284, -5657, -1668, 9866]
1310I866k0215J6642k810j2932K0541j6021J562J3696k0684J4534N18j5610K0589
1323I676j3388j946J5664j9800J1975K913j5933J9740j1522l867J7085j9598J0655
1336A654N604j8089J9428q524p110J8620j8940P984P678j8926J8527o772r205
1349h071J9334j7742M872J0248j9531J6743m287j1159J9735j6427K915J2155j9754
1362a0969J5264j319j2921J9534j3523o1J3943j9420J3155J163j4382J9475j2038
1375b099k671J5542j8885J0415M424j6622J8076r569n091J6590j8064Q567N762
1388F375j6952J7625p615p277J7937j7513O023R136j8352J6692m441r542J8040
1401A0136j5490L356J0801j8194J5075k532j1590J8592j4457J377J2841j9069
$$ y = [9866, -10349, 6293, 3483, -9449, 11092, -4929, -3367, 10329, -10355, 4179, 4697, -10913, 9676, -3712, -5658, 10006, -9794, 2181, 5094, -10839, 8901, -2621, -6488, 10597, -9001, 1654, 7258, -10831, 8597, 73, -7037, 11583, -7357, 627, 8305, -10621, 7906, 1134, -8071, 11263, -6479, -1607, 8641, -10890, 5853, 1566, -9593, 10142, -6285, -3370, 8785, -10969, 4295, 2976, -9945, 9589, -3934, -3995, 9948, -9472, 3683, 4846, -9536, 9939, -2099, -4770, 10772, -8113, 2302, 6726, -9896, 8180, -1389, -6480, 10110, -7954, 613, 6375, -10577, 7048, -567, -7844, 10093, -7420, -1397, 7739, -10613, 6079, 1638, -7904, 10136, -5354, -1998, 8803, -9391, 5684, 3152, -8438, 10154, -4303, -2926, 9915, -9154]
1413i154J3256m10j3151J8668j2723j399J4154j8772J1550K656j4527J7608j0146
1426b390l512J5247j7306R117M598j5457J7270p706o282J6581j6921P119O942
1439G300j6791J6433n877q600J7632j5532L958R657j7685J4417k965j0219J7117
1452H845j4030K127J0805j7277J3495j645j1192J7690j3242N80J3173j8669J2429
1465C089J698j4313J8390j0430l141J4261j6447R451L258j4143J6094q587m516
1478e336J5016j6895P923N207j5524J6288p033o939J6299j5744N697Q036j6665
1491i670J4834m191q683J6440j3697L199R427j6345J3517k077j0528J7149j2625
1504c250P38J1423j6816J1455O20j1968J5894j0801p87J2036j6708J0593J831
$$ y = [-9154, 4102, 3692, -9459, 9209, -3514, -4913, 9241, -9531, 2019, 4675, -9852, 7756, -2390, -5902, 9345, -7961, 1156, 5754, -9703, 7567, -139, -6421, 10160, -6761, 358, 7300, -9491, 6942, 1065, -7535, 10097, -5435, -1477, 8180, -9505, 4912, 1947, -8272, 8845, -5185, -3058, 7747, -9530, 3965, 2320, -8872, 8818, -4424, -3844, 9329, -9340, 3089, 4787, -9526, 8864, -1566, -4707, 9554, -6893, 2558, 5816, -8327, 7767, -820, -5336, 9680, -7215, 708, 5915, -9609, 6679, -354, -7293, 9006, -6738, -1041, 6995, -9670, 5164, 973, -7710, 8730, -4967, -1768, 7659, -8686, 4831, 2754, -7774, 9375, -3250, -2512, 8911, -7905, 3550, 4170, -7798, 8096, -2705, -3492, 8544, -8164, 2429, 4260]
1517D260j3616J7007r623m200J5096j6255P244N657j4215J4449o224m933J3728
1530H375j4436O342N906j4551J5039o085p321J6427j5090M326R064j6742J3199
1543D453j932j0117J5675j1937R56R453j4574J1718j885r708J5562j1889M80J1896
1557H151j6579J0813K052j3027J6006q718l370J3251j4700P461M075j2665J4343
1570G093p793m116J3723j4973O974N222j4870J4578n452o764J4575j3503L792
1583a514P501j4213J2668l822p464J4648j3182L471R099j5821J2528j227j0383
1596g711J5683j0847k30J1108j4594R407J026j0435J3904r530p41J0969j4914
1609f905R110J823j2535J5504q365m097J3397j4564O487N184j3318J3249n162
$$ y = [4260, -9356, 7651, -1972, -6172, 8924, -7331, -87, 5570, -8645, 5804, -420, -5353, 8375, -6061, 281, 6187, -8364, 6675, 590, -6731, 9696, -5394, -1068, 7996, -8746, 4453, 2521, -7596, 8079, -3858, -2902, 6551, -8023, 3695, 1810, -7898, 7664, -4225, -3745, 8151, -8428, 2385, 4437, -8590, 7416, -1302, -4672, 8579, -6121, 1340, 5415, -7250, 7093, -700, -4816, 8907, -6066, 908, 6130, -8740, 5838, 386, -6378, 8197, -5306, -1514, 5987, -8226, 4442, 620, -6844, 7804, -5378, -1907, 7192, -8629, 3899, 2672, -7711, 7972, -2875, -3105, 8003, -6591, 2816, 3842, -6593, 7311, -2219, -2960, 8009, -6905, 2205, 4028, -8507, 6997, -1368, -5465, 7932, -6632, -145, 5039, -8279, 4970, -192]
1622a92n504J2770j2485N369N350j3045J3313n077o278J4391j3140L522Q290j4932
1636g648J1945j808r281J4223j0493P36R063j4113J0442q73r578J4172j0210k73
1650c696J0477j4498R557J639j1623J4737q340k708J2252j4050P496L381j2097
1663g473J3735o479m184J2447j3276O052N022j3137J2666m635o358J3297j2337
1676d660L784O420j3274J1629l133p347J3270j1347K493Q356j3721J0719q24r484
1690g119J4149r710J68R839j3612Q649J212r908J2817q034j427J0314j3488Q063
1704A913K433j1757J3526p186l592J1980j3071N470M912j2062J2108m910n504
1717e740J2132j1482M629N478j2387J2166l997o427J3151j1487K867P403j2941
$$ y = [-192, -5696, 7074, -5411, -42, 5308, -7737, 5576, 499, -5779, 8612, -4528, -1006, 7284, -7648, 4297, 2489, -6792, 7431, -3062, -2326, 6737, -7376, 3066, 2193, -7385, 6787, -3423, -3696, 6781, -7717, 1840, 3479, -8144, 6593, -1747, -4455, 7797, -6253, 1243, 4624, -7473, 6262, -217, -4401, 8046, -5230, 822, 5844, -7293, 5373, 738, -5620, 7677, -4660, -876, 5544, -7730, 3899, 766, -6581, 6689, -4658, -2165, 6191, -7530, 3189, 2365, -7119, 7030, -2680, -2512, 7327, -6285, 2364, 3576, -6332, 6485, -1549, -2976, 7338, -6150, 1913, 4346, -7411, 6115, -1071, -4663, 7317, -5754, -284, 4628, -7434, 4674, -236, -5740, 6392, -5090, -461, 5017, -7370, 4796, 799, -5628, 7523, -3964, -1097, 6306, -6635]
1730f635J0745j590q342J2744r699Q61Q599j3232R210R8r560J2856q426j135R691
1745F185j2973Q228J480j0250J2855p465k340J1037j2577O769L503j1422J2399
1758E429n515m427J1845j1983N116N130j2179J1755m294n988J2342j1426L287
1771i08O172j2286J0872k970o757J2540j0804K053P770j3002J0050m95q707J2773
1785F301r104k64R184j2041Q469Q94r542J2386p476j694J0011j2483P107K544
1799D292j0553J1987o274l687J0835j1670N134M268j1140J1113m481n066J1453
1812F211j0983L556O009j1757J0682k933o406J2174j0378K499P221j2079R535
1825C351j209p639J1997r051O69Q421j2740R026p1q838J2130q167j088R564j2266
$$ y = [-6635, 4110, 2520, -5822, 6922, -2777, -1916, 6683, -6549, 2661, 2759, -6801, 6055, -2371, -3506, 6185, -6788, 1440, 2920, -7330, 5525, -1940, -4280, 6757, -5820, 949, 4452, -6970, 5429, -86, -4513, 7332, -4651, 465, 5595, -6584, 5171, 877, -5111, 7231, -4195, -908, 5264, -7022, 3850, 880, -5877, 6663, -4141, -2088, 5682, -7320, 2730, 2235, -6472, 6301, -2803, -3067, 6117, -5924, 2545, 3439, -6103, 6283, -1193, -2887, 7124, -5359, 1748, 4292, -6261, 5726, -548, -4235, 6600, -5070, 64, 4332, -6808, 4305, -176, -5242, 6211, -4772, -1216, 4793, -6964, 3718, 785, -5621, 6553, -3825, -1326, 5895, -6184, 3351, 2142, -5497, 6500, -2551, -1882, 6539, -6201, 2825, 2754, -6084, 6046, -2121, -3209, 6355, -5911]
1840e911P344J645r821J1887o784k276J0153j1675O046L487j0925J1835n372m280
1854d647J1674j1366M543N211j1608J0631l458n824J1367r918K605O235j1485
1867f040R555j982p212J1622r331J079P959j2021Q796j50q617J2031q047m89Q793
1882E946j1815P397J505r118J1614o813j883R409j1443O547K658j0165J1228n160
1896i3l781J0083j0585M641M079j0514J0640m521m806J1058j0437L485N508j1369
1910f612J0245k848o525J1838r720J768P191j1227R060j666o903J1488q317Q1
1924b147P971j1286Q140K95q822J1645p489j181R020j1197O259J985r633J1224
1938D784n800k997R722j0581N336L126r963J0911m971l882J0440j0554L846N542
$$ y = [-5911, 1433, 3078, -6743, 5144, -1640, -3916, 6237, -5438, 608, 4095, -6830, 5005, -367, -4647, 7027, -4339, 204, 5415, -6193, 4438, 980, -4844, 6523, -3395, -790, 5445, -6040, 3515, 1533, -5679, 5943, -3388, -2309, 5650, -6371, 2425, 2275, -6342, 5689, -2358, -2847, 5946, -5869, 1528, 3033, -6085, 5529, -1284, -3167, 6242, -5201, 1346, 4004, -6161, 5067, -93, -3874, 6209, -4376, 265, 4344, -6170, 4470, -51, -4857, 6201, -4236, -751, 4757, -6612, 3633, 785, -5740, 6098, -3622, -1854, 5337, -5890, 3170, 1504, -5399, 6089, -2228, -2147, 5824, -5462, 2678, 2973, -5849, 5796, -1693, -2874, 6146, -5051, 1208, 3193, -6440, 4784, -1016, -4013, 5709, -4872, 464, 3590, -6373, 4538, -433, -4315, 6125, -4429, -583, 4959]
1952D959j1174J0222k969n710J0903r620K521N966j1058R556k026o824J1548r494
1966c200J351P147j1512Q622j99q488J1442p259r68Q562j0981P047J355q951J1342
1981E310o708j941R453j1196O036K895r547J0429m861l705R883r913M288L833
1995D256r996R724l754m406J0138j0279L553N199j0874R612k168o523J1189q501
2009b830R76P127j0827P960m01o974J0619q021M54P426j0789P592O52q501J1015
2024E478o970j335R106j1153N894K327r079J0252n621k623R129j0127N042L388
2038C708r667J0094m621l736R940r733L878M381r980R615k874n244J0251r123
2052c111J999O138j0179Q498j584o493J0410q415J080O846j0465P485k34p600
$$ y = [4959, -6215, 4007, 1038, -4672, 6231, -3389, -868, 5098, -5960, 3596, 1570, -5254, 6294, -3200, -1849, 5298, -6214, 2408, 2209, -6279, 5163, -2096, -3064, 5498, -5483, 1564, 2919, -6032, 5310, -1398, -3339, 6114, -5082, 954, 3849, -5698, 4731, -130, -3835, 6048, -3865, 423, 4256, -5740, 3984, 230, -4176, 5962, -4317, -764, 4435, -6439, 3173, 1005, -5518, 5671, -2830, -1854, 5273, -5554, 2406, 2005, -4969, 5650, -2371, -1917, 5509, -5280, 2312, 2964, -5537, 5478, -1492, -2827, 6279, -4874, 1020, 3347, -5732, 4520, -1101, -3724, 5405, -4722, 320, 3708, -5959, 4135, -486, -4222, 5718, -4015, -137, 4244, -5736, 3879, 1005, -4239, 6012, -3111, -1112, 5026, -5153, 3345, 1761, -4732, 5678, -2737, -1657, 5189, -5276, 2209, 1975, -5625]
2066e625J0577p109o75P971j0397O707J037q266J0630o365j754R181j0531N531
2080I12K661r202J0303m899l327R433r678M046L826r418R467l807m468R839r184
2095c496K814N052j0211Q837k359n638J0258q195J155O558j0056P778q21o669
2109d993J0024o766k54P361j0037O735N35p446J0222o844r14Q063j0064N682K052
2124C356q636R765n102k902Q596r479M649L013r249R449l744l928R436r313L828
2139b61M400r532R033l114m739R707q225K038N498j0035Q160j181o504J0330p960
2154b385O57O798r847O833J08p298R818o721l39P286r723O278R72p856R855n826
2170a390j869Q393r467N012K693q347R167m380l164Q563r000M021L745q904Q683
$$ y = [-5625, 4952, -2157, -2832, 5139, -5258, 1449, 2486, -5780, 4850, -1515, -3269, 5912, -4619, 912, 3573, -5629, 4674, -225, -3552, 5881, -3797, 249, 4075, -5343, 4124, 317, -4151, 5688, -3496, -682, 4370, -5841, 2996, 637, -5001, 5257, -2938, -1783, 4775, -5281, 2497, 1676, -4993, 5031, -1735, -1989, 5372, -4665, 2070, 2605, -4841, 5381, -1463, -2377, 5686, -4378, 1304, 3356, -5280, 4485, -617, -3519, 5077, -4402, 247, 3260, -5989, 3460, -284, -4212, 5224, -4089, -261, 4139, -5393, 3640, 526, -4213, 5494, -2731, -693, 4805, -5230, 2930, 1749, -4755, 5575, -2385, -1728, 5070, -4777, 2056, 2164, -5134, 4684, -2037, -2376, 4910, -4813, 1465, 2437, -5419, 4436, -1390, -3259, 5134, -4333, 679, 3372, -4975, 4192, -188, -3352, 5211, -3789, 232, 3977, -4927, 3756]
2185C756l061m328Q882q797L053M767r573Q002j928n154R295p892J362N949r661
2200e328P298n81o263R563o854R7O602r121O480O38p164R351n879j229P694r553
2216d249N557J650q017R309m893k360Q139r258M201L214q587Q745l498l657Q448
2231D744q309K955M282q664P889k281m741R334q045J870N394r429P502q47n931
2246d277R303o991L37O533r196O273q3o446R015o266l88O753r224N495J503p291
2262d950Q947n413j655P712q710M363K812q028Q711m223k944Q225q226L531L114
2277C266q180Q360k998m078Q666p793K094M528q663P580j675n210Q754p215R82
2292a582N717q715O607n36o050Q914o268o8O543q865N616Q47o676Q755n282j476
$$ y = [3756, 695, -3633, 5249, -3548, -495, 4272, -5301, 2701, 773, -4381, 4914, -2978, -1616, 4333, -5328, 1970, 1389, -4874, 4689, -2165, -2068, 4534, -4587, 1893, 2531, -4633, 4718, -1161, -2390, 5304, -4249, 1308, 2958, -5059, 4250, -643, -3003, 5136, -4122, 79, 3293, -5294, 3451, -47, -3704, 4744, -3565, -610, 3672, -4992, 2897, 616, -4125, 5209, -2836, -966, 4428, -5001, 2501, 1654, -4277, 5026, -1965, -1628, 4905, -4291, 1982, 1899, -4547, 4468, -1798, -2186, 4567, -4657, 838, 2341, -4950, 3997, -1416, -3071, 4641, -4069, 294, 3106, -4922, 3789, -434, -3378, 4847, -3379, 152, 3266, -4914, 3446, 448, -3630, 5036, -2757, -663, 3865, -4798, 2782, 1107, -4103, 4651, -2564, -1582, 4135, -4580, 2027, 1491, -4559, 4355, -1913, -1981, 4562, -4303, 1313, 2160, -4516, 4239, -1043, -2519]
2308b519P353q624M982J522p249Q485m533k130P516q456M009L004q297Q098k999
2323A62l643Q061p829K573L996q062P389k381m174Q559p383J663M972q891P430
2338B442j172n400Q755o393J48O011q179N396L82o072Q267n449m93N832q060N162
2354A177J050o671Q004m213k110P006q013L736K950p497P686k912l451P646p584
2369c196L023L454p722P401k164m146Q159o992J658M549q128O564j315m792Q031
2384D384o539P27N054q077N995k14n596Q093n575k98N887q004N406P85o315Q052
2400C765m650j422O303p278L948J540o311P516l443k615P448p874L161L292p537
2415d157P260k763l669P511o725K082L606p417O432j449m548P787o362R65M730
$$ y = [-2519, 4834, -3790, 1192, 2714, -4535, 3950, -583, -2713, 4803, -3653, 356, 3360, -4937, 3161, 162, -3481, 4580, -3249, -676, 3320, -4742, 2647, 266, -3908, 4651, -2732, -1069, 3903, -4988, 2442, 1270, -4130, 4625, -1768, -1620, 4391, -3788, 1608, 1990, -4082, 4185, -1264, -1757, 4075, -3985, 1177, 2227, -4444, 3560, -653, -2763, 4243, -3770, -34, 2916, -4581, 3105, 193, -3258, 4388, -3196, -173, 3281, -4441, 2960, 796, -3350, 4809, -2183, -525, 4024, -4104, 2460, 1145, -3647, 4384, -2155, -1428, 3626, -4451, 1544, 1330, -4266, 3827, -1748, -2046, 3841, -4163, 1243, 2028, -4287, 3765, -885, -2307, 3996, -3282, 666, 2206, -4105, 3411, -32, -2647, 4801, -3073, 88, 3380, -4157, 3103, 340, -3329, 4182, -2543, -461, 3145, -4272, 2160, 711, -3837, 3950, -2412, -1447, 3283]
2430C283p324N707n75m686P548n631O9N500p510N157O80n899P245m433j019O147
2446D259p628M291J273o346P438l828j814O083p005L287K456o807O947k609l019
2461c022O905o752K745L482p401O428j784l629O942o007J476M299p149N547p52
2476A328m745P277n647N65M599p183N314j04n088P239m850n13N350p247M464Q50
2492A609n637P120l953j532N964o512L501J813n925O601l069k274O237o404K805
2507C44K682o541O172k059l496O513n970J691L544o687N779j347l880O743n637
2522b149R70M173o685N338n80m471O731m800P2M767o734M520N61n088O596l870
2538f49j178N706o631L800J360n884O356l331j945N938o089K417K359o125O382
$$ y = [3283, -4041, 1666, 1091, -3595, 3953, -1678, -1609, 3891, -3619, 1538, 2218, -3681, 3564, -869, -1888, 4259, -3369, 922, 2195, -4151, 3287, -541, -2355, 3728, -3277, 10, 2466, -4341, 2606, -3, -3022, 3883, -2869, -124, 3358, -4043, 2385, 601, -3028, 3914, -2093, -617, 3682, -3467, 2080, 1328, -3417, 3860, -1787, -1222, 3377, -3806, 1508, 1404, -3684, 3555, -1295, -1808, 3542, -3705, 759, 1609, -4028, 3092, -861, -2393, 3571, -2941, 560, 2373, -3552, 3049, -20, -2294, 3943, -2461, 344, 3026, -3515, 2657, 598, -2898, 3615, -2355, -664, 2880, -3807, 1972, 625, -3255, 3488, -2149, -1179, 2994, -3691, 1647, 1067, -3404, 3327, -1473, -1401, 3366, -3368, 1152, 1713, -3375, 3221, -649, -1827, 3879, -2752, 1048, 2408, -3476, 2880, -451, -2396, 3542, -2547, -130, 2229, -3896, 2486]
2553B486k695k542O264o012K033L084o482N831j234l485O026n256J211L821o294
2568c244N128o80m309O702n124L44M235o220M777j13m888O756m327p59N089o114
2584b747L234J441n524O264l648j491N711n970L224J587n414N974l002j998N877
2599C518n726J965K896o114N700j713k889N957n833J795L453o423N284j280l686
2614c096O369m835M47L804n811M112O9m110N966m170j06M398n936L888N44m539
2630c006O284l984p73N007o041L162J614n604O194l211j886N535n633K470J935
2645B063n234N335k376k595N917n627K069K959n795N256j547l167N776m687J026
2660f27L389n691M414l13l713N986m390k56M347o026M183L11m619N833l825n67
$$ y = [2486, -209, -2751, 3513, -2499, -466, 2618, -3864, 1967, 733, -2752, 3274, -1982, -771, 3050, -3244, 1884, 1204, -3105, 3597, -1527, -1183, 3052, -3168, 1609, 1496, -3392, 3364, -963, -1722, 3367, -2747, 487, 1928, -3596, 2668, -980, -2471, 3240, -2730, 494, 2081, -3333, 2641, -361, -2359, 3518, -2208, -243, 2653, -3461, 2239, 526, -2363, 3594, -2239, -444, 3009, -3414, 1870, 590, -3096, 3273, -1562, -1115, 2689, -3122, 990, 1059, -3051, 2915, -1255, -1361, 3037, -2899, 989, 1533, -3006, 3278, -706, -1479, 3528, -2513, 649, 2263, -3341, 2853, -358, -2244, 3291, -2342, 128, 2063, -3171, 2164, -212, -2807, 3110, -2517, -448, 2511, -3284, 1972, 425, -2742, 3034, -1653, -627, 2762, -2929, 1485, 1172, -2541, 3445, -945, -1201, 3146, -2880, 1303, 1614, -3005, 2828, -997, -1564]
2676a564M845n996L216R18m654N804l357j101M572n275K762J483m824N259k100
2691a2k276N285n048J927K260n019M785j343k749N372m927J261L020n652M738
2706A622q71l489N510m312N42L515n542M229k84l675N060l441n33M404n653L676
2722G58N92l996N020k938q31M547n637K969J541m899N468k093k201M771n185K206
2738I2K260n161M843j959k372M827m512J275K942n354M717j176l183N330m216
2753a647P67L393n300L995n0l742N149l458Q0L638n280L547N0l616M983l130o71
2770a292M030n038K902J063m206M695k474j617M673m833K269J792n006M947j938
2785c3k057M900m517J610K282m930M508r71k865M784l869P00L004n192M131n60
$$ y = [-1564, 3281, -2715, 501, 1419, -3235, 2569, -788, -1889, 2683, -2592, 170, 1653, -3171, 2088, -12, -2288, 2997, -2051, -124, 2136, -2883, 1902, 559, -2190, 3182, -1745, -484, 2536, -3116, 1622, 751, -2738, 2772, -1540, -998, 2517, -3025, 1204, 920, -2755, 2305, -1136, -1669, 2735, -2918, 758, 1350, -2646, 2374, -564, -1395, 3152, -2485, 484, 2025, -2874, 2594, 501, -1700, 3071, -2114, 92, 2352, -2809, 2034, 75, -2297, 2530, -1982, -707, 2235, -3119, 1598, 422, -2761, 2569, -1647, -880, 2513, -2787, 1208, 1158, -2584, 2565, -893, -813, 2825, -2455, 1092, 1142, -2474, 2509, -621, -1292, 2738, -2300, 602, 1665, -2541, 2154, -320, -1937, 2736, -2097, 172, 1964, -3042, 1905, -33, -2090, 2810, -1707, -97, 2185, -2745, 1763, 792, -2073, 2711, -1158, -458, 2546, -2646, 1485, 925]
2801I25l422M936l754O88L147n364L811R7l767M949l238j10L601n065L335M59
2817A228l793M749k529j016M063m855K581J378m308M627j990j764M617m731J871
2832A28K046m683M533j752k469M746l988R54K670n018M059p37k965M960l983M93
2848a006L288m986L540J5l391N209l637JL575m716L023N96l640M485k700q03M207
2865C060n156K536J027l990M379j982j548M213m700K150J862m601M522k077j929
2880b234M757m148J326K341m461L791q37k394M408l829Q65K898m870L776p68l033
2896b412M940l458J32L039m368K934P0l107M464l156l31L406m598K596J040l702
2912b511M474k401r91L839m456K188J204m014M373j900j575M140l974J209K391
$$ y = [925, -2497, 2439, -1315, -627, 2520, -2844, 967, 1064, -2703, 2246, -992, -1102, 2499, -2566, 769, 1228, -2565, 2184, -345, -1361, 2702, -2153, 428, 1806, -2502, 2125, 135, -1629, 2988, -1743, 128, 2174, -2509, 2024, 272, -2197, 2549, -1439, -485, 2185, -2833, 1226, 489, -2476, 2484, -1499, -1006, 2282, -2704, 836, 851, -2540, 2669, -968, -967, 2608, -2108, 915, 1511, -2129, 2356, -344, -1147, 3060, -2096, 440, 1467, -2523, 1856, -126, -1674, 2539, -2161, -11, 1851, -2750, 1772, -305, -2234, 2523, -1625, -299, 2042, -2419, 1372, 535, -1859, 2549, -1280, -415, 2483, -2387, 1389, 621, -2412, 2528, -930, -798, 2241, -2127, 807, 877, -2230, 2234, -922, -1253, 2153, -2445, 151, 1191, -2511, 1963, -438, -1429, 2410, -2046, 142, 1346, -2668, 1705, -195, -1770, 2370, -1604, -395, 1996]
2927A996m457M037q98k586M474m083J173K438m525L577o82k836M704l426J85L212
2943B303m689L172K51l397M806l409mL095m367L050L61l421M401k266j431L866
2959B321m014K025J100l443L713j954j342L859m172J966J621m030M038j800j784
2974a896M105l818J166K433m231L584r12k683M512l566O37K754m313L567l63k844
2990a868M302l064j95L076m259K908Q6l128M088k572o69L648m241K306Q19l499
3006b262M206k396j131L711m026J804J607l646L764j479j601L931m109J581K158
3021B112m391L848j164k325M320l506O34K395m069L199m23k868M339l154J06K848
3037A901l883K672nk747M036k550n12L147m009K601P61l530M185k424p97L395
$$ y = [1996, -2461, 1576, 678, -1908, 2566, -1517, -344, 2094, -2431, 1146, 464, -2372, 2332, -1094, -909, 2303, -2386, 786, 1037, -2360, 2446, -963, -967, 2128, -2239, 811, 1172, -2249, 2152, -114, -1545, 2321, -1693, 332, 1432, -2011, 1702, -252, -1594, 2265, -1907, 59, 1680, -2350, 1688, -112, -1896, 2209, -1609, -443, 1990, -2241, 1343, 431, -2252, 2260, -1306, -669, 2085, -2228, 1339, 976, -1868, 2434, -630, -825, 2251, -2008, 900, 986, -2142, 1946, -626, -1295, 2353, -1888, 418, 1237, -2262, 1944, -452, -1583, 2128, -1898, -94, 1513, -2133, 1631, 152, -1449, 2482, -1627, -46, 2112, -2279, 1569, 405, -1920, 2400, -1106, -472, 1923, -2146, 1053, 630, -2238, 2101, -1053, -947, 1901, -1982, 690, 685, -2062, 1974, -576, -1088, 2059, -1950, 651, 1412, -2118, 2067, -357, -1154, 2241]
3053B241l650J589J337l525L853k078j324L944l711J232J791l813L595j254j914
3068a687L637l673J541J794l639L317r59k281M320l295K41K785m020K824L1k749
3084a813L866k559m24L338m291K666M77l081L552k168r78L727m421K455J117l610
3100b147L574j675j349L775l648J312J773l821L508j123j480L459l514J017K165
3115A826m120L475o02k317L764l265R01K420m233L160k47k649L775k573q1K771
3131B005l901K514M08l163M064k753j97K903l644K114R94l503L707j776j254L820
3147B338l829J695J588l683L369j510j493L734l382J165J449l496L476r06k188
3162a673L616l426J142K036l699L079o02k280L719k880J65K686l699K672J46k626
$$ y = [2241, -1409, 180, 1517, -2008, 1845, -233, -1557, 2387, -1324, -92, 1699, -2114, 1481, 227, -1687, 1950, -1723, -182, 1612, -2027, 1290, 331, -1950, 2370, -925, -684, 2101, -1919, 905, 936, -1813, 2053, -506, -930, 2408, -1883, 783, 1260, -1821, 1731, -437, -1415, 2312, -2109, 346, 1463, -2147, 1427, -248, -1597, 2178, -1470, -158, 1615, -2206, 1302, 179, -1301, 2158, -1356, -339, 1826, -2294, 1181, 579, -1738, 2026, -1239, -338, 2082, -2151, 1009, 762, -1887, 1888, -685, -766, 2005, -1896, 618, 1026, -2137, 1927, -826, -1023, 1880, -1764, 350, 1344, -2159, 1548, -228, -1482, 2338, -1491, 204, 1792, -1891, 1478, -32, -1525, 2209, -1173, -8, 1441, -2055, 1421, 515, -1673, 1943, -1483, -341, 1695, -2004, 1075, 473, -1807, 1912, -968, -803, 1883, -1816, 856, 1002, -1624]
3178a624L557k614k10L165m117K659J49k790L382k157o25L307l799K069Q48l439
3194b239L860j893j511L869l736J374K020l724L193j221j701L703l300J077J798
3209A569l669L321q97k152L910k959M71K559l971K761k2k887L641k546K23K568
3225A920l799K311O53l102L773k239r31L239l303J879N59l060L552j677o92K891
3241A974l413J473J654l411L207j139j771L532l419J068J890l327K974q95k179
3256a782L554k753J60K355l546K961n00k103L306k697N41K302l602K468K63k774
3272a847L590k430l86L026l539K080N79k865L519k082p89L015l302J911Q15l271
3288a976L347j430j236L292l385J158J587l380L084j036j528L342k924R54J754
$$ y = [-1624, 1933, -681, -891, 2274, -1843, 816, 965, -1825, 1557, -600, -1225, 2082, -1717, 352, 1200, -2239, 1621, -272, -1783, 2086, -1650, -276, 1744, -1980, 1213, -8, -1709, 1994, -1306, -229, 1569, -2100, 1221, 324, -1828, 2082, -877, -406, 2153, -1818, 943, 921, -1966, 1675, -871, -648, 1920, -1879, 432, 1085, -2017, 1756, -483, -1414, 1825, -1478, 401, 960, -2100, 1452, -225, -917, 1974, -1439, 34, 1688, -1723, 1484, 345, -1426, 2106, -1313, -245, 1645, -1682, 1292, 397, -1782, 1772, -981, -821, 1534, -2012, 949, 449, -1654, 1652, -1045, -504, 1798, -1804, 664, 927, -1847, 1743, -687, -1073, 1953, -1586, 494, 1073, -1792, 1727, -355, -1144, 1871, -1431, 480, 1295, -1976, 1371, -59, -1295, 1997, -1388, -230, 1357, -2023, 1061, 25, -1503, 1839, -1085, -131, 1623]
3303A623l327K605p4k329L185k564L72K060l133K583l29k344L360k192l59K738
3319A875l482J816M54k578L300j969n85K940l134J556O10k541L077j598j179L310
3335A872l038J273J111l082L606j738j397L213k971R61J733l237K725n59k067
3350a595L171k401L10K097l247K286l15k124L481k225k88K556l341J989K95k238
3366a589L320j996n92K470k842J667O30k892L201j512o86K620k850J268J243l127
3382a667K919j192j336L136k839P35J473k744K604o86j887L114k810O40K122l383
3398a801K531l61j858K878j879q8K065l114K303L11k405L101k178m25K706l041
3414a255J790M55k646K952j625n93K380k794J375P06k646L076j366j022K685k481
$$ y = [1623, -1704, 901, 827, -1502, 1683, -881, -509, 1551, -1582, 1001, 672, -1672, 1688, -504, -863, 1875, -1607, 209, 663, -1915, 1385, -584, -1169, 1771, -1363, 193, 803, -1738, 1339, -259, -1438, 1872, -1166, 107, 1218, -1864, 1742, 4, -1393, 1820, -1151, -190, 1543, -1694, 1031, 472, -1595, 1576, -825, -515, 1582, -1665, 621, 306, -1818, 1663, -562, -850, 1706, -1635, 354, 649, -1589, 1731, -265, -857, 1613, -1229, 438, 1068, -1824, 1377, -135, -821, 1799, -1051, 217, 1460, -1667, 1252, 60, -1276, 1860, -979, -244, 1229, -1515, 1089, 403, -1484, 1630, -1180, -540, 1582, -1801, 730, 369, -1489, 1389, -490, -578, 1487, -1627, 676, 987, -1418, 1683, -495, -920, 1786, -1255, 535, 990, -1656, 1296, -329, -922, 1458, -1336, 39, 745, -1901, 1175, -191, -1213, 1472, -1009]
3430a009P37J611k988K959r43j686K901k432M67J674k588K164m51j782K959k478
3446h85M26J880k865J963o3k116L076j947k91K120k632J804K79k453K689j317
3462c32p00K552k746J369R62k789L098j421j040K543k769J155J142k656K987j012
3478C43j729K914k376O44J683l147K430n93j454K750k437M11J781k764K056q7
3494D25j762K786j880J40J473k487J910p7j722K708j879k39K132k753J543P27
3510A045k486K577j140p81K116k363R47R31k461K550j008j053K504k238O91J438
3526A269k744K391o09j559K892k367K86J720k528K020l67j769K803j743nJ638
3542A328k618J816K7j752K480j706n24K344k734J599L78k202K409j166o39K097
$$ y = [-1009, -272, 1339, -1649, 1310, 367, -1319, 1582, -850, -383, 1291, -1297, 867, 416, -1366, 1593, -885, -459, 1421, -1444, 519, 456, -1660, 1416, -531, -822, 1298, -1334, 470, 749, -1704, 985, -332, -1032, 1520, -1226, 143, 1105, -1684, 1414, -7, -1047, 1496, -1273, -118, 1024, -1632, 1355, 343, -1386, 1528, -848, -204, 1479, -1668, 762, 169, -1285, 1465, -972, -561, 1220, -1544, 512, 425, -1337, 1449, -431, -291, 1182, -1305, 605, 528, -1194, 1514, -365, -604, 1528, -1225, 318, 1045, -1441, 1136, -4, -785, 1331, -1032, -85, 846, -1615, 935, -73, -1126, 1378, -860, -169, 1269, -1475, 916, 307, -1252, 1640, -727, -441, 1279, -1249, 771, 404, -1365, 1438, -305, -310, 1328, -1290, 526, 553, -1199, 1281, -425, -949, 1395, -1339, 260, 638, -1564, 845, -321, -960, 1137]
3558A137k146R34R92k473K632j300r82K630k282P44J082k238K058n13j420K333
3574A188j939N11J498k352J830k61j794K587j769nJ482k388J806J66j581K251
3590A230j409n18K203k768J696J47k041K575j377o03K290k497J195Q50k335K544
3606A182j236q89K241k417J234P72k382K432j061j235K593k064L04J712k543J638
3622B81J94j715K671j871J72J371k337J792N1j754K373j577j05J625k108J437
3638E00J53j870K218j350m58K189k586J220O78k024K368j021j056K210k217Q89
3654a57R94k008K028j104p06K268k046M37J339k200K042n51j155K184j972M05
3670b02J213k232J909k91j547K229j668q4J760k569J811L91k074K572j717O5J493
$$ y = [1137, -1009, -75, 917, -1556, 1076, -224, -1206, 1424, -858, -114, 968, -1270, 788, 275, -1145, 1188, -751, -240, 1258, -1094, 736, 475, -1319, 1268, -501, -506, 976, -1412, 394, 560, -1021, 1230, -179, -697, 1506, -1262, 434, 581, -1460, 1115, -262, -865, 1425, -1072, 123, 973, -1362, 1182, -54, -943, 1298, -1119, 115, 887, -1495, 937, -124, -1359, 1234, -830, -526, 1186, -1357, 281, 475, -1240, 1431, -440, -268, 1103, -1234, 558, 609, -1145, 1228, -349, -454, 1171, -937, 500, 653, -1217, 1001, -349, -807, 1382, -1204, 16, 694, -1330, 1038, 17, -1039, 1171, -1046, -157, 837, -1171, 857, -247, -953, 1315, -731, -294, 1045, -1155, 887, 336, -819, 1365, -607, -202, 1011, -1221, 688, 397, -1150, 1079, -589, -673, 1087, -1482, 329, 720, -1354, 1218, -499, -434, 1059]
3687A059j990J327J86j802K219j335m60K161k219J058N28j770K159r22p35J938
3703A402k050L45J394k182J772l97j137J698j283N0J182j947J750k28j466K146
3719A049j715L5J603j806J240J8j486K007j117k00J462k169J265M68j632J968
3735I90j216m91J852j935Q11P97j708J856j081q80J966j713P50J176k614K076
3751F36m41j077J925j740N86R75j975J571j04j188J699j094j05J244j800J394
3767E06j56j320K018j377k12J624k245J374J42j553J948q06p82J809j781Q90O18
3784F97j706J825r82m47J666j717O14P26j742J992q75q72K094j847K95J165j796
3801i10J357k37j371K130j645L00J269j934J411j37r14J655j317n8J357j978J312
$$ y = [1059, -931, 396, 582, -1220, 999, -336, -796, 1365, -854, 204, 732, -1038, 1121, 199, -536, 1402, -648, -303, 1091, -1091, 681, 284, -853, 845, -438, -388, 794, -1153, 597, 369, -1097, 1049, -666, -631, 972, -834, 406, 424, -1062, 945, -172, -372, 1090, -1079, 186, 654, -978, 990, -226, -717, 1135, -800, 11, 808, -900, 956, -125, -1005, 961, -752, -2, 1174, -1440, 636, 195, -882, 1043, -697, -111, 864, -1111, 460, 356, -832, 867, -227, -332, 912, -888, 506, 350, -970, 1048, -329, -541, 1083, -1162, 212, 354, -1199, 749, -57, -839, 970, -811, 79, 697, -1009, 816, -166, -613, 1053, -664, -50, 676, -1066, 926, 51, -821, 1273, -574, -279, 886, -910, 447, 210, -1161, 969, -676, -376, 893, -1041, 370, 233, -681, 974, -343, -401, 956, -1022, 290]
3818B90M18j820J688o50m60J555j653R17M22j833J917o37r80J963j723K88R80
3835F82j568J570n63p95J657j694M85R73j748J443p9j556K100j605L40J160j748
3852i46J306j29j043J796j343l31J621j796J291J42j309J504j048q8J138j560
3868g95P87L67j361J909r03q01J699j781J000N51j940K148r87m86J620j739O44
3885f8R38j716J334m03q08J572j294L25Q28j582J472j61j284J812j250k98J713
3902A130k043J462j48j264J526r18k15J402j510O78J31j262J823r88n16J640j643
3919g15P55Q53j698J347l17r04J910j733L75P26j830J705n0r99J306j206J55J099
3937G79k073J938n88r37J550j200O7J313j784J177J12j395J951j393jJ443j930
$$ y = [290, 708, -1112, 576, -74, -534, 1021, -632, 285, 707, -1126, 791, 154, -826, 1137, -586, -298, 682, -886, 684, 121, -674, 983, -711, -226, 747, -1001, 442, 363, -1193, 907, -698, -358, 802, -946, 360, 231, -812, 984, -359, -690, 931, -865, 426, 568, -741, 763, -285, -373, 765, -795, -8, 359, -1002, 907, 4, -797, 902, -879, 121, 672, -1268, 880, -107, -593, 1027, -712, -68, 870, -846, 488, 85, -723, 849, -445, -120, 708, -874, 598, 437, -847, 965, -285, -583, 1130, -913, 549, 401, -863, 663, -255, -470, 932, -578, 100, 231, -1031, 792, -196, -712, 928, -715, 40, 893, -805, 542, 225, -679, 1231, -502, -127, 599, -1231, 474, 424, -575, 731, -475, -320, 779, -1294, 644, 56, -881, 669, -531, -464, 849, -935, 242, 354, -1041, 910, -483, -484, 959, -971]
3954i71J069N77j496J544r51l35J548j573P49N17j580J597p38o76J453j374L54
3971b86Q66j596J577m72r40J917j538L41O45j314J146N9j052J494j357K63J070
3988H23j610J349n0j269J408q44j16J081j603R75N93j517J482q10n50J761j907
4005h04Q06N41j471J399n86o13J347j012N76M04j457J662q12n20J398j275L48
4022f9M88j276J392k37j055J534j233K38J011j723J356J91j438J546j045k78J002
4039D04j322J298j03j184J620p23o07J520j681Q22M79j369J461q79j11J339j406
4056d42M81O40j521J628p34o27J342j121L40P04j352J111n53p80J727j607M26
4073c38R88j384J055r2q45J407j005l2R77j298Q23J70j118J403j044n6J202j536
$$ y = [-971, 98, 675, -821, 723, -228, -563, 985, -588, 161, 678, -902, 695, -43, -719, 734, -640, -286, 580, -1016, 561, 89, -851, 1066, -472, -131, 514, -800, 346, 405, -647, 847, -510, -247, 823, -787, 562, 512, -757, 651, -193, -309, 772, -831, 144, 737, -780, 702, -108, -658, 1103, -804, 2, 543, -928, 471, -115, -728, 619, -393, 183, 587, -870, 792, -20, -540, 858, -417, -69, 419, -857, 535, 298, -757, 777, -456, -218, 793, -930, 426, 617, -821, 725, -320, -598, 404, -918, 380, 277, -907, 713, -10, -617, 903, -778, 44, 523, -846, 615, -264, -375, 964, -442, 39, 679, -842, 786, 52, -575, 767, -354, -14, 690, -662, 449, -104, -884, 843, -764, -338, 650, -734, 321, 229, -616, 791, -214, -246, 731, -567, 256, 426, -692, 711, -333, -389, 813, -723]
4091g23Q97K38j136J358n22o27J304j528O81O38j646J606o38m33J119j337N13
4108b36J022j865J537k98j055J808j311K80O76j134J315k59j103J494j040K92
4124A23L61j112P25J44j008J460r64J67P90j344R43J69j160J405p87k61J277j658
4142g30P34O68j264J020m11o89J420r68J68P34j406J227l39o45J259j250N14O80
4160G22j603J287k95p98J357j191L5Q46j048J051n8j419J853j243lJ123j307P00
4178IN23j324J236o73k90J347j543R18K23j257J347n65m75J270j227N26P45j521
4196g31J130k04q90J535j318M54N75j193J151j83p67J226j326J76J311j709J089
4213C26K50j243J590j266J72R43j489R95L41j470J471p59o41J429j648J333K55
$$ y = [-723, 174, 412, -724, 634, 112, -515, 789, -739, -58, 580, -1066, 540, -98, -531, 588, -749, -236, 786, -1079, 458, 160, -895, 913, -398, -118, 558, -576, 739, 480, -623, 871, -169, 123, 484, -628, 97, 241, -767, 693, -271, -104, 686, -658, 285, 454, -706, 699, -88, -349, 928, -730, 4, 672, -592, 428, 17, -672, 748, -220, -52, 682, -724, 503, 164, -481, 778, -472, 42, 722, -881, 406, 111, -687, 670, -521, -486, 360, -688, 363, 305, -1114, 739, -504, -507, 616, -691, 9, 532, -792, 444, -229, -519, 828, -715, 203, 426, -831, 516, -49, -524, 746, -481, 45, 790, -731, 399, 195, -695, 840, -478, -24, 551, -642, 509, 326, -441, 785, -541, -365, 946, -763, 326, 576, -667, 923, -343, -171, 772, -717, 278, 619, -851, 620, -139, -780, 649, -999, 334, 589]
4230E89j148J319r34m28J274j522Q48N88j407J270l42p16J359j085K80Q90j402
4247e67R06k68n90J299j200J00Q76j386J360l71j031J475q99j70J252j571R20
4264A35L07j235J400q24P3J063j533P24N03j338J243q26k73J307j402O18M68j267
4282h57J366l50o75J164j042J29R28j341J060k97o62J300j143L19P35j437J274
4299D71l47p51J069r07K93Q36j525J206nr11J271r74j20J245j666P01M46q31J223
4318G24r13k93J315j481O61N32j353J100m23m78J360j218M26N80j407J254l72
4335A4o63J444j377M72Q00j491J148j24j001J574j069K01N67j348J538l77p87
4352d79J267r28n06J267j111O11j13q70J187n57R5P77j106N45K25j016J279o54
$$ y = [589, -559, 760, -174, -602, 672, -850, -2, 586, -821, 449, 107, -609, 750, -335, -55, 835, -567, 339, 71, -519, 780, -420, -320, 556, -830, 530, 159, -872, 603, -296, -466, 786, -785, 135, 442, -793, 607, -217, -144, 919, -614, 110, 613, -725, 518, -308, -581, 726, -676, -58, 410, -857, 509, 159, -516, 648, -394, -265, 663, -678, 382, 85, -577, 723, -420, -101, 634, -803, 471, 124, -627, 442, -465, -172, 664, -861, 345, 340, -571, 700, -274, -394, 851, -815, -114, 332, -499, 724, -189, -482, 833, -648, 13, 545, -808, 292, -131, -609, 751, -467, -41, 539, -868, 386, 14, -649, 795, -582, -110, 690, -801, 347, 223, -778, 796, -273, -72, 495, -853, 685, 308, -479, 788, -140, -646, 621, -490, 121, 8, -862, 325, -232, -137, 640, -466, 79, 304, -712, 567, -87]
4370h7k08J203j488N44M47j313J292k97l47O75q80K99O89j280J244l27q30J489
4388H25j217L95M95j099R69Q4j127J418r85l9R25j361R66Oj258J875j108m2Q16
4407E38j394J152J83j235J236m82n26J586j562N69L47j415J675o64m61R70r60
4424d43M74M99j248J193m95m69J179q12j45P73r54Q57k59p27J305j013mR20j455
4443h24R94L46j194J341r31n7Q37j201P31K32j055J408p65m14J045j051O43L10
4461C95j193J208m98l72J189j481P08R03j733J298n34k40J098j045L49K76q61
4478e33R90k75r15J502r79j02P95j096P94j08q72J608j108j92J062j145Q25J89
4496D40j005J237o91n9J054j355L13N81r93J025m55n13J209j240O96M73j350J068
$$ y = [-87, -295, 908, -580, -36, 411, -902, 390, 93, -254, 421, -459, -160, 529, -751, 493, 166, -664, 825, -392, 3, 498, -601, 368, 452, -675, 743, -242, -281, 644, -717, 249, 255, -1003, 872, -236, -278, 538, -856, 296, 479, -756, 480, -2, -528, 1058, -504, 65, 412, -1003, 672, 8, -453, 517, -443, 31, 530, -718, 475, -20, -489, 690, -122, -267, 506, -448, 409, 150, -577, 728, -285, -289, 631, -824, 170, 516, -678, 663, -268, -325, 512, -689, 42, 274, -781, 627, -138, -552, 493, -558, 85, 395, -798, 410, -88, -460, 729, -752, -44, 859, -874, 424, -110, -350, 748, -297, 52, 328, -533, 457, 182, -733, 769, -210, -312, 483, -613, 181, 73, -799, 809, -299, -491, 571, -574, 251, 440, -565, 672, -19, -78, 976, -379, -66, 515, -478, 547, 92, -421, 788, -452, 244, 717, -633, 435]
4514D35l15q81J563j591N59Q30j373J266j73o87Q89q54j81J052j134Q97j63q62
4532g23J359p53j08R82j328P17K42j162J482q22j60P69j284R59K15j244J460p99
4550a98j66J178j248N79L27j367J218k67n77J248j160K49N91j055Q81k56l15J154
4568H16j350L72O64j073Q59j96o34J072r24l4J156j394R53j66q04J157q02m15
4586g43J420j446P90L63j133J489q12k57R09j021K72N90j192J373n42n98J461
4603I23j296N31K69j095J275m69p99J372j045m0R75j282Q65n0p59J424j137P5
4621b63Q10j175P90L33j207J248p78m9J078j410Q13J93j078J386m61o87J198j217
4639d76M85O27j375J256n05n10R84j096Q43P2j006R32j76q25J592j164Q3Q79j296
$$ y = [435, 120, -761, 802, -789, -230, 600, -773, 493, 320, -367, 522, -332, -513, 539, -595, 302, 139, -723, 636, -117, -225, 757, -571, 146, 388, -774, 708, -114, -274, 495, -789, 170, 385, -859, 601, -198, -364, 814, -434, 145, 472, -895, 323, 56, -521, 727, -433, -184, 407, -648, 233, -23, -338, 816, -534, -162, 502, -571, 288, 92, -542, 530, -394, -428, 728, -666, 287, 121, -683, 474, -328, -743, 677, -769, 21, 384, -749, 740, -72, -329, 580, -441, -169, 421, -771, 602, 60, -538, 923, -373, 158, 427, -668, 607, 138, -661, 711, -334, -374, 601, -681, 184, 134, -625, 799, -338, -263, 547, -628, 162, 495, -712, 536, -242, -291, 787, -623, 190, 383, -695, 691, 230, -457, 741, -476, 9, 636, -739, 517, 12, -498, 486, -610, 233, 305, -701, 231, 55, -770, 822, -342, -259, 620, -676]
4658f76R24j80p24J220q27L8Q91j378R60l29p03J403q51l1R12j134N90J11q44
4677f28J314r08j49J030j481R53N08j428J110m89l0Q25j039O10R5p00J019o00
4695A2p09J319j120N47M70r04O68K58j166J230j019J41Q56j251J133m21o98J254
4713F00q69K1P07j195Q21Q6q43R86o72m5J159j311O05M32j052R75n19k55J126
4732G57j097L64R0n96N92j1o61J478j195R4R00j384Q32r3o34J515j318K79N56
4751D68j216J053j49p90R18l58NJ042j528N88N58j205J444q96k10J035j165N88
4769A82p7p42J231o33j65O65q22L84M42j085J064n11l75J261j318O01K61p24O73
4788C12l50l34J062j114L01N55p79M84J47o47J049q79k5Q62j419R98K3p50J101
$$ y = [-676, 248, 68, -656, 564, -263, -225, 666, -712, 248, -81, -784, 619, -232, -263, 649, -485, 105, 216, -628, 686, -222, -371, 659, -822, 131, 639, -789, 321, -168, -198, 627, -412, 198, 293, -407, 612, 12, -697, 622, -498, 49, 519, -385, 283, 541, -625, 605, -414, -273, 583, -668, 465, 44, -654, 600, -269, -248, 459, -736, 85, 171, -672, 314, -358, -403, 756, -555, 50, 482, -570, 405, -114, -369, 757, -340, 24, 114, -482, 110, 99, -562, 916, -279, -185, 715, -669, 163, 70, -564, 951, -367, -88, 468, -748, 305, 156, -634, 284, -74, -69, 973, -555, 33, 591, -614, 830, -66, -276, 759, -406, 182, 105, -637, 594, -39, -204, 461, -361, 23, 465, -620, 444, -67, -442, 819, -499, 102, 363, -361, 312, -38, -372, 690, -424, -123, 432, -347, 137, 284, -363, 686, -193, -218, 644, -775, 223, 246, -504, 597]
4807E97j089K31Q62j080N59K56j037R32n54L2R97j213N73O1p52J177n08l28R69
4826F85j051L06L95q75Q60l76l3Q05j015J40N55j287J636p64o09J177r14L31L71
4845C37r22Q01k88m48R97p04p9R30j282R08j28o00J026p41p6J000j146N95L19
4864D99r65Q66n45j58J024j268L77M43p22R20m75m82Q61q70L84O04j435J398l85
4883G1o40J191q36j72J089j392J106J33r19R51q09j62J122j106N38L43j288J207
4901D27o43J30N05r01O95J47p91J123q27l53P98o59L8O77q95J027n10k65Q48j056
4921d85O41J87p29P79oq61P89q05L88O19j211R89m7q87J189n86N2L10q63N75l1
4942Gn44R11n90q9P89j006O61J00r53J632q00l89J029j134N34L2r16R20l30k24
$$ y = [597, -492, -261, 601, -479, 80, 336, -701, 231, -323, -291, 706, -507, 66, 127, -625, 552, 44, -284, 685, -366, -60, 335, -540, 320, -56, -89, 716, -299, -159, 396, -891, 745, -19, -628, 549, -365, -34, 337, -585, 216, -72, -520, 477, -227, -306, 624, -658, 250, 122, -478, 548, -193, -269, 731, -415, 180, 499, -466, 400, -145, -303, 721, -547, -170, 273, -449, 471, -4, -486, 375, -495, -111, 493, -942, 456, 71, -569, 622, -214, -386, 703, -689, 417, 550, -369, 582, -227, -389, 733, -373, 165, 508, -780, 427, -216, -86, 419, -482, 213, 360, -431, 692, -135, -488, 310, -349, -311, 366, -529, 498, -12, -277, 571, -485, 156, 343, -386, 393, 387, -474, 315, -490, -102, 517, -694, 295, 248, -639, 550, -36, 16, 326, -537, 38, 7, -537, 374, -216, -305, 484, -522, 139, 239, -714, 918, 118, -271, 758, -376, 158, 190, -726, 194, -136, -360]
4962c60J001j017K87O03j328J211o49j95R20j050N68L28q58O53o3l31R26j027
4980c81K81P85j053N58k8p21R95j020K32J017j269N67N89r43R76o94l90J298j333
4999e34O66J3q44J094n46m12J407j302M26P74j218Q60n93k81J051q07L17M54q89
5018c64Q02j87n75J090r14J19N90q46N86l06n59J108p52j00P36r97P21j9o26J042
5038E49j113J92R86j092P47Mq53J207n86k29P25j195O66M44q70J109q44j51J010
5057G06j056K86L10q33J303n80o70J025p19j81Q74p85M12j56m61Q35o27J70O19
5076D72j063J024p8p89J007q41J35Q01j048N85M2p85R81n44k04Q33j182R34Q9
5095C69j150J101n74l5R06j170L75M74r06R72k27q33J191r91M33N66q70N64j29
$$ y = [-360, 641, -376, -89, 514, -814, 397, -252, -447, 473, -577, -9, 319, -539, 114, 51, -280, 646, -381, -100, 685, -368, 190, 162, -559, 436, -584, -352, 665, -604, -37, 552, -391, 585, -109, -499, 799, -534, 132, 145, -699, 395, -151, -563, 844, -458, -32, 742, -476, 384, -209, -490, 561, -246, 71, 525, -364, 438, 251, -324, 766, -148, -29, 561, -285, 301, -5, -564, 544, -208, -308, 428, -569, 152, 133, -493, 549, -564, -372, 614, -478, 269, 273, -580, 627, 41, -188, 537, -658, 8, 452, -418, 691, -153, -304, 706, -350, -64, 246, -587, 716, 136, -534, 491, -228, -409, 465, -320, 92, -64, -525, 310, -317, -147, 472, -591, 433, 355, -434, 573, -268, -133, 668, -380, 205, 247, -538, 443, -101, -305, 528, -654, 280, 369, -781, 320, -254, -289, 617, -553, -178, 296, -610, 362, 135, -698, 493, -498, -65, 501, -369, 195, 66]
5114F6m67R57q92L60M88j095P17J22p19J287r69k23Q99j062P23m4o67J231r74
5133b62k52Q66q85P70m1p70J053p58k85J163r71M51K92j015J067k81n75Q61r06
5152d78L49N37q77Q97l89p06J082o62M52L02r97Q17l58k74R07q32j75J167j423
5171f61R03O9q81J135r66P8J185j591Q57K47r54J207q20j09Q68j109N76K63j002
5190g05J084k53o01R55j033P82J34j083J055m69l86R14q67M83N68j186J023l71
5208D4m03J023o79J60K05r71P97j80m34Q61o00o5Q16j010N23Ko37J109p80O8O30
5229D79j051N71J20o34Q44n10k39J152j143O82K77j090J153n11n19J255j135J64
5247a35N61j080J127m28m57J055r47R6P96j217R76k67m46P53n82k1P06j094J032
$$ y = [66, -401, 556, -336, 24, 512, -583, 134, 256, -463, 824, -145, -368, 531, -531, 192, 148, -519, 712, -262, -514, 352, -533, 237, 196, -574, 479, -279, -564, 599, -372, 79, 371, -644, 423, 142, -433, 428, -478, -129, 408, -469, 428, 39, -667, 415, -247, 205, 507, -490, 327, -31, -305, 602, -230, -405, 762, -661, 242, 311, -570, 565, -401, -323, 862, -729, 128, 375, -579, 628, -192, -301, 567, -542, 34, 297, -705, 379, 126, -475, 480, -553, 229, 363, -720, 335, -134, -520, 394, -473, 10, 578, -608, 415, 44, -359, 664, -15, 145, 350, -621, 176, -4, -438, 423, -177, -242, 574, -436, 87, 89, -548, 561, -219, -151, 479, -572, -1, 119, -515, 329, -181, -420, 732, -411, 271, 548, -542, 611, 100, -419, 836, -299, -135, 426, -654, 473, 45, -412, 643, -304, -208, 588, -629, 347, 80, -366, 387, -195, -216, 490, -604, 428]
5266D28l61n39R52o19o2J023j357P61j03p60R68k39m11Q24q58K08P21j098J053
5285E31n74l25J141j094L42M09j155Q27j63m57J078j032M62N10j238R13j9p68
5303f12J162p92J16Q18j122N87J83o93R68q00QO47j150J124q1r58J090n05n02
5322e12J138j315N59M54q87R13n40k27Q33o61K28L12q99J108n75l34R48r50M39
5341C2K84r30R04j12n86J048r08K1Q17j277Q36j64l38R37q23K7R01j265O06K78
5361B88q32J218j103M2J062j076N23%p37J197l32m63Q97r75M93Q9q35Q68j33m63
5381b72J117j442N79M99j292J064j27n94J153j174N03M52j270J175l93l89J104
5398F93j163K54Q28j229Q89K3q46J052o94QQ53j195N46K85r15J097p81o0J014
$$ y = [428, 67, -472, 480, -139, -201, 822, -535, 226, 123, -637, 331, 92, -319, 505, -353, -145, 576, -522, 531, -43, -368, 773, -321, 21, 430, -725, 102, -61, -518, 560, -472, -10, 500, -738, 175, 156, -612, 550, -242, -126, 692, -430, 157, 340, -353, 615, -185, -177, 470, -680, 444, 363, -595, 495, -10, -512, 626, -689, -130, 324, -563, 350, -190, -417, 416, -245, -17, 295, -604, 504, -71, -405, 543, -407, 32, 316, -614, 290, 178, -408, 640, -268, -247, 570, -707, 129, -35, -373, 564, -259, -232, 669, -596, 10, 288, -544, 674, -429, -387, 675, -401, 122, 122, -615, 582, 250, -213, 684, -291, 202, 291, -544, 324, 191, -272, 845, -597, -18, 481, -811, 253, 126, -468, 685, -489, 14, 466, -804, 371, -22, -411, 693, -470, -216, 612, -617, 272, 295, -551, 501, -193, -185, 668, -527, 19, 304, -611, 486, -295, -355, 659]
5417F59j127M00L81q66Q26l60o8O07r57M08N52p84O11l90k33J002q69R3K84p12
5437e43R38l38o48J065o80L12L27j042J087j98o24P16o85K13P48j251P32M7j114
5456i38J302o88Q8Q61j104O90J07q57J232r36nR76j146N39K33p20Q16o52k97J154
5476F55q94K00L75o51M91q4m07N89p86K86Q62j219J052m01r32J448p21R8M63r16
5496d92P40j4r31R98m49J78K87p13N71j3r02J124m33k98Q31j026N02J41o37O91
5516A55j34q05J297j073L27O91j170J126n06l32Q73q22J54Q23j366J075m19l73
5534d79J239j061L37N91j019M96J46r26J203q88M45M22j038O47K03q47J155r01
5552b75J05N17q68O62J85r46J137p17k00Q12p87M42L31j207J361m84m91J047q47
$$ y = [659, -468, -68, 313, -553, 273, -87, -155, 452, -505, -97, 455, -329, 282, -108, -341, 661, -208, -115, 169, -543, 395, 57, -591, 474, -206, 106, 433, -609, 478, 280, -344, 372, -313, -100, 648, -603, 129, 176, -938, 364, -324, -236, 625, -479, 211, 318, -539, 693, -243, -248, 728, -418, 121, 354, -366, 450, -202, -499, 655, -239, -39, 336, -315, 176, 92, -315, 274, -512, -226, 636, -583, 469, 68, -864, 584, -137, -39, 424, -492, 248, 234, -697, 301, -148, 30, 317, -396, 175, 162, -740, 384, -49, -347, 484, -542, -40, 101, -536, 155, 21, -784, 513, -560, -233, 458, -712, 414, -92, -424, 449, -373, -219, 604, -762, 313, -106, -479, 760, -301, 36, 627, -392, 104, 250, -676, 527, -361, 84, 506, -532, 115, 318, -529, 626, -275, -170, 347, -521, 141, 326, -620, 517, -200, -400, 412, -375, 67, 398, -809, 552, 68, -423, 624, -223]
5571b23J04M63r30J063l38n51R38j123O25J86p83M35M10p38J032p13o9P45j031
5590d98O70j1p82J080o58O3O12n39J97N3m32Q27o13r5P00r43N56K15j071R16j84
5611F3l09P13p21L11L32o05O35m13m13J027r67L89K30r97J325l69o57J015p71
5630a82jM84r66R23k82n33J118p21n4N79p43N81K68r17J087r01j18R68j065N64
5650H9N0q22J063m91l44Q79o59J59M06p76J069m06o94J067p07QP68r63M68J8o32
5671d50P70p76K73N58r31R14j65m09P76q39J71M66p28O17M2q10J042n70k56P40
5691D35r97N56L57r64J089q48K24M39o69O12J75q94P37l84Q7K78n70M34R5r36
5711g44J034m01l22Q82j107O56M18j069R92k35p21J144p05r6J006j184N26J26
$$ y = [-223, -119, 344, -586, 477, 139, -412, 526, -597, 28, 214, -569, -134, 276, -462, 570, -143, -212, 533, -498, 172, 161, -621, 459, -199, -136, 476, -63, 134, 187, -245, 582, -31, -126, 574, -369, 187, 402, -669, 247, 63, -246, 467, -254, 57, 389, -216, 419, 6, -407, 620, -347, 42, 272, -725, 600, 231, -426, 589, -182, -183, 301, -665, 258, -24, -557, 561, -160, -214, 365, -378, 203, 471, -446, 641, -260, -378, 590, -475, 89, 139, -683, 380, -111, -455, 424, -235, -76, 330, -446, 623, 217, -477, 590, -117, -109, 659, -304, 164, 182, -450, 320, -456, -183, 375, -556, 358, 193, -216, 560, -279, -108, 358, -370, 247, 289, -521, 521, -49, -305, 435, -562, -6, 351, -613, 476, -372, -148, 291, -378, 234, 409, -485, 252, -132, -45, 233, -337, 97, 192, -744, 290, -111, -433, 449, -658, -2, 416, -653, 339, 104, -617, 527, -178, -274, 732, -452, 74, 200]
5729B00p86J205p74k7Q06q70N16k76l52O73j37n39P99r09O44po25Q58o60j99O17
5750A57p97O01J83q71J187l10n99Q25p41L00N23p82P64l18n27J011j015L18K43
5769A52n23O69k33m19Q08p16L03L74q99O68r0o63R44n65K63L45p13K28M63p59
5789c63O54m24j24R70j213L86L13n18P71m83m82R99r45P02J93j056J059n36m57
5808e54R40p93L09M63q53Q15n51j75R51p35J42L40q07R09l28m00O73n63L2P35
5828E50j188R60k6p23N57l42J01N57j037O55L39p08J001r31q0N25n84N90K1p23
5848d86J018o53k58R95r04L20K54q16R23m16j08N02o19L63J49p62R12l98m18R52
5868E50q06J2P89r56N60o1q17J112m99n0N18q50M37M7m06P21j09m45N05q54P14
$$ y = [200, -586, 619, -155, -182, 624, -246, 270, -6, -358, 315, 178, -361, 438, -471, 173, 166, -459, 399, -261, -460, 157, -640, -39, 144, -727, 460, 150, -449, 376, -365, -65, 458, -324, 440, 122, -405, 606, -409, -91, 152, -371, 298, 65, -354, 454, -262, 41, 415, -484, 184, 94, -569, 375, -190, 73, 418, -295, -67, 396, -363, 291, -133, -257, 713, -500, -114, 199, -319, 452, -31, -513, 486, -459, 243, 436, -620, 439, -97, -554, 386, -407, -98, 365, -488, 327, -224, -399, 552, -183, -41, 299, -508, 401, 73, -327, 346, -217, -185, 550, -638, 322, 296, -427, 130, -212, -111, 446, -591, 64, 403, -305, 696, -235, -315, 210, -374, 216, 237, -486, 532, -121, -379, 616, -288, 32, 286, -530, 393, -23, -131, 371, -248, 115, 264, -498, 414, 16, -402, 550, -256, -244, 545, -411, 149, 88, -729, 383, -116, -166, 352, -498, -61, -14, -420, 301, 192, -253, 252, -602, 112]
5889A12J25p89R28m17p9O25j079N92K17p21R13k39p23R15m49J39om47Q40m78l43
5910c64O02o12J28M07p33R54k95l76O35p44K70M71q05O13j65n87J321p48m04J030
5930E98j099Q48k84m63O26m34K00L20q31L47L56o82Q60n59j54R15p84N6N15n59
5950b08K67P7r5L09l84o9P02q83N59l21k84P33p01M13J94q31N51J87l06L79l74
5971h5J04K80p59M90K27r46P77j16k03O03q37P79j56n65O35m85J41P20r16O81
5991C69k57m34P02l93l25O88o50J97M51r16P97j42n76Q39l96%K59o14N49j32l3
6012a7M06o60K2O81q36O16O8m33M08l25O5K46n27K89K03m18N33l55j99M42n84
6033c75J36M31o36P90n32k76R66q30J67N69q29N68P8p59J105o59q2L94n18N00
$$ y = [112, 237, -552, 376, -41, -120, 505, -574, 18, 235, -486, 427, 188, -535, 380, -69, 70, 64, -383, 457, -21, -364, 238, -374, -246, 161, -572, 382, 87, -289, 346, -398, -128, 343, -462, 151, -14, -601, 720, -28, -432, 598, -501, 347, 63, -400, 226, -208, -8, 312, -519, -172, 184, -498, 362, -197, -351, 564, -220, -164, 351, -208, 59, 136, 41, 350, -34, -103, 599, -284, 275, -46, -330, 403, -298, 115, 309, -522, 29, 216, -90, 289, -85, 19, 299, -460, 30, 257, -689, 88, -28, -231, 372, -465, 314, 158, -407, 228, -257, -116, 604, -312, 369, 112, -322, 380, -13, -338, 350, -300, -103, 348, -568, 229, 87, -489, 350, -46, -46, 213, -401, 148, 16, -17, 389, -271, -249, 432, -404, 212, 280, -153, 255, -70, -5, 241, -286, 3, 206, -212, 321, -34, -233, 209, -375, -239, 192, -444, 346, -186, -462, 504, -326, -159, 410, -419, 149, 227, -532, 573, -86, -168, 226, -292, 208]
6053B08K0l96Q62p27MN45q85M98o9m29P82n79P7L88n60K33K08n64O57n01j77N68
6075A63l51L42L6p50P18j40j14M87o33N63K67r74P49m11j88O64p91M85O8n78O73
6096B85k57k68O07o18J27L16p41O15j45j98L63j44J00L31o69L40K5o22J080o77
6116a50j13Q91r25M28K25m55P85q57j26R71j103N59L68j137J033j94n26N37m87
6135b76L92N6q27J049l64k17N47n85P4M14p03M38K67n12P24n09q3M40p24N22R1
6156B14n86P41k80k50N73r02P07o7j96K46k94k02Q68p94j87N36m48O14m54O2L69
6177B70l63Q9M03r46O94l80J41K02m38M18k4j88M49n02j54Q12p32L8L85o19O17
6198A72j04k01L10k28J73J0l95L01J03m38P69m95m31P02n59M10J79n44M86l48
$$ y = [208, 228, -168, 694, -33, -29, 516, -369, 129, 60, -369, 413, -166, -89, 299, -261, -28, 180, -384, 273, -228, -405, 163, -188, 154, 190, -560, 158, 18, -96, 391, -242, 321, 588, -386, 363, -48, -236, 428, -363, 122, 190, -388, 285, 28, -240, 367, -251, -124, 192, -549, 66, -79, -277, 86, -58, 42, 373, -296, 44, 69, -553, 527, -150, -263, 628, -297, 131, 356, -99, 686, -171, -297, 674, -429, 130, 498, -639, 394, 200, -326, 211, -276, 116, 172, -655, 394, 30, -187, 360, -225, -151, 263, -440, -2, 265, -247, 477, -32, -115, 325, -399, 123, 214, -372, 369, 89, -161, 412, -490, 217, 150, -46, 200, -94, -296, 572, -222, -409, 127, -321, 293, -161, -99, 270, -93, -4, 399, -547, 147, -233, -92, 110, -328, 90, 66, -122, 327, -175, -329, 483, -249, -211, 174, -445, 172, 68, -133, 177, -51, 122, 132, -263, 38, 141, -297, 472, -23, -454, 248, -311, 99, 278, -266, 220, -128]
6218a28p0L64m28M86L3n89M59n1l69O07n45J93J25o81P79m20k2M31l21K22K79
6239C54o62M42M7k73N77o90J57N29r03Q74n93O2L21l95Q1M30p50L90J92l31L93
6260B52l87j40P30q68N22L13p76Q61o54J07O21q40K16J39l98M56k56n0L63m88
6280b77J38L62o94P38k87j07M85p03L53K66q23Q33j80o73P34l55J68M62p70L60
6300C0J06m93P20m34j10O30n32J40Jl90O38l79k5M52p77M74K21n22N39l98k02
6321c11N00m02J72L00p88Q47j18o35Q17o89L26K33n60L74pk23O92o92J06K67n83
6342c74M90K07n80L71k23K21L20n80L10J81o00M55m83K29N01q15M52J80m95M09
6362A76k48j8M22o32M44o8m42P64m72j56M80q56N94N14j021O57m05j67R56p17
$$ y = [-128, -198, 166, -262, 224, 257, -332, 127, 76, -293, 314, -231, -38, 87, -594, 185, -235, -257, 174, -147, 75, 354, -308, 134, 181, -92, 485, -205, -48, 481, -422, 452, -141, -79, 242, -153, -72, 358, -392, -2, 190, -141, 252, -135, -275, 455, -413, 109, 422, -354, 507, -147, -40, 581, -259, -43, 96, -302, 154, -102, -152, 211, -277, -139, 223, -471, 267, -20, -127, 358, -345, 8, 274, -549, 284, 104, -569, 165, -190, -22, 440, -330, 30, 136, -357, 363, -71, -181, 449, -83, 57, 58, -332, 306, -73, -98, 354, -423, 51, 272, -250, 289, -109, -311, 189, -213, -41, 259, -529, 318, 200, -435, 382, -307, 19, 252, -308, 66, 59, -164, 528, -164, -58, 209, -374, 116, 323, -257, 114, -109, 112, 432, -148, 162, 343, -257, 198, -285, -56, 445, -370, 82, 262, -233, 176, -72, -90, 332, -300, 144, 76, -366, 398, -74, -230, 250, -606, -12, 502, -519, 138, -267, -434, 522, -195]
6382a95J10K80n81N20l4l85P14p16J07M45r52O52M7k53M88m27k18O62q14N42q0
6403h8k16P43p76M32K43q53M59K37n80O29l43n6N29o61M19O1m06M28j56l37N88
6424B96n65J46K46l91M75k97l56R09j027P61R6n60L95k82k21R22p60J11P08p93
6444a87N47Jo47O42n04Q2L71o21O40N6n99N68l81J44L84q76N30R1p05N39m5l04
6466b74O32m89K32J92n50M11k77j93Q17q45K59K25m84M12j42p2L78m16J98L84
6486C98q74Q35j46m28N92n30K2O01p66K35J31m83O86k22k51N24r69Q03K61q66
6506d47N93k20N8M37p93K49L60p21R04m53q5N47q90M56J34n16N90k28l44P93n68
6527a44K61M17p75M15j79k71P12n36o9O61q66O37K2m73N57m81R3O98r04L63k43
$$ y = [-195, -85, 195, -386, 134, 100, -285, 429, -287, -180, 265, -687, -35, 12, -241, 247, -180, -398, 264, -550, -8, -88, -304, 439, -337, 95, 338, -515, -56, 181, -399, 230, -113, -169, 360, -301, 118, 179, -227, 201, 45, -292, 296, -269, -123, 123, -268, 207, -90, -446, 463, -564, 197, 293, -267, 128, -154, -375, 547, -213, -102, 606, -187, 360, 361, -286, 356, -148, -66, 305, -316, 324, 380, -219, 349, -32, 112, 496, -380, 150, 241, -464, 75, 30, -274, 358, -131, 101, 293, -257, 154, -123, -316, 501, -344, -85, 140, -344, 68, -74, -146, 232, -184, 14, 398, -476, 359, 213, -215, 377, -153, -131, 470, -296, -61, 70, -413, 273, 51, -200, 324, -645, 158, 419, -447, 146, -74, -16, 421, -372, -123, 237, -484, 420, -33, -118, 429, -461, -5, 129, -387, 203, -25, -369, 424, -144, 117, 534, -241, 174, -5, -276, 436, -100, -169, 492, -374, 263, 285, -188, 369, -112, -19, 679, -225, 138, -105]
6548a05n7L96k03j89N69q74N68L46r57R30q5m85M04p19L97L11o44N57p9k86O28
6569D23m60K5L4l61M18o1k51P19o47NK60p26R00q1o37O43n33O5O01p32L61K05
6591A70n57O48p04K13M20o15O00j8l92P16o22k85P35o75K69L30o63O91k85l28
6611c52O19m10K93K39p68O73n24O8N24n82J57J41l15K93j54j29L36n25M85J26
6631A95l96L30J02p17P50m17J08L78o60L81J28m55P22o36qL20l67J78J11j77L57
6652B27l97J1O57q60M96q2m47O79l83j4L32o00L75r2l37Q03m04j50L56n75K33
6673a72O67r40N39J41n66Q50o81J69K18n10N10l5n11M84j46QJ33j97J98J44m68
6694a65M53n7l71J5l6K84k3k90M33m16r9Q15p78J43M50p54O14J3k06K81o58J98
$$ y = [-105, -162, 234, 31, -158, 411, -463, 105, 451, -506, 424, 339, -146, 258, -461, -64, 247, -397, 160, 81, -205, 423, -37, -12, 22, -339, 79, 18, -233, 486, -161, -156, 104, -622, 278, 197, -440, 203, -330, -265, 336, -396, -35, 170, -387, 261, -443, -230, 190, -425, 175, 157, -235, 481, -141, -426, 309, -366, -97, 233, -430, 261, -24, -352, 267, -143, 150, 389, -379, 294, -230, -162, 362, -220, -63, 78, -237, 56, -98, -227, 109, -416, 69, 195, -201, 129, 231, -486, 264, -153, -45, 333, -327, 54, 182, -273, 449, -187, -195, 125, -242, -64, 47, -130, 227, -170, -159, 498, -362, 134, 52, -395, 284, -99, -113, 219, -381, -6, -98, -435, 368, -36, -186, 170, -405, -172, 495, -445, 94, 235, -331, 519, -162, 7, 225, -285, 225, 190, -321, 163, 17, 25, 158, -39, 159, 303, -165, 288, 231, -140, -125, -161, 123, 100, -190, 243, -173, -272, 543, -235, -92, 358, -396, 218, 231, 25, 306, -352, -154]
6716a54N57n95J37K27p65R51n62Q3N01o82L12j13j91N84n71K01M51n50M33P5p18
6737c89N86m13N3O01p25K79J13k82N04k98j84N28o33O33k08k70L27k26j23L32
6757B05j24j04N3l24M98j85k97O10n04K59K62o15N42k01l24M74k87j71O58j051
6777f26Q38m0m78P91r07K62L00l68J66j24j43L51k11L14M0m88M45K77n90M37j04
6798A42n01N58m84M72L8n57O22n53j53O12n02L59L63p25K56rj61N41n85J08N17
6819C58p53K91M9k18O47m28j7R5j81L27p7n21N28j82k7N06m89J04p4n02Q72j99
6841A09j55K56o06L81K65n46N11k08k76K48j3k19K81n96N61r3k05P56n68L65K43
6862D91n74J95K3l89N35j97o6J08l95J40n5q6N59m61K10K08o47N83k64pK85j39
$$ y = [-154, 403, -192, -55, 172, -593, 358, -204, -121, 380, -302, 10, -103, -294, 290, -281, -80, 371, -179, 254, 329, -389, 197, -216, -163, 438, -287, -8, 105, -177, 327, 29, -155, 373, -260, 373, 165, -105, 222, -4, -127, 205, 81, -23, 30, -294, 204, 19, -278, 332, -172, 87, 349, -266, 276, 75, -249, 225, -62, -233, 425, -626, 212, 172, -306, 485, -422, -160, 140, -228, -62, -186, -329, 22, -189, 125, 165, -323, 122, 399, -191, 246, 142, -359, 199, -285, 187, 225, -332, 290, -263, -416, 196, -306, 53, 416, -309, -53, -62, -223, 318, -267, -159, 358, -395, -104, -55, -273, 374, -54, -71, 24, -157, 170, 93, -428, 100, -82, -109, 397, -92, 12, -62, -564, 308, 109, -46, 210, -396, -15, 250, -296, 215, 7, -269, -21, -34, -253, 28, -568, -7, -100, -305, 451, -117, 248, 491, -83, 112, 135, -254, 281, 84, 18, 126, -269, -129, -184, -270, 289, -172, 38, 246, -401, 182, -82, -89, 196, 57]
6884E7l86L51l81K56J85l84O68n7n80O58p55L96O5k23M64l06k57M59n18J32L36
6905A80o31N92J75o62M21q9K5K84p19N49j10l89P46m88K02K97n19J80J32m61N38
6926B53m80L35J31n30K34K90k52K29k86j11K57l92N46m2m64L17j65m7L35k96L22
6947A84K71q05L87M7j81L61l76K13Q4n41M06K9k16K79k02p6O71q52O06l71k68
6968c50O06k55n3L50l15L6P7l99N82l46k78O69l65q9L80m75L96j17l37K18r9N9
6990a05J42l71O08k76k32M22n65K21K33j53L67l12l7K16l55m8O04n64K55k12o4
7011b26M13k30n9K16m87O58j53m10L84j47k14N82o71N99j98l96M90l35J49K57
7031B22m91J57J35l82O06j28j10L71o76J47K08k20M11j77j04K60j72k0L30n65
$$ y = [57, -329, 22, -359, -103, 82, -302, 366, 309, -271, 387, -368, 28, 93, -130, 334, 28, -229, 230, -288, -156, 180, -451, 141, 316, -346, 75, -14, 11, 295, -424, 125, 15, -374, 372, -116, 86, 383, -136, 44, 176, -285, 253, -227, 108, 239, -291, -57, 233, -19, 210, -76, -187, 70, -322, 224, 182, -282, 35, -130, -177, 158, -138, 184, 455, -350, 37, 84, -97, 264, -112, 101, 185, -356, 50, 79, -137, 142, -60, -136, 535, -317, 289, -82, -350, 256, 1, -52, 298, -17, 19, 96, -303, 279, -67, -345, 324, -41, -130, 250, -225, 171, 54, -283, -65, -164, -105, 37, -334, 274, -2, -234, 188, -377, -156, 77, -76, 291, -21, -58, 158, -197, -245, 359, -205, 50, -162, -226, 187, -43, -102, 114, -373, 285, 132, -278, 106, -41, -255, 327, -344, 255, 57, -339, 151, -184, -35, 222, -269, -112, 23, -359, 247, 119, 9, 380, -296, -149, 59, -161, 250, 73, -31, 229, 57, 37, 367, -198]
7051a98L88k70l83P13l02jK52k18K72l04k33N37l21Q9N2o03N58R5o66R43l79k17
7073a96M28m12N6L98n00K84n6rJ77m74L27rk68K00J4k3M02n67J71M56o56L72j43
7096b8k31L24k04K01J9k78L63l59k08M73m59N01K77n75K09p4j22K93j32l47P33
7117C76l87K41n4m74N96l61o8N47m53L54j29m52M15j18j21R8k35J15N1J8K08k12
7139d5j70M74k21J52j52k34K24N5k17K16L6m9J73m41N45m49k11N92m21l4N42q29
7161d64Q41p5o64O49m14L3J61j62J27N5l28M72k92J79Q6m34J70K51m06M23k21
7182a3l61O47m08L72j45m35Q38n72J52M25p19K30K45m13M90k79l26P69p31K32
7202bJ96l03L21k42n18P12m14K51J68n37J71K55j81L35j60j46O00q39L99J50l26
$$ y = [-198, 190, -80, -463, 250, -52, -53, 199, -19, 253, -51, -284, 253, -68, 21, 73, -530, 28, 123, -543, 400, 21, -196, 232, -180, -124, 274, -226, 58, 2, -7, 170, -304, 23, 14, -254, -54, -40, -63, 339, -228, -57, 399, -257, 115, -28, -259, 65, -139, 62, 81, -197, 166, -193, -401, 72, -387, 114, 391, -184, 25, -49, -171, 122, -10, -357, 376, -11, 230, 176, -298, 298, -63, -131, 416, -37, 317, 188, -264, 151, 33, -88, 10, -225, -110, -59, -41, 167, -45, -215, 259, 38, 190, 38, -196, 28, 83, -134, 82, 118, 69, 242, -199, 346, -103, -314, 278, -143, -177, 365, -464, 377, 302, -362, 287, -127, -94, 67, -95, 32, 87, -241, 231, -61, 118, 204, -230, -60, 191, -215, 208, -13, -374, 273, -135, 237, 92, -343, 495, -77, 75, 500, -219, 11, 256, -157, 333, 54, -272, 497, -234, -2, 194, -109, 212, -30, -548, 164, -250, 1, 169, -368, -197, 58, -123, 212, 52, -94, 506, -333, 66, 216, -110]
7223a10N81o24J38P03j010P58k20n41N27m63J99M43o41K15L43m74K59j80j51M83
7243B35m02K70L06o35K15K0j8L34n12k15O39l53L57m68q2N06N1n42P36o82M03
7264A63j67l67M35j42o8M93m49J76j66l11M63j4J7M0j10kJ76l02M76l16j38N16
7286D03p68L36L56m34R6mo5K21k79L51R5n60K34M9k15M50l51k49M20l93M79k56
7308h4J84J92k75j95O69o68K54k3l92Q67o63Q4L39n55L12o1j56L23k10q5L07n35
7330c71P53k42m61M35l66J12L62l51Q0K06j30R0Q8j67J97k38J38J69p26M12J7
7351Gl84N82j50k36L74k87L14j3p4J34l78K45L9m65M43J69o43M85j66l17P09l71
7373A7j2r1rK09k91j21N45n11J69p8k30N66q8j58L34k49k1O7j25L94m29j96N17
$$ y = [-110, 471, -153, -15, 688, -322, 436, 216, -325, 202, -261, -62, 381, -260, -45, 298, -176, 83, -97, -248, 235, -167, 103, 409, -226, -11, 9, -9, 325, -187, -402, 237, -116, 241, -227, -309, 197, 248, -294, 442, -240, 163, -4, -371, 64, -78, -146, 347, -102, 74, -92, -403, 60, 46, 63, 103, -7, -9, 167, -135, 341, 25, -113, 403, -365, -29, 327, -107, -11, -15, -80, 141, -138, 213, 308, -252, -18, 31, -184, 266, -85, -334, 86, -307, 172, -84, 100, 292, 17, -178, 491, -177, 77, 54, -338, 529, -134, -50, 289, -266, 46, -15, -171, 152, -58, -143, 164, -371, 382, 140, -321, 114, -252, -140, 222, -129, -49, 157, 27, 117, 205, 38, 235, -3, 135, 304, -422, -10, 7, -377, 205, 55, -181, 193, -94, 220, 207, 133, 267, -111, 134, 173, -292, 151, 320, -323, 162, -4, -321, 388, 17, 5, -86, -95, 114, -177, -298, 247, -264, -95, -173, -403, 163, 75, -83, 251, 2, -19, 48, -77, 317, -112, -308, 209]
7396B09l04J4J34j63J88K34l83K83l52N6J84m27L14J32m89M74k77J70J28l53M03
7417A75m3m38O17l88p1L23m09L38J55n10N71k89j59N65p20J92K22j83M80j87m04
7438a63L00l19M33K3m29J47j71m0L69m33L92K54n09K81j25k72M93p6j59L77q29
7459d56L41K12l24J37r5J82K8j8r2J03l10K66j04j17O11q49N77J85n09J61O1K8
7481A8J60m01J82L15m93J77J07l15P01n27M7J75l31J83Qk53P05m66J14q4k6L75
7503C71j75j90J61k06O1K64k89L7L11n82L58j54j68J62k30N00q5m52Q76n59J53
7524A64j01n45J85L85j75Q5N6R1L6n83M33j11k01K68k11J58N71p29L42L77q94
7545c99M11rj95L97m45L70J89m10K67j77l10M67m45K69Q3m22M98K5l71K31J0n1
$$ y = [209, -95, -81, 53, -110, 78, 312, -71, 212, -140, -84, 100, -327, -13, 119, -370, 104, -173, -3, 125, -228, 175, 132, -306, 311, -77, -148, 175, -234, 104, 259, -251, 320, 31, -128, 437, -283, -91, 131, -52, 428, 241, -163, 137, -182, 251, 274, -155, -8, -179, -219, 150, -283, 109, 363, -146, 135, 10, -262, 231, 155, -4, 373, -456, -115, 97, -227, -90, -185, -3, 25, 7, -85, 18, -292, -26, -130, -247, 364, -485, 92, 277, -232, -71, -10, 18, 178, -223, -41, 274, -219, -42, 65, -250, 451, -76, -29, 146, -185, -2, 6, -247, 458, -8, 106, 22, -4, 371, 196, 6, 167, -39, 22, 286, -3, 34, 345, -237, 121, -33, -201, -39, -269, 231, 146, -306, 570, 11, 164, 63, -482, -297, 88, -87, -2, 54, 145, 181, -402, 31, -80, -281, -13, -224, -66, 505, -224, 118, 495, -399, 12, 3, -192, 205, -240, 130, 319, -91, 176, -1, -311, 156, -289, -20, 63, -359, 139, 164, -207, 24, 34, -17]
7567a7K20m74L15J87j60M2j94l59L70o9K59m2l58L86l2l20N95j67l27M92o81M62
7589A28l1n62P60k92j31J71j95K19j19j38K68l97K42M65m28K84l2n46M66k79j98
7610c45M67k96O03k22m86M40l18lN67m24m9L18n88K69K6l06L03j12J46J95m56
7631b71K70Q5n38Q53l54m5J28l58K96K7m66O71l99o8L50m62M42j59k90M93k42
7652c7n1J42j34L2J07k19M42m17q1O18o19J00K27j20K11k91p3K90l62L60J87q54
7674e42L71Q9n7J33l74L16K94m15J76k37K57K98o33L45J56k89J83k3l96M85l3
7695A04q3K3l03J02M42l75L45n36J38L43n12L48K69k19K70o75P8O96o55K99k48
7716a49j63L27R2l05K33n04K29K62k42L20jk86L65k95R5J11l34N09K1o03M30l81
$$ y = [-17, 203, -271, 44, 231, 71, 113, -81, -440, -70, -139, 120, 78, -280, 106, 74, -246, 349, 182, -145, 347, -334, 128, 97, -465, 295, 3, -128, 43, -152, 67, -52, -190, 78, -319, -77, 388, -40, 244, 212, -334, 132, -147, -345, 122, -174, 429, 207, -279, 161, -157, -160, 407, -17, -66, 252, -336, -67, -41, -347, -44, -156, -10, 185, -271, -1, 84, -454, 399, 45, 0, 128, -230, 66, 93, -373, 298, -101, -169, 181, -281, 161, 2, -288, 205, -37, -88, 54, -80, -48, 59, -160, 282, -135, -216, 402, -217, -117, 110, -10, 201, -90, -163, 127, -235, 125, 312, -542, -171, -82, -139, -6, -380, -64, 230, -185, -9, -246, 11, 309, -324, 21, 177, -112, 71, 48, -348, 137, 104, 21, 44, -259, -157, 285, -90, 255, -281, -143, 200, -312, 36, 305, 86, 356, -319, -241, 455, -200, 99, -149, -312, 15, 107, -198, 35, -469, -240, 22, -220, 100, 99, -187, 178, -117, -22, 89, -245, 264, 285, -318, 112, -269]
7738b69K90K39l65J69K0j11J88l23J72L7k47K79j87k5K69m50N23p4l74L14K81
7759C56m61n2K30l16N40o16N75k25l18O95m52l26O63n17K16Q9k22L40l56Q7M20
7780C50n40j03N24l82L08M3n88N85k54k0M03m52M96k51l17L38k41k35M64n53O57
7801B32m58J33K34k18r1K99l82N84n28j80O63n76L64m9k53M21m6m35O02l39K5
7822BL02n08M55k96j54K24J03n14O21k44J85j3l69M97L8p41J039p61j4O59q40
7843c29K88P7j65L70m09J02L88n11M51J26o66O64l52n7k3l11L42O1l54M47j82
7864d3j13M48l74J81j61k87N25J50m90K94q1j1p5l19O30m37j43P13p36K09M45
7885C25p10N29k17k76N76l31k6M56l60K28O7n02K86k9M0M0k87N6L25n06O68m43
$$ y = [-269, 21, 260, -105, 64, 84, -27, 161, -162, 10, 47, -200, 79, -108, -133, 136, -314, 209, 135, -239, 75, 356, -105, -157, 73, -243, 297, -319, 256, 31, -287, 408, -44, -370, 293, -224, -8, 81, -141, 199, -157, -70, 350, -190, -293, 231, -151, 157, 200, -388, 197, -57, -77, 326, -126, 370, 119, -198, 140, -101, -336, 128, -425, 232, -226, -93, 141, -77, -168, 131, -251, 333, -195, -375, 288, -288, 76, 27, -226, 195, 149, -286, 316, -23, 2, 304, -204, 251, -45, -199, 25, 128, -386, 235, -9, 176, 163, -206, 291, 329, -412, 627, -134, -148, 511, -329, -41, 36, -129, 241, -168, -66, 322, -189, 262, 388, -278, 386, 34, -23, -46, -357, -15, 46, -308, 139, -43, -156, 292, -82, 99, -62, -349, 176, 326, -164, 130, 49, 38, -37, -356, 274, -163, -306, 407, -329, -120, 325, -385, 144, -73, -349, 227, -104, -130, 326, -34, 194, 261, -241, 45, 16, 56, 96, -191, -135, 190, -316, 352, -91]
7907i1O0K99n95K10K54n43O97k09l44N19l71K25J87m07K96j50m79O30m05O3M39
7928B85p44O65j15m61O55n82M00P9n52L27J10k97J83L2p3K34k62J74Q8m49O27
7949C24l59k91M26j05Q4J14m27M86l35J05J66l79L88J58n13M71k21k87K90j73
7969g8L8M17n36N71n96M4K80j24k94M75l27P8o8l64N73k96L9K98l84L37j26L6
7991gM13l75J4J82l98l4J27j01L95k24p0K46l45j45N76n88K06J80k18N57m29Q0
8013D2j80J7J01L63p25M76j29j88M78m69L45p8k33L35l75K11J92m29J97J91m77
8034c35O12l45P3L26n97L87j4l12J76j93J34K96n67L29K01l24K46n00K25N09o49
8055c22N50j96k59L71k33q5N97o14J83K76j17K5k56k08N98m03n4N22p98N42n8
$$ y = [-91, -31, 268, -327, -117, 137, -406, 291, 82, -262, 257, -114, 111, 298, -109, 187, 37, -442, 188, -217, -154, 285, -459, 206, 91, -370, 285, -297, 103, 182, -370, -43, 67, -230, -47, -15, -88, 146, -116, 58, 146, -303, 324, -35, -326, 100, -5, 79, 193, -234, 252, -83, 22, 188, -191, 197, 355, -158, 313, 92, -195, 95, -78, -40, 377, -159, 412, -184, -140, 140, 16, -278, 197, -130, -52, -120, -484, 89, -207, -168, 130, -254, 83, -43, -7, 406, 31, 45, 227, -171, -205, -78, -179, 216, -8, -78, 168, -177, -322, 254, -334, -128, 52, -166, 391, -38, 42, -138, -121, -20, 343, -382, 94, -35, -223, 255, -214, 131, 53, -180, 155, -220, -9, 183, -246, -49, 142, -335, 277, -68, 5, 331, -266, 121, 107, -205, -29, -222, -88, 208, -359, -30, 171, -153, 93, -407, -182, 327, -322, 228, 32, -227, 144, -89, -174, 423, -191, -8, 268, 151, 176, -80, -288, 310, -93, -147, 375, -423, 119, 61]
8076F1k77M20j45l10O05m43J36l6k58L03j14N1J90n46K93J66m39O93k91q2J23
8097A00j71o8L28l39L19l40j16N62m64J69K99n12L91j31l76N78m69L83N5j70r6
8118f8j18j14O66m92P5J51m55N60j04n74P30k92k60N30n10M94Q1m72K98k83O8
8139h9L13m80R3K19m97O85k84j75L94p73N28P2l00M15jk61K43k02J87K58n71M73
8161B47k96j22M54n67K69%j16R2J37j78K46k34N0J06l67L77k21O8K60n8m6k0l23
8184b42M50k01j60L22p7J10J04
$$ y = [61, -216, 204, 59, -251, 354, -89, 47, 11, -247, 56, -58, -7, 183, -363, -70, 96, -343, 350, 59, -23, 100, -71, -139, 189, -150, 169, -171, -287, 275, -189, -20, 279, -233, 158, 27, -349, 229, -240, 143, 198, 28, -68, -186, -300, 366, -126, -51, 100, -355, 205, 101, -473, 257, -35, -295, 235, -275, 219, 300, -172, 126, -157, -89, 224, -256, -163, 56, -441, 244, -40, -215, 179, -594, -66, 6, -294, 121, 120, -141, 102, -100, 87, 345, -226, 247, -49, -171, 283, -284, -15, -15, -131, -39, 98, -80, 166, -68, -18, 88, -279, 98, -123, -55, 205, 147, 101, 81, -242, 208, 7, -153, 169, 92, 202, 306]
8191C06
$$ Imaginary data points
##PAGE= N=2
##DATA TABLE= (X++(I..I)), XYDATA
0@%%%%%%%%%%JpJ4j6K4l2L3m1N6p0Q4j00J18j41J66j95K32k69L10l59M13m74N43
33B90o20P02p94Q97j010J134j269J418j580J758j953K165k397K649k924L225l556
50a865L919m316M751n233N770o366P036p791Q646r630J0776j2127J3746j5726
64h410J8206k1403K5665l1527L9448n9205O54008o75675m76600P96699l81512
75a20306k33436N86483r6326n49131K85701L91700k97583r9061K49184k26904
85a09679J01426K27767l00579N6852J10416j55015K36904j41653k01156L53404
95A78687j02237j88710K20063r6505o6443J54772k6412j43655r601J90511o5204
106D5266j58970J62105j10010n0251K55913k07234q2193K08847j36660N4814R1516
$$ y = [0, 0, 0, 0, 0, 0, 0, 0, 0, 0, 0, 1, -6, 8, -8, 16, -16, 17, -24, 32, -38, 46, -54, 64, -77, 89, -106, 126, -143, 167, -192, 221, -253, 290, -330, 372, -422, 475, -535, 599, -670, 748, -832, 926, -1027, 1138, -1259, 1390, -1534, 1691, -1865, 2054, -2262, 2489, -2744, 3026, -3340, 3696, -4095, 4551, -5079, 5697, -6430, 7316, -8410, 9796, -11607, 14058, -17469, 21979, -37226, 616782, -58893, -535493, 261206, -120306, -353742, 232741, 136415, -412716, -127015, 264685, -32898, -131959, 117225, -109679, -8253, 219514, -81065, -24213, 86203, -68812, 168092, 26439, -174717, 178687, 76450, -112260, 107803, 11298, -55145, 99627, 73215, -70440, -80041, 110470, 45266, -113704, 48401, -61609, -111860, 144053, -63181, -145374, 63473, -73187, -18373, 73143]
117G3143j56356O2274K9150J4008N0830j40248P1749O0729j06548R7773m0103
128A6401o2702Q1769o9455O0665J2773j24202J19020k0558n9314J01148q2948
139b7403K8769L5154r4249J23385n0186q0272J45550j09691q307J18462j34423
150e3211M1430N2415r0030O2651j2161r603J8853n7473Q7474l5068o0233J19257
162F4301r3338l756R9170j23295O9487K9884j24320J24241k1517q0397J03199
173D3659n7165j723M2075n3313O1095l9509k0490P8387q1137M0176K6780r4571
185e5736J03425l3932o6211J15696q1320j2060P3577p8297N1831j1845m8849R0948
197D7227p5476M276P5021j00712N5945J8363p3149Q6084m4434k4595O9399o4906
$$ y = [73143, -83213, -20939, 8211, 22219, 73049, -67199, 4550, 65279, -41269, 56504, 16401, -46301, 35468, -33987, 26678, 39451, -84751, 34269, 13711, -45603, 55545, -27403, 1366, 36520, -57729, 65656, 15470, -64802, 80748, -28943, -37250, 81212, -53211, -11781, 40634, -49396, 13255, 1094, -8509, 10344, -47129, 40345, 5277, -54956, 64301, -29037, -32793, 66377, -56918, 12569, 42453, -81867, 42374, 20857, -59540, 43659, -13506, -15229, 26846, -26467, 34628, -4881, -25371, 53016, -28121, 12055, 38835, -55736, 47689, 13757, -52454, 63242, -18078, -30138, 43439, -34858, 16973, 5128, -43721, 47227, -28249, -23973, 51048, -49664, 6281, 24644, -48505, 37579, -6855, -31450, 37949, -26957]
209b6957L5297O050m9867P7052o0636j416P7670j02091M7770L5816q6922Q5948
221C7714l3849m5882R5149p4598M834N6580p0901M2789p788k4224N4197o6966
233c2945L3193L1688q1109P5651k1996m6616R1026p7012O511P2498r4856N0207
245F240K1723o4991O6495l7524m681N0417p2769M8085R553n8637P0725m6084o741
258a8189O0893q2044M7157K1823p6015P4629k8000k8637O6420o9596L0765L2361
270C1567p5063O5533j4885l7253O3239n6431K1776L0453o9611O5197j4108m3984
282c3570P0858n4714J0481M1551p3015N8386k715n3957P1222m4548m861M7069
294C2187o6504M9191J648n7234P2621l9339j5371N4586o2896L8571J0167n7233
$$ y = [-26957, 8340, 14390, -35477, 41575, -19061, -20477, 57193, -44898, 2872, 38688, -48234, 37714, 3865, -42017, 53132, -21466, -16632, 39948, -30953, 11836, 4048, -20176, 34021, -32945, 248, 31936, -49173, 26478, 4482, -42134, 48892, -28120, -21609, 50889, -43967, 6240, 27963, -37028, 29467, -8057, -12738, 37679, -35090, 12995, 22548, -36089, 34636, -11448, -18189, 42704, -39340, 7817, 29640, -46375, 28254, 254, -28383, 38037, -31559, -794, 31567, -43496, 22037, 7152, -30101, 33138, -23293, -1517, 28936, -40675, 24522, 10414, -33570, 37288, -17426, -6945, 34606, -38409, 19977, 17262, -36695, 34527, -10021, -14882, 32187, -34317, 14874, 16522, -40712, 31909, -7430, -22801, 31785, -31111, 7460, 17627, -39606]
306c9606P0803l5867k0838O2235o2902K9634K1956o1676O6834k7084l1255O6498
318C8732n6772J5572K8554n9268N8293k1712l4594O8341n6907Q548M0375o2772
330c3610M9429r179l9453O6417m9704Q97M5806o1313M2636p15m3677O5944m5125
343a1647p202N3990o1756L3112J1439m7209N9175l5966j1285N4580o1852K8227
355C606J9804n2857N4704k8921j8554N6741n9951K1999K6489n6720N3370k0420
367g10k6282O0382n6672J5990L7248o2919M6874m847l3014N3922m7253J0510L6062
380B9291n9370M5253n208l7911N9198m5228K672M4293o4707M0516R268m9162N4973
393B3878l1046q491M3890n6375L2744J3186m9215N2585k5880j3011M6375n3001
$$ y = [-39606, 31197, -4670, -25508, 36727, -26175, 3459, 25415, -36261, 30573, 3489, -27766, 38732, -18040, -2468, 26086, -33182, 25111, 3399, -31195, 37146, -19761, -11213, 29162, -33610, 15819, 6640, -32813, 33604, -16100, -15203, 30603, -30710, 11926, 11211, -32466, 33478, -11647, -18849, 35141, -26615, 6497, 17936, -29273, 29902, -6064, -17349, 37231, -24621, 3606, 23410, -29447, 25257, -3664, -22218, 34523, -25428, -3429, 23060, -33660, 19710, -710, -26992, 33390, -23282, -7292, 29956, -32963, 13911, 9064, -23950, 29972, -17281, -6771, 29291, -30079, 15174, 9966, -27945, 31253, -13975, -11303, 32990, -31717, 8799, 18067, -31095, 23878, -7168, -15659, 28231, -28144, 4600, 17786, -31429, 21156, -4724, -17735, 28640, -24361]
405b4361K8150J7096n2022N4944k0241k4119N0799m9611K0454K5047n7308M9830
417A8658j1667l1632N3626m4284Q668L0459n4311M5476o025l7875N4377l7224
429a1754Q14L3614n0237L9072l575l6599N4963l8436O44L9835n8743M2047P928
442A9573n2916O2134k7026k4407N2764m2745J2927J4856l7473M1431k3244r639
454a3765L7181m9105K9812J2356n0724N8148k5411k8800O4656n0593M178L9426
466B7359n2710L4420J818l1812M2702l0515L384K4352l9292L7646j3029k5347
478b1024N3261m6047O361M1722o1283L6415R734m7163N3559k7564j7787M4185
490B4369m2983J8939J1037l6473M2662k6777p487M3825n1261K2973K0152m5107
$$ y = [-24361, 3789, 20885, -31137, 23807, 3566, -20553, 30246, -19365, 1089, 26136, -31172, 18658, 6991, -24641, 28985, -15299, -6631, 23828, -30483, 14993, 8968, -28907, 25470, -11754, -10940, 22674, -27563, 11509, 7934, -28665, 26298, -12138, -11494, 28341, -30402, 11645, 19573, -33343, 28791, 1765, -22642, 30122, -12623, 304, 15160, -22313, 19118, -4126, -13765, 23416, -25689, 4123, 16479, -34245, 23903, -1508, -30308, 34348, -16245, -12067, 27359, -25351, 9069, 10887, -20925, 21777, -8738, -5354, 18998, -20294, 17352, 4323, -21024, 32237, -13810, -7449, 34273, -27010, 9405, 19139, -28024, 25535, -2029, -19816, 24369, -18614, 325, 11362, -25111, 17551, -9226, -16713, 27112, -24149, -1176, 18976, -26131]
502b6131M4484j7467j8623M4751m5408J8067K3006m8897M2551j2320k5028M9583
514B8568m2963P833L2283n1514L6849K067l4715M2416k8112k60K8322m0914K9584
527I444m237k7037M5148l6514K733L5071n3427L5906R046m5600N0766k3882j7005
540a9588M6833m3757J3999K0711l9929L3325j0916j2426K8884l7110K4875Q528
552A3429m1920N0099k2105k2062N1881m4971J0741L0593n1504L8431m76l4333
564b2197M4002k7142k216K5836l6226K9236n975k4209M1357l4641N094L1241m8843
577b4683L3116M056l9563M7561k4013j3330L6880l9593K0731J0114l6429M0869
589A5716k0393j2830L9510l9974J7141J6051l8354L9423j3957j9488M0872l5087
$$ y = [-26131, 18353, 886, -17737, 27014, -18394, -327, 22679, -26218, 16333, 4013, -21015, 28568, -14395, -6562, 25721, -25793, 11056, 13123, -21592, 20824, -7288, -7548, 20774, -20140, 9444, 5207, -21830, 23318, -13196, -10463, 24608, -28819, 7087, 16133, -29467, 21299, -2583, -19588, 27245, -16512, -2513, 18198, -21731, 11594, 678, -11748, 17136, -19974, 4901, 13429, -28491, 21608, -497, -22559, 29322, -15649, -4908, 25685, -25819, 12612, 12136, -22197, 21805, -5337, -7553, 18283, -17943, 11293, 5318, -18891, 22466, -12175, -7081, 24160, -24683, 8433, 12489, -27074, 20487, -3526, -16856, 20024, -19569, 1162, 11276, -25153, 15716, -4677, -17507, 22003, -17971, -830, 15221, -23133, 16290, 2333, -17155, 23717, -11370]
601a1370R586J9876l6871L4939j3177j9519M2535l8758J0097K6711m7720L5623
613A1952j260l3029M5272k8612o510L2681l7404K1394K382k6053L6655k7825J080
626i277K9562m3396K9285N076l5666M5177k4804j2092M1823m2469J6252J8728
638A8199l9079L4935j1635j6869L5519l2999J1049J5997l3737L2452j3246j5069
650a4483L6316l7392J3238K1729m3481L6322o081k8222M3192l0753l36L0823m0360
663a9488K4571M425k7223L4593k3128k24K5468l6916K6459J766k9951L9866k5317
676e099n775L3830m2229K2562J1618l8060L8559j5673j5749L5550l4455J3178
688a743J5562l4211L2641j1985j5613L3978l2058J2797J5969l7062L5527r739
$$ y = [-11370, -1784, 18092, -18779, 16160, 2983, -16536, 25999, -12759, -2662, 24049, -23671, 11952, 10692, -22337, 22935, -5677, -12187, 20494, -16910, 4484, 6866, -19187, 17468, -10357, -9277, 20285, -23111, 6174, 11250, -24416, 20761, -4043, -16135, 25688, -16781, -529, 18199, -20880, 14055, 2420, -14449, 21070, -11929, -880, 15117, -18620, 13832, 586, -14483, 21833, -15559, -2321, 19408, -24073, 12249, 6168, -22054, 21138, -9615, -9951, 20872, -19488, 5083, 9508, -17715, 16878, -6250, -6474, 18994, -17922, 8537, 10303, -19648, 20218, -5099, -10874, 22956, -19273, 3289, 14907, -23153, 15406, -267, -16016, 19534, -14921, -1743, 13819, -20392, 12249, 264, -15349, 18629, -13429, -632, 15337, -21725, 13802, 4063]
700D063k1998L9728l1921M137K5409l7812K7693j169k5592L6096k5164l56K4691
713A7805l6303K5712J254k8684L7511k3428n174K9666l5532K0418O836l0786L6575
726A5870j9353r120L2732l5701J7205J2309l3718L5259j3980j5925L4973l2268
738a1717J1138J5936l4054L1294j0338j7407L5122l1710P129K0267l5032K9199
750I827n807k2536L6815k8312K616K5007l6065K4733R65k5628L5517k3173k856
763h897K7177l3704K0721M547k6996L4216k0726n929L0285l5649J7908R824l1206
776a8429L2737j4792j2471L1050l2091J3045J3886l2270L0427j1354j4961L3478
788A8255l0894R200J8125l3776K9420n377k0000L3353k7419N257K1207l4314K6056
$$ y = [4063, -17935, 21793, -10128, -5991, 19418, -18394, 9299, 8130, -17462, 18634, -6530, -6886, 17805, -18498, 7214, 8468, -20216, 17295, -6133, -11307, 18359, -17173, 3245, 10081, -20705, 15870, -3483, -12603, 20129, -15572, 1633, 13942, -19776, 15483, 1503, -14422, 20551, -11717, -579, 15357, -18697, 12597, 2259, -15148, 19974, -11736, -4607, 15660, -19372, 9827, 4020, -18516, 18299, -10013, -7397, 17610, -18455, 6278, 7243, -18385, 17132, -6041, -8897, 18280, -15424, 5297, 9844, -17152, 17064, -3662, -9591, 20694, -14955, 2953, 12777, -18429, 14308, -484, -12955, 18095, -13996, -951, 12935, -19335, 11092, -262, -15223, 18255, -12639, -3439, 14686, -19090, 10330, 4953, -15047, 18306, -9113, -3856, 17351, -16963, 9093]
801I093k310k3238L4843k4948O2K4320l4485K2604K935k6641L3175k0654m693
814i937K7305l4000J9429P088k9482L2383j5542r144K8350l0931J5722J0337k9761
827a8183L1699j3023j3438L1800k9458J0072J5479l2076K8352p162j7342L0715
839A7435k6575N920J7843l1483K6376n316k0479L2983k4961K070K1768l3088K3617
852F110Q05k4177L2951k1823l006K5431l1773J9782M773k6172L2148j7644o464
865i059K6638l0456J6631P253k7900L1813j5950j0789L0249l1201J1561J3832
877A2622l0409K8122r865j4115K9541k7051Q379J5100k9539K7213p096j8051L2359
890A7210k6044L897K0526l1203K2825j135k0454L0374k1884M69K1406l0488K0969
$$ y = [9093, 6783, -16455, 18388, -6560, -6498, 17822, -16663, 5941, 8876, -17765, 15410, -5244, -9937, 17368, -16632, 2797, 9885, -19597, 12786, -2756, -11900, 16450, -14481, 1241, 11578, -18183, 13516, 493, -12945, 18855, -10603, -531, 14948, -17128, 11224, 4062, -13280, 17435, -9140, -3220, 14623, -16860, 9516, 4200, -16279, 16704, -8257, -6187, 15581, -17507, 6110, 6915, -17262, 15689, -6134, -9140, 16291, -15482, 4300, 9073, -17099, 15049, -2595, -9059, 17579, -12877, 3754, 11007, -16893, 14920, -1030, -11819, 18430, -12771, -1210, 12622, -17787, 10335, 470, -13645, 15896, -11155, -2776, 12324, -17215, 9998, 2902, -15149, 17210, -8834, -4937, 15589, -15614, 7211, 6076, -14378, 15996, -5888, -5419, 15987, -14501, 6468]
903F468J657k3791L1079j9722m644K5732l1425J6793P334k6732K9207j4598q704
916a1346K6730k8619J4012R527k6692K8664j2657j0467K9018k9796J1372J5033
928A4779l1279K7608p026j7500L0347k4509L942J8019k8964K2082l267j7160K7453
941A4525k2999L936J8531l1205K3777m27k3616L1493j9817l888K4797k9033J6310
954B384O017k3507K7726j4909n548K3260k7713J6123P307k6242K8594j3631j0134
967a0273K7378k7778J0750J2003k7856K6080q964j3853K7908k5746P853J5322
979A2824k8835K4906n897j7158K9237k3051L693J8015k9200K2270j005k0133K9028
992A4694k0069r23K0765k7425J9164M91k1259K9348j9049l553K3823k9968J5647
$$ y = [6468, 8125, -15666, 15413, -4309, -8953, 16779, -14646, 2147, 9481, -17251, 11956, -2642, -11346, 15384, -13235, 777, 10304, -16388, 12276, -381, -10848, 18170, -11626, -254, 14779, -16500, 11108, 4082, -13418, 16929, -7580, -3638, 14381, -14583, 7499, 4232, -12928, 14525, -8474, -4538, 13993, -17212, 6565, 6138, -17478, 14015, -5802, -9690, 15107, -13926, 2384, 8401, -15106, 12620, -2289, -7837, 15423, -12290, 3833, 11140, -15102, 13492, -139, -10273, 17105, -10673, 77, 12080, -15776, 10304, 1340, -12513, 15395, -10351, -2498, 12824, -16011, 8895, 2998, -14160, 15077, -7974, -4281, 13734, -15466, 6804, 5799, -14334, 14694, -5375, -6298, 14467, -12958, 6206, 6697, -14562, 14786, -4263, -7816, 16007, -13961, 1686]
1005A686P854k5842K6915j2399r405K4366k4777J1820Q444k4161K5835j0939r875
1018a0478K5998k5863R652J3043k7383K5638p464j5531K8634k3822M119J7989
1030A4532k8365K0757j762j7795K6576j9729R79J7001k6413K0025j209j9637K8140
1043A3100j9759j359K2760k9315J7176N023k3058K7486j4423o378K3706k6678
1055a1719J3586Q529k4049K5391j1124j0058K4729k4425R760R917k4724K4545
1067A0358r441j1816K5991k5209P483J4999k7787K2588l698j7228K6833j9964
1079f891J687J7473k6045J8914l13j7077K5084j8139N51J8293k6233J8761J622
1092G687k1800K7677j6299m918K2690k6187J3248O229k2202K4373j2268p219K2289
$$ y = [1686, 9540, -16302, 10613, -1786, -11191, 13175, -11602, 218, 8662, -15499, 10336, -603, -10478, 15520, -10343, -691, 12352, -15031, 10607, 3143, -12388, 16246, -7576, -3457, 14532, -13833, 6924, 5162, -12633, 13943, -5786, -4807, 12194, -14219, 5806, 4597, -15040, 13100, -6659, -8018, 14742, -14573, 2603, 7626, -15432, 12054, -2369, -8747, 14959, -11719, 1867, 10396, -13653, 11738, 614, -9444, 15285, -9140, 620, 10537, -14187, 10358, 917, -10899, 15092, -10117, -2634, 12365, -15422, 7166, 3468, -13760, 13073, -6891, -5204, 12269, -13776, 5138, 4825, -12252, 12832, -5307, -4756, 13537, -12696, 6065, 7687, -14113, 13564, -2735, -7653, 15037, -11150, 2098, 8327, -13875, 10498, -1770, -8989, 13300]
1105A3300k4717J1916Q315k3973K5074j0330j0872K5270k3229P739J2440k4446
1117a3513K2071o181j3116K4855k1268M932J4885k5799K0930k984j7054K6258
1129A4016j9343K39J8386k5381J6400J526j8599K4243j6127j901J8123k4493J6143
1142C232K675k0275K6066j5069n801K3000k4658J1185R149k2739K2880r062r129
1155h546K1579k1928R656R331k2695K2488r069j1033K4723k2925O296J3473k5265
1168a3915K0803l953j5023K4781j9430K023J5981k3713J7480j145j6159K4225
1180A1955j7436O06J7542k4648J6167K593j8998K4027j4239m266J9951k3394J2702
1193B562N233j9827K2363j1676o297K0433k3181J0834Q419k2497K2497q821j0632
$$ y = [13300, -11417, 499, 8814, -15159, 9915, -415, -11287, 13983, -9246, -1507, 10933, -13513, 8558, 2377, -10739, 14116, -7152, -2220, 12665, -13134, 7796, 4812, -12242, 14016, -5327, -5088, 13298, -12083, 4317, 5843, -12756, 11487, -4640, -6541, 11582, -12911, 3232, 5907, -14368, 11698, -3371, -9172, 13828, -10830, 355, 9504, -13235, 9645, 583, -8546, 13033, -8895, 761, 10092, -12603, 9885, 816, -10217, 14506, -8419, -2123, 11350, -13915, 6888, 2935, -12088, 12693, -6737, -4714, 11267, -12446, 5034, 3889, -12270, 11955, -5481, -4875, 12667, -11981, 4186, 6779, -12219, 11808, -2431, -6697, 13254, -10140, 2562, 7795, -12032, 10331, -1345, -7642, 12791, -10390, 444, 8863, -13634, 8863, 42, -10590]
1206a0590K2555k0439O380J1620k2006J9255n169j1497K2305j9434M819J3400
1218A1199k3426J9381k683j5865K4287j7355J87J6927k3584J5105J694j7158K2208
1231A0917j4656k124J7422k2933J4132L169j8635K2580j2902n014K0050k2309
$$ y = [-10590, 11965, -8474, -2094, 9526, -12480, 6775, 1606, -9891, 12414, -7020, -2201, 11199, -12227, 7154, 4471, -11394, 12893, -4462, -4275, 12652, -10932, 4173, 5867, -11291, 10917, -3739, -5863, 11559, -11374, 2758, 5927, -12708, 9872, -3030, -8044, 12006, -10303]
$$ [...]
8191b69
##END NTUPLES=NMR FID
##END=
