##TITLE=1H_43-2021
 CDCl3, 8 sc, 
 11.06.2021
##JCAMPDX= 6.0         $$ Bruker NMR JCAMP-DX V2.0
##DATA TYPE= NMR FID
##DATA CLASS= NTUPLES
##ORIGIN= UXNMR, Bruker Analytische Messtechnik GmbH
##OWNER= root
$$ XWIN-NMR		Version 3.5
$$ Fri Jun 11 11:18:40 2021 Russian Standard Time (UT+4h)  she@DPX200
##.OBSERVE FREQUENCY= 200.131506
##.OBSERVE NUCLEUS= ^1H
##.DELAY= (6, 6)
##.ACQUISITION MODE= SIMULTANEOUS
##.ACQUISITION SCHEME= undefined
##.AVERAGES= 8
##.DIGITISER RES= 18
##SPECTROMETER/DATA SYSTEM= spect
##.PULSE SEQUENCE= zg30
##.SOLVENT NAME= CDCl3
##.SHIFT REFERENCE= (INTERNAL, CDCl3, 0, 15.7039)
##AUDIT TRAIL= $$ (NUMBER, WHEN, WHO, WHERE, WHAT)
$$ ##TITLE= Audit trail, XWIN-NMR		Version 3.5
$$ ##JCAMPDX= 5.01
$$ ##ORIGIN= Bruker BioSpin GmbH
$$ ##OWNER= she
$$ F:/spectra/data/she/nmr/H-F/1/audita.txt
$$ ##AUDIT TRAIL=  $$ (NUMBER, WHEN, WHO, WHERE, WHAT)
(   1,<2021-06-11 11:17:08.92 +0400>,<she>,<DPX200>,
      <created by zg, POWCHK disabled, PULCHK disabled
       configuration hash MD5:
       00 E9 B6 7A A2 85 ED C7 34 08 36 98 17 FE 4E 26
       data hash MD5: 16K
       B7 75 A5 42 46 75 EC 9E A4 52 55 69 E6 A0 DF B5>)
$$ ##END=
$$ 
$$ hash MD5
$$ 0E 58 4B CD F8 44 94 AE C1 E1 EF 91 64 7C EE 4C
##$RELAX= 
##$RELAX= 
##$RELAX= 
##$RELAX= 
##$RELAX= 
##$RELAX= 
$$ Bruker specific parameters
$$ --------------------------
##$DU= <F:/spectra>
##$EXPNO= 1
##$NAME= <H-F>
##$PROCNO= 1
##$TYPE= <nmr>
##$USER= <she>
##$AMP= (0..31)
100 100 100 100 100 100 100 100 100 100 100 100 100 100 100 100 100 100 
100 100 100 100 100 100 100 100 100 100 100 100 100 100 
##$AQSEQ= 0
##$AQ_mod= 1
##$AUNM= <au_zg>
##$AUTOPOS= <>
##$BF1= 200.13
##$BF2= 200.13
##$BF3= 200.13
##$BF4= 200.13
##$BF5= 200.13
##$BF6= 200.13
##$BF7= 200.13
##$BF8= 200.13
##$BYTORDA= 1
##$CFDGTYP= 0
##$CFRGTYP= 5
##$CHEMSTR= <none>
##$CNST= (0..31)
1 1 145 1 1 1 1 1 1 1 1 1 1 1 1 1 1 1 1 1 1 1 1 1 1 1 1 1 1 1 1 1 
##$CPDPRG= <>
##$CPDPRG1= <>
##$CPDPRG2= <>
##$CPDPRG3= <>
##$CPDPRG4= <mlev>
##$CPDPRG5= <mlev>
##$CPDPRG6= <mlev>
##$CPDPRG7= <mlev>
##$CPDPRG8= <mlev>
##$CPDPRGB= <>
##$CPDPRGT= <>
##$D= (0..31)
0 1.2 0 0 0 0 0 0 0 0.06 0 0.03 0 0 0 0 0.0002 0 0 0 0 0 0 0 0 0 0 0 0 
0 0 0 
##$DATE= 1623395828
##$DBL= (0..7)
120 120 120 120 120 120 120 120 
##$DBP= (0..7)
150 150 150 150 150 150 150 150 
##$DBP07= 0
##$DBPNAM0= <>
##$DBPNAM1= <>
##$DBPNAM2= <>
##$DBPNAM3= <>
##$DBPNAM4= <>
##$DBPNAM5= <>
##$DBPNAM6= <>
##$DBPNAM7= <>
##$DBPOAL= (0..7)
0.5 0.5 0.5 0.5 0.5 0.5 0.5 0.5 
##$DBPOFFS= (0..7)
0 0 0 0 0 0 0 0 
##$DE= 6
##$DECBNUC= <off>
##$DECIM= 32
##$DECNUC= <off>
##$DECSTAT= 4
##$DIGMOD= 1
##$DIGTYP= 9
##$DL= (0..7)
0 120 120 120 120 120 120 120 
##$DP= (0..7)
150 150 150 150 150 150 150 150 
##$DP07= 0
##$DPNAME0= <>
##$DPNAME1= <>
##$DPNAME2= <>
##$DPNAME3= <>
##$DPNAME4= <>
##$DPNAME5= <>
##$DPNAME6= <>
##$DPNAME7= <>
##$DPOAL= (0..7)
0.5 0.5 0.5 0.5 0.5 0.5 0.5 0.5 
##$DPOFFS= (0..7)
0 0 0 0 0 0 0 0 
##$DQDMODE= 0
##$DR= 18
##$DS= 0
##$DSLIST= <SSSSSSSSSSSSSSS>
$$ [...]
##$SUBNAM2= <"">
##$SUBNAM3= <"">
##$SUBNAM4= <"">
##$SUBNAM5= <"">
##$SUBNAM6= <"">
##$SUBNAM7= <"">
##$SUBNAM8= <"">
##$SUBNAM9= <"">
##$SW= 20.0188882624521
##$SWIBOX= (0..15)
0 0 2 0 0 0 0 0 0 0 0 0 0 0 0 0 
##$SW_h= 4006.41025641026
##$TD= 16384
##$TD0= 1
##$TE= 0
##$TE2= 300
##$TE3= 300
##$TEG= 300
##$TL= (0..7)
0 120 120 120 120 120 120 120 
##$TP= (0..7)
150 150 150 150 150 150 150 150 
##$TP07= 0
##$TPNAME0= <>
##$TPNAME1= <>
##$TPNAME2= <>
##$TPNAME3= <>
##$TPNAME4= <>
##$TPNAME5= <>
##$TPNAME6= <>
##$TPNAME7= <>
##$TPOAL= (0..7)
0.5 0.5 0.5 0.5 0.5 0.5 0.5 0.5 
##$TPOFFS= (0..7)
0 0 0 0 0 0 0 0 
##$TUNHIN= 0
##$TUNHOUT= 0
##$TUNXOUT= 0
##$USERA1= <user>
##$USERA2= <user>
##$USERA3= <user>
##$USERA4= <user>
##$USERA5= <user>
##$V9= 5
##$VALIST= <valist>
##$VCLIST= <CCCCCCCCCCCCCCC>
##$VD= 0
##$VDLIST= <DDDDDDDDDDDDDDD>
##$VPLIST= <PPPPPPPPPPPPPPP>
##$VTLIST= <TTTTTTTTTTTTTTT>
##$WBST= 1024
##$WBSW= 4
##$XGAIN= (0..3)
0 0 0 0 
##$XL= 0
##$YL= 0
##$YMAX_a= 499570
##$YMIN_a= -596583
##$ZGOPTNS= <>
##$ZL1= 120
##$ZL2= 120
##$ZL3= 120
##$ZL4= 120
##$ABSF1= 10
##$ABSF2= 0
##$ABSG= 5
##$ABSL= 3
##$ALPHA= 0
##$AQORDER= 0
##$ASSFAC= 0
##$ASSFACI= 0
##$ASSFACX= 0
##$ASSWID= 0
##$AUNMP= <proc_1d>
##$AZFE= 0.1
##$AZFW= 0.1
##$BCFW= 1
##$BC_mod= 2
##$BYTORDP= 1
##$COROFFS= 0
##$CY= 11.3945322036743
##$DATMOD= 1
##$DC= 2
##$DFILT= <>
##$DTYPP= 0
##$F1P= 15.9154993809931
##$F2P= -4.1035820241983
##$FCOR= 0.5
##$FTSIZE= 0
##$FT_mod= 4
##$GAMMA= 1
##$GB= 0.15
##$INTBC= 1
##$INTSCL= 1
##$ISEN= 128
##$LB= 0.24
##$LEV0= 0
##$LPBIN= 0
##$MAXI= 10000
##$MC2= 0
##$MEAN= 0
##$ME_mod= 0
##$MI= 1.114404
##$NCOEF= 0
##$NC_proc= 0
##$NLEV= 6
##$NOISF1= 3.799351
##$NOISF2= 2.8
##$NSP= 1
##$NTH_PI= 0
##$NZP= 0
##$OFFSET= 15.70392
##$PC= 1
##$PHC0= -11637.82
##$PHC1= 6.80101
##$PH_mod= 1
##$PKNL= yes
##$PPARMOD= 0
##$PSCAL= 0
##$PSIGN= 0
##$REVERSE= no
##$SF= 200.130013532006
##$SI= 16384
##$SIGF1= 3
##$SIGF2= 2
##$SINO= 400
##$SIOLD= 16384
##$SREGLST= <1H.CDCl3>
##$SSB= 0
##$STSI= 0
##$STSR= 0
##$SW_p= 3612.71676300578
##$SYMM= 0
##$S_DEV= 0
##$TDeff= 0
##$TDoff= 0
##$TI= <>
##$TILT= no
##$TM1= 0
##$TM2= 0
##$TOPLEV= 0
##$USERP1= <user>
##$USERP2= <user>
##$USERP3= <user>
##$USERP4= <user>
##$USERP5= <user>
##$WDW= 1
##$XDIM= 8192
##$YMAX_p= 0
##$YMIN_p= 0
$$ End of Bruker specific parameters
$$ ---------------------------------
##NTUPLES= NMR FID
##VAR_NAME=  TIME,          FID/REAL,        FID/IMAG
##SYMBOL=    X,             R,               I
##VAR_TYPE=  INDEPENDENT,   DEPENDENT,       DEPENDENT
##VAR_FORM=  AFFN,          ASDF,            ASDF
##VAR_DIM=   8192,          8192,            8192
##UNITS=     SECONDS,       ARBITRARY UNITS, ARBITRARY UNITS
##FACTOR=    0.0002496,     1,               1
##FIRST=     0,             0,               0
##LAST=      2.0444736,     0,               0
##MIN=       0,             -596583,         0
##MAX=       2.0444736,     499570,          0
$$ Real data points
##PAGE= N=1
##DATA TABLE= (X++(R..R)), XYDATA
0@%%%%%%%%%%%qJ6j6J6k4L2m0N2o0P2q4R7j17J36j57J81k05K37k76L13l53M00
33B12m50N07n74O43p16P97q86R85j093J211j337J477j631J796j980K183k402K642
51A384k910L210l548L928m355M846n415O084o883P855r067J0619j2686J5578j9884
66a1244K6903m0118P2550k76111k89278R30667l80282k74784O30711n22901l08093
77d41980Q14090k54771l43343M58615m09610j38920Q04649m27247m64193O61783
87B59073l07296k98730Q46523l87430o76281P52716M193m61881N48192k13011
97F6068n23169O40684L9529m46221M12470j99886m10772P30709l0748o67151M94444
108A05957K4426n21372O59051P0539p94092M24271K89045m81768L73042O4574
$$ y = [0, 0, 0, 0, 0, 0, 0, 0, 0, 0, 0, 0, -8, 8, -8, 8, -16, 16, -24, 28, -32, 40, -44, 53, -64, 72, -85, 96, -109, 128, -148, 165, -188, 212, -238, 269, -305, 338, -378, 419, -467, 518, -575, 636, -701, 776, -855, 941, -1039, 1144, -1258, 1384, -1526, 1684, -1864, 2064, -2291, 2555, -2860, 3224, -3659, 4196, -4871, 5748, -6938, 8640, -11244, 15659, -24459, 48091, -228020, -517298, 413369, 33087, -241697, 389014, -133887, -441980, 372110, 117339, -226004, 232611, -176999, -315919, 488730, 61483, -402710, 259073, -48223, -346953, 499570, 112140, -564141, 188575, 192768, -269113, 279079, 66068, -457101, 183583, 223112, -223109, 189361, -10525, -421297, 309412, 278664, -388487, 105957, 130383, -390989, 268062, 338601, -455491, -31220, 257825, -223943, 149099, 213673]
118B13673o14303M06780K78826m74309K87015N7234n73632M91581L35450o77588
128b69273K05976K95165n52132L51663L94001o93870Q4658M32334m03572J75163
138B0113K77078n75908J28803M38129m01728Q9868K75710n46022J46643N42993
148C95679m84742q9031M08311m12873M0039N23027m53008j78831M40396k61370
158g2403j8571L91141m16791j35972M75622k30541j11211L66118l66712j53187
168b72507N53258k10230k82170L77367k15804j78820N01343j94612l32930L69214
178A14109j05600j71993M03907k03485l18725M03481l8075k43587L40082j45155
188C4959l30311M31345K9975l54790K77199l2364l00699L86831L0960l85563K49523
$$ y = [213673, -400630, 6150, 284976, -189333, 97682, 154916, -418716, 72865, 408315, -269273, -63297, 231868, -320264, 31399, 425400, -268470, -183812, 248522, -155050, 20113, 297191, -278717, -149914, 288215, -113513, -23645, 252065, -293957, -147314, 395679, -89063, -178094, 230217, -182656, -142617, 380410, -72598, -251429, 188967, -72403, -90974, 300167, -116624, -252596, 223026, -7515, -118726, 247392, -119320, -272507, 280751, 70521, -211649, 165718, -50086, -228906, 272437, 77825, -255105, 114109, 8509, -163484, 240423, 36938, -281787, 121694, 83619, -159968, 180114, 34959, -295352, 135993, 165968, -188822, 88377, 56013, -244686, 142145, 173105, -212458, 37065]
199C7065M2915k63451L17502J4318l83571K47719J23482k78746K24747N0018l67213
210b35215K38641J91336l21337J36990J06446l13933K15545J86564l39265R8727
220c5501J49536k59443J70124J63845l32560P2316K08995k26133Q5304J64248
230A60731l02105N4776K58617k27384O790J80490k52960M8801K56522k36022l1484
241h3228J96367j97813K7368K29454k23614o2168K22094j41345k9341K05034j91279
252d8471p9864K49628j17098q7697J95856j51959p8896K47196j12236j16863J84769
263H4365j04059p7857K14868r5076j37149J75981m4466r9832J74415o6649j47506
274a22965J79849r311j31723J49033m0224j38860J73231o16j42487J23518j2116
$$ y = [37065, 79980, -183471, 134031, 148349, -235222, 12497, 135979, -142767, 81980, 131998, -235215, 3426, 194762, -126575, 10415, 116861, -197072, 18473, 205037, -134228, -35501, 114035, -145408, 24716, 188561, -143999, -71683, 137312, -88821, -3517, 160731, -141374, -86598, 172019, -55365, -48575, 131915, -121045, -72244, 184278, -51744, -83228, 113139, -84674, -57306, 172148, -51466, -113634, 108460, -32885, -62226, 142808, -48471, -128335, 121293, 4195, -83502, 112354, -39605, -118501, 128695, 16459, -100404, 84365, -19694, -97551, 117317, 22241, -114908, 61073, 16607, -83225, 91190, 24541, -122965, 56884, 47573, -84150, 64883, 24659, -114201, 59030, 58414, -84073, 39445, 27329]
285B7329j18140J42715Q530j43800R7257K9549j11335J01934K4894j42994Q7967
296C906N7944j21104P6465L6976j31967Q2453O1408j17876N4633M2656j04962
307e9468O2553N9447j05638K7821O0746q2946L0707O4300r5905J3335P6696p8717
319b7069J2663O5388q5637J1433P2344o8764K828N3825o0854N050N8487m9425
331i731j3968N0623l4415j3466N2257l5023k4312N3393k6063k1336M7736k8951
343c256k0094M3783j9580j6326K9330j5002j2896K4072m697j7443J4606M363j7371
356a0511J2031P242j9704J0839Q150j6502Q519N538j0732L072M912j908n713N167
370D00N676j4324Q474R333k1510J2855J1354k5826J3368J3457k5329J0325J5784
$$ y = [27329, -90811, 51904, 60434, -83366, 13891, 43440, -67895, 34039, 58933, -84061, 3906, 61850, -59254, 17211, 54187, -77780, 4673, 66081, -51795, 2838, 45494, -59468, 3085, 62532, -43106, -15285, 45461, -37485, -6778, 57522, -38383, -25048, 51648, -27069, -14406, 50982, -34655, -23222, 49122, -19642, -16814, 37011, -23843, -18793, 39694, -9731, -23699, 26924, -7491, -20957, 31300, -3723, -28035, 25358, -705, -22041, 25695, -3256, -23350, 20433, 853, -15473, 13857, -1145, -14041, 10031, 5334, -12109, 2497, 6860, -10511, 1520, 8762, -10942, -103, 8047, -8455, 64, 5602, -5130, -2058, 2854, 946, -4767, 400, 6076, -8248, 226, 9559, -11951, 904, 12258, -13568, -200, 13257, -12072, -1747, 14037]
383A4037k4523M766K2775k5389k889L2341k8606q527M1829l3416j1528M8463l7941
396h608j2245N2026l9352j3943N3032l6475j9195N4063k9924k6971N6158k5645
408B921l6543O4062k1537m7861O9077k0073n2065P5929k1276n8678P7126j6853
420A4229n8290P5541j4885o5205P3987j015p0129O7755L847p9106P4163J7025
432C7917r2222O9159K1574r4196P7610K5106j06154P1312L3369r8820O9771L3104
444D7530j09236O2846N3275j04051M9593N3000j12963N2618P6589j19906L5024
455a5681P6921j18318M6056Q8005j30934K7411R2914j13271L0895R1267j26510
466e1245J3324J11675j04655J0J02812j16155l441J33703j07875k8639J22173
$$ y = [14037, -10486, -5720, 17055, -8334, -11223, 21118, -7488, -16015, 25814, -7602, -19130, 29333, -8608, -20853, 31173, -8179, -22122, 30910, -5565, -24760, 29303, -621, -27592, 28566, 2921, -33622, 30440, 8903, -38958, 30119, 10046, -42019, 33910, 12634, -46044, 31082, 14229, -44061, 31480, 16595, -48610, 25377, 24362, -45767, 21988, 25835, -53271, 20892, 37917, -54305, 14854, 36428, -57768, 19842, 44948, -61206, 10106, 43475, -55345, 14426, 47530, -61706, 1140, 54415, -49636, -43, 52957, -60006, -7388, 69201, -50705, -15681, 61240, -57078, -11022, 76983, -53951, -26540, 66374, -46897, -16002, 75265, -51245, -37921, 73754, -30901, -30891, 71921, -44234, -47675, 86028, -21847, -50486, 71687]
477G1687j06838j5057J42931j12746m5479J35356q9353l0214J36582j04324o0202
488g7657J48512o7044o2568J33455q5142p6854J66694n6627j00180J40710o3204
499I5q7232J72375n5372j23621J45238l4875r4688J56441m7750j37069J51043
510D4585r44j20185J36289k5114j49521J60492K5502j57101J21650N381j49942
521a08908J58297L2707j78559J10345L6393j40091J36412L3545j87876J05749
531a986P7097j49613J00791N2816j92991J03318J16077j72442O2432P8340j76916
542a03077R7591J22933j86245L9053J00173j51283Q2682J15364j98119K6811J44329
553I0212j43355L7674J27115j95387J1151J88429j42017j6833J33606j64899J1996
$$ y = [71687, -35151, -50208, 92723, -20023, -65502, 69854, -19499, -49713, 86869, -17455, -77657, 70855, 3811, -58757, 74698, -10444, -87298, 79396, 22769, -77411, 63299, 95, -87137, 85238, 29866, -93755, 51483, 16608, -78080, 78361, 30611, -106458, 44585, 43641, -76544, 59745, 34631, -114890, 45602, 71104, -85997, 35653, 41034, -108908, 49389, 82096, -96463, 13882, 50275, -89816, 46596, 80141, -107735, -1986, 75111, -74502, 26289, 79105, -113886, -10568, 105509, -66933, -4501, 73839, -103077, -5486, 117447, -68798, -29745, 70428, -80855, 1827, 117191, -80928, -54117, 90212, -53143, -15469, 111646, -83741, -72590, 115839, -26178, -43011, 90595, -74304, -62308]
564f2308J90241j50505m2691J41950j34933J0453J83901j67823o8659J86328j03952
575a7998m1008J81757j49831r6705K17572o9759r2940J55993j15772p9272K15991
586A08028p7746j15709J53083r0068p1836K17820q9203j61524J80757k6681j15354
597h8433J86888n6800j84215J81965K7424j37425J33077m3859j47998J92118J4306
608G7048j62845J28052k2766j42633K01996K1400k21538J21158O3823j55435J41581
619D9841M8222k21905J00220J09893j42238Q9405K6882j89568J36051J02534j80928
630g1591Q1052N3238j90338J38684J34622k27951K8401J34679j52794O6754J32386
641A27142k04593N320J54894j18778L9745Q9593j98739N2961J74638j61096Q534
$$ y = [-62308, 127933, -22572, -65263, 76687, -58246, -47793, 136108, -31715, -100374, 85954, -17998, -59006, 122751, -27080, -123785, 93787, 24028, -68912, 87081, -28691, -107963, 108028, 30282, -85427, 67656, -22412, -94248, 123572, 34369, -127155, 53602, 26921, -88433, 98455, 41655, -142560, 39405, 66829, -70596, 62481, 18622, -129376, 62742, 77048, -85797, 42255, 19489, -123144, 78852, 100252, -121286, -128, 63695, -91740, 49841, 98063, -123842, -23622, 86271, -55967, 33438, 60320, -129248, 6803, 109337, -71591, 9461, 62699, -127639, 11045, 145667, -82284, -53883, 80796, -71998, -5244, 127142, -77451, -72131, 82763, -36015, 3730, 93323, -105416, -52455, 122183, -38913, -30379]
652c0379J21838j86936L4206K12483j67333p4884J59326j03194j3125J71451j42824
663a9371q0361J61521p2729j4768J34427j66445m7478K11420r5362p3665J52711
674H9900j29172p3736K28142o4133j48098J34434l8127p2747J71728o4065j39984
685a05858J39625k1385o6570J56991r8103j40422J98385n702j33059J41429m5941
696A9390j50922J86698L9037j72036Q5139J6448j09587J46617J5986j72288R7703
707B185L4497j08859J42464l650j97807J32182Q5819j49346Q7961L5649j75501
718a14406J06270J16562j51201K4552N7649j20246R5104Q9268j68856L1289Q6931
729E2916j17835Q4965Q3834j93165L3708J41928j16474J9813Q8549j53049J8615
$$ y = [-30379, 91459, -95477, -61271, 151212, -16121, -91005, 68321, -34873, -47998, 123453, -19371, -99732, 61789, -10940, -25708, 108719, -57726, -105204, 106216, 10854, -62811, 89900, -39272, -113008, 115134, 51001, -97097, 37337, -790, -73537, 98191, 34126, -105858, 33767, 12382, -54188, 102803, 4700, -135722, 62663, 56961, -76098, 65331, 19390, -131532, 55166, 94203, -77833, 7306, 23754, -85833, 60784, 76770, -95518, 2185, 36682, -72177, 70287, 66637, -131170, 1012, 86831, -62515, 25446, 61095, -114406, -8136, 108426, -42775, -18223, 39426, -80820, 14284, 103552, -65304, -34015, 52916, -64919, 20046, 103880, -89285, -55577, 86351, -30123, -10310, 78239, -74810, -56195]
740e6195J52236j02127k8030Q2285j08571K8019J39227j28147l8908J14306r4720
751d0625J3624J36309j41952n4398J51331o4300l3045J10338j08436n2182J53456
762G0120m7001o6132R1258p8069l7461J54721o4501r4410J10633m8671m7176J44254
774H7565o8699j11484J24177q549o6023J03784n1683r8944J24287J0524q7804
785d2849P6987k9698q5044J28272Q740j18143P4919L710q1290J12975N677j28780
797g4524P2611L6970p6717P5720N896j15476P2406N6700q6065M5457J8149j02036
809g0909P5393O4327j07537K9216M1347q7025O5475N7805j14238K0944O2757o9774
821c2219L9681M7561j04658J9206Q0588o6542R896M9539r0331J9957R0721p5911
$$ y = [-56195, 96041, -6086, -34116, 48169, -60402, -32383, 106844, -21303, -60211, 54095, -40625, -27001, 109308, -32644, -87042, 64289, -11, -33056, 77282, -31154, -83336, 70120, 23119, -43013, 48245, -29824, -67285, 87436, 22935, -71475, 39158, -9513, -56689, 87565, 18866, -92618, 31559, 23010, -43013, 60771, 9088, -89856, 34431, 44955, -42849, 34138, 4440, -80604, 47668, 56408, -61735, 13184, 16894, -64396, 48579, 54256, -74524, -1913, 35057, -41660, 34060, 39956, -75520, -3114, 53586, -32479, 12978, 31127, -70909, 4484, 68811, -38726, -9510, 31837, -55188, 10287, 68092, -46146, -25202, 37555, -32219, 7462, 55023, -49635, -30429, 50159, -16383, -6487, 43052, -47279, -27322, 63399, -12512]
833a2512j2059N9725p0704J6853Q2782p9535k2012O8956m8109K809O6791p1251
845a8266k5720P9524l3957k0767N8765n7037k5896Q6410l2626l9836N7065m0035
857a2376k2101P9095l4319m7448N5770j9488k3857O1979k9536m9790N7500j604
869A3825l6118M7994j9713m8587O1286M122m8280M0344r449m1028N7233J801n2169
882b8739L3895L884l3797M2525K941n1215K9283J9094l5775K7803P994m9128L0548
895f87K5345m1164J9116J1493m0483K8951K2280m0686J1609J6308k8811J8629
907A900J9527l6035M609K4567k3169O757J9842l2329L363K8967k3462N43J8520
920A3600k6040N169K4513k0972l343J5570j4812J282J8524j5157q592J7286p057
$$ y = [-12512, -24571, 35154, -35550, -18697, 64085, -15450, -37462, 31494, -16615, -13806, 52985, -18266, -43986, 35538, 1581, -19186, 39579, -17458, -43354, 43056, 10430, -29406, 27659, -12376, -34477, 44618, 10299, -37149, 18621, -867, -24724, 37255, 7719, -42071, 15429, 13825, -22293, 25701, 5988, -42599, 18687, 22809, -25471, 14873, 5424, -35604, 21629, 23430, -28739, 5156, 9040, -24757, 17768, 20709, -30506, -1223, 17871, -17904, 9899, 17893, -31235, -687, 24658, -16506, 2610, 14103, -26380, 2571, 24851, -15835, -4226, 12082, -16729, 1900, 21427, -14608, -9999, 14568, -8601, -1844, 17998, -14331, -10968, 17999, -5463, -4920, 13600, -12440, -7271, 17242, -3730, -7073, 8497, -6315, -5033, 13491, -1666, -10258, 7028, -29]
933b9n496J6154j2170r200J9038o512p294J2727r506m760J4210n181o102O593
947B472k672k984O704k09p640L777L652n510L551J927p287L929L353m416J474
962A21M55j493J23J745J109m813K282L660o606L719L673r131N173M515r153M273
978c48M777q539K682O572q425k38J0009r243k666J3313j0930l521J6438j3108
992c227m420J7973j3593m084J8096j3925n424J8882j1494p884J8776r767j1192
1005a1283K1756q151j5641K3941p681j7691K6980q308k0286K8442p800k0369K8304
1018A2213p156k1882K7535l509k3916K5945j77k7154K6213L769l1416K6787O432
1031A3684l4510K7930P920l6567K8250R149l7365K6870J1352l7138K3961J4119
$$ y = [-29, -5525, 10629, -1541, -10741, 8297, 1785, -5509, 7218, -2288, -7048, 7162, 1981, -4121, 2472, -200, -3184, 3520, 3311, -4329, -552, 3100, -2410, 1141, 3068, -4219, -290, 3063, -1353, 121, 576, -917, -794, 951, 2060, -2753, -471, 3189, -3417, 302, 3975, -5156, 17, 4532, -4621, -348, 4429, -4110, -1428, 5144, -3281, -3519, 6490, -2753, -5419, 7894, -3036, -6557, 9881, -3227, -7647, 10326, -3267, -7351, 10745, -3180, -8604, 10278, -1216, -9100, 9676, -91, -11283, 10473, 2322, -13319, 10622, 2941, -14750, 12230, 3922, -16364, 12078, 4278, -16091, 12213, 5057, -16825, 10710, 7201, -16715, 9230, 9053, -18101, 8112, 11881, -19535, 7252, 13684, -20826, 7104, 15024, -21543, 6707, 15856, -21509, 5361, 16713, -20425, 3536, 17655]
1043A7655l7891K1141J9344l9424J7457K3312m1629J6938K7712m4544J4468L0119
1055B4658m4490J4876L1115m6101J1571L4155m2464Q226L4477m3009M266M0734
1067B8014m0624k139M1900m1284k846M8543m2627r254M9130m0458p217N1385m2783
1080a0260j3522N2763l5488j4338N0592l6686k0523N6635k8437k6742N3169k9658
1092b495k8082O1890k6557l6949N7626k3551l2523O1889k4766m2439N8742j3863
1104H922l8313N5102j6601m7093N8147k388m9192N0239o009n1795N9816L355o0452
1117c6262M9555L984n4204N7009O492o6039M6615J6575n4985M5281J2483o6423
1129c9919M2483K9553o0642L4121K1651o7646M2732L8025p1551K7840L3059o6161
$$ y = [17655, -20236, 905, 20249, -19175, -1718, 21594, -20035, -3097, 24615, -19929, -5461, 24658, -19832, -4956, 26159, -19942, -8371, 25784, -16680, -8454, 26023, -16986, -12720, 28014, -12610, -14749, 27151, -14133, -16979, 31564, -11063, -20317, 28813, -11645, -18862, 32523, -10260, -23782, 28981, -6507, -20845, 29747, -6939, -27462, 29173, 736, -26006, 27163, -2495, -30577, 31313, 4756, -32193, 25433, 1882, -30641, 31248, 6482, -35957, 22785, 8922, -29391, 25711, 9110, -37983, 20164, 17776, -31416, 18823, 12814, -38981, 20835, 24190, -36262, 13293, 17277, -36927, 20082, 26574, -39465, 7150, 23725, -31260, 14021, 26504, -39919, 2564, 32117, -28525, 5596, 27247, -40399, 2333, 40358, -31193, -3353, 29706, -36455]
1141c6455L8325M1270p5743J9847M5365n8629K4217M1522p2311J4442N7028n7786
1153a8908R787M6336p0540J3453O8628o5488m519N6920o2310O793P0426o4950
1165a4372j6910O3100m5334m155O1957n9573k1307P1899l8568j8989O2307n6248
1177a6193k5083Q5797l8632m0083O6307m0698k9979Q2770l3436n1483O2258k0377
1189A168l0237O8990l3242n3794P0384j0645m3563O6579k9234o1792Q3902L57
1201B8873o6669N8395r697n8868P5499N411p2317M6856N477m8003O4473j416p7185
1214d9171N5130K0953o0811N6739P147q7353N9934M3127p5792L3767K2490p2384
1226d6224N0346M2424p4102K0301K7910n5994M6857L4194q5163K3533N0882o2777
$$ y = [-36455, 1870, 43140, -32603, -12756, 32609, -26020, -1803, 39719, -32592, -18150, 38878, -18908, -9121, 37215, -33325, -19872, 48756, -16732, -21251, 35669, -26641, -19848, 50578, -14372, -31282, 31818, -13516, -17671, 44286, -15287, -36594, 35305, -3263, -22252, 40055, -16193, -41276, 44521, 5889, -34194, 32113, -8585, -38564, 44206, 10770, -40713, 21545, 1168, -29069, 39921, 6679, -47115, 23269, 12624, -30939, 35640, 6406, -55386, 28516, 28873, -37796, 20599, 10902, -47966, 27533, 32944, -39373, 7483, 12960, -35043, 29430, 28014, -49171, 5959, 26912, -33899, 22840, 29987, -57366, 2568, 45695, -30097, 3670, 26160, -46224, 4122, 46546, -27556, -7255, 20655, -35339, 11518, 45712, -39451, -15918, 34964, -27813]
1238b7813L0247M4952r0082J6006P4924o0837L69M5114o7002J4723O7588n8483
1250a0294q347M2634n3337J9552O4083p3677j5874O9098m7624l916O9513o9503
1262a7692l0034Q5224l1064k7606N3483n0350j8439P7866l4033l3109N0010m1791
1274a7535j2741Q2037m4949n3440O9691j9639l4420P4719l3969o4322P2863K077
1286B0372m3398N0300k7470m6273P3280l200n1187M6311j9207m2974P8083k520
1298C2117p5819M8366J2692n1057N9557N703p8825M3891L0528m7106L7804r23
1310A6928o3652N2858K8872n7347K9694P924n9543N4386L6897p6430J6399L5729
1322B2715n0981L5052L5891p5116J2173M7726m2378K1642K3044o8536K4104N3048
$$ y = [-27813, 2434, 47386, -42696, -26690, 48234, -12603, -12234, 32880, -34122, -19399, 48189, -10294, -18641, 23993, -29344, -9792, 54291, -19386, -35260, 33838, -13786, -17702, 51811, -17692, -47726, 37498, 6434, -21172, 32311, -18039, -36478, 41388, 7355, -25754, 24256, -17535, -30276, 51761, 6812, -46628, 23063, 3424, -30996, 43723, 9754, -54568, 18295, 20372, -23026, 27274, -196, -46469, 26811, 23611, -27576, 18735, -472, -43446, 34637, 32117, -43702, 4664, 17356, -33701, 25856, 31559, -47266, -3375, 27153, -19953, 17851, 16928, -46724, 6134, 35006, -22341, 7353, 15277, -44266, 10120, 47017, -29413, -13014, 22715, -28266, 6786, 42677, -32439, -20266, 27460, -14918, 6724, 29768, -38768, -14664, 38384]
1334C8384n0752P544K9584o0010K1705O1852n8231j3850M5334m1053R468N4521
1346D4496n8202j7287N3468l0488K240M1882n7853r751O3344l0477j5348M0141
1358B6165m4719j1716O7965k8154l6194M2051k3411j4048N9248l0844m0771M7565
1370A3137j1626j6643M7571l3671l7274N6232m030l0363L6983k1782l4623N7195
1382B1106J734m5502L0011n111k9855N1686k436n2100L2946O650k8444M1799o909
1395A5575n1020L7706J7325l4134K6677r22m4673L7412K4066m2954J5079R886
1407A0023l6800L4843K1519n0107J3392K0021l1042K7308J5751m9787J4072K9905
1419A9098k8259J2310J4850m2108J3661L6390l1255j041J9675l2880J3121L5423
$$ y = [38384, -12368, -4824, 24760, -35250, -13545, 48307, -9924, -23774, 21560, -19493, -10025, 44496, -13706, -30993, 22475, -8013, -5773, 36109, -21744, -31495, 31849, 1372, -13976, 26165, -18554, -30270, 37695, 9541, -26653, 15398, -8013, -22061, 37187, 6343, -34428, 13137, 1511, -15132, 32439, -1232, -38506, 17726, 13696, -16667, 20316, -1466, -36089, 21106, 22840, -22662, 7349, 2238, -27617, 24069, 21633, -30467, 2479, 9129, -19315, 22484, 15575, -35445, 2261, 19586, -14548, 12129, 11207, -33466, 3946, 28012, -14942, 137, 10023, -26777, 8066, 29585, -20522, -7130, 12891, -18151, 9157, 24908, -24879, -10807, 19098, -9161, 3149, 17999, -24109, -10448, 25942, -5313, -6354, 13321, -19559, -6438, 28985]
1431B8985l6695o365K6331k4219R235K8371l6747p015L2264j6783j334K2560l0354
1444a1766o658L6829j5100j2711K1716k2262n155L7065j8391j8868K4016j3855
1456e140m863L0719j9730j9531K6038n361r427K2179j5328j9082K8650m14j7664
1469h954J7825r720j6394K9455j725k2826J6561l594j2643K4445l823k3096J5451
1482I62L915j1985J5690k252k1460J5614R612j6177R613J100j8535J6558R519
1495A2174j9202O678L971j3351J3838O438j8529M575Q132r331P124N530j6226
1508h179L356J2322r630J857O195j4009M736J2601j1372m15O112r387M652R034
1522G873r996k209O624m134J152O496p897l589R111k662k545N647o390k193R246
$$ y = [28985, -7710, -14075, 12256, -11963, -2728, 25643, -11104, -18119, 14145, -2638, -3972, 18588, -11766, -18424, 18405, 3305, -9406, 12310, -9952, -15107, 21958, 3567, -15301, 8715, -5140, -10003, 20716, 986, -18545, 7493, 2132, -7295, 14884, -444, -19526, 9124, 8710, -8954, 8871, -849, -17243, 12212, 10487, -12339, 4222, 628, -12015, 12430, 8607, -14489, 962, 4877, -7108, 8582, 6330, -15130, 484, 10096, -6081, 3532, 4632, -13903, 2655, 12174, -7028, -350, 3621, -9730, 4108, 10546, -7983, -3408, 4724, -4607, 2517, 8047, -8179, -4823, 7499, -2131, -274, 5921, -8088, -3352, 9249, -2123, -2538, 3574, -5813, -1161, 7873, -2123, -4332, 2292, -1842, -690, 5806, -2091, -5680, 3431, 769, -1776, 3871, -2519, -4712, 4534]
1537D534l441l377L917l709j5N721k600l337J861N87o40K247n03m100K255K598
1553A998k321R89j26k630K280J564j659o05OO49k66J002M17l425J932K269l355
1570a281J904R04m133K958K043m002J350K018l424J167L467m479l56N247m695
1585a312p78O301o043r55P670o690r46P604o786j067P852o433j889Q247n383l661
1601d269Q848m769n072J0404m520o849J1533m524p326J2534n254p916J2921m373
1615A368q168J2192l874q779J2094j850j0607J1555m62j1827J2588P23j4174J2821
1629C600J642j4548J3450J487j5594J3286K874j5292J2094L409j5840J1454N777
1642G799j6670R793P304j7598R873R475j9557R071J0556j9703R274J1136k0522
$$ y = [4534, 1093, -2284, 1633, -2076, -2091, 3630, 1030, -2307, -446, 141, -499, 1748, 1245, -2855, -600, 1998, -323, 666, 540, -2090, 190, 1754, 95, -510, -504, 145, -121, 881, 1298, -2127, -195, 2074, -1281, 623, 1527, -2606, 352, 2395, -1607, -257, 1761, -1663, -496, 2971, -1508, -1864, 3383, -1312, -2090, 4211, -1832, -2787, 4883, -1807, -2753, 4851, -1935, -3002, 4850, -1583, -3472, 4775, -608, -4269, 4579, -190, -5262, 5142, 622, -6227, 5306, 782, -6544, 5990, 736, -7180, 5741, 1368, -6800, 5392, 1518, -7261, 4833, 2983, -7624, 3931, 3469, -8358, 4230, 4953, -9221, 3600, 5242, -9306, 4144, 5631, -9963, 3323, 6197, -9095, 2999, 6408, -9432, 2022, 7799, -8871, 922, 8226, -9372, 501, 9976, -9581, -510, 10046, -9657, -383, 10753, -9769]
1655i769Q588J2168j9998P401J2668j9762N713J4820j9502L470J6435j9714K193
1668e289J8375k0139Q27J9784k0407j1K0492j9937r87K0816j9157k606K1562j7413
1682d090m907K1999j6339p041K3697j5022r864K4348j4216j0734K5938j4218j2824
1695a3273K5891j2597j2702K5677j2392j4792K5684q841j6077K4372q179j8136
1707a5365K6048m990k1081K4609m103k1355K6689l008k4370K4887j089k2474K5138
1720I536j540k5482K3943L343k4677K1296L261k7247K2222Q742k8537J8102Q319
1733A1281k8073K0853J1074l1051J6572J2047k7544J7991J2184l1859J4524J7361
1745A5360k7618J1893J5791l0738J0913K2755k8577N533J9640k8500R056K4361
$$ y = [-9769, -1181, 10987, -9011, -1610, 11058, -8704, -2991, 11829, -7673, -4203, 12232, -7482, -5289, 13086, -7053, -6226, 13558, -6849, -6860, 13632, -6305, -7292, 13524, -5633, -8239, 13323, -4090, -8997, 13002, -3337, -10378, 13319, -1703, -11567, 12781, -1435, -12169, 13769, -449, -13273, 12618, 21, -12681, 12996, 604, -14188, 11496, 2655, -13422, 10950, 2771, -15365, 10683, 5693, -15388, 9221, 5118, -16237, 10452, 7444, -16926, 7961, 6872, -15602, 9536, 7996, -17486, 6457, 9800, -14877, 6419, 9680, -17567, 4655, 13397, -15140, 2962, 11281, -16792, 4061, 15135, -15916, 656, 12703, -14841, 3150, 15334, -16525, -2001, 15360, -12258, -365, 15426, -15312, -4399, 18356, -10221, -4688, 14952, -13548, -4492, 19869]
1757A9869l0418K938K2894k6460O729K4370l0874k11K7987k3152j021K5280k7205
1770i274m258L2075k0984q087K5753k3348m403L3145k3361j1426K8866k0518o148
1783a1968L2910k3174j6344L2550j3325j3197K9419j7883j8901L3781q527j8820
1795a3479K6343j4514j7186L5844j0410k4226K8477r544j8992L4741q385l0275
1807b1606K8008J763k2548K6163l543k9952K7242O689k5146K1192k515k7532L1005
1820I220O586l2639K0787M598k8019K8011R698l6742J5583J5202k4524J7499R677
1833A4937l3634J5093J9182k5506J3152R198l3586K0277K2525l3417Q406J6502
1845A3129l0295J5578K4921l4183R3K3141k1050P673J9995l1650Q42K7288k1161
$$ y = [19869, -10549, -7611, 15283, -11177, -4448, 19922, -10952, -11163, 16824, -6328, -7349, 17931, -9274, -13532, 18543, -2441, -10528, 15225, -8123, -12526, 20619, -2742, -14168, 14698, -5820, -11968, 20942, -2232, -18576, 13974, 649, -12548, 16871, -1012, -19913, 13868, 5341, -13479, 12864, -1650, -18836, 17008, 6598, -17628, 10849, 1305, -17687, 17054, 8669, -21606, 6402, 8165, -14383, 11780, 8237, -21715, 5527, 12216, -12930, 8262, 5747, -21785, 9220, 15806, -16833, 3954, 8552, -19467, 8544, 18242, -18500, -2917, 12285, -12239, 5260, 14937, -18697, -3604, 15578, -9928, 3224, 12422, -21164, -887, 21638, -11779, -3373, 13129, -17166, -1588, 23333, -10850, -10757, 12384, -8666, -993, 19002, -12648, -11806, 15482, -5679]
1858e679L274J9399l2912L849L4503k5610o734K3921k4830m64L3723k2988j4803
1871a5351K4412j3062k862K6034k3268j3462K9589j1848p862K5285k4244j3785
1883b0424L7485j0847j9063K3684j4058j3943L3742p889k4149J9932m349j0971
1895a0850K7268j1297k4931K5714m18j6280K5444j1022k7201L1471N376k4819
1907a1545J8188l516k2135K7717O318k7292J2517L148j6640K4296K354l1160J6328
1920a422J0965k0018J9269L304l2972J8604J8401k3410R233N921k5126J7331J7786
1933A7866k4807L078R832j8566J5682J5243k9757K788J8737j7663R408J4590l0300
1946a3869K995K5187j6380J33J2383k3056M436K4864j7298o042J3344j6250M753
$$ y = [-5679, -2405, 16994, -15918, -12069, 22434, -3176, -9910, 14011, -10819, -11283, 22440, -548, -15351, 9061, -4001, -6863, 19171, -4097, -17559, 12030, 182, -7680, 17605, -6639, -20424, 17061, 6214, -12849, 10835, -3223, -17166, 16576, 8687, -15462, 4470, 121, -10850, 16418, 5121, -19810, 5904, 5486, -10794, 14650, 3628, -23573, 7898, 13274, -11545, 6643, 3127, -19008, 8709, 15027, -12265, 252, 3400, -13240, 11056, 13410, -17750, -1422, 9543, -10475, 8794, 12098, -20874, -2270, 16131, -7279, 1954, 7875, -17251, 80, 17866, -6941, -3863, 5969, -12597, 3085, 18328, -11429, -8641, 10096, -7567, 1841, 16431, -13869, -10874, 14313, -2067, -1934, 10449, -12607, -8171, 16693, -605, -6647, 6697, -9553, -4800]
1959d800K3466k1421r991K0428j1459k42K0775k2111r981K5028p749o130J4927
1972A0740j7483o469K5660p682j2264J3358j1003m898K4948j0128j7988J7018
1984C809l872p212K0859j1216j8402K0273Q04j0112J4149r514j4648K1269K594
1997H781j5111R954m015j1764K0564K067k0581R659K973j0777J6840q9k1473J1562
2011a410P780j1043J0647r70j8217J2764J0547j3672M674K015j4169J2745J0700
2024A2391j7705J758P167j0967J0594P855j9270K607J1285r042N803N205j6924
2037i243M036J3802r255j62N320j2427M476J4286j1659m176Q429q668L852J2175
2051A0786j3724m238J1075n467J147Q202j2049l448J2965l492l542O110q412k388
$$ y = [-4800, 18666, -2755, -12746, 7682, -3777, -4019, 16756, -5355, -15336, 9692, 1943, -4187, 10740, -6743, -13212, 12448, 4766, -7498, 5860, -5143, -10041, 14907, 4779, -13209, 3809, -63, -7275, 13584, 2368, -16034, 4239, 5043, -5069, 9080, -434, -15082, 6187, 8781, -6330, 3624, -391, -12155, 8409, 10476, -10105, -446, 2527, -8250, 8590, 8501, -12972, -1410, 6370, -4673, 5974, 5004, -13213, -449, 10098, -3574, 1100, 3115, -11054, 1691, 12391, -5314, -3556, 3611, -7356, 3238, 11093, -8177, -5570, 5715, -3327, 2476, 7681, -9243, -5207, 8595, -660, -822, 4498, -7929, -3453, 10833, -826, -5002, 3427, -5241, -1389, 10786, -2938, -7176, 3899, -1568, -421, 7781, -4268, -7716, 5249, 1757, -1785, 4325, -4087, -6475]
2065f475J3720m303p577O882m838j605J2128o301q339Q133j431j952Q116o187
2079b9p220R091J166m658M801l851n790R710J406p812M005j226m217R165m86q644
2095d589M202J116k892N952j432p447M267L661l490K526n74o187M899M342n386
2110a032Q11Q31m296N084K785o151O65J906k144L246J078n286M80L524j245K63
2126E19R59l963P66M415k329r35J104k603J539L268k741j343J152m70J094J182
2142A614j970j379J467J168o36J87r69j168K228P03j493L0m70J09J398j6j149
2159c46p48Q56Q30n33M31p30j219K181K03j687R73m36q47K096k31j810R26N60
2177D69j129J164P55k727R59K118k647J010J659l394J514K333l417J039K067l380
$$ y = [-6475, 7245, 2942, -4635, 2247, -2591, -4196, 7932, 1631, -6708, 1425, -6, -1958, 6158, -29, -7249, 1842, 3008, -1650, 3151, -700, -6490, 3220, 4626, -3186, 819, -407, -4624, 4541, 4055, -4589, -387, 729, -2163, 3789, 2357, -5090, -823, 2838, -652, 1874, 1300, -4887, 12, 4354, -1032, -221, 610, -3686, 1398, 4183, -1968, -1303, 603, -1541, 1705, 2783, -2503, -2023, 1501, 256, 519, 1478, -2485, -1719, 2696, 367, -568, 536, -2067, -528, 2740, -1, -1344, -192, -662, 432, 1614, -356, -1735, -268, 900, 264, 451, -518, -1686, 542, 1245, -248, -218, -688, -579, 819, 803, -346, -1094, -238, 592, 59, 490, -240, -1459, 722, 925, -762, 211, -225, -1072, 1024, 793, -1017, -91, 469, -660, 504, 1259, -1468, -509, 1609, -1038, -28, 1631, -1763, -249, 2084, -1333, -294, 1773, -1607]
2193a607J374K385l365K81K909k920j26L438l311o28M345l640q71M661l910p95
2209a780M879m193r48M938l567j341M854l410j791N145k743k881N463k432l232
2224c039O106k801l988O725k523l933O572k839m129O914k134m628O141j629m690
2239c875O400o97o018O078R5o363O690J25p447O962P32p180O555N50p587O540
2255A560J669p455N481J769p554N516L074q486M558L872q364M684M397r418M376
2270c21N121r200M378M860r480M077N628q867K934N753q763K379P146r112J394
2285b073P528q864J074Q507r545N63Q920r187K87Q883r018l20R245q362j086R274
2301E826p811k043R968p420k969J0417p127l802J1036p012m320J1357o827m855
$$ y = [-1607, -233, 2152, -1213, -932, 1977, -943, -1069, 2369, -942, -1570, 2775, -865, -1736, 2925, -985, -1780, 3099, -1094, -2042, 2896, -671, -2012, 2842, -568, -2359, 2786, 43, -2838, 2625, 193, -3039, 3067, 266, -3722, 3003, 480, -3453, 3119, 280, -3849, 3065, 931, -3697, 2444, 815, -3875, 2525, 1828, -4190, 1888, 1983, -4380, 2310, 2435, -5012, 1950, 2682, -4498, 2057, 2607, -4980, 1560, 3229, -4226, 1255, 3024, -4530, 986, 4060, -4426, 132, 4004, -4360, 324, 4721, -4697, -321, 4800, -4400, -22, 4838, -4642, -565, 5063, -3804, -870, 4883, -3880, -1501, 5645, -3467, -2073, 5455, -3409, -2335, 6172, -3373, -2810, 6110, -3077, -2790, 6093, -2925, -3245, 6000, -2362, -3448, 5826, -1985, -4028, 5940, -1480, -4449, 5968, -1159, -4961, 6075, -937, -5257, 6100, -727, -5582]
2315e582J1494o096n364J0995n299o067J1090m156o980J0648l517p620J1361k913
2329A994q872J1155k008r078J1388j919r881J0969p58r522J0230p03j0072J0083
2343C006J029j0396Q920J348j1165R895K745j2418Q332L624j1861R207L474j3073
2357g333Q050M824j1521P333M144j2455O969O429j1987N346O200j2598N911Q610
2371G922j3397L494Q564j2200M580Q957j3222K418R419j0681K796Q435j2294J551
2385c658J1219j0604K4R912j1572J38J3311j0790l173J1697r485j371J2818j0486
2399b020l944J1924p608k063J1458j0252m439J3709o545n463J1852q200o222J5216
2413G403n289q943J1661n254o140J4035n787r241J1705l669n970J2527n867j0261
$$ y = [-5582, 5912, -184, -5548, 5447, 148, -5919, 5171, 1015, -5965, 4683, 1166, -6454, 4907, 1994, -6878, 4277, 2269, -6809, 4579, 2660, -7221, 3748, 2990, -6532, 3698, 2995, -7077, 3006, 4035, -6361, 2559, 3907, -7258, 2637, 5382, -7036, 1296, 4920, -6941, 2266, 5740, -7333, 717, 5541, -5980, 1353, 5497, -6958, 11, 6440, -5547, -201, 5999, -6599, -688, 7922, -5475, -1981, 6583, -5617, -1037, 7920, -5302, -2884, 6535, -4146, -1350, 7085, -5209, -3658, 7561, -3043, -3019, 6893, -4679, -4541, 8770, -2020, -5193, 6504, -2981, -4352, 8466, -2020, -5964, 5960, -1648, -3711, 7747, -2505, -6944, 6765, 220, -5243, 6609, -1591, -7813, 7403, 2114, -6829, 4832, -422, -6562, 7473, 1686, -7555, 4150, 481, -5489, 7038, 1171, -9090]
2427i090J3404q39r695J1162k890j1516J3602J684j2354Q935l60r655J2525M67
2441E380j2984R006J554r344J1329M07j4609R521N871j1352P438L059j4083Q506
2455c01Q287j2336M051M317j1445Q824O776j3817M082O080j0514P605O781j5470
2469g080L179J0594r822K540P573j3423K217J2434r849m79P047j1157M084J1413
2483I271j2054j356R043r498K950J1173j2753l756J2438o146j755R908j0896l923
2497g354J3992n604m303Q325r180j707J4359p513o790R590o029k584J3351p335
2511A218r522J1096j393m985J0051o111r260J2518N5p353Q076n378p032J3830
2525E810j212j0306P790j832o504J2242j072j2463P407K903o725Q647j101j2179
$$ y = [-9090, 4314, 3475, -6220, 4942, 2052, -9464, 4138, 5822, -6532, 2403, 2043, -7612, 4913, 5380, -7604, 1402, 2956, -6388, 4941, 5348, -9261, 260, 6131, -5221, 2217, 5276, -8807, -301, 7986, -4350, -299, 4018, -7427, 1397, 8173, -5644, -1562, 4518, -5996, 1609, 8390, -7080, -3901, 6693, -3129, -589, 6984, -6439, -4222, 8212, -1637, -2116, 4931, -6226, -2142, 9271, -2783, -4139, 4904, -4594, -1644, 9529, -3224, -6980, 5458, -688, -2443, 7465, -3431, -7354, 6638, 1034, -3269, 5056, -4124, -5831, 8528, 1015, -5775, 3815, -2214, -4798, 8553, 1218, -8304, 2792, 1399, -3586, 6465, 354, -8906, 3612, 3667, -3686, 4390, -988, -8020, 5810, 4598, -5708, 2082, 250, -6254, 5988, 4916, -7547, -140, 2763, -3962, 4685, 3584, -8595]
2539h595Q878M915q473O436j199j0617J0798M870j1070M218J784q388R185M763
2553G505j2790K815N576o685O108L595j2779L584Q349p354L374K905j1501N322
2567a976R488r004P7M258q270M678Q723r976k370O941n122K522P196j0693j986
2582e514R783m717m5N782r977l95J1265n271l365N265o492J63J0445n735o056
2597d864O376k886p50Q785o804o400Q717j217k542O725o771m954J0234q46m922
2612b119M623m175l544R824r69p632M331n59l048Q208j999q738N776J797l792
2627b016O064k858p511P065L051n201K924j350n392P044K972p056J423J461m012
2642c392N924J988q491K115L956l721L936O82p814L230M988l876J175O10n531
$$ y = [-8595, 283, 5198, -3275, 3161, 1962, -8655, 2143, 7013, -4057, 161, 1945, -6443, 2742, 7505, -5285, -2470, 3106, -3579, 2529, 6124, -6655, -3071, 5278, -2076, 1298, 4203, -7298, -1976, 7512, -1492, -1415, 2843, -5427, -749, 7974, -2002, -4372, 2569, -2553, -31, 7165, -3528, -5514, 4269, -448, -493, 5289, -4688, -5083, 6182, 911, -2454, 2811, -3681, -3518, 6927, 1192, -4864, 1512, -1374, -2124, 6661, -143, -6543, 2174, 957, -1585, 5140, -1631, -6585, 3649, 2803, -2119, 2504, -1671, -5215, 4609, 3640, -3992, 339, -220, -3268, 4940, 2941, -5797, -21, 1776, -2016, 4048, 1190, -6321, 744, 3795, -1406, 1518, 168, -5224, 1820, 4792, -2264, -841, 620, -3392, 2532, 4520, -3971, -1856, 2100, -1621, 2315, 2997, -4817, -1587, 3401, -475, 700, 1310, -4221]
2657d221L559N235m949j037K342l666L087M499o460j202M181k471J949K774o423
2672b803j56N304j979o6J512m579M85N595k276k503K015k507P43N119l461l256
2688b813L326j111M11L391l974k287L956j37o82J556k864j420M227K88k770J071
2704A68j071q40M050o98l539J566K15n53K954j619k960K044R63m60Q88j273j860
2721b025K095J625j519l05p7j258K255J055k649R0N36k73J703j71k216J60J161
2738A87L49J57m85j211J85J808j19j059o4m51M49J353p20j042J94L16O15Q9n97
2757d6o78K16J145j68p20K71p43M38J410j078o49P37m34L92Q95j179q47J163L84
2776E09q08P07l61j286J764K16j596J133q0j516K180m9k077J523K05j400J526
$$ y = [-4221, -662, 4573, -376, -1413, 929, -2737, 350, 4849, -1611, -2813, 1368, -1103, 846, 3620, -2803, -2959, 2345, 366, 300, 1812, -2767, -2282, 3313, 1037, -1466, 549, -1958, -1215, 3904, 443, -2813, 513, -598, -187, 3204, -770, -3057, 899, 762, 80, 1636, -1228, -2648, 1579, 1867, -903, 168, -903, -1743, 2307, 1609, -1930, -364, -149, -702, 2252, 633, -2327, -283, 680, 220, 1108, -165, -2025, 70, 1695, 176, -129, -206, -1464, 791, 1846, -803, -713, -177, -450, 1253, 1082, -1134, -974, 187, 536, 693, 208, -1003, -818, 990, 871, -188, -252, -703, -254, 1099, 379, -663, -469, -153, 462, 551, -46, -724, -508, 637, 469, -251, 20, -723, -285, 1125, 47, -602, 135, -299, 93, 988, -191, -1038, 125, 509, -299, 408, 47, -1239, 525, 741, -855, 278, 198, -1318, 862, 813, -1264, 259, 464, -936, 590]
2793E90J95k209J323J239k074J105J054k726J378J741k986J362J485k965J596
2808A08J584l109J144J825k838R74J855k739N29K456k812K53K728l048J56L183
2824B249l434M1L406l346K2L329l297k00L552k949q37L463k528j216L979k403
2840a69j935M258k312j962M646k811k239M996k352k358M505k376k392M868j945
2855D22l052M501j397l027M610j002m274M911m57m140M965q60m726N456m39m639
2871c148M859l96m603M948L57n142M110P77m943M375J260n929L987K154n876M060
2887H50J948o458M005K752o348L641K453o308L571L224o227K452L739o126K258
2902e74M407o680J494N198o407J597N057o916J156N731o345Q70N325o357P05N869
$$ y = [590, 785, -1424, -101, 1138, -936, 169, 1223, -1503, -125, 1616, -1370, -8, 1477, -1488, 108, 1692, -1417, -273, 1552, -1286, -312, 1543, -1196, -667, 1789, -1023, -770, 1958, -1090, -934, 2249, -1185, -1144, 2262, -1084, -1062, 2267, -1030, -1230, 2322, -627, -1464, 1999, -529, -1745, 2234, -169, -2104, 2154, -158, -2120, 2526, -285, -2524, 2472, 120, -2238, 2267, -109, -2501, 2367, 422, -2630, 1871, 474, -2553, 2057, 1055, -3219, 1692, 1235, -2905, 2060, 1200, -3526, 1930, 1491, -3148, 1711, 1315, -3288, 1660, 2017, -3125, 985, 1762, -3181, 1194, 2454, -3475, 512, 2666, -3210, 850, 2798, -3660, 345, 3097, -3251, 390, 2843, -3465, 106, 3330, -2897, -445, 3294, -2832, -574, 3833, -2847, -1353, 3845, -2562, -965, 4092, -2824, -1668, 4063, -2282, -1412, 3913, -2444, -1739, 4130]
2918D130n749m85N899n457q42O776n642j659P101n264j778P318n552k089P387
2933D094m973k297P187m563l017P364l901l667P396l390m254P479k926m673P699
2948C558k754n337Q037k489n452P817k132n921P712j392o043O963p41o348O784
2963B262J54o944O283P17p132O734J067q079O406J666p816O336J659q245N897
2978I65K736p872M900K724p862M735L957q173L754L960q084M286M760r052L501
2993g65N331q443L595N138r007K612O350p555J562N561p788J599O936p316k5O568
3009D353p394R54P951q254r99Q135o891l88Q052p674j846Q531n268k032P200n997
3025a567k517Q954m640l922P621n123l037R723n033n619Q854l548m258R041m258
$$ y = [4130, -1619, -2104, 3795, -1662, -2504, 4272, -1370, -3029, 4072, -1192, -2970, 4348, -1204, -3293, 4094, -879, -3176, 4011, -552, -3569, 3795, -106, -3773, 3623, 233, -4021, 3458, 532, -4141, 3558, 804, -4533, 3504, 1015, -4437, 3380, 1248, -4673, 3039, 1647, -4396, 2567, 1826, -4522, 2262, 2416, -4528, 1755, 2472, -4660, 2074, 3141, -4938, 1468, 3134, -4682, 1654, 3313, -4932, 965, 3701, -4171, 729, 3453, -4409, 326, 4283, -3890, -136, 3824, -4260, 26, 4786, -4266, -765, 4566, -3877, -282, 4856, -4151, -1539, 4811, -2744, -1182, 4379, -3409, -1810, 5126, -2190, -2215, 4353, -3041, -2087, 5864, -2390, -3389, 4746, -2145, -2533, 5519, -2155, -4001, 4530, -738, -2770, 4430, -1567, -4084, 4870, 230, -3692, 3929, -1194, -4231, 5492, 459, -5160, 3694, 146, -4112, 4929, 671]
3040F71o238Q630j580m915P082l178n936Q881r17o822P161j965o609R598m81q906
3056e524P126K12o429P967j05q859O330K173o308N846m0q190O762L232p861M847
3072A179J427q353O999M364r957L758L667p330N469L949r583K667N202o078L499
3087H79L345r205L286O883p148J232M628q745L166Q177q374o89N859o485K187
3102a004P079q359j297O712m668Q79N847q210j331Q921m541j923O073p053j394
3117d269R957m877m385O225m592r80Q665n472m921O691k369j691P081n490n299
3132e726Q534j050m417O125l964n244R407n26o549M992k037l786Q516j510p280
3147d515M956L15l582O678j552q104N911K965n309M509o40p658P012L577o944
$$ y = [671, -5567, 3063, 1483, -3432, 3650, 472, -5464, 3417, 2500, -4322, 2839, 874, -5735, 3863, 3382, -5524, 1602, 1814, -4615, 3352, 3247, -5612, 718, 2891, -3417, 2429, 2389, -5801, 961, 4193, -3668, 1179, 2606, -5747, 1252, 5616, -4341, -583, 3084, -4246, 1223, 5172, -4411, -1744, 3458, -2620, 879, 4224, -4981, -1695, 5188, -1960, -728, 3900, -4845, -1679, 6498, -1876, -2565, 3294, -3191, -1004, 6075, -2284, -3581, 3131, -1537, -658, 5189, -3021, -4352, 4569, 28, -1895, 4178, -2875, -4269, 5688, 811, -3574, 2651, -1941, -2921, 5744, 272, -4649, 2042, -327, -2018, 5063, -427, -5726, 2808, 1758, -2659, 3466, -498, -5742, 3665, 3139, -3410, 1582, -455, -4241, 4275, 2765, -4515, 441, 756, -2826, 3852, 2300, -5804, 107, 3072, -2237, 2272, 1632, -6026, 986, 4563, -2381]
3162b381K759N27n677O757K839q017K071K499m242M908K097q543K403N184m633
3177a449K638J890p939L299O253n517M84K137n922L791N637o630q27L689l955
3192b421K864M431p019j389N916k857M28L844o882n19P293l004j578L000n081
3207b974N05P001l757l249L325k465L71N724m271m322N007m80j288M497m346l890
3223d612O742l30k797K996l460k141O653n94m525K362j111j406N589j143n713
3238c490K992J336k019L996j739n366M430K076k911K239j659l724M823J997m010
3253a029P97p6k168M110J541n260O21K207j909K956M71n434J770L280k065J291
3269A103k00m037K531L368k697m45M00k110K287K945l556j563K265j140J498K029
$$ y = [-2381, 378, 905, -4772, 1985, 4824, -3193, -1122, 1377, -2865, 2043, 4140, -4403, -2000, 3184, -1449, 1189, 3079, -4860, -1561, 4692, -825, -341, 1796, -4126, -335, 5302, -1328, -2155, 1534, -2421, 443, 4874, -2145, -3534, 2382, -475, -47, 3797, -3085, -3604, 3689, 685, -893, 2107, -2974, -2469, 4532, 775, -2474, 851, -1614, -1243, 4481, 210, -4112, 895, 415, -873, 3624, -722, -4612, 2130, 1800, -997, 1999, -1461, -3602, 3051, 2457, -2068, 294, -817, -2223, 3366, 2223, -3490, -498, 838, -1181, 2815, 1076, -4290, 140, 2216, -695, 1544, -115, -3839, 984, 2981, -1029, -232, -308, -2476, 1634, 3175, -2085, -1464, 743, -1166, 1790, 2261, -3173, -1403, 1877, -188, 1103, 903, -3134, -603, 2765, 68, -377, 23, -2087, 200, 3145, -411, -1974, 291, -849, 649, 2678]
3285B678m268o24L352q98L46O37l130K67L532q80j420O06j747P54L168j631k360
3302a618J392k54L38K401k432j976K211L62P3O51k090p12K372M19r38k78q15k63
3320a157K340K85k200l0M12Q9J607o40k182Q82R60O0N65j145j148J000J189k07
3338F80q39l06k84Q16J134j054r39L85J90P74K23j295m25P91P92oo34m33k25P22
3358F7J138j166o01L88j68P47N09j433k20Q60R5K32o5r39j64J352K8r42M75n31
3378c38l53J763o27j429J311m77l30J623j067j214J442J9p37J052m73j372J524
3395C17N31j667J111J70j863K020M44k360J570K92j809K005J09k246J516O72j721
3412i09J189P50k265J100J583k511Q55J614k675J188J636k964J086J895k867J125
$$ y = [2678, -1590, -2214, 1138, 240, 586, 1223, -1907, -1640, 1892, 1012, -408, 198, -1549, -795, 2373, 742, -1618, -226, -480, -142, 2259, -173, -2149, 62, 424, 497, 1148, -942, -1654, 718, 1137, 199, -79, -894, -1157, 1183, 1468, -732, -762, -350, -261, 1346, 706, -1476, -594, 366, 426, 991, -154, -1302, -302, 887, 680, -159, -465, -749, 67, 1201, 147, -792, -407, -217, 557, 780, -515, -940, -149, 643, 637, 3, -430, -655, 67, 1205, 39, -562, -174, -342, 405, 914, -519, -739, 121, 216, 448, 383, -556, -720, 632, 660, -282, 193, -338, -691, 1072, 445, -984, 327, -150, -480, 1143, 76, -1138, 304, 323, -414, 638, 165, -1207, 317, 848, -819, 292, 462, -1401, 619, 1063, -1297, 273, 565, -1244, 761, 870, -1376, 140, 812, -909, 280, 1030, -1235, -135, 1448, -1063, -208, 1406, -1269, -81, 1555, -1409, -323, 1572, -1295, -170]
3428a70J709k768Q15J893k584N68K147k390m7K733k748j92L030k777l09L184l016
3445i22l53L460k834o21L118k448o85L357k395j351L474j925j465L462j977k053
3461b158M201j729k312M011j897k357M373j601k749L947j280k592L953r69l376
3476b535L845k93l293L681k73m095M140L56m057L812j22m104M317N29m567L404
3492G45P48m161L669J105m773K854J788m367K878J871n279K979K646n103K566
3507A66K331n305K782K967n187J810K848m778J942L425n167J122L857m582R45
3522h24M047n229L03M922m903M28M441n268L80N087m577n35M717m374n19N254
3538C350m132j649N402l703j596N529l699k401O099l433k441N926l670k615N988
$$ y = [-170, 1539, -1229, -414, 1479, -1105, -537, 1610, -780, -827, 1906, -842, -1034, 1996, -781, -1090, 2094, -922, -1275, 2185, -649, -1270, 1848, -600, -1285, 2072, -323, -1674, 1800, -125, -1590, 1872, -105, -2158, 2043, 314, -1998, 2013, 116, -2241, 2132, 531, -2218, 1729, 449, -2143, 1810, 841, -2535, 1310, 1017, -2276, 1405, 1132, -2963, 1177, 1533, -2524, 1288, 1166, -2938, 1379, 1908, -2659, 745, 1493, -2668, 1001, 2106, -2667, 187, 1975, -2392, 486, 2357, -2922, 57, 2703, -2400, 166, 2497, -2808, -26, 2941, -2246, -436, 2412, -2366, -424, 3001, -2166, -1044, 2813, -1769, -824, 3223, -2006, -1703, 3219, -1684, -1256, 3185, -2083, -1703, 3384, -1193, -1728, 2989, -1385, -1904, 3350, -782, -2431, 2971, -732, -2328, 3201, -498, -2899, 3200, -233, -2674, 3252, -418, -3033, 2955]
3553B955k779k993N489k579l110N689j853m028N647j458m420N816j157m843N825
3568B201r28m791N758r31m900N603m48n032N244J7n238M828O94n577M531J330
3584B361n849M257J920o213M290J871o138M213K125o124L838K149o091L632K912
3599C153o035K646L440o109K378M203o340J473M655o068J805M540o425J356M822
3614C494n839J406M504o016Q20N445n432j97N292n208m42O183n087j545N878m521
3630a265q24N971n179j576O245m207j244N682m774k101O787l312l025N592l145
3645c75k952O768k558m331N738k214l162O604k756m716O390j631l681N879k283
3660G20m939O204J33n188M795n57n138N834Q75o081M333L74m934N720M22o648
$$ y = [2955, 176, -2817, 2672, 93, -3017, 2672, 819, -3209, 2438, 980, -3440, 2376, 1219, -3624, 2201, 1273, -3518, 2240, 1309, -3591, 2012, 1564, -3468, 1776, 1793, -3445, 1383, 2077, -3500, 1031, 2361, -3488, 769, 2689, -3524, 766, 2637, -3501, 712, 2837, -3287, 551, 2700, -3391, 241, 3153, -2882, -236, 3204, -2905, -527, 3676, -2664, -1191, 3464, -2604, -799, 3741, -2684, -1328, 3494, -2345, -939, 3565, -2451, -1631, 3814, -1618, -1815, 3477, -1731, -2173, 4010, -1077, -2622, 3256, -1265, -2089, 3882, -1297, -2873, 3372, -835, -2079, 3603, -1171, -3272, 3515, 203, -2822, 2770, -375, -3327, 3441, 883, -3448, 2290, 76, -3086, 3518, 762, -3954, 2436, 805, -2876, 3003, 720, -4219, 1985, 2118, -3070, 1725, 1168, -3970, 1864, 2739, -3342, 991, 1365, -3569, 2151, 2573, -4075]
3676d075M660J512n023M707O14o631M180L330n530K726J813n914L705L704o004
3691b226J647K762n521L834L711p251J747L938n052K762L303o718J186N184m240
3706i34L62L379n617J012N804m736r15L963m781J209N886n668j638M899l456K09
3722a022N104n417k192N938k039j591L969m139k013O586k068l250M288l431j624
3737b901O869l056m218M579j504j654N389k941m469M963J94k652L894k391m338
3752d236O011O27m329L114j392l423O113K57n613L097J47k797M958k82n755K912
3768e91K253k865K971l00n327L631L321m191J586L07m496M343L084n342Q56J523
3784G63l014L464K179n639L15L368k235J607J827n474Q45M843k821j87J776m623
$$ y = [-4075, 585, 2097, -2926, 1781, 2395, -4236, -56, 3274, -2256, 470, 2283, -3631, 74, 3778, -2226, -579, 2183, -3338, 496, 4207, -3044, -1297, 2641, -2411, 351, 3654, -3064, -1878, 3306, -934, -572, 2807, -2810, -1798, 4006, -730, -1645, 2318, -2463, -1254, 4632, -1036, -2674, 2225, -1231, -1022, 4082, -1335, -3527, 2411, 372, -1219, 2750, -1389, -3402, 3184, 1116, -2134, 2154, -1277, -2901, 3968, 912, -3306, 1273, -231, -1885, 3504, 563, -3906, 1057, 1251, -1401, 2493, 102, -4236, 1775, 2402, -1927, 1187, -205, -3628, 2485, 2742, -2871, 226, 373, -2424, 2534, 2252, -3503, -591, 1662, -1203, 1768, 1468, -3859, -228, 3093, -1098, 488, 795, -3701, 642, 3726, -1616, -760, 763, -2251, 1213, 3392, -2247, -1932, 1436, -799, 808, 2635, -2839, -1994, 2849, 28, -159, 1617, -3006]
3800c006J877N008m030j132K056k726J663L965m146k087L339j084K73K861m094
3815a263j898M828p71j296K212l671q11N399j459k587J782j928J69M436k070l562
3831b490K332J00l75K931k213l462L564J003j829K033k080k572M366O83k771J156
3847C76j206j225L918K24l743P89Q09p15K578k98l998J513K322j573J477q34l242
3864b828K704K224k075J19o11j438K540J712k817o75R06n26J721J027l287l49
3880a653K435o90P71K77l270R70K712r61m14j43j746J326K342j477j470N45k07
3897f53Q68J746k066j687J672M83J15O28k032p01K188L52n68k70j229K97K046
3914A189j87j494k89K78K16J596p36j802O18Q42K73N47j244j236J205J002j19
$$ y = [-3006, -1129, 3879, -151, -1283, 773, -1953, -290, 3675, -471, -2558, 781, -303, -30, 2831, -1263, -3161, 1667, 896, -400, 1812, -1859, -2670, 2729, 1270, -1317, 465, -1463, -1294, 3142, 1072, -2490, -158, -58, -433, 2498, 285, -3177, 387, 1390, -439, 1594, -486, -3058, 1308, 1991, -780, 376, -830, -2055, 1863, 2087, -1656, -867, -58, -773, 1805, 1507, -2491, -978, 1344, -229, 1248, 414, -2828, -124, 2100, 25, 144, -467, -1905, 635, 2347, -470, -1145, -239, -765, 956, 1983, -1304, -1653, 782, 92, 863, 1140, -2130, -1160, 1552, 591, 177, 34, -1712, -386, 1956, 479, -991, -446, -653, 215, 1961, -105, -1792, -120, 363, 478, 1106, -926, -1627, 561, 913, 345, 75, -1154, -857, 1189, 1002, -492, -781, -503, -287, 1309, 573, -1229, -611, 231, 504, 1051, -193, -1429, -224, 778, 659]
3931F59n32r01j01J069J006r12j074K58L68Q09L08j318n95Q20N54L90n94j052
3949h38K24P75O76m44j014J34J73R54J62j346j91P47L4O35l44j135K07R64N8k39
3969A92l85l25R1J291m47j051O46l26J92J309j237q04J083j55l3P64j072p01J294
3988C26K34p79M34k90p80J440K32j519P26J06r48J640j48j825J344J21r01J185
4006E98j66j550J139P68j323P09M39j643J036J185k025P80Q21j792J172R85k170
4023a037R06J035j674Q18R34j909O11J458j845K05J680j953J84K020k152P6K065
4040A422k167N5K159k203p7K267k063k07K242j885l83K309j847p35K505j533j071
4057a212K716j615j369L072j507j504K841j526j380L064j442j700K751q97j609
$$ y = [659, 127, -774, -875, 194, 1200, 288, -786, -528, -160, 649, 957, -361, -956, -136, 418, 808, 214, -838, -614, 161, 837, 393, -621, -487, -314, 640, 802, -544, -735, 12, 46, 681, 337, -798, -591, 373, 431, 192, -193, -518, -427, 864, 417, -634, 12, -314, -122, 1187, -50, -854, 229, 74, 41, 805, -267, -968, 326, 560, -219, 215, -75, -855, 585, 817, -702, 24, 130, -818, 822, 674, -1151, 193, 314, -587, 598, 432, -1118, 21, 789, -534, 175, 614, -1029, 7, 1192, -833, -53, 768, -1024, 148, 1133, -1037, -131, 904, -770, 48, 982, -927, -316, 1142, -703, -498, 1182, -771, -587, 1433, -719, -643, 1422, -745, -690, 1469, -734, -811, 1456, -607, -814, 1428, -457, -840, 1469, -378, -1113, 1392, -141, -1212, 1504, -111, -1480, 1592, 85, -1419, 1422, -104, -1484, 1580, 138, -1562, 1189, 292, -1317]
4072a317K577p82k248K825j67k513K793n92k439L073k36k842K945l88k535L125
4088A279j52l030K514L86k624K570K34l242K266J294l121J975J116l638K436J731
4104A994l650J819J221l452K381J660l579J337J772l014J446K132l750Q54K936
4119B107l390Q19K507l802O88L543l533K61K900l678O89L438l611k66L201k852
4135i79r3L412l068j049L854k583r26L751l130j140M299k527j410L710k631j375
4151a885M134k134k088L671j707j932L988j737k611L791q45k757M065j408l074
4166b529M273q15l146L831j009l053L985m15l420L269L8l344L517L69m080L288
4182G59P22l862L270Q68m430L276J342m247K966J130m243K861J648m101K097J766
$$ y = [-1317, 1260, 478, -1770, 1055, 888, -1625, 1168, 576, -1863, 1210, 974, -1868, 1077, 689, -1846, 1279, 1127, -1903, 611, 997, -1627, 943, 1177, -2065, 201, 1495, -1626, 349, 1465, -2173, 263, 1994, -1656, 163, 1384, -2068, 313, 1973, -1606, -269, 1503, -1511, -65, 2067, -1683, -829, 2107, -1283, -464, 2043, -1759, -1071, 2472, -1061, -800, 2100, -1578, -889, 2549, -1062, -1328, 1873, -979, -1072, 2340, -728, -1777, 2077, -506, -1432, 2319, -811, -1951, 2348, -179, -1589, 2121, -510, -1885, 2249, 115, -1973, 1698, -9, -1941, 2047, 310, -2301, 1490, 645, -2112, 1953, 545, -2529, 1744, 929, -2217, 1614, 605, -2448, 1537, 1122, -2298, 971, 1009, -2335, 1182, 1551, -2529, 759, 1481, -2381, 889, 1757, -2673, 603, 1945, -2302, 664, 1794, -2449, 412, 2060, -2041, 56, 1822]
4198A822l985K150K414m443J678K539m149J683K822m397J117L265m340J147L091
4213B414m005Q34L096l729N42L228l648J13L612l573k40L850l497o43M201l428
4229h73q20M159l277r98M204k855j173L854k721j488M188k115k060L950j859k402
4245b286M586j893k846M369j473k752M312j550k973M264j167k583L638j169k956
4260b479M025k55l674L584j39l572L932L68m395L279P03l652L452L32m125L077
4276D61J038l218K532N51l925K952J772m028J923J427l874K578K406m487J244
4291f48K369l420J923K116m512J317K837l145J085K053l987J044L431l246n9K616
4307A774l434N62M023l718q83L326k794L72L546l828q72L732k258k73K855l174
$$ y = [1822, -2163, -13, 2401, -2042, -364, 2175, -1974, -291, 2531, -1866, -749, 2516, -1824, -677, 2414, -1591, -757, 2339, -1390, -848, 2380, -1268, -1155, 2457, -1116, -1356, 2494, -1003, -1646, 2555, -873, -1693, 2466, -811, -1809, 2395, -460, -1633, 2221, -500, -1988, 2200, 85, -1975, 1975, 116, -2286, 2300, 407, -2439, 1930, 457, -2295, 2017, 467, -2506, 1758, 591, -1992, 1646, 477, -2479, 1546, 1291, -2383, 1201, 1062, -2510, 1422, 1790, -2605, 674, 1377, -2275, 1177, 1509, -2616, 461, 1499, -1719, 813, 1364, -2561, 391, 2163, -1865, 58, 1485, -2389, 189, 2595, -1892, -648, 1721, -1699, 224, 2340, -2172, -855, 1982, -1163, -78, 1975, -2012, -968, 2463, -783, -842, 1774, -1660, -1098, 2925, -793, -1676, 1650, -1144, -772, 2774, -1054, -1926, 1806, -452, -725, 2130, -1044]
4323a044j043M242j709j757K902k494j210M652j969k615L212j657q58L756k072
4338C36k756L312n61j390K985j886k688L679K05k439K331r79k607L931M18l508
4354a617K012j52k057L560k03l702K005Q71j743K530l63l679K282K055k583J290
4370E06K99l379K808K184l306O71P87k466K622J560l775N03J803j864J669J225
4386A847l609N45K729j688K13J206l282R53L404k314o70J313k257J196K936k852
4402c30j074J915j157P88J963k780j307K881n09m28J438k557p35L527q19j461
4418f45J292j805j38L376j318k104J363m10M6K285j646k442K123O52p40J384j437
4435a64j975K754P53j699P97r90j137K805L49k359M77L9l31J987j56k663P86J339
$$ y = [-1044, -2087, 2155, 446, -1311, 1591, -903, -2113, 2539, 570, -2045, 1167, -490, -1348, 2408, 336, -2420, 892, 331, -1059, 1926, 40, -2648, 1031, 1236, -1203, 1128, 149, -2458, 1473, 1891, -1617, 395, 243, -1814, 1746, 1543, -2159, -154, 717, -1026, 1504, 1141, -2538, -256, 1799, -784, 506, 805, -2574, 234, 2418, -888, -217, 570, -1896, 726, 2286, -1489, -986, 817, -1047, 622, 1847, -1762, -1217, 1512, -176, 37, 1243, -2039, -1086, 2318, 4, -666, 647, -1610, -414, 2522, -330, -1404, 511, -646, 142, 2105, -675, -1982, 899, 390, -38, 1400, -1157, -1892, 1635, 816, -645, 647, -1158, -1296, 2080, 762, -1342, 21, -389, -343, 1942, 296, -2146, -23, 629, -111, 1273, -164, -2139, 615, 1368, -331, 466, -524, -1661, 1144, 1493, -866, -389, -350, -681, 1306, 1150, -1513, -727, 612]
4453F12p43J161m36k522J465J881j266K38m21j703K035J387j945l10J80m20J505
4470F98Q76k333m60J362j11O95L37k441K43K015m53nj88j614R16J877r10q84O6
4489c14m14R34J242j256j320P99L64M72O67j642q85J639L58k56l2j246m7J722
4507G85N5q76l65k90M43J269l21j427O3M80M17O16p15j231P27Q59J6r0r19m23
4527i27J202N01l40q47l09M12P74M26r23p50N30N67K97r2j157k8P70M96j27o90
4547b15l05K50P65J89q21n16M35K75N50n0j196P0Q52qJ45m86n45L40O96R9o33
4568a09k20m8K77Q37l86j035N80L0J31P15r85n22R49J17k21J90o44k36R23K44
4588E87p50J19m3l70R97Q6j314O38J55l80Q26j61j216P26N11n22L71p6r41O70
$$ y = [612, -131, 1030, 594, -1928, -463, 1418, 152, 390, -31, -1734, 301, 1688, -257, -567, -387, -807, 698, 1574, -759, -1219, 143, 32, 727, 1064, -1377, -1134, 881, 428, 423, 235, -1379, -463, 1414, 504, -380, -314, -728, 206, 1448, 192, -1128, -329, 35, 507, 1174, -468, -1353, 286, 644, 388, 356, -890, -937, 785, 840, -36, -401, -691, -248, 1021, 700, -727, -664, -184, 233, 849, 134, -1097, -370, 489, 505, 415, -504, -927, 275, 776, 436, -411, -720, -308, 466, 892, -31, -781, -251, 316, 613, 521, -636, -664, 106, 602, 475, -215, -520, -270, 495, 684, -137, -653, -218, 57, 607, 557, -639, -569, 283, 275, 420, -66, -611, -271, 425, 524, -109, -329, -377, -100, 737, 351, -684, -104, -74, 57, 772, -213, -735, 214, 331, 110, 300, -344, -580, 343, 587, -163, -44, -87, -457, 540, 626, -688, -50, 105, -275, 551, 390, -826, -100, 411, -111, 260, 184, -757, -87]
4608h7Q51j045J10N27j069Q50Q03j537L68P12j105Q97N83j560M82Q66r38L05O28
4627F41j086J54J032r90k54J286j328J70J358j289m00J439j255Q1J413j297k98
4644f23J376r95l55J441r61o60J592o41q71J458o96r79J705p75r74J729p36r18
4662h83J640n90r84J597n47j283J573j50j252J435j09j632J726J17j834J719K2
4679E65j798J809J66j978J730M5j587J594K79k017J234Q52j773R67Q91k191J165
4696d7J295k197R56J011k266J272J251k240Q59J003j739P74J267k060L95J349
4712H83j604L87J658k189K43K121j931o9J814k253L60K220k060l78J924j839K43
4729d70J906j828p17K095j190n20K109j669j027K594j161j065K209j604r64K661
$$ y = [-87, 764, -281, -171, 356, -713, 137, 940, -597, -229, 483, -622, 275, 858, -702, -220, 646, -292, 13, 641, -445, -291, 741, -249, -503, 783, -545, -375, 983, -306, -706, 733, -522, -441, 972, -325, -623, 753, -242, -597, 844, -117, -777, 815, 174, -697, 761, 65, -914, 791, 16, -958, 771, 35, -883, 757, 167, -817, 780, 233, -1050, 523, 373, -879, 556, 447, -1185, 541, 658, -1176, 543, 565, -1233, 576, 742, -1236, 494, 539, -1048, 546, 825, -1192, 42, 894, -879, 88, 979, -1212, -47, 1248, -949, 7, 1018, -1248, 24, 1275, -965, -106, 897, -842, -68, 1199, -861, -466, 883, -721, -334, 1324, -865, -622, 1499, -432, -501, 1313, -940, -580, 1640, -420, -798, 1126, -713, -470, 1436, -392, -1109, 986, -204, -724, 1385, -284, -1311, 1283, 122, -943, 1266, -338, -1302, 1359]
4745A359j230j302K097j064j015K459r72j767K097k73j488K203n72k229K433n7
4761F79j975K193m83k056K588j38k077J820p0j973K173L82k435J572O17k047J872
4778F42N03k708J560J242k379J423Q24k687J767J164k510J160R48k308J453J494
4794A588k556O08J579k215Q02J895k781L78K168k292N44J749k482L27K270k245
4810f63Q3K046k357K09K283k105l96K214j737m79K409j844q24K545j641p16K483
4827A510j907q49K731j529j078K419j447j170K562j080j523K295q17j463K544
4842A198q76j826K513o06j907K582o39j966K533n59j867K321l06j932K000P8k099
4859a358J880L58k157J709N35k451J986O20k664J936O67k387J737N97k475J578
$$ y = [1359, 129, -1173, 924, -140, -1155, 1304, 332, -1435, 662, 389, -1099, 1104, 532, -1697, 736, 679, -1296, 897, 414, -1642, 946, 808, -1269, 551, 481, -1492, 681, 1063, -1372, 200, 817, -1230, 642, 1145, -1563, -3, 1239, -1140, 283, 1107, -1580, 187, 1351, -1159, 1, 949, -1359, 94, 1588, -968, -360, 1219, -996, -194, 1701, -1080, -702, 1466, -826, -282, 1467, -1015, -688, 1582, -663, -580, 1466, -891, -682, 1601, -504, -900, 1314, -423, -902, 1507, -337, -1161, 1384, -257, -973, 1510, -397, -1246, 1485, -44, -1122, 1297, -150, -1320, 1242, 162, -1361, 934, 117, -1346, 1198, 322, -1504, 1009, 403, -1504, 1078, 439, -1527, 1006, 447, -1420, 901, 595, -1337, 663, 741, -1358, 522, 880, -1277, 432, 967, -1484, 502, 1122, -1542, 394, 1061, -1326, 411, 1008, -1467, 111]
4875A11J019k355J306R15k049R61J442k339P95J417k279R59J539k561P32J617
4891A230k217P19J632k362K90K088j959K24J541j969J48K178j974m58K026j688
4907e51j64K282j980p45K382j600j97K041j861q31K280r15q27J688j247r42K327
4924A140p70j428J744p76j057K434q60j809K013n69r55K070q31j757J958J03j396
4941g46J446m54j721K037N04j955J146l2j502K144K45k310J214M98j393J719M2
4958H82k187J104J124j463Q63L32j991J163J451j718K87P77j942J407J363k209
4974g57K61J001j219R79R69k160J28J480q97M12O92j777K2K062j120n62J047j567
4992a006N23J989j466q73J188q80M39J493j731p54J472k80j74Q78j289q24J955
$$ y = [111, 1130, -1225, 81, 996, -1053, -92, 1350, -989, -194, 1223, -1056, -97, 1442, -1119, -387, 1230, -987, -268, 1364, -998, -708, 1380, -579, -355, 1186, -783, -635, 1543, -431, -889, 1137, -551, -715, 1567, -413, -1158, 1224, -376, -573, 1468, -393, -1224, 1056, 141, -686, 1002, -245, -1187, 1140, 370, -1058, 686, -90, -1147, 1287, 427, -1382, 631, 62, -893, 1177, 346, -1411, 547, 650, -746, 700, 246, -1475, 562, 1066, -889, 257, 225, -1277, 867, 1112, -1198, 16, 514, -879, 840, 882, -1305, -201, 923, -540, 323, 655, -1336, -173, 1278, -440, -153, 624, -1318, 89, 1452, -757, -496, 505, -714, 265, 1234, -926, -798, 682, -215, 197, 889, -888, -866, 1196, 76, -486, 561, -1006, -483, 1506, 40, -833, 355, -525, -86, 1407, -324, -1078, 394, 114, -60, 818, -471, -1295, 660]
5009F60n1r35Q25j049m55K087m49j482Q41l73p4J584p78j425R25L13l06R97p60
5028I5j371J339O93r13M36m66r88J694N13j415K86q8n52J601mj527J45N36p2P99
5048G41j37j574M33J162m88J59j37j285J039J119j063k9j06o06J160O07j211n27
5066g43O25rN47L62j357k40J129Nk8J17j331L73J454n63m14l2o01O44Q64n45p66
5087e09K45K01L28N82q65r00P95M43m9J77q65l89J187K47m58k37m30J72R34N3
5107F62q61l22J78M76N30k72j108J95P54R1J21n39o63O45O38k30j91n44P3O10
5127B43K91k27p49M2M95K95J87q69k73N47L08J63l85n91J16N73K33j63o45K1L35
5148e3M42R2p76k16N16J70K71l07o77K65N15P2j07m07j33K87N47j45q64K92J88
$$ y = [660, 609, -326, 499, -550, -1005, 1082, 633, -849, -8, -381, -455, 1129, 351, -1074, -149, 164, -142, 855, 95, -1276, 63, 756, -157, 279, -187, -1175, 519, 1032, -383, -97, -185, -737, 864, 860, -667, -522, 14, -58, 741, 604, -970, -537, 625, 137, 296, 159, -1126, -87, 1032, -31, -60, -166, -772, 388, 995, -216, -743, -118, -127, 420, 782, -575, -815, 314, 319, 291, 408, -923, -550, 904, 341, -73, -105, -706, -62, 802, 257, -509, -264, -63, 265, 847, -18, -918, -123, 320, 271, 448, -417, -806, 381, 628, 170, -67, -497, -325, 609, 662, -199, -521, -343, 133, 663, 391, -717, -522, 232, 323, 444, -95, -758, -113, 525, 295, 104, -440, -367, 243, 534, 307, -442, -400, 95, 390, 577, -292, -565, -18, 290, 453, 68, -523, -407, 166, 399, 236, -409, -388, -53, 389, 481, -295, -511, 5, 175, 446, 139, -538, -273, 242, 314, 207, -200, -333, -46, 501, 356, -508, -216, -28]
5169b8J31M26m89o69N38L36n9K21n75l03O58L49m88p6k52q3N49L56p53J5J82k59
5191b73P44n1q71J96M55l39M70k43o82O01L85l70m3L6m92N26O38q21r2M05m78
5212b99L34O33j125K50N95n67L75K63q37j4P90m78m3M28n74o4R75o49l89Q24o55
5233b27j10J004r13k27J044p50k13R60p57k71R20l23n40O97k66m78Q33j99p43
5252e59J012l97n31R93m33o98J061m00n66R64l23o11P72l8q45R22K9q67Q72mj090
5273g37J040K50j271R74K11j192R93L11j319R94J40q97O76L46j142N48P69j182
5291d88M39O97j345N60R88j427N00O18j324P72Q79j391L09Q86j171L89Q79j279
5309e09J57J054q59r6J004j298m9J543j236j81J024r71j49J565j123m64J296r85
$$ y = [-28, 103, 529, 40, -629, -91, 245, 186, 407, -168, -471, 187, 536, 48, -28, -280, -363, 186, 542, -211, -196, -14, -273, 471, 420, -451, -255, 200, -139, 331, 88, -594, 7, 392, 22, -21, 15, -477, 49, 687, -134, -226, 179, -299, 35, 668, -457, -207, 388, -179, 196, 459, -378, -392, 398, -80, -123, 305, -269, -333, 642, -7, -396, 428, -227, -337, 667, -246, -473, 571, -179, -392, 568, -189, -460, 460, 137, -403, 294, 28, -450, 383, 184, -559, 453, 56, -475, 518, 85, -613, 448, 48, -518, 446, 123, -488, 284, 246, -599, 323, 352, -515, 357, 353, -737, 303, 553, -718, 256, 467, -725, 268, 579, -740, 254, 394, -503, 173, 519, -623, -75, 694, -488, -49, 648, -697, -137, 851, -576, -76, 542, -782, -10, 869, -522, -213, 673, -498, -109, 770, -509, -352, 702, -157, -253, 751, -547, -596, 947, -289, -470, 554, -417, -566, 999, -124, -588, 708, -277]
5327b77j69J324r63p87J561m90q89J455q53r10J841n81q96J291p11q25J732o31
5345B22j007J236l97o59J303l50j261J200J60j112J189k15j398J413K44j268R98
5362B98m7j254J467K03j589J059K11j215J291L27j582P11Q35j401Q43O37j771
5379i77Q81J003j445N67O93j819J091R69j572M17Q12j277N21J167j590J7J279
5396G37j313K59J312j764J33J617j268j29J321j603J39J702j342m18J279j064
5412d02p1J483j073p88J597q02n68J608j171q87J896p12p57J432j025o76J713
5429G97n72r84J387n68q99J701n66j255J450l25j024J566k75j565J441K26j380
5446h45J391k13j381J576J22j470J179P0j375J304M95j749J097M79j610J254M45
$$ y = [-277, -446, 878, -85, -872, 689, 199, -690, 765, -88, -998, 843, 262, -634, 657, -54, -879, 853, 222, -785, 451, 54, -605, 698, 348, -913, 287, 447, -665, 524, 309, -1089, 324, 568, -700, 298, 251, -1003, 464, 667, -922, 137, 348, -867, 424, 751, -831, -120, 715, -686, 157, 794, -977, -96, 907, -538, 29, 722, -1097, -6, 963, -609, -192, 620, -657, -136, 1031, -559, -542, 737, -576, -317, 995, -769, -636, 981, -287, -416, 905, -698, -559, 1143, -199, -617, 662, -402, -473, 1010, -63, -851, 746, -56, -624, 984, -187, -1074, 822, 110, -647, 785, -240, -916, 797, 225, -759, 628, 60, -839, 862, 296, -959, 491, 166, -858, 708, 433, -1132, 309, 535, -845, 546, 333, -1048, 528, 650, -820, 359, 429, -946, 358, 853, -896, 201, 680, -930, 324, 769]
5463G69j772J056P24j567R59N50j646R58Q41j518O27O71j235M31J050j449K63
5480b88J076j399K16J311j538J88J377j507K05J199j458K17J267j298o7J250j023
5497b72k54J363j149k17J291j045l68J412r16m35J568j075n75J510r47m45J330
5514G76r21o30J471n25p86J115m46q74J561m42j082J304l65r41J397l62j173J331
5532D08j37q61J012j66j193J229J68j076Q19J73j164J005M86j457Q76L15j181
5549g44J111K90j459P87M64r56P55K24j352O76R27j143M26M62j188O32R54j217
5567c51M9P24r76M99R80j440J64R33r43L73O19j146qJ067o15j15O75r56m2J341
5587H32q28m21Q36q54R5J194q57o32R11m63L3Q76q90n34J040l4m44N95o94l68
$$ y = [769, -1003, 53, 777, -790, 169, 719, -927, 31, 872, -646, -19, 652, -583, -152, 898, -551, -288, 788, -611, -395, 916, -622, -434, 943, -564, -359, 840, -618, -401, 866, -432, -499, 751, -272, -526, 837, -312, -529, 762, -283, -651, 761, -155, -590, 978, -97, -672, 838, -109, -554, 776, -145, -775, 696, 171, -615, 500, 54, -820, 741, 299, -783, 521, 156, -785, 612, 250, -923, 408, 271, -590, 422, 256, -937, 292, 460, -616, 203, 376, -788, 217, 703, -754, 122, 437, -744, 367, 657, -802, -15, 449, -507, 248, 472, -880, -204, 723, -420, 6, 468, -720, -88, 866, -351, -302, 422, -554, -55, 925, -515, -351, 582, -361, 12, 631, -515, -523, 544, -71, -186, 489, -467, -509, 832, 4, -417, 419, -435, -340, 854, -3, -635, 276, -187, -154, 722, -168, -702, 338, 304, -140, 455, -239, -607]
5607f07J094pr26O54l54l17J221l81r81P25k32o6Q15m38r36O82L63k99K94l42
5627c8p44J004L93q36L67j67n96J155Q7j024J88J32j90P39o6j011J93O98j69m
5647A11J39r07L50R66n70k6p1o98Q11O72q35k52J72m8N28K21q87k43O91k9P2K64
5669D31q59j14R81j24k20m8n90K09Q90l64m27L8q9M47M27n22o69L74N02o4K96
5690E05o27n16P43K67k69j0m63l5Q93m1m27k09j81L25N75k13o62p1N45NK54k96
5712I2o07K60O15j15j06m22k52O36L46k25l56k78K87M50L9m29m93L28M88J6j06
5733A68n57MM95L05k80j98m42L85M76m8l57l90L47K59J35j86m37m3M95J01j2k68
5755d8l36K35N94j42l47l62K30K74L43l52m59J81K99MK61m78m08O38QK5n8l50
$$ y = [-607, 487, 480, -446, 208, -146, -463, 758, 377, -604, 121, -111, -177, 638, 200, -736, -54, 309, 10, 304, -38, -782, 222, 615, -221, 146, -21, -617, 538, 625, -399, -211, -79, -269, 470, 404, -607, -414, 284, 115, 111, 250, -657, -307, 659, 89, 63, -8, -706, 105, 777, -58, -310, -138, -186, 342, 563, -324, -567, 124, 95, 167, 431, -428, -542, 439, 315, 95, 47, -543, -334, 556, 192, -235, -197, -286, 161, 588, 66, -603, -229, 273, 209, 505, -122, -638, 105, 372, 103, 93, -370, -405, 488, 447, 20, -189, -370, -45, 530, 317, -345, -416, 129, 134, 388, 92, -515, -255, 360, 245, 139, -283, -535, 101, 447, 222, -134, -412, -125, 325, 364, -65, -558, -230, 258, 274, 168, -389, -385, 110, 415, 135, -63, -505, -120, 356, 308, -49, -439, -92, 167, 302, 116, -321, -364, 131, 232, 220, -48, -384, -149, 445, 303, -44, -406, -176, 98, 441, 89, -370, -189, 110, 114, 375, -103, -511, 127, 135, 160, 102, -248]
5777b48p6N67O9l03k31m8R2N58k3n89J45K29j93L21j76m43J91M09j66M9j03l81
5799c50L73M21l40j79J91l13K52M08o57j16M94l01K42K27p01N7N86l14L7K09n32
5820c06O8O73l68k82K03j39J5N97l42n02M88j82k3N99o82k21O39k20j38L23l03
5841a03j87N87o0n14M69j82m02Q08k92o06O86j56l57P42l27o86Q05j71l13N19
5861B60j44o49O88J19o76M85J16n47N16J52p13N45K48p53N02J97q01O11J65o74
5881c53M19L05p92L75M13o69K22N26o88K01N33q77K47O29q51K70O10q71K86N55
5901D90q77J68O35o57J59N28o38j98Q70o57k29Q17p31j19J030p55k31P75n08k37
5921c65Q57n66l70R07m60k61P87n14n77R77k93n08Q46n13o14J121k40p09P76k00
$$ y = [-248, -324, 243, 312, 9, -222, -270, -178, 380, 357, -232, -87, 142, -51, 270, 94, -349, -158, 251, 85, 134, 31, -350, 23, 444, 104, -75, 116, -197, 55, 463, -194, -310, 184, -117, 125, 352, -349, -292, 294, -20, 17, 226, -306, -238, 435, 67, -215, -12, -151, -136, 461, 119, -383, 105, -77, -100, 499, -183, -404, 235, 15, -123, 200, -103, -290, 297, 237, -277, 192, 10, -392, 416, 124, -482, 204, 48, -309, 433, 106, -580, 225, 54, -259, 260, 116, -533, 155, 274, -402, 83, 199, -348, 168, 320, -393, 152, 400, -353, 149, 346, -455, 156, 321, -353, 66, 371, -421, -46, 367, -302, -80, 446, -242, -41, 492, -385, -138, 491, -360, -90, 520, -351, -65, 490, -387, -219, 416, -241, -82, 446, -192, -390, 480, -177, -406, 411, -320, -439, 591, -164, -395, 380, -128, -365, 492, -74, -444, 463, 3, -258, 529, 15, -562, 415, 122, -386, 460, -53, -667, 454, 214, -495, 281, 81]
5941H1n63R49l11o96P78M3o34P08p5q99P69L69r82P08J6j041J006K66r65O10N5
5962A92p19Q21K29j053M74L95p41O14M02j265N18P90r25L29M58j279N70R36j076
5981c30K30M53r44N84P43j060qO97o86K69O69j010j17J109o23j51Q47j138MJ221
6001G59q94k04O95o79q2J175q54l42P07m10j71J023p49o23R29k02n02J056p14
6020h2o51J373l85p36Q24m41m31J183k67q60O35j77m08R42j63j139R07L08j026
6039e94R99j13j140J119K24r62P16j61q88J051K91j071M03L27p51O86N04j216
6057e76M26O73j007O65L84j295O82O62j039M16M85j059M05Q50r52J27N17q22L04
6076a54R07j131qR64r63J88P95j011Q9R08p90j5P61q59j6Q98o36l59Q29n10k28
$$ y = [81, -482, 467, 156, -540, 238, 281, -353, 355, 280, -619, 150, 519, -463, 245, 261, -780, 226, 492, -473, 137, 192, -527, 294, 523, -530, -56, 339, -402, 212, 614, -651, -133, 657, -268, 61, 519, -760, -190, 746, -330, -100, 353, -591, -7, 736, -324, -332, 365, -321, -52, 617, -393, -510, 599, -24, -175, 672, -466, -462, 759, -135, -339, 356, -323, -405, 770, -84, -426, 281, -129, -300, 723, -26, -649, 280, 78, -424, 632, -82, -733, 640, 255, -481, 343, -98, -529, 654, 387, -473, 162, -15, -423, 519, 356, -783, 124, 432, -594, 405, 292, -848, 271, 495, -467, 249, 88, -800, 251, 542, -529, -126, 201, -550, 136, 640, -576, -150, 523, -484, 181, 565, -730, -48, 614, -425, -9, 476, -583, -178, 672, -280, -153, 364, -458, -154, 753, -378, -386, 578, -385, -197, 598, -413, -324, 584, -206, -221, 540, -319, -335, 563, -73, -432, 397, -113, -341]
6097c41R11n92m91J033o20l84J062p09m11J006n52k16P64m71n21R92m09m30P38
6116C59j66o88Q37k4r51R49j67q22R83j6r27Q83no96P04Rp57P13P1o84N98J03
6138C06p83O19K79q40M66M08j005N95L93q94N87J92q09M98L47o25K13N49q05J92
6158a17N63o63P4O33q50K74O15q26J79N27o77J70N78q39J27N67m10p9N29n36j81
6179c42Q10m66k41N65n59j31R19n91l59P22n31K6O20n13l49N43k7l54O22n19k96
6200d51O77J4n37M16k00l88Q75j21o60N24r2k13P14l78o74N84N4k16L96k86n08
6221d70N21K67l93J48o6n08O75L95p71J23J31k39N98q3o59Q0L43n4K21ko21J69
6243a95N49k11k81J77m56K99N77n06j85K54l88N72J90n22k82L00J49J24K05o22
$$ y = [-341, 570, -22, -513, 520, -100, -484, 578, -131, -542, 464, -88, -304, 460, -11, -532, 460, 51, -379, 359, 193, -495, 342, 318, -633, 316, 149, -673, 310, 294, -633, 250, 245, -451, 253, 262, -495, 218, 289, -395, 203, 306, -477, 142, 421, -419, 47, 455, -550, 45, 438, -456, 131, 323, -486, 12, 359, -266, -53, 496, -309, -117, 446, -217, -143, 490, -360, -86, 529, -297, -118, 409, -268, -98, 480, -359, -232, 335, -75, -154, 375, -161, -342, 468, 2, -239, 326, -233, -364, 555, -36, -395, 327, -204, -178, 442, -71, -420, 123, 96, -258, 364, -155, -451, 226, 240, -297, 119, -81, -469, 406, 285, -375, 149, 57, -156, 558, 180, -494, 90, 144, -72, 324, 38, -470, 51, 318, -75, 73, 7, -501, 174, 569, -202, -79, 52, -187, 411, 328, -331, -251, 92, 38, 259, 257, -364, -195, 354, 143, -138, 39, -417, -118, 459, -47, -232, 22, -366, 206, 396, -126, -408, -108, 41, 165, 370, -252]
6263b52j98O96j16r0J22n81K14O40k78l37O6j87J94N01k87m09Q7J46K01K59l85
6284Fn11N39K40j65Q2l91k50P26J06l55j47j31J27N26k09k96j29R5J92K23r7m84
6306c03j9N90n7j8k46l87M69K72k69j62j84J31K93K49k33m20J37K16K63j71l29
6327a78k34M83J79p9j50l79K06L40J23l14k38M6K45K19L8m29j90L07K92n6j59
6348G2l85J07N08pj65k58o0K07K79j17l29r0K69P3K05l34l24K73J99J05P4n25
6370b23j18M60J91l38K6k67J39L59m4l04j74K59K8L00k8o48J35L74r4J76k65l91
6392d47M33J59j3r9j19j61K79L64m48j60J84n7K14K46n58p3L62l3J1J85n99J40
6414a90M39r4j18J2l33K00M52k56k73K38j97lM78l55j80K87j42K1L41m68j47N30
$$ y = [-252, -450, 246, 130, 40, 162, -419, -205, 435, 157, -180, -114, -301, -107, 394, 107, -302, -215, -69, 132, 391, 6, -505, 34, 274, 109, 191, -200, -450, 276, 382, 27, -120, -251, -124, 402, 193, -103, -232, -137, 55, 278, 181, -303, -322, 268, 211, 193, -53, -440, 29, 301, 32, -130, -314, -183, 110, 359, 126, -294, -157, 59, 322, 151, -178, -412, 71, 250, 171, 21, -358, -152, 188, 311, -3, -241, -195, 50, 269, 307, -122, -312, -5, 287, 231, 72, -313, -206, 302, 295, 130, -128, -188, 19, 298, 181, -148, -238, 31, 104, 309, -25, -349, -76, 123, 228, 302, -223, -341, 119, 310, -28, -2, -269, -130, 229, 185, -119, -293, -34, -6, 294, 266, -382, -247, 127, 33, 209, -56, -447, -14, 145, 132, 33, -86, -247, 32, 396, -52, -212, -28, -85, 129, 375, -183, -256, 106, 73, 84, 269, -330, -190, 249, 155, 37, 49, -284, -84, 368, 112, -161, 77, -120, -123, 355, 0, -180, 107, -35, -14, 327, -141, -288, 242]
6436B42k34p3J18j72q8M31Q2n32K50J03l30N52r2o03M63Q7m19N43l19l63N07o9
6458H4j95J42J7k09L47O2m89K92J61n58N49j0m99L26K26m94L65J05m76K96J93
6479B35l02J70J85n10J48L28m56K04K23l78j2N38o43J52M77n57J3M40m42R9L73
6500B85l67m8N21n68j5N01m32%M55m04j63O71n05k00P05n31k50O12l80r3N74m16
6522d8k34N43j22l27M66l09l70Q08k19n17N43q5n10Q22k57n29M83j35k50N50k10
6543I3n38N51J35m28L12P9p96Q00J60p73M73J20o47O35K14q10M29J94n14M53J97
6564C39q07K37N52m55K39K38q74M44O23p46K08K36o38L85N70q28R8M53n63L31
6584D2M62p97J1O08l57N4M25q26j5Q68m77j81M55o48J32Q69p41j95M56l19P8P28
$$ y = [242, 8, -65, 53, -119, -207, 224, 306, -226, 24, 127, -203, 349, 257, -346, 117, 204, -215, 328, 9, -354, 153, 84, -111, 31, 48, -161, 186, 248, -241, 51, 212, -346, 203, 193, -306, 20, 246, -248, 117, 222, -254, 42, 235, -67, 103, 288, -222, -74, 254, -202, 2, 225, -153, -165, 373, -270, -118, 359, -198, -185, 255, -187, -88, 285, -82, -130, 391, -177, -192, 309, -123, -123, 332, -72, -235, 436, -69, -269, 436, -95, -345, 267, -113, -206, 368, -48, -282, 261, 139, -188, 278, -31, -401, 407, 188, -329, 214, 129, -381, 441, 184, -345, 138, 3, -247, 303, 93, -445, 106, 241, -187, 125, 204, -592, 208, 368, -405, 68, 188, -459, 176, 390, -420, 9, 203, -311, 142, 339, -468, -231, 321, -134, 105, 343, -531, -87, 536, -210, -2, 234, -404, -19, 551, -277, -179, 274, -289, 42, 504, -293, -282, 326, -31, 23, 448, -378, -393, 475, -2, -183, 272, -376, -244, 625, -116, -311, 145, -174, -96, 632]
6606F32p62l86P47k13j75O40o05l94Q75j81m69O09n06k02P95j44o76N24j79l17
6626c87Q67k18q07O27M6l88O30k46o56P12J62o44M62n1o29P69J11o32L44L7o01
6647d92P45Q9o56K46K80m77M46K55r06L41M91m87K13J47p34L66O98p70J69J82
6667A46n38L35O44q00q5M74l94J33M76o76l0O59m81J04L57o77J44O65l78j70L92
6688C00m75K5O00m12l49M16k42m6P13o05m12P59k09j97M57m18k28O80k56l73M95
6709B23j91l26O10j29n28M59Qm44N81j36n83N84P7m58M42j41m27N82M6n97M70
6730A22pm45L74J31n72L31K17m58N63Om89J70K98n45L12K39n91K95L37m57J75
6751FJ33m25K73K86n10J06N20n40J0N34o49J63L87m67P4M97m81o3M04l60l1L91
$$ y = [632, -130, -516, 231, 18, -157, 483, -122, -516, 359, 178, -291, 318, -188, -390, 405, 261, -415, 109, -70, -387, 480, 262, -545, 82, 128, -260, 370, 124, -532, 180, 342, -302, 160, 109, -520, 249, 360, -272, 72, 109, -492, 253, 342, -314, -68, 212, -265, 181, 436, -470, -129, 362, -125, 88, 235, -499, -133, 565, -205, -36, 146, -392, -57, 587, -213, -298, 176, -218, -85, 391, -285, -315, 344, -137, -33, 324, -353, -209, 456, 78, -92, 300, -175, -150, 450, 38, -311, 105, -137, -183, 530, -75, -487, 272, 63, -134, 323, -95, -323, 357, 101, -272, 223, 32, -294, 316, 187, -341, 118, 126, -318, 263, 127, -456, 128, 205, -253, 189, 48, -379, 203, 249, -348, 122, 115, -330, 44, 175, -397, -66, 151, -307, 256, 262, -227, -57, 241, -304, 8, 247, -344, -49, 288, -169, 6, 139, -286, -13, 273, -237, -131, 389, -151, -141, 393, -256, -93, 294, -173, -99, 398, -83, -146, 258, -102, -133, 258]
6773B58l35q1M73l85j05N34k93k66M67k45l08N43l26k24N79l61q4M81m39l7L83
6794B29k10j82K65n3l31M91n5l54K55j0l64N87j54n14M47Q4k32K76j37k96L43
6815H5L0k42K14K5m87L50L16l67J01R3l74L96Ol77K75Q1j93J21J24m29J06K95
6837A49j20L7M2k63O2L65k49j72K67l11K65K54m09l2J92k18K11J57l41q7K56M3
6859I8m8N0l28MM75j4m32K26k79J73M24k97j71K5M1J99R5k82j57J31J64k2k6q5
6883c6k10L30J53l39J03j78k8M76o3k29j99O1J88J65j48k64pL44k8k2j12l35K00
6906a78M29j46p5j63m2K60J73k28k9k01J62K93m1k04k32R5K87N3k38j77L6K65
6928I9R2j65q7j62J79K65q5j06k08J27J95pj91k16Q0K54M1O2k64p5J36K41j18
$$ y = [258, -77, -158, 315, -70, -175, 359, 66, -200, 267, 22, -286, 257, -69, -293, 286, -75, -159, 322, -117, -154, 229, 19, -163, 102, 49, -282, 209, 154, -200, 55, 45, -319, 268, 114, -400, 47, 131, -101, 175, 38, -258, 85, 115, -127, 87, 112, -375, -25, 291, -76, 25, 118, -256, 140, 146, -231, 44, 125, -68, 53, 177, -252, -146, 149, 29, 66, 108, -155, -93, 272, 23, -149, 118, -193, 72, 326, -83, -115, 77, -141, 70, 227, -114, -201, 55, 98, 50, 100, -228, -224, 251, 237, -195, 31, -248, -75, 349, 52, -119, -94, -53, 146, 241, -41, -198, -67, 97, 75, 49, -36, -246, 84, 237, -102, 1, -177, -205, 271, 208, -21, -220, -159, 29, 194, 46, -218, -225, 119, 91, 69, -43, -378, -178, 251, 105, 30, -133, -175, 85, 258, 30, 1, -200, -38, 255, 214, 10, -222, -127, 160, 213, -25, -202, -166, 99, 191, 26, -61, -223, -44, 221, 136, 30, -178, -51, 144, 137, -54, -270, -190, 64, 105, 167, -97, -172, -36, 205, 87]
6951H7j11k01J51K84l9j20k75J47K07NK9k03k75K99K86j45qm22L42K14j54p2k74
6974b48J67m4L63r1l60L8K30j16K43j54l03K38K09j93P1k33o3L37J58k30p2j26
6996a79Q0J94P1k67j47K18P8M3M3l56R8K70k3j46N8j52PK17n1j09qk3q7N26n08
7021a53j48M17j10n5L35m36j42L36J16j66K7j80j4L66m1k45M3m5k8L14j08l12
7043b29L59r7r8J78n2k14K59k7r8J93j25k76L49O1k34K06k00k10K77J19l05J18
7065d6K48m01L41jn06M93pl46M04n4k90R4L03k73J6J42l11K58K55m61L2L97n84
7088b97L00K87n22J64L19n00K26K21l78J30K46k58k3K54j62j13K62l61R3L72l84
7109a24M9K71k78n2L33l11k2L04j23j10K66k69j47K60L7l48M76k27l30N88k06
$$ y = [87, -24, -225, -74, 210, 171, 51, -224, -77, 130, 135, 164, -39, -314, -15, 271, 126, 118, -304, 38, 252, 98, 26, -248, -81, -125, 238, 147, -213, -175, 55, -61, 182, 28, -275, -37, 172, -21, 50, -183, -246, 91, 249, 19, -53, -179, -99, 95, 166, -101, -248, -30, 48, 91, 134, -222, -124, 146, 123, -23, 35, -117, -110, 107, 56, -53, -61, -84, -171, 355, -153, -301, 116, 6, -49, 286, -150, -292, 44, 160, -6, 21, -159, -173, 193, 152, -93, -50, -95, -123, 191, 83, -229, 130, 33, -65, 113, 61, -153, 106, 79, -19, 174, 49, -227, 122, 183, -51, 155, -45, -255, 22, 141, -164, -46, 202, -199, 142, 141, -365, 128, 121, -225, 179, 125, -165, -71, 232, -41, -25, 117, -194, 64, 319, -142, -110, 287, -297, 3, 290, -232, -68, 251, -249, -23, 198, -180, -50, 196, -62, -85, 169, 7, -106, 156, -205, -112, 260, -124, -75, 196, -82, -134, 199, -112, -134, 170, 47, -63, 203, -66, -213, 47, 84, -264, 212, -15, -345, 243, 37]
7130C7k33N08k84k02L89k13k32L80j20j25K16n7l38K83J43k90J92J2l08N33Mo31
7152c36M17K4l49M76k0n20L39R7k09K26j5n38K88L67l61J57R1m06L12L36n66Q2
7174a08K67m03K61K80n45N7L97k75J12J64l65KL19j53j0K35n24K51M60m86o6L66
7196B36l94K15L64m97r7K69k14R4L62l47l17N29l7l01L92l46k92P76k37l51M21
7217B28m17j69P40k75m01L88j88R0K31j03n29M86K98n47L78j11n72O53J01n25
7237b44L86j33k96N84j26l95K05P0k46N24j34n68K84L05k36J30J06o23L02M50
7257C45m71J95Ol96L71L03m74O8J16k90L83J03l77p3L91l71J83L29n46l7N87l23
7279B2j21K50m52L27K77l39k30L51j85j6M26k77l36N10k53MM49n98j38P34l32
$$ y = [37, -196, 312, 28, -174, 215, 2, -230, 150, 30, -95, 121, 64, -274, 9, 152, -138, 54, 66, -242, 291, 295, -336, 81, 105, -244, 232, 212, -308, 31, 128, -81, 145, 130, -408, -120, 247, -114, 43, 134, -272, 40, 376, -190, -108, 159, -244, 17, 297, -248, -191, 206, -69, 43, 207, -158, -156, 163, 10, 0, 235, -289, -38, 422, -64, -130, 236, -158, 57, 421, -76, -173, 96, -118, -24, 338, -9, -326, 203, 166, -135, 257, -89, -381, 395, 158, -193, 228, -189, -358, 382, 107, -294, 94, -94, -4, 227, 124, -405, 81, 379, -168, 210, 99, -473, 180, 281, -244, 142, 9, -287, 297, 171, -224, -19, 51, -195, 329, 195, -373, -89, 216, -20, 110, 216, -407, -105, 345, -126, 69, 75, -321, 50, 353, -121, -53, 63, -227, 156, 259, -118, -191, 200, -171, 12, 341, -205, -242, 345, 22, -99, 151, -301, 26, 303, -36, -266, 85, -100, -116, 310, 33, -303, 207, -46, -42, 407, -191, -329, 405, 73]
7300G3r0J71k88j63N35n2l69L12j44p6M54k72m26L48O9p9K39k60l34M36m4j95
7322a55L96l32j77M01Q7l62K50o3j25K31J99n39J04K06j84K43m8m44L36J12j95
7343e9K70j81l70L30K47l18M4M7j85J25L49m36l3K28q5j9L46n15L4L72k89R9K76
7366B77l83M9K84l05J27Q1k08k0L65l43o5L59k55J1L12l33j53L84k34lL04k73
7388b2r6K97j85o4J62j31q5J98l0k46L39j00j35L58l44j41L83q9k51K50p4j69
7410a75J98l3j10J95q7j68L01j1j61O7J68l44K55Qk34L80k08k50K01J5r9J21n6
7433b7k2M6J8L0j26J08j67J30K03l22J4K61j86M3J99l17L5J59j71J67p5j28l8
7456a66K77o2j38K55j90l7K61j41k53J92q0J58K7j11j32N6M4Q1Q8k15j5J29J03
$$ y = [73, -17, 154, -134, -297, 238, 186, -183, 129, -15, -91, 363, 91, -335, 13, 82, 3, 242, -18, -352, 84, 40, -155, 241, -91, -268, 133, 220, -142, 108, 45, -80, 151, 350, -189, -85, 121, -63, 180, 132, -312, 24, 136, -59, 211, 30, -340, -10, 237, -81, -37, 10, -175, -50, 299, -137, -170, 58, -27, -46, 300, -215, -181, 191, -98, 1, 277, -106, -57, 227, -78, 49, 130, -78, -98, 267, -76, -141, 218, -37, -26, 286, -47, -200, 184, -50, -53, 251, -22, -118, 179, -6, -70, 92, -39, -124, 74, 44, -202, 137, 37, -98, 260, -84, -225, 158, 69, -182, 68, -6, -175, 23, -10, -120, 75, -12, -180, 121, 110, -51, 16, 184, -160, 95, 103, -131, 249, 41, -209, -8, 7, -92, 29, -27, -49, -3, 15, 45, -81, 27, -140, -10, 193, -129, -115, 146, -40, 3, 202, -115, -80, 79, -92, 75, 0, -128, -166, 111, 49, -89, 166, -24, -61, 200, 59, -194, -2, -82, 76, 103, -8, -140, -84, -40, 41, 129, -86, -101, 28, 131]
7479A31k8j6j90l8K81n3j53J36j25N4J34m6k49Q1P1J12rj36j28M4L16j05n6p5
7503d7r5K10J24k27q4N7M8J90l7j98q5N5K32j60M6j40n1K96j43k1KK1k2K40p8
7528A33j53j56J05J59Q4j82j39l8K09Pk3p3j73J46K49j27J7j49k8J87n0j0k8q1
7552a14J10J51o9k16n9J18K39m6j00j92N7K00J6j32r2P2R1J87n8j52r6J0J45J47
7576B17j52j86P4J57n0o7j21r9K57J57j65pj53Q5K84l6k69j52J66K7J68M3l07
7599a29J2K53j65Q3J10m18L21J84j74K8k27o2K84J34j84j28J5N3J50L8k83r5L10
7622A10p5M1M8l46J76K09j33j3L3r2LJ88n3k44J01O2j11L00j46l26L37N0j73K05
7646A51k55j43L26o5o4J24j15l6K11q0j53J10l5PQ3L8k50J75R0j77K14j25k70
$$ y = [131, 103, 87, -103, -141, 140, 87, -66, 70, -55, -1, 133, 87, -162, -81, -10, 102, 93, -43, -171, -127, 189, 84, 28, -47, -142, 68, 192, -35, -119, -62, -14, 176, 139, -59, -144, -89, 143, -17, 29, -111, -162, 134, -9, -30, -28, -7, -29, 211, 133, -20, -176, -71, 88, 172, -10, -149, -187, 22, 29, 6, -67, -240, -94, 155, 28, 45, -104, -132, 55, 5, -5, -33, -114, -4, 147, 78, -138, -197, -79, 160, 114, 14, -178, -121, 79, 95, -37, -129, -57, 34, 221, 163, 11, -85, -75, 70, 217, 65, -121, -47, 110, 60, -7, -128, -227, 30, 187, 22, 15, -138, -53, 231, 195, -74, -226, -60, -33, 135, 178, -129, -117, 136, -29, 54, 164, -254, 67, 251, 77, 105, -122, -184, 100, 234, 50, -78, -63, -10, 140, 178, -105, -200, 110, 35, 76, 124, -222, -46, 163, 30, 17, 50, -42, -39, 149, 96, -148, -47, 15, -96, 204, 58, -268, 69, 119, -54, 151, -104, -247, 79, 14, -50, 74, -41, -77, 134, 54, -99, 11, -24, -17, 66, 104, -146, 29, 119, -58, 156, 31, -239]
7669b39K95J00j22P1j24j83J59J45r7OR5k55J99J21m00P8K52k22K42n8k31J40
7691b8J53j18O4P2k48k5K31j87LK29k49M5K41k53r0M00k45j09K66k37O3R3j15
7714d4j2R6m8j04K34j34j6J16j52k0K48j43r4L18k06k39L77j92j53L19j87%J11
7737G5n9j42J12pk13L79o8k21K46j18j42L19k3m09M05m2j90L01o9l28K80J9j33
7760b8J18j4j53J14J78m00K29L7k35K68M8k07jJ32j66K28L0l81K17J78j78m5R3
7783F2j99J3L54k35o8J28j95K32K98n08JJ28q0J68P3k28p9K54j08j9J53j98j45
7806a98L95j66q2J22k09R2L57k37k16J65jl0J40q9l29K72J30q7J30k06k59N00
7828A94oj77L5j63j30N36o4m18L22k10Q5K41j00l27R0J97n4P5k8m32K77K40k50
$$ y = [-239, 56, 156, 34, 105, -19, -202, -43, 102, 5, 11, 106, -149, 50, 171, -229, -151, 101, -121, 121, 63, -168, -28, 125, 7, 71, 143, -105, -130, 101, -86, -83, 146, -103, -58, 183, -70, -160, 240, -5, -114, 152, -85, -22, 71, -44, -56, 40, -8, -112, 122, -12, -28, 88, -64, -84, 164, 21, -73, 245, 39, -200, 177, -15, -168, 151, -36, -36, 75, 16, -126, -14, -21, -234, 145, 77, -144, 102, -16, -158, 161, 138, -271, 134, 92, -98, 203, 134, -194, 86, 105, -28, 90, 76, -77, 37, 215, -185, 44, 81, -154, 114, 162, -45, -46, 86, -80, 148, 178, -203, 14, 192, 14, -31, 62, -137, -124, 230, -5, -73, 55, -140, 92, 390, -118, -117, 11, -69, 99, 172, -56, -135, 119, 11, -8, 145, -53, -198, 197, 31, -51, 71, -138, -46, 311, 74, -142, 23, 22, -8, 132, 43, -286, -14, 116, 29, 159, -47, -306, 194, 188, 11, 46, -117, -247, 289, 225, -193, 129, -81, 4, 245, 145, -182, -92, 105, 51, 126, 98, -334, -57, 183, -67]
7851f7K25j24k66K79K35l44J5k0p5L26ok76p1K76k46J53J67l64mL80k13M5P9l94
7875b90J67L43k94NQ3j43K49J39l42p4K32j19J55O8k38j50M33j56m1Q9l21n5N97
7898C37k75j66K19k28J31J76k84j52J74O2j7K42k81j92K45J45j60J51l01n7M83
7919B52o9k52R5j58q8M12j19j96J5K23r1J29J2m13K59J06j39K07j86k81L27J36
7941A81j35l0p1QJ01J46k86l7J43m7R9K03m97Q9L23k47K54j36k33P7K96j82j11
7964i2n0j2J33J56j66l5J23j47K6K99j83k13K28q1L9J33k68l8K49j44j6J49k07
7987a17L8K06p0j26K5p6K08N1j01j68J99j33M1K28k89l7K07j11n7K1O3j41K64
8010A25l3r0l0oq8K57p9l38L02k3J5Q6j4j90J28O3j07P5j24L2L0Q4j85J16k1J2
$$ y = [-67, 158, 34, -232, 47, 282, -62, -47, -67, -142, 184, 178, -98, -169, 107, -139, 14, 181, -183, -187, 193, -20, 25, 104, -290, -123, 220, -74, -69, 14, -129, 120, 259, -83, -157, 75, -44, 111, 179, -59, -209, 224, 68, 27, 116, -205, -260, 337, 62, -104, 115, -113, 18, 194, -90, -242, -68, -6, -23, 219, -62, -254, -9, 136, -24, 127, -174, -231, 252, 183, -69, 26, -132, -220, 192, 73, -123, -108, 115, 24, 153, 165, -248, 11, 117, -22, 185, -1, -282, 45, 181, 46, 16, -55, -47, 54, 200, -86, -123, 20, -27, 72, 275, -222, -133, 190, -57, 197, 61, -172, -95, 201, 19, -92, -142, -154, -21, 135, -31, -66, 57, -90, -64, 235, 52, -161, 67, -14, 25, 158, -110, -148, 101, -43, -59, 90, -117, -79, 127, 57, -69, -44, -120, 88, 139, 38, -130, 69, -64, -23, 205, -84, -121, 86, -25, -82, -61, 2, -139, 125, 92, 2, -28, -34, -122, 135, 56, -282, 20, -3, 12, 98, 84, -106, 22, 85, -22, 53, -71, -39, -9, 75, -110, 6, -15, -3]
8036cR0M6j54n3J17o0Q5j5j72J23J0n0l7J20j20J5QO7r9M9P2k54K34o1J3N6j32
8063a05J55pj23P7J03k53O7J94o3KJo6l9J90p8q0j7K1l7K45q7j98J83j3q7J45
8089A30j65j69J68J31m4Jn8j17N6J96q6q5j5N2M7k9j07Q9J0R1L9j92q4J05J67
8114A31r1m0N3j44J6K14o2j75J30p8Q6Qnq5o8J78kr2m0rQ7J38j38o6P9j62K05
8141F8J07k61J04J1j1Q5l6q9p3O1J08kn6q9r9J93rKN8j15j4K02j57k5J%J93j14
8169D3j22m0J13K07j27J7j40r3J32J35kr7j74n8M13j87o4q0M6J95J04k52
$$ y = [-3, 87, 133, -21, -74, 43, -17, 68, 53, -119, 4, 14, -36, -73, 47, -73, -58, -50, 17, -82, -33, 39, -215, 19, -42, -29, 27, -105, 50, 43, -80, -3, 100, -153, -86, 108, 45, 47, 48, -18, -57, 133, 55, -25, -42, -21, -58, 187, 100, -98, 85, 72, -15, 130, -35, -204, -36, 95, 51, 52, -6, -123, -67, 129, 43, -42, -57, -5, 42, 13, -94, -5, 5, 96, 135, -57, -141, -36, 131, 40, 0, 53, -91, -75, 139, 77, -98, 32, -46, 40, 48, 43, -42, -110, 68, 66, -26, -66, -75, 12, 150, 12, -54, 25, -137, 68, 175, -86, 18, 29, 18, 103, 67, -22, -95, -34, 74, 72, 16, -73, -172, 21, 12, 14, 72, -43, -57, 145, -12, -37, -36, -36, 157, 43, -79, -119, -6, 201, 74, 91, -49, -142, -10, 125, 123, 26, -148, -206, 207, 20, -44, -124, -78, 117, 221, -31]
8191c1
$$ Imaginary data points
##PAGE= N=2
##DATA TABLE= (X++(I..I)), XYDATA
0@%%%%%%%jRj6J6j6K4l3M1n6P2q8J04j28J53j78K11k50K97l51M11m76N46o28P23
31C86q28R44j069J207j362J533j723J932k158K402k669K966l292L646m029M445
47B331m904N411n962O565p231P965q782R694j0717J1873j3186J4699j6466J8559
61I849k1082K4190k8133L3328m0519N1192o8860J04939k96616M99176P9615p52814
73d05735O41044j96067m95950P35460M0805o77358M42914n5851l42814O75734
83C62182j37428p32918O24518Q4968n43597O41633l6494q59447O50217L62873
93D16507o82253L22967J37820o17312M95994L09127o21168K21794J50640m80987
103c46871N19042K24236p85674K92650L94247n79254L56151L35954q16322K07061
$$ y = [0, 0, 0, 0, 0, 0, 0, 0, -1, 8, -8, 8, -8, 16, -17, 24, -32, 40, -48, 56, -72, 81, -97, 114, -136, 161, -190, 221, -255, 291, -337, 386, -442, 502, -567, 640, -722, 811, -912, 1020, -1138, 1264, -1405, 1561, -1731, 1915, -2114, 2331, -2573, 2838, -3124, 3441, -3790, 4175, -4607, 5087, -5630, 6243, -6943, 7756, -8710, 9849, -11233, 12957, -15176, 18152, -22367, 28825, -40035, 64904, -231712, 267464, 347079, -405735, 235309, 39242, -456708, 278752, 319557, -357801, 85113, 29262, -313552, 362182, 224754, -508164, 116354, 201322, -342275, 299358, 262864, -596583, 53634, 416507, -265746, 57221, 195041, -422271, 73723, 382850, -238318, -16524, 134116, -346871, 172171, 396407, -389267, -96617, 297630, -281624, 74527, 410481, -405841, -198780]
113a98780O01498n23975O3896L12987n69244J97974N06464n07967Q886L12241
123B03980m90914K33320N17107o54065p3142N49913m32890L0601N36435n91971
133a71626j66036O34944k91832j38156L95705m32404q4419N76106l06127j97107
143a80952L91401l57863q1196O12593l52740l53776N06661j88431k10615N32856
153C17938k81692l92024N10470n9220k61092L79901k27279l00386N06342n7335
163A35623l33017L42281j40954k97481N15771l1451m69431L36899L4468l20172
173b27464M09699r783m72037L26350J22353l12502K95377j6083m10283L44110
183D9737J55671l67519K16894N9006l80352L22515K03058m44004J44811J82812
$$ y = [-198780, 402718, -121257, -57361, 255626, -313618, -115644, 390820, -117147, -108261, 203980, -286934, -53614, 463493, -190572, -263714, 286199, -146691, -116090, 420345, -171626, -337662, 297282, 5450, -132706, 262999, -169405, -253824, 322282, 16155, -180952, 210449, -147414, -228610, 383983, 31243, -322533, 184128, -4303, -214918, 317938, 36246, -355778, 154692, 95472, -165620, 214281, -12998, -313384, 192958, 135623, -197394, 144887, 3933, -293548, 222223, 190772, -278659, 58240, 92708, -227464, 182235, 172452, -299585, 26765, 149118, -163384, 131993, 115910, -294373, 49737, 205408, -162111, 54783, 113789, -266563, 55952, 259010, -184994, -40183, 142629]
193A42629l33675K39087J89165m39388J29765K40864k97326J59130J59265l97111
203b07595J33633K83765l00149N9771J88578l35260J04700L15085l18246k7328
213a03046K45181k60683O1263K85602l16595m5656K77847k09003J2982K41379
223A89271k84931m9257L04456j71902o8669K23031k18734o3282L16409j60993
233A5399j41495K35003j50018p6855K91029j63509j61270K47723r8655r5965K43706
244A45093j42946j62745K51827m7752j42008J97691r0544j62212K49231k1963
254G3672j91692J80928l7149j58370K28146k0448k06019J72118L999j49669J82456
265G7972j1329j97379J54367M9926j56154J24880J9704j82481J39167P7886j77723
$$ y = [142629, -191046, 48041, 237206, -202182, -72417, 168447, -128879, 30251, 189516, -207595, -73962, 209803, -90346, -30575, 158003, -177257, -72557, 242528, -75718, -103046, 142135, -118548, -57285, 228317, -88278, -133934, 143913, -65090, -52108, 189271, -95660, -144917, 159539, -12363, -81032, 141999, -76735, -140017, 176392, 15399, -126096, 108907, -41111, -117966, 173063, 9554, -151716, 96007, -2648, -98613, 145093, 2147, -160598, 91229, 43477, -98531, 99160, 8616, -153596, 95635, 73672, -118020, 62908, 25759, -132611, 95535, 75087, -130932, 41186, 45185, -104484, 77972, 66643, -130736, 23631, 73557, -82597, 42283, 61987, -120494, 18673, 96559, -81164]
276h1164R2091N2555j65630J22398P7618j80035P3912P2263j38682Q9659P0247
287H5232j61355N1785R6274j18517M1523P7720j38501L5126J13986j19702J1577
298b4852R0983j20307K6564J09822j15485j123R0661r2495J2986R2046r5339j6233
310d2772R2825o3142j6588Q3420p1355k9316R8185n3057l6477Q3352n7193l0335
322d2453R0554m7773l7701P0211l8304k5944O7080l1969l9051N5704j2147l5615
334b7408M8741j1787m3779N0446j177m3048M3300n336l8635M2770j668l3299K9033
347H153j336k2574K2318L245k1800J0280J1777j7135L839J4163j8012J846J6375
360A1139j6244J129J2262j1696K33P575k963m401K070P177r926r4J4675j7016
$$ y = [-81164, 10927, 63482, -102148, 20250, 97868, -82167, -8255, 64008, -74674, 14985, 85232, -76123, -24338, 71936, -46581, -5058, 72662, -65839, -30713, 83273, -36429, -24852, 66131, -54176, -27612, 82210, -33275, -34398, 56263, -36232, -23246, 68800, -26539, -42772, 50053, -13089, -29677, 53743, -17612, -46928, 51257, -1800, -38277, 45075, -12118, -42453, 48101, 328, -37373, 32838, -5466, -31410, 35670, 3701, -35350, 20354, 8207, -27408, 21333, 9546, -34233, 16213, 15036, -28012, 15288, 9952, -28683, 14087, 12419, -20880, 8153, 6817, -15757, 6561, 9806, -11994, -1714, 10063, -7072, -3233, 10930, -7082, -5236, 11139, -5105, -3976, 8286, -3410, -3177, 4398, 1435, -2966, -896, 6281, -3645, -3739, 10936, -6080]
374f080R32J9658k2274R83K2514k2144j401K2751j9238o240K5912j5813j5258
387a5698L1966j2791k4686L9825j2618l1870M6989j4314l5774N1874j5290l7934
399c0321N2602j3007m0556N0922o166m5345M7776J569n2484M9626J0016o4206
411c9574N0669J7480p0169N4356J8670p7644N6437K3983p7668N3023K4436p9547
423d5548N0188L6040q1051L8207M2667q2984L8321N5788r4398K8498O6410r3720
435d1582L1019O9347j05373K6524P9849r7634K1126P5088j01650J7068R1625r4135
447b8728k545Q9604r1385j940J08261r7271k4731J13299q7590j8825J18731j01150
459b4270l4433J28174q1232l5103J16599q9254m3804J34304o6847o3501J18081
$$ y = [-6080, -5148, 14510, -7764, -6781, 15733, -6411, -7812, 14939, -4299, -10539, 15373, -440, -15698, 16268, 3477, -21209, 18616, 5998, -25872, 21117, 6803, -28971, 22903, 7613, -30321, 22281, 9274, -31282, 19640, 13474, -31871, 15905, 17474, -35010, 14616, 24632, -39574, 11095, 28575, -41594, 12762, 31432, -46212, 10225, 34208, -43460, 9563, 33999, -45548, 4640, 40680, -40371, -2164, 40503, -42481, -4160, 51628, -42770, -14272, 52138, -41582, -10563, 58784, -46589, -20065, 59784, -37850, -16724, 58364, -43286, -26218, 65407, -28728, -31273, 58331, -33054, -34994, 73267, -24004, -48735, 64564, -23026, -41851, 76880, -24270, -58703, 69471, -11761, -46864, 69735, -19519, -63323, 70981, 4134, -59367, 58714]
470E8714o4820o1794J41464n8289r3009J31861m4261p9866J42885n5336j07251
481h9702J41953k6098r4646J28891m1660j11386J42882m184j19892J13833j1271
492B8720j20604J41815J2722j52206J12725K2085j31667J33888J8864j68333J15204
503A3213M9535j37720J09353K7321j66121J12245P6718j54087P7668N5598j62255
514i8532J03549J00040j80695N5229R3807j56229Q6392J04543j91867M5896J22065
525H4198j44513N7151R9500j83443M1114J49406j45461J3311J16405j65857K6937
536e1252J75212j56872k9855J44568j37561R740J71112j61850m5989J63832j10528
547b9443j0817J52623j58171n0133J93290r7024o1055J54429j30405o7056K16790
$$ y = [58714, -6106, -67900, 73564, 15275, -77734, 54127, 9866, -70000, 72885, 17549, -89702, 52251, 26153, -68493, 60398, 18738, -92648, 50234, 46050, -73842, 39991, 28720, -91884, 49931, 62653, -89553, 23172, 45257, -86410, 47478, 66342, -101991, 13213, 62748, -74972, 34381, 61702, -104419, 7826, 84544, -69543, 8125, 63723, -98532, 5017, 105057, -75638, -20409, 73398, -82831, 3561, 108104, -83763, -37867, 84198, -60315, -3164, 96336, -87107, -45993, 103413, -42048, -28737, 87668, -78189, -51252, 123960, -32912, -62767, 81801, -55760, -46020, 125092, -36758, -82747, 81085, -29443, -40260, 112363, -45808, -95941, 97349, 325, -60730, 93699, -36706, -103762, 113028]
558A13028q7664j16035J59337q5251p0983K02762r3254j31764J68667n4076p6943
569g2176J81525r9243j42628J99559k0553j29502J62114n9652j58059K07425J3614
580H2424j76457J31739j3103j36627J89480M02j88887J33861J4443j30428J73741
591H0588p910k13168J51803P5002j67747J21032L4124k09483J35522J17878j83333
602f5692O3775N5226j63411J34057R2982k02887O6428Q1146j55498J25050R3787
613A24963k36893N6482J59599j57224M4352J16193k05591L0576J87231j41561
623b1873r332J00648j61270N9933J67445j80850j1807J35116j54153M5790J82653
634A52300k04671n7883K03145j04586l7577J62671j54311p0745K04898p4918o5977
$$ y = [113028, 25364, -90671, 68666, -16585, -87568, 115194, 21940, -109824, 58843, 4767, -72176, 109349, 10106, -132522, 67037, 46484, -83018, 79096, 19444, -138615, 68810, 82424, -94033, 37706, 24603, -112024, 77456, 77858, -111029, 22832, 37275, -93153, 80588, 72678, -140490, 11313, 86315, -81432, 39600, 73724, -135759, -237, 117641, -65692, -1917, 53309, -110102, 23955, 116937, -85950, -19522, 61624, -93874, 31176, 124963, -111930, -55448, 104151, -53073, -8721, 107472, -98119, -67543, 119688, -21873, -31205, 69443, -91827, -31894, 135551, -45299, -57106, 78010, -76143, -30353, 152300, -52371, -110254, 92891, -11695, -49272, 113399, -40912, -111657, 93241, 18323, -47654]
645d7654J24170j35940k4533K12662j21015r4432J61508j09732n0979K23415j13174
656B4296j58700J84279j9352r7690J57704p4146j42848J75237J355j03692J22371
667F8814q3587j06721K13337k6690j61166J41160l0874j28011J99647M214k09305
678a19182J14368N9060j19503J21114N835j78270J17830O7091j21826J03060j3555
689C6022j70117J65704P6029j86866Q4307M9142j64790J30743J04884k01508K9819
700d6631J05463j13931P4628P3590j82259M7189J18825j21088O0502O3507j91979
711a12184P5182J58922j59184L366J04430j49399M0590J63090j46429m8588J19514
722D9310q5502J9832J21436j49582l3356J46670q6534l173J16637j55929k8638
$$ y = [-47654, 76516, -59424, -83957, 128705, 7690, -86742, 74766, -34966, -85945, 137470, 24296, -134404, 49875, 30523, -67167, 90537, 16391, -126457, 48780, 50135, -53557, 68814, -14773, -121494, 91843, 65153, -96013, 45147, 14273, -113738, 85909, 90123, -119182, -4814, 54246, -65257, 55857, 61692, -116578, 1252, 68343, -53483, 49577, 36022, -134095, 31609, 107638, -79228, 5079, 54221, -110569, 20174, 125058, -76450, -46631, 58832, -55099, 19529, 93119, -89140, -41951, 76874, -44214, 16288, 79795, -112184, -37002, 121920, -37264, -33898, 70532, -78867, -38277, 124813, -21616, -70204, 49310, -36192, -16360, 105076, -44506, -77862, 68808, -17726, -20899, 95738, -60191, -88829]
733h8829J87892q6573o6648J16922r8958l8982J71724o9842j00216J06932m7303
744a3881l3443J41705q7331j01512J38703l2530n9410J32263q6763j07573J65395
755E5623q247j03255J00889m3435r2006J47871J418j23850Q0620o660p5541J31663
767F5090j3909j41315J00234K5594r1561J10023j1315j44295J09873N5680j08111
778d4012O5768Q177j15044R9504O0851j20378L9398L3861r3449Q8419N4021j39389
790f2273L8528O8983r0404O2240M9917j36655L9226R2075q5948K3635M7447j08502
802f1731L7579R6577r0026n526O0286q4219L1206R4621j03557j9090Q5234o7674
814b6320J3253Q3172j02176j9652R9954n3336j2226O7346q1723j5970J04181m9089
$$ y = [-88829, 99063, 12490, -54158, 62764, -36194, -75176, 96548, 26706, -73510, 33422, -13881, -47324, 94381, 7050, -94462, 44241, 11711, -47699, 84564, -2199, -109772, 55623, 47376, -55879, 45010, 1575, -90431, 57440, 58858, -64992, 15628, 8968, -66573, 65090, 51181, -90134, 10100, 35694, -55867, 54156, 42841, -101454, 8419, 64099, -44012, 21756, 29933, -85111, 14393, 75244, -45134, -5736, 28125, -65324, 23095, 77116, -62273, -23745, 45238, -45166, 17074, 66991, -69664, -30438, 61637, -24311, -676, 46771, -61731, -24152, 72425, -17601, -23127, 37159, -47060, -15854, 78767, -24790, -43880, 41354, -26320, -13067, 70105, -32071, -51723, 48231, -5105, -17331, 50015, -31708, -47678, 56503, 7414]
826G414l9666O6769n6531j8008J02546n4389n7886P8316l4709k4990Q7813n5057
838A622n8347Q4518j6658l7303O5847m1858n2032Q4744n344n6530N3297k0157
850A799m8773Q1034m072p1331N2101p62m5881O8006p267p1267N2030J4484m5372
863b5271M6602l023o2851M8883K6790n3073K8413J0021n5156M5440K9874o2415
875b5766K1633K2132m7378L8418K3968o1850J9208L0765l8672K2274K0801n2796
887b7263J5115L9205l7066N217K5293m3455J2266M2133m0921k853L0189l4665
899a6805J0236L5535l9729m934L1684k3407J950K7095l0836q024L3927j5945j0093
912i346K4921k2327r631L5084j5689j5930K4447j5787p356K8775j5432j4880K0626
$$ y = [7414, -32252, 34517, -22014, -40022, 62524, 8135, -49751, 28565, -6144, -31134, 56679, 1622, -56725, 27793, 11135, -26168, 39679, -2179, -54211, 30533, 25189, -31341, 21956, 1799, -46974, 34060, 29988, -41343, 10758, 9996, -35885, 32121, 24854, -46413, 5617, 20101, -25271, 21331, 18308, -44543, 4340, 31130, -21943, 6470, 16491, -38665, 6775, 36649, -25766, -4133, 17999, -29379, 9039, 33007, -28843, -9635, 21130, -17542, 4732, 25533, -27263, -12148, 27057, -10009, -4792, 20501, -22954, -10688, 31445, -9476, -12329, 17860, -16805, -6569, 28966, -10763, -15697, 15987, -7420, -5470, 21625, -9211, -17235, 16692, 747, -9346, 15575, -6752, -16383, 18701, 3012, -12918, 11529, -4258, -11614, 17161, 1729, -13151, 7475]
925G475p277p448J8608r483j4687J7708Q44j2794J3220l524j4811J7908J377j5137
939h021J1545j768r972J3872r48j0956O754J383m988N112J323p535J813O290n025
954a121j97M423o388J312N947m924o44K430j812L76J187O93l203m1N251m953m19
971b083O451p579O50P848q195P6P814p256j049Q327o049l700R987m514p511J2645
987E862m091j0242J5786n228j2197J8111n422j2784J8262n571j3302J8542l474
1000D252j5068J6968p75j6915J7316K240k1318J7958N148k4213J9639N859k7350
1013a6259K1146P198k8100K0631P475k8284J9579J0179k8792J6442J3553k9896
1025a5128J4421J7836l2609J2668K1902l5113J2046K4776l7253J1584K6265l7650
$$ y = [7475, 198, -7250, 11358, 1875, -12812, 4896, 5740, -7054, 6166, 2642, -12169, 5739, 7116, -8021, 3524, 1756, -8216, 5656, 4708, -6248, 506, 1889, -3099, 2013, 3336, -4199, -2386, 3904, -1121, -1318, 3105, -3283, -1971, 3976, -948, -1592, 838, -974, -598, 589, 1282, -1921, -1962, 3289, -1664, -2083, 4368, -3211, -2561, 5287, -2908, -2832, 4982, -2274, -3323, 5004, -1045, -4745, 5242, 728, -6783, 5862, 1771, -8471, 7315, 2087, -10110, 8001, 2579, -10205, 8057, 2486, -10816, 7726, 4252, -10816, 6152, 5377, -11538, 5778, 8018, -13300, 4658, 9806, -14407, 5232, 11091, -16259, 4887, 12085, -16015, 4616, 12091, -16193, 3386, 13565, -15227, 1215, 14768, -15128, -707, 17129, -15480, -2812, 19090, -16023, -3977, 20799, -16454, -4870, 21395, -16255]
1037a6255J0293K7695l6573P302K9196l5180L890L2246l3992j351L5669l3190
$$ y = [-16255, -5962, 21733, -14840, -7538, 21658, -13522, -9632, 22614, -11378, -12729, 22940, -10250]
$$ [...]
8191c1
##END NTUPLES=NMR FID
##END=
