##TITLE=1H_42-2021
 CDCl3, 8 sc, 
 11.06.2021
##JCAMPDX= 6.0         $$ Bruker NMR JCAMP-DX V2.0
##DATA TYPE= NMR FID
##DATA CLASS= NTUPLES
##ORIGIN= UXNMR, Bruker Analytische Messtechnik GmbH
##OWNER= root
$$ XWIN-NMR		Version 3.5
$$ Fri Jun 11 11:08:16 2021 Russian Standard Time (UT+4h)  she@DPX200
##.OBSERVE FREQUENCY= 200.131506
##.OBSERVE NUCLEUS= ^1H
##.DELAY= (6, 6)
##.ACQUISITION MODE= SIMULTANEOUS
##.ACQUISITION SCHEME= undefined
##.AVERAGES= 8
##.DIGITISER RES= 18
##SPECTROMETER/DATA SYSTEM= spect
##.PULSE SEQUENCE= zg30
##.SOLVENT NAME= CDCl3
##.SHIFT REFERENCE= (INTERNAL, CDCl3, 0, 15.7039)
##AUDIT TRAIL= $$ (NUMBER, WHEN, WHO, WHERE, WHAT)
$$ ##TITLE= Audit trail, XWIN-NMR		Version 3.5
$$ ##JCAMPDX= 5.01
$$ ##ORIGIN= Bruker BioSpin GmbH
$$ ##OWNER= she
$$ F:/spectra/data/she/nmr/H-F/1/audita.txt
$$ ##AUDIT TRAIL=  $$ (NUMBER, WHEN, WHO, WHERE, WHAT)
(   1,<2021-06-11 11:06:51.64 +0400>,<she>,<DPX200>,
      <created by zg, POWCHK disabled, PULCHK disabled
       configuration hash MD5:
       00 E9 B6 7A A2 85 ED C7 34 08 36 98 17 FE 4E 26
       data hash MD5: 16K
       7D 9F C8 BE EF A2 1B BB 76 B3 C6 1B 3E 96 BD 6E>)
$$ ##END=
$$ 
$$ hash MD5
$$ A4 90 D4 3B 41 0F 16 02 42 34 30 D1 14 50 E5 CF
##$RELAX= 
##$RELAX= 
##$RELAX= 
##$RELAX= 
##$RELAX= 
##$RELAX= 
$$ Bruker specific parameters
$$ --------------------------
##$DU= <F:/spectra>
##$EXPNO= 1
##$NAME= <H-F>
##$PROCNO= 1
##$TYPE= <nmr>
##$USER= <she>
##$AMP= (0..31)
100 100 100 100 100 100 100 100 100 100 100 100 100 100 100 100 100 100 
100 100 100 100 100 100 100 100 100 100 100 100 100 100 
##$AQSEQ= 0
##$AQ_mod= 1
##$AUNM= <au_zg>
##$AUTOPOS= <>
##$BF1= 200.13
##$BF2= 200.13
##$BF3= 200.13
##$BF4= 200.13
##$BF5= 200.13
##$BF6= 200.13
##$BF7= 200.13
##$BF8= 200.13
##$BYTORDA= 1
##$CFDGTYP= 0
##$CFRGTYP= 5
##$CHEMSTR= <none>
##$CNST= (0..31)
1 1 145 1 1 1 1 1 1 1 1 1 1 1 1 1 1 1 1 1 1 1 1 1 1 1 1 1 1 1 1 1 
##$CPDPRG= <>
##$CPDPRG1= <>
##$CPDPRG2= <>
##$CPDPRG3= <>
##$CPDPRG4= <mlev>
##$CPDPRG5= <mlev>
##$CPDPRG6= <mlev>
##$CPDPRG7= <mlev>
##$CPDPRG8= <mlev>
##$CPDPRGB= <>
##$CPDPRGT= <>
##$D= (0..31)
0 1.2 0 0 0 0 0 0 0 0.06 0 0.03 0 0 0 0 0.0002 0 0 0 0 0 0 0 0 0 0 0 0 
0 0 0 
##$DATE= 1623395211
##$DBL= (0..7)
120 120 120 120 120 120 120 120 
##$DBP= (0..7)
150 150 150 150 150 150 150 150 
##$DBP07= 0
##$DBPNAM0= <>
##$DBPNAM1= <>
##$DBPNAM2= <>
##$DBPNAM3= <>
##$DBPNAM4= <>
##$DBPNAM5= <>
##$DBPNAM6= <>
##$DBPNAM7= <>
##$DBPOAL= (0..7)
0.5 0.5 0.5 0.5 0.5 0.5 0.5 0.5 
##$DBPOFFS= (0..7)
0 0 0 0 0 0 0 0 
##$DE= 6
##$DECBNUC= <off>
##$DECIM= 32
##$DECNUC= <off>
##$DECSTAT= 4
##$DIGMOD= 1
##$DIGTYP= 9
##$DL= (0..7)
0 120 120 120 120 120 120 120 
##$DP= (0..7)
150 150 150 150 150 150 150 150 
##$DP07= 0
##$DPNAME0= <>
##$DPNAME1= <>
##$DPNAME2= <>
##$DPNAME3= <>
##$DPNAME4= <>
##$DPNAME5= <>
##$DPNAME6= <>
##$DPNAME7= <>
##$DPOAL= (0..7)
0.5 0.5 0.5 0.5 0.5 0.5 0.5 0.5 
##$DPOFFS= (0..7)
0 0 0 0 0 0 0 0 
##$DQDMODE= 0
##$DR= 18
##$DS= 0
##$DSLIST= <SSSSSSSSSSSSSSS>
$$ [...]
##$SUBNAM2= <"">
##$SUBNAM3= <"">
##$SUBNAM4= <"">
##$SUBNAM5= <"">
##$SUBNAM6= <"">
##$SUBNAM7= <"">
##$SUBNAM8= <"">
##$SUBNAM9= <"">
##$SW= 20.0188882624521
##$SWIBOX= (0..15)
0 0 2 0 0 0 0 0 0 0 0 0 0 0 0 0 
##$SW_h= 4006.41025641026
##$TD= 16384
##$TD0= 1
##$TE= 0
##$TE2= 300
##$TE3= 300
##$TEG= 300
##$TL= (0..7)
0 120 120 120 120 120 120 120 
##$TP= (0..7)
150 150 150 150 150 150 150 150 
##$TP07= 0
##$TPNAME0= <>
##$TPNAME1= <>
##$TPNAME2= <>
##$TPNAME3= <>
##$TPNAME4= <>
##$TPNAME5= <>
##$TPNAME6= <>
##$TPNAME7= <>
##$TPOAL= (0..7)
0.5 0.5 0.5 0.5 0.5 0.5 0.5 0.5 
##$TPOFFS= (0..7)
0 0 0 0 0 0 0 0 
##$TUNHIN= 0
##$TUNHOUT= 0
##$TUNXOUT= 0
##$USERA1= <user>
##$USERA2= <user>
##$USERA3= <user>
##$USERA4= <user>
##$USERA5= <user>
##$V9= 5
##$VALIST= <valist>
##$VCLIST= <CCCCCCCCCCCCCCC>
##$VD= 0
##$VDLIST= <DDDDDDDDDDDDDDD>
##$VPLIST= <PPPPPPPPPPPPPPP>
##$VTLIST= <TTTTTTTTTTTTTTT>
##$WBST= 1024
##$WBSW= 4
##$XGAIN= (0..3)
0 0 0 0 
##$XL= 0
##$YL= 0
##$YMAX_a= 930510
##$YMIN_a= -859215
##$ZGOPTNS= <>
##$ZL1= 120
##$ZL2= 120
##$ZL3= 120
##$ZL4= 120
##$ABSF1= 10
##$ABSF2= 0
##$ABSG= 5
##$ABSL= 3
##$ALPHA= 0
##$AQORDER= 0
##$ASSFAC= 0
##$ASSFACI= 0
##$ASSFACX= 0
##$ASSWID= 0
##$AUNMP= <proc_1d>
##$AZFE= 0.1
##$AZFW= 0.1
##$BCFW= 1
##$BC_mod= 2
##$BYTORDP= 1
##$COROFFS= 0
##$CY= 11.3945322036743
##$DATMOD= 1
##$DC= 2
##$DFILT= <>
##$DTYPP= 0
##$F1P= 15.9154993809931
##$F2P= -4.1035820241983
##$FCOR= 0.5
##$FTSIZE= 0
##$FT_mod= 4
##$GAMMA= 1
##$GB= 0.15
##$INTBC= 1
##$INTSCL= 1
##$ISEN= 128
##$LB= 0.24
##$LEV0= 0
##$LPBIN= 0
##$MAXI= 10000
##$MC2= 0
##$MEAN= 0
##$ME_mod= 0
##$MI= 1.114404
##$NCOEF= 0
##$NC_proc= 0
##$NLEV= 6
##$NOISF1= 3.799351
##$NOISF2= 2.8
##$NSP= 1
##$NTH_PI= 0
##$NZP= 0
##$OFFSET= 15.70392
##$PC= 1
##$PHC0= -11481.73
##$PHC1= 8.60101
##$PH_mod= 1
##$PKNL= yes
##$PPARMOD= 0
##$PSCAL= 0
##$PSIGN= 0
##$REVERSE= no
##$SF= 200.130013532006
##$SI= 16384
##$SIGF1= 3
##$SIGF2= 2
##$SINO= 400
##$SIOLD= 16384
##$SREGLST= <1H.CDCl3>
##$SSB= 0
##$STSI= 0
##$STSR= 0
##$SW_p= 3612.71676300578
##$SYMM= 0
##$S_DEV= 0
##$TDeff= 0
##$TDoff= 0
##$TI= <>
##$TILT= no
##$TM1= 0
##$TM2= 0
##$TOPLEV= 0
##$USERP1= <user>
##$USERP2= <user>
##$USERP3= <user>
##$USERP4= <user>
##$USERP5= <user>
##$WDW= 1
##$XDIM= 8192
##$YMAX_p= 0
##$YMIN_p= 0
$$ End of Bruker specific parameters
$$ ---------------------------------
##NTUPLES= NMR FID
##VAR_NAME=  TIME,          FID/REAL,        FID/IMAG
##SYMBOL=    X,             R,               I
##VAR_TYPE=  INDEPENDENT,   DEPENDENT,       DEPENDENT
##VAR_FORM=  AFFN,          ASDF,            ASDF
##VAR_DIM=   8192,          8192,            8192
##UNITS=     SECONDS,       ARBITRARY UNITS, ARBITRARY UNITS
##FACTOR=    0.0002496,     1,               1
##FIRST=     0,             0,               0
##LAST=      2.0444736,     0,               0
##MIN=       0,             -859215,         0
##MAX=       2.0444736,     930510,          0
$$ Real data points
##PAGE= N=1
##DATA TABLE= (X++(R..R)), XYDATA
0 0 0 0 0 0 0 0 -8 8 -8 8 -8 16 -24 24 -32 40 -48 64 -77 93 -106 128 -152 176 -210 245 -280 323 -373 429
30 429 -487 557 -629 711 -801 901 -1012 1132 -1261 1401 -1561 1736 -1924 2127 -2349 2592
46 2592 -2860 3156 -3474 3823 -4212 4642 -5118 5653 -6250 6927 -7700 8595 -9641 10885
60 10885 -12389 14249 -16624 19772 -24134 30594 -41111 61013 -111153 478551 570525 -859215
72 -859215 172503 289098 -542685 365564 467640 -660198 28115 320788 -385926 301533
82 301533 390255 -718545 39077 531191 -472292 150944 562566 -785865 -178436 814260
92 814260 -262843 -212910 386948 -494081 -114287 736143 -202973 -372767 257663 -269821
102 -269821 30000 688085 -423074 -565268 571477 -9245 -270338 552210 -300976 -625590
112 -625590 655065 208828 -477875 258247 -83928 -387699 521890 118312 -499214 242395
122 242395 37900 -394744 471766 180537 -641497 217747 287553 -477877 302444 339455
132 339455 -644162 40779 421107 -307090 135717 215652 -548283 78441 479674 -278683
142 -278683 -30631 188953 -449155 115286 595157 -389372 -302351 370032 -193063 -18568
152 -18568 480617 -382533 -341022 469107 -33535 -141811 284122 -300580 -210694 496911
162 496911 -55463 -294219 277095 -121490 -253064 448877 10639 -414539 268422 51768
172 51768 -312632 350727 89030 -417068 198084 109356 -258783 297229 74672 -436671
182 -436671 167421 228490 -234710 158745 88084 -424105 158734 378424 -287077 -51337
192 -51337 159155 -284808 150511 348404 -364976 -118867 264911 -160433 66408 234937
202 234937 -348721 -89150 353622 -123067 -107924 209145 -206768 -111817 345111 -107160
212 -107160 -212074 240564 -100198 -164646 299317 -72172 -219737 227261 -65571 -177667
222 -177667 274350 -18882 -252000 161367 25850 -155395 212075 9786 -298121 144478
232 144478 155414 -174244 101724 20890 -262545 187467 190906 -246113 20226 84958 -162746
243 -162746 155068 135170 -268327 2984 185303 -112303 24943 114076 -202109 5030
253 5030 227334 -137655 -65233 163898 -134665 -25989 200259 -138455 -67064 184634 -108971
264 -108971 -70846 176526 -70250 -82844 136540 -68664 -85376 177452 -22630 -152115
274 -152115 110786 10706 -85708 146065 -37124 -175335 144277 63992 -114498 70859
284 70859 -25439 -110552 144585 52693 -152775 24670 56489 -63548 67266 34083 -146901
295 -146901 38262 115646 -96478 -1797 59686 -102196 42445 90021 -120602 -1686 90481
306 90481 -72350 -5531 57673 -68288 2167 77835 -67726 -45710 84951 -16957 -44346
317 -44346 52883 -47686 -32106 106226 -34073 -81482 60887 -2480 -17020 56588 -51459
328 -51459 -52270 74700 21852 -47068 2929 -777 -13749 50075 8870 -73543 18433 52208
340 52208 -28128 8256 208 -41549 47825 31721 -52335 -1739 22227 2613 14022 -9259
352 -9259 -24947 11640 37148 -3869 -34564 7686 17273 5418 13884 -26925 -18828 39612 13467
365 13467 -17969 -13913 -3406 23265 11742 -11575 -18213 -9107 36474 11609 -38798 941 7788
378 7788 1260 26178 -23238 -35361 31306 22289 -19847 -11928 -2241 -3861 21209 14416 -49015
391 -49015 -10197 51229 -17698 -15953 17313 -42286 16690 54496 -56222 -24614 43533 -15979
403 -15979 -478 21772 -46320 -10192 62366 -15775 -51233 33074 420 -23065 53124 -30852
415 -30852 -62934 78325 11531 -63133 40539 -12630 -37592 78071 -9572 -80625 48541
426 48541 32551 -44799 31179 5240 -67950 56833 53952 -89203 13742 56035 -65445
437 -65445 38376 48058 -100649 33378 79732 -83049 7462 60652 -68141 19425 67604
448 67604 -83161 -8077 96128 -55611 -37234 77685 -52964 -18206 106791 -76976 -64660
459 -64660 118779 -29309 -50338 82521 -67540 -45661 131156 -32082 -94016 73945 -6945
470 -6945 -48925 96766 -28371 -115678 98422 39744 -99431 66608 3696 -109790 106143
481 106143 38802 -133032 65247 41908 -106804 71872 44662 -120366 52195 65157 -115509
492 -115509 35660 88661 -112628 7481 87925 -108983 24091 116195 -133926 -23917
502 -23917 124405 -82906 677 96761 -132990 -18495 157489 -69477 -62817 87793 -74801
513 -74801 -21777 156093 -75776 -117050 123890 -12143 -60736 126746 -72028 -116293 159415
524 159415 2348 -106383 106648 -35181 -104083 146916 11672 -133130 93372 21490
534 21490 -119252 107720 52989 -144019 66179 57558 -128753 94006 79409 -164913 43577
545 43577 87107 -114368 77731 74013 -180683 31230 142640 -98129 1015 73316 -139601
556 -139601 21425 173070 -108560 -73990 101453 -80384 11742 152873 -142241 -85234
566 -85234 158128 -55427 -37841 130370 -122780 -87642 182243 -28021 -106117 108986 -49177
577 -49177 -99279 154747 -1125 -132037 99880 -16061 -109815 156582 7749 -163913
587 -163913 103397 17730 -121158 147736 31002 -197848 72274 97161 -100572 66284
597 66284 34499 -171514 65445 139416 -109784 4624 42510 -138911 96089 147512 -178250
608 -178250 -25886 118482 -104206 45567 136335 -170819 -55650 163977 -48035 -32655
618 -32655 94585 -112166 -43168 163024 -54108 -65152 110946 -101062 -55211 196791 -62494
629 -62494 -124762 136177 -49036 -91983 180588 -15794 -162246 89749 26688 -65997 118130
640 118130 -26474 -158395 106946 63233 -92062 91922 -26718 -174626 155091 113544
650 113544 -173231 27601 50209 -125023 107353 106424 -171636 -17064 92447 -60293 56796
661 56796 57359 -164165 14697 135400 -94817 10208 93939 -164298 -6124 187039 -96135
672 -96135 -65878 110172 -97241 -33847 159530 -58289 -88232 76490 -52140 -12608 144474
683 144474 -82258 -118599 121168 -12876 -56346 142545 -74851 -161863 159539 60258 -112634
694 -112634 64403 -28455 -106748 141432 54416 -129470 29553 9029 -64728 129778 27878
705 27878 -173977 53913 88258 -97555 72983 59028 -172805 37799 133328 -92688 9416
716 9416 57886 -120478 32845 117306 -84654 -10032 57230 -103630 30839 139310 -104315
727 -104315 -63523 100779 -64185 -7168 141122 -100540 -103616 122752 -4343 -31925 81760
738 81760 -92318 -71968 139467 2527 -73450 54445 -55659 -56468 148089 121 -137648
749 -137648 60370 21806 -68865 105628 4643 -142801 65031 56750 -71454 63103 1983
760 1983 -117659 70178 64504 -84298 36869 25446 -110996 54585 96025 -96636 -6874
771 -6874 55816 -88766 37685 105383 -104345 -35101 73357 -51649 29607 78283 -112794
782 -112794 -35958 105074 -25517 -15619 55268 -86269 -32727 128537 -18566 -74484 53208
793 53208 -34261 -28704 113613 -31188 -92008 68058 -487 -35496 82632 -30407 -84099
804 -84099 73599 21042 -54500 55403 -3501 -82740 61570 45200 -68327 34095 15921
815 15921 -82079 57881 58461 -79244 14373 25658 -63442 55918 53766 -90244 -5255 51971
827 51971 -35595 25885 40000 -86646 -10236 84631 -29529 -18922 36168 -63882 -783
838 -783 90121 -45615 -43266 46926 -33687 -3523 67700 -46625 -45230 55017 -9807 -25134
850 -25134 48017 -24668 -47950 53677 3575 -42166 44785 -9500 -55310 51949 13766 -45565
862 -45565 34851 -6393 -48697 50358 22005 -49939 12257 9176 -29872 37890 22720 -60077
874 -60077 3154 39755 -23810 14613 17780 -57463 14556 52948 -33933 -5298 19246 -34527
886 -34527 17934 40167 -37141 -13563 30292 -13873 -1455 29076 -24935 -16893 37707 -11093
898 -11093 -18422 33535 -14681 -21268 33999 -10668 -15931 31681 -14366 -22939 27714 1875 -14425
911 -14425 14173 -8151 -17775 25593 11174 -27566 3050 8418 -13058 20358 4366 -34633
923 -34633 11131 18401 -13753 6579 -2705 -19187 15644 13384 -16619 -5909 6374 -3212 2831
936 2831 6951 -14506 -5347 17116 -6346 -8998 9387 -7999 -615 10935 -12601 -3580 10646
949 10646 -3432 -3588 -858 -1714 3313 2756 -1586 -8683 1234 11053 -3615 -4367 382 -3584 7953
964 7953 4799 -9598 -2884 4273 6631 169 -6059 685 -144 5434 7128 -13178 -1008 13090
978 13090 -4512 1241 2652 -10175 8142 10926 -10053 -4976 7691 1546 -332 5607 -7005
991 -7005 -6788 18438 101 -16229 11534 -469 -7932 18862 -8496 -17137 20747 1970 -13360
1004 -13360 10027 -3186 -10248 16144 2459 -21377 8248 13218 -16855 6038 8509 -23980
1016 -23980 13733 17747 -30030 5485 17130 -22242 9957 12043 -28840 7605 22290 -21802
1028 -21802 -4468 17243 -17168 -463 24424 -24100 -12493 33063 -15417 -14652 28203 -21097
1040 -21097 -11007 36731 -21117 -20323 32763 -10768 -16218 26912 -13575 -19845 33941 -2240 -31752
1053 -31752 24959 4957 -26536 29759 402 -39726 33601 14478 -37814 23571 7359 -34063
1065 -34063 32178 13232 -41654 18475 20695 -31294 15595 19595 -38538 13435 33634 -38938
1077 -38938 3526 34921 -38149 5363 37748 -41949 2247 41827 -39638 -4139 40772 -31417
1089 -31417 -6217 38650 -33077 -13329 48545 -22078 -27381 40865 -17847 -22273 51411 -23385
1101 -23385 -41337 51010 -5513 -32370 42113 -19379 -38058 53610 801 -45468 31264 1221
1113 1221 -36253 41461 8500 -55227 28511 22933 -45349 28677 18178 -57023 28315 29866
1125 29866 -52148 23246 26016 -54809 20200 35926 -47843 11271 33817 -50723 6279 50113
1137 50113 -42428 -9811 41978 -41716 -15 58818 -47997 -23485 54392 -30687 -7064 53484
1149 53484 -49593 -26804 66757 -17213 -30094 42835 -28143 -29418 66168 -8471 -52291 41770
1161 41770 -3504 -34668 58872 -8723 -60217 50717 8516 -44711 50625 -614 -62036 46403
1173 46403 23654 -50328 31631 16000 -58540 31160 39214 -50749 14198 24129 -56203 31246
1185 31246 47702 -64083 4569 38306 -51254 24974 50318 -70896 -10183 58859 -31636
1196 -31636 -3201 39643 -54137 -13855 68210 -25663 -27665 39596 -40609 -11684 74945 -38471
1208 -38471 -46105 57299 -23452 -26274 67886 -29332 -56465 56324 2458 -36400 44957 -13006
1220 -13006 -52647 50484 13632 -44844 39334 -6517 -59859 61250 25451 -67406 31119
1231 31119 14392 -58016 51623 36533 -72780 7965 35594 -34077 28121 25703 -67859 9311
1243 9311 54032 -36434 9192 29325 -69008 14546 76498 -52017 -21301 46834 -44437 1349
1255 1349 68397 -43914 -35837 46548 -17106 -6139 48980 -40845 -34252 58570 -13017 -24912
1267 -24912 54777 -36521 -49290 75112 1700 -51150 43436 -14970 -46551 64465 12209
1278 12209 -55947 22425 574 -29087 55861 4157 -70374 28322 27649 -39577 40862 11605
1290 11605 -82302 31868 57147 -49383 6797 18704 -56811 27661 51706 -49359 -8957
1301 -8957 24610 -36139 22908 45725 -58587 -16317 50371 -31068 -1153 52537 -54167 -29588
1313 -29588 64807 -16335 -20180 39441 -39464 -23667 61015 -10001 -28721 29038 -27944 -18288
1325 -18288 65909 -10602 -54330 34459 85 -27251 57171 -6812 -67993 38592 25435 -30293
1337 -30293 32448 -9469 -53701 44963 29514 -40101 15141 2325 -42295 42061 35134 -56558
1349 -56558 2213 29663 -35924 23748 37205 -58038 -4119 42442 -27809 10672 28673 -51408
1361 -51408 -2193 47350 -22757 -4416 25410 -41447 -6544 56788 -19013 -29516 27880 -22546
1373 -22546 -9894 55953 -22071 -43137 32768 -4635 -9668 40969 -27769 -40675 41838 8737
1385 8737 -22045 23163 -17048 -35091 43924 16995 -40711 12864 3130 -30346 37909 15614
1397 15614 -48694 12620 15717 -26653 28731 12018 -46590 11822 25342 -22840 13877 14050
1409 14050 -41195 5988 37207 -21131 -3047 17839 -33963 5717 43421 -26150 -15628 20901
1421 20901 -21175 7426 36635 -30354 -21146 27911 -4802 -1801 23733 -24814 -21664 35859
1433 35859 4040 -19335 17125 -13362 -18562 38057 1119 -29592 17208 -3071 -15143 30593
1445 30593 -1079 -29366 14903 6686 -14513 19074 3376 -28915 11208 16706 -16725 10302
1457 10302 6947 -30404 11726 23110 -19968 3037 6315 -23372 14249 21877 -22370 -5905
1469 -5905 10511 -10759 8159 16605 -22324 -11072 20569 -4024 -3797 12704 -19772 -7804 26347
1482 26347 -6607 -11771 11486 -12230 -3488 21187 -7738 -13099 10275 -2706 -5558 13706 -2779
1495 -2779 -15291 9441 3973 -9700 11893 530 -17307 10579 6727 -9954 9421 -1789
1507 -1789 -14201 11222 8187 -8245 1151 -9 -6476 8311 9056 -10815 -4359 8032 -2612
1520 -2612 3794 6741 -13187 -1315 12562 -4281 -35 3101 -8298 3037 8565 -4197 -3277
1533 -3277 2512 -826 -160 4348 -1405 -4930 4247 769 -4351 5160 -245 -5147 4029 -971 -1772
1548 -1772 4517 -1862 -3572 805 994 1499 -1456 -1834 -1107 -584 4492 -929 -5275 1143 605 440 2135
1565 2135 -3838 -2801 2279 2174 -590 -3436 383 126 -772 3552 -4024 -4094 6466 -1751 -3177 4112
1581 4112 -3937 -866 5715 -3666 -3581 4385 173 -2803 2063 269 -4343 5136 2653 -8503 3997
1596 3997 4818 -7278 5582 2133 -9891 7339 4825 -8860 4113 3476 -6595 4708 4705 -8074
1610 -8074 1686 8544 -6838 -1786 8907 -7606 -275 11809 -10688 -2976 13622 -8079 -2552
1623 -2552 10813 -9493 -1959 12912 -7273 -6510 10452 -3233 -5789 10801 -4328 -10014 14078
1636 14078 -454 -13132 12037 -1253 -11888 15307 -1356 -15468 13503 1395 -13237 10771
1648 10771 530 -13753 10817 4911 -16104 6722 8337 -15223 6233 9835 -18564 6883
1660 6883 13109 -19224 3797 12855 -17360 5285 12571 -18779 1897 15530 -14566 -1511 14311
1673 14311 -13290 -2734 18154 -13008 -7924 20208 -10506 -9329 20273 -11356 -9822 22358
1685 22358 -10349 -12429 20921 -6402 -11807 18375 -5831 -14220 19946 -105 -18550 15711
1697 15711 2661 -17852 18345 3117 -23613 17600 8759 -21664 15342 5761 -22904 16649
1709 16649 10788 -23318 10049 11235 -20215 9871 14222 -22751 4110 18654 -20693 2312
1721 2312 19962 -22651 21 22489 -21154 -826 22143 -22028 -4092 23992 -16752 -5526
1733 -5526 21614 -17090 -9030 26074 -10663 -15284 20752 -9201 -13504 27177 -9354 -22908 24138
1746 24138 -3314 -16821 24469 -8385 -23416 25687 2586 -21955 17325 -419 -22551 21287
1758 21287 8955 -26615 11785 9789 -23446 16683 12482 -30219 11487 15808 -25647 13803
1770 13803 15685 -30673 7535 21481 -22522 5016 18091 -25785 883 26751 -17992 -5078
1782 -5078 19744 -21458 -1177 31086 -20734 -12311 25241 -16695 -4068 31213 -21168 -17842
1794 -17842 29471 -6120 -12049 22533 -13573 -18925 28871 416 -20624 18627 -6350 -19751
1806 -19751 30481 504 -29065 21058 2229 -23539 27091 4586 -32515 16202 11950 -21326
1818 -21326 15543 8068 -29430 11165 18330 -20873 8622 10448 -30754 12642 26229 -28216
1830 -28216 47 18070 -26982 8453 28994 -28300 -9508 22262 -13933 1275 20994 -24619
1842 -24619 -10661 27625 -9772 -7793 20779 -22590 -12351 36799 -10241 -21001 23288 -12173
1854 -12173 -15016 32910 -6112 -25265 18343 -1122 -12458 24179 -4837 -26077 19692 6185
1866 6185 -17828 21438 -1024 -32824 23261 17338 -25916 11779 6149 -27751 19588 20266 -26043
1879 -26043 1532 9971 -16986 16289 16680 -30105 -370 21342 -15528 6924 18890 -31873
1891 -31873 -3330 33125 -14637 -6978 18024 -22557 -2794 30990 -12922 -12929 15090 -13451 -2380
1904 -2380 27609 -14417 -19819 21329 -5471 -10481 26957 -11399 -26965 24679 4851 -16056
1916 -16056 18419 -8455 -23150 24638 8092 -18944 10204 -4548 -17628 24632 9226 -28011
1928 -28011 6282 9007 -16593 17904 11009 -32680 4370 20511 -14971 7915 7650 -27659 7375
1941 7375 22643 -15328 -132 8600 -20344 6218 24809 -17689 -10181 15691 -12561 -3
1953 -3 24918 -17563 -15616 20561 -5847 -3434 19929 -17264 -14259 22782 -1009 -8332 13571
1966 13571 -12794 -13153 25739 3110 -18690 9265 -2508 -12288 23947 3236 -25570 9405
1978 9405 6369 -10248 17847 -528 -24809 12316 12498 -11787 8017 849 -20541 11372 17578
1991 17578 -15432 -811 7059 -15685 8497 18370 -18800 -4870 11953 -11516 6240 15336
2003 15336 -19453 -6313 15256 -6260 674 11072 -16126 -7667 19291 -1728 -8174 8533
2015 8533 -11043 -7215 21974 -2500 -15561 8735 -4472 -4680 18977 -5848 -17169 9990 2774
2028 2774 -5091 10873 -4817 -15953 11256 8808 -10030 4921 -212 -14006 11982 10498 -14313
2041 -14313 2523 3423 -10853 10874 8567 -14756 343 6766 -6398 6685 7253 -13689 -2304
2054 -2304 11438 -3425 134 6439 -12492 -2042 15529 -4272 -4602 5831 -8885 596 14724
2067 14724 -5687 -8016 5484 -2235 472 9735 -5752 -9753 7412 3354 -3798 5946 -4026 -9315
2081 -9315 9797 3816 -7602 4385 -1916 -6706 9187 2347 -7969 1725 636 -4012 6061
2094 6061 2926 -8205 -542 4404 -2940 2762 3330 -9268 -60 7339 -3657 654 1439 -8024 1959
2109 1959 7000 -3483 -2398 505 -2833 2366 5071 -3175 -5043 2663 757 -662 3630 -3796 -4466
2124 -4466 5371 763 -2082 2465 -3319 -1911 4339 261 -1963 312 -711 -531 2088 1360 -2146
2139 -2146 -800 1374 -1023 1823 1664 -3467 -81 2139 -489 1786 71 -2180 767 1820 1452
2154 1452 -595 -1669 590 468 1574 1358 -3026 -138 2182 -234 1136 -173 -1901 871 1441 111
2170 111 -980 66 562 -1068 1707 235 -3084 2437 737 -3080 2690 368 -2860 2209 -133
2185 -133 -2335 2156 517 -2478 431 1526 -2350 118 2208 -3268 -452 4008 -3845 -583 3793
2200 3793 -4311 177 4256 -4616 -424 4036 -3175 -681 3230 -2906 -1412 4359 -1763 -3572 4818
2215 4818 -585 -4242 5468 -1671 -5077 6978 -623 -5372 5702 -1195 -4309 6194 -577 -5553
2229 -5553 4763 1600 -4764 3695 1876 -6360 3810 4344 -7299 2788 4614 -7669 3618 5412
2243 5412 -8588 2981 5459 -7794 2334 5476 -6805 1148 5861 -5826 -136 7476 -5840
2256 -5840 -2522 8116 -4934 -3006 9174 -6004 -4201 10109 -4487 -4550 8588 -5054 -4488 9335
2270 9335 -3456 -6519 7658 -1471 -6308 7878 -954 -8673 7957 1579 -9585 7732 1520
2283 1520 -10074 8417 2263 -10578 7237 2792 -10007 6277 3697 -9871 4935 5205 -9886
2296 -9886 2995 7287 -9997 1872 8447 -10625 1027 10015 -10937 35 10164 -10024 -52
2309 -52 10361 -9534 -1646 10778 -7455 -3271 10279 -6347 -4602 11217 -4873 -7259 11742
2322 11742 -3762 -8483 12097 -3360 -8676 12534 -2909 -9728 11638 -890 -9135 10216 -252
2335 -252 -10271 10006 3069 -11245 7106 4099 -11034 7964 5504 -13755 6586 7256 -12588
2348 -12588 6897 6266 -14065 5770 8504 -12175 3128 8029 -11619 2078 10647 -10670 -1535
2361 -1535 10657 -10133 -1602 12922 -10108 -4131 12564 -9265 -2870 13728 -10007 -6500 13289
2374 13289 -6128 -5723 11952 -6594 -8588 12951 -1186 -9823 9677 -2568 -9933 13331 176
2387 176 -13526 10432 582 -11220 12643 677 -15252 9919 5068 -11291 7572 3323 -13541
2400 -13541 6711 8461 -11333 3636 6247 -13107 5711 11126 -13662 1746 9695 -12966 4199
2413 4199 12717 -13864 -1892 11469 -8628 251 11337 -10799 -4264 13012 -5174 -3637 10762
2426 10762 -9590 -5539 16815 -5604 -9205 12238 -6759 -6987 16669 -4213 -12374 11038 -575
2439 -575 -6945 11594 -2400 -12443 9976 3436 -9469 9255 -201 -14348 11547 6875 -14363
2452 -14363 6640 4082 -14016 9616 8434 -14684 2333 6314 -9705 6110 7796 -13568 -177
2465 -177 9851 -8294 2558 9104 -15005 -1085 15675 -9016 -3206 9858 -11858 -1659 15665
2478 15665 -7806 -6927 8409 -6249 -1176 13108 -7727 -9623 10880 -1776 -5096 12352 -6210
2491 -6210 -12456 14039 2218 -9740 9720 -3299 -11539 13330 3516 -10926 5919 -250 -8421
2504 -8421 11433 4110 -13416 3645 4999 -8826 8593 6341 -16468 2757 11113 -8605 3888
2517 3888 5666 -14216 3303 12137 -7843 -416 4571 -9942 3125 12755 -9011 -5534 8444
2530 8444 -5844 -99 12811 -9805 -8454 11920 -2586 -3229 9880 -8520 -7326 12770 -1293
2543 -1293 -5857 6788 -5968 -6706 12664 701 -10136 5381 -928 -7213 12044 1872 -13622
2556 -13622 5177 3785 -6886 8997 516 -13653 5858 6598 -6466 4121 349 -11128 6012
2569 6012 9285 -8549 -1172 4117 -8021 4394 10325 -10707 -3546 7572 -5521 2913 8179
2582 8179 -10985 -3068 9589 -3212 -437 5598 -8508 -3256 11390 -1178 -5330 5050 -4851
2595 -4851 -3805 12086 -1416 -8727 5597 -1842 -3042 10536 -2826 -9658 6133 1569 -2745
2608 -2745 6420 -2617 -9074 6288 5474 -5429 2454 -339 -7558 7217 6545 -8587 409 2409
2622 2409 -5881 6592 4756 -9680 97 4657 -3252 3509 3290 -8440 -1038 7014 -2068 -977
2636 -977 3395 -6751 -1064 9135 -2860 -3651 3502 -5121 -380 8389 -3985 -5012 3410 -1620
2650 -1620 -89 5752 -3670 -6220 4264 2208 -2495 3508 -2640 -6307 6097 3209 -4584 2339
2664 2339 -1347 -4435 6624 1970 -5927 586 563 -1617 4268 1373 -5772 27 3660 -1565 1492
2679 1492 1845 -5894 315 5631 -2415 -8 1525 -4934 1921 5059 -2598 -1131 1217 -2026 1723
2694 1723 4003 -2280 -3091 2023 605 -79 3132 -2638 -3738 3775 999 -1225 1766 -2782 -1890 4323
2710 4323 874 -1903 118 -1148 -460 2595 644 -2758 -823 1295 -376 1610 856 -3723 154
2725 154 1908 -980 971 -278 -2896 1254 1497 -607 -146 -981 -852 524 1280 -69 -1848 -238
2741 -238 336 111 1393 -1115 -1765 1142 344 282 91 -1887 -700 1005 824 279 -1463 -206 265 -156
2759 -156 1369 -817 -1453 1086 183 40 818 -646 -586 859 529 -359 -423 410 -520 258 1931 -1251
2777 -1251 -273 1773 -1416 473 2152 -1879 -229 1784 -1082 431 1399 -1334 -456 1934 -66 -1183
2793 -1183 1335 -455 -1566 2584 96 -2392 2269 -387 -2041 2909 -560 -2553 2411 -25 -1976
2808 -1976 2095 88 -2174 1635 1016 -2476 1019 1735 -3283 929 2135 -3527 1058 2510 -4001
2823 -4001 913 2419 -3460 1058 2481 -3429 255 2597 -2639 -358 2880 -2283 -1195 3737 -2364
2838 -2364 -2076 4141 -2336 -2038 4692 -2395 -2183 4507 -2333 -2583 4575 -1648 -3163 3866 -970 -2776
2854 -2776 3899 -227 -4122 3695 1331 -4563 3600 1266 -5670 4223 2191 -5404 3335 1541 -4835
2869 -4835 3434 2246 -4829 2332 3104 -4205 1777 3796 -4794 383 4613 -4529 53 5158 -4967
2884 -4967 -260 5723 -4984 -324 5265 -4781 -858 5490 -3645 -1824 4904 -3204 -2556 5824 -2348
2899 -2348 -4352 5862 -1504 -4484 6395 -1608 -5414 6417 -791 -5390 5846 -961 -5651 5818
2913 5818 256 -5750 4472 1102 -5973 4042 2509 -6848 3246 3573 -7034 3107 4040 -7308
2927 -7308 2685 4739 -7280 2575 4657 -6675 1380 5031 -6327 691 5280 -5593 -1063 6343
2941 6343 -5181 -1808 7139 -4634 -2600 7820 -4569 -3196 7618 -4331 -3466 7507 -3733
2954 -3733 -3777 7183 -2444 -4707 6894 -767 -5472 6473 -115 -6502 6790 1078 -7642 5935
2968 5935 1409 -7319 6290 1849 -8046 5319 2996 -7103 4409 3097 -7270 3468 4693
2981 4693 -6769 1765 4694 -7230 1899 6322 -7652 392 6747 -7369 926 7193 -7921 -954
2995 -954 7338 -5794 -900 6927 -6043 -2689 7247 -3404 -3498 7017 -4190 -4418 8506 -2775
3009 -2775 -5502 7904 -3050 -5638 9101 -1873 -7599 6929 -393 -5766 6800 -466 -7813
3022 -7813 5359 2456 -6445 4626 1469 -7999 5601 4609 -8465 3454 3580 -8186 4984 5696
3036 5696 -8940 1521 5294 -6305 2494 5521 -7543 -224 6741 -4927 83 6398 -7457
3049 -7457 -1306 9260 -5250 -2500 7414 -6506 -2430 10052 -4527 -4674 6625 -3280 -2538 8025
3063 8025 -3034 -6233 6562 -385 -4196 7417 -2144 -8032 8027 1927 -6914 5925 -387 -8077
3077 -8077 7613 2979 -7712 3451 1341 -5989 5653 3233 -8408 2009 4040 -5898 3828
3090 3828 4442 -9637 1080 7056 -6067 837 5102 -8678 576 8198 -5246 -1505 4330 -5983
3104 -5983 138 8040 -5289 -3903 5463 -3370 -1404 8109 -5103 -6496 7416 -1154 -3374 6742
3118 6742 -4341 -5993 8030 420 -4850 4216 -2677 -4754 7562 1348 -6777 3297 685 -5142
3132 -5142 6676 2042 -8954 2925 3621 -5118 4827 2229 -8767 3318 5161 -4685 2129 1986
3146 1986 -7127 2829 6392 -4957 -1171 3532 -4972 1517 7764 -6078 -3505 5768 -3353 234
3160 234 6223 -6270 -3633 7021 -1548 -1116 4284 -4964 -3191 7070 -271 -4477 3455 -1987 -3629
3175 -3629 7471 22 -7113 3396 83 -3405 6399 -572 -7052 3736 1808 -3096 3981 -623
3189 -623 -6411 3497 4241 -3749 962 1038 -5504 3249 5669 -5465 -893 2592 -4353 3098 4675 -6288
3205 -6288 -1154 3864 -2396 1779 3141 -5585 -1607 5535 -871 -1040 2588 -3998 -2091 6778 -1058
3220 -1058 -3646 2958 -2535 -1150 6350 -1711 -4689 2939 -253 -675 4376 -1398 -4837 2912 1888
3235 1888 -1930 2328 -787 -4914 3808 3479 -3521 1078 -121 -3693 4007 2854 -4558 107 799
3250 799 -1610 2971 1971 -4480 -894 3119 -934 810 1778 -4228 -620 4312 -1145 -654 1797 -3570
3266 -3570 243 4403 -1763 -1857 1067 -1744 607 3090 -1487 -3003 1479 446 -607 2142 -1523
3281 -1523 -3548 2625 1494 -1348 1602 -1666 -2654 3151 1009 -2061 22 -903 -961 2438 568 -2583
3297 -2583 -836 923 -518 1257 928 -3212 -259 2014 -604 556 130 -2824 1147 2150 -729
3312 -729 -345 -23 -1120 671 1864 -428 -1323 391 -2 270 1662 -400 -1885 1338 693 464 1042
3329 1042 -1318 -853 1378 692 249 -248 -1011 119 919 983 -658 -1108 447 180 594 774 -1219 -747
3347 -747 783 170 524 -434 -1013 122 361 554 -307 -946 124 -41 540 742 -1172 -703 436 -502
3365 -502 650 37 -1184 -137 687 48 -252 -4 -418 -830 1030 463 -1661 509 18 -925 1427 -279
3383 -279 -1941 1330 331 -587 1025 -255 -1261 494 732 -568 9 690 -1192 177 1808 -1263
3399 -1263 -411 1830 -1714 186 1676 -1864 50 1661 -1123 134 1626 -1181 -654 1530 -538
3414 -538 -934 2008 -446 -1405 2134 -250 -1731 2522 -332 -1730 2756 -504 -1823 2461 -283 -1735
3430 -1735 1773 233 -1685 1645 905 -2153 1460 1383 -2427 1302 1558 -3172 985 2049 -2935 1355
3446 1355 1478 -2843 1086 1708 -2944 528 1715 -2384 97 2446 -2227 -754 2799 -1972 -1291 3023
3462 3023 -2451 -1100 3764 -2290 -1841 3311 -1945 -1430 3304 -1727 -2275 2813 -961 -1834 2994 -304
3478 -304 -3526 2862 675 -3394 3112 358 -3990 3106 1135 -3778 2819 591 -3768 2829 1574
3493 1574 -3595 1665 1551 -3536 1444 2747 -3869 414 3135 -3331 590 3589 -4008 261 4006
3508 4006 -3476 158 3464 -3756 129 3949 -2577 -817 3675 -2319 -1590 4207 -1650 -2263 4276
3523 4276 -1247 -2762 4848 -1572 -3434 4769 -772 -3287 4297 -1283 -3695 4168 -214 -3421 3150
3538 3150 554 -3768 3137 1590 -4499 2107 2092 -4641 2911 2474 -5540 2222 2635 -4604 1919 2395
3554 2395 -4892 1665 2760 -4135 636 3097 -3837 -322 3955 -3556 -931 4604 -3575 -1164 4953
3569 4953 -3601 -1742 4772 -3517 -1746 4900 -2947 -2197 4775 -2409 -2589 4281 -1254 -3501 4236
3584 4236 -357 -3984 4329 192 -4522 4659 128 -4614 4573 337 -4711 4112 1160 -4349 3592
3599 3592 1778 -4802 2303 2610 -4055 1760 3024 -4682 1555 3804 -4861 726 3942 -4948 850
3614 850 4591 -5139 -29 4126 -4072 -167 4279 -3828 -1353 4593 -2597 -1696 4394 -2875 -2501 5490
3630 5490 -2071 -3066 5036 -2431 -2945 5650 -1769 -4191 4472 -1294 -3202 4510 -316 -4113 3208
3645 3208 630 -3604 3580 300 -5048 3372 2171 -5146 3061 1550 -5644 3503 3125 -5395 1411
3660 1411 2400 -4245 2528 3022 -4655 235 3379 -3669 401 3603 -5090 -566 5149 -3578 -580
3675 -580 4577 -4756 -1348 5443 -2586 -1835 3758 -2542 -1323 5089 -2094 -3048 3761 -1025 -2122 4929
3691 4929 -1614 -4581 4548 392 -3319 4298 -1244 -4713 4799 1129 -3643 2985 -367 -3561 3962
3706 3962 1665 -4224 1436 1611 -3349 3112 2826 -5702 1121 3320 -3727 1913 2549 -5753 918 3893
3722 3893 -3355 505 2203 -4567 636 4457 -2924 -1566 2737 -2778 -287 5097 -3176 -3444 3711
3737 3711 -1756 -1008 4414 -3434 -3371 4375 -686 -1794 2809 -2467 -2907 4449 233 -3238 1958 -875
3753 -875 -2913 4278 1125 -4697 2242 1003 -2635 4282 563 -5310 2153 2026 -2126 2138 4
3768 4 -4454 1975 3329 -2415 252 1212 -3648 1335 4137 -3693 -1362 2378 -2696 1744 3928 -4096
3784 -4096 -1183 3034 -1332 854 2729 -3481 -1560 3676 10 -1610 1999 -2398 -1916 4678 17
3799 17 -3051 2036 -1254 -1443 4330 -1014 -3602 1984 -160 -587 3348 -1255 -3437 1745 1814 -1277
3815 -1277 1243 -135 -3661 2132 2783 -2728 407 304 -3238 2869 2535 -3795 -500 808 -1632 2020
3831 2020 1530 -3443 -806 2068 -572 91 1263 -3076 -984 3574 -693 -1099 1266 -2476 -283 3764
3847 3764 -1252 -1875 926 -1110 253 2668 -1090 -2404 955 658 -234 1618 -794 -2922 2324 1686
3863 1686 -1526 1186 -1041 -2011 2873 1267 -1820 329 -831 -693 2285 1030 -2173 -650 1022
3878 1022 -188 1089 973 -2283 -350 2168 -415 254 405 -2356 549 2108 -501 -349 -63 -1167
3894 -1167 946 1604 -641 -1315 4 -20 149 1321 -867 -1801 1177 524 -352 1083 -1560 -1462 1594
3911 1594 341 -366 -44 -1183 -334 1207 591 -827 -807 302 74 822 554 -1483 -666 594 -136 674
3929 674 -41 -1626 404 817 458 -66 -703 -343 169 520 441 -1219 -615 283 84 829 -352 -1269 250
3948 250 486 296 267 -675 13 242 872 560 -641 -333 -49 46 945 51 -1150 454 59 474 827 -583
3968 -583 -616 740 399 160 -120 -528 -245 406 1261 -541 -329 307 -627 547 1266 -1324 178 563 -599
3987 -599 577 430 -1034 -157 921 -5 -67 744 -735 -758 1238 10 -1046 917 -354 -1161 1543
4004 1543 -384 -1137 893 -238 -620 1276 -511 -1048 581 86 -793 444 733 -1296 592 1290 -1839
4021 -1839 406 936 -1751 1048 1357 -2197 495 1022 -1492 563 994 -1611 47 1328 -1107 -103
4037 -103 1389 -963 -524 1980 -1022 -751 2329 -1410 -1122 2471 -1472 -830 2102 -1151 -913 1763
4053 1763 -487 -1107 1752 -313 -1615 1907 229 -2084 1913 140 -2337 2018 545 -2369 1861
4068 1861 216 -2354 1914 544 -2301 1233 881 -2341 1263 1313 -1993 456 1775 -2101 191 2104
4084 2104 -2813 296 2305 -2408 146 2248 -2521 -207 2427 -2120 -770 2183 -1768 -988 2382
4099 2382 -1323 -1778 2462 -1059 -1933 3093 -1133 -2246 3095 -826 -2072 2919 -935 -2287 2702
4114 2702 -375 -2182 1976 -55 -2352 2449 727 -2939 1438 1349 -2995 1866 1440 -3379 1610 1844
4130 1844 -3185 1904 1760 -3395 1270 2159 -2766 712 1917 -2611 343 2810 -2341 -345 2983
4145 2983 -2212 -470 3363 -2498 -875 3369 -2359 -750 3375 -2409 -1227 3306 -1517 -1277 2885
4160 2885 -1135 -2115 2992 -310 -2814 2706 -255 -2808 3222 44 -3512 2938 210 -3185 3347
4175 3347 453 -3295 2583 771 -3242 2162 1098 -3276 1564 2077 -3300 838 2354 -3702 1052
4190 1052 2911 -3817 860 2783 -3737 481 3182 -3173 -21 2822 -2641 -695 3050 -2317 -1035
4205 -1035 3066 -1620 -1451 3449 -2027 -1886 3759 -1638 -2141 3848 -1312 -2130 3639 -1131 -2332 3214
4221 3214 -379 -2327 2734 213 -2713 2737 503 -3259 2728 960 -3403 2824 1025 -3875 2488
4236 2488 1519 -3929 2050 1720 -3446 1747 2051 -3214 857 2318 -2913 407 2721 -3282 25 3421
4252 3421 -3043 -332 3520 -3117 -445 3828 -2733 -824 3081 -2302 -693 3279 -1978 -1570 3039
4267 3039 -1078 -1624 3102 -873 -2865 3493 -285 -2722 3264 -948 -3175 3627 -146 -3032 2359
4282 2359 -402 -2721 2972 477 -3119 1438 850 -2666 1886 1448 -3680 1273 2411 -3059 1510
4297 1510 2012 -4038 1285 2864 -2752 569 1791 -2992 675 2845 -2478 -400 2462 -2390 -22
4312 -22 3392 -2376 -1714 3499 -1482 -1119 3511 -2400 -1909 3687 -792 -1155 2443 -1821 -1645 3515 -182
4329 -182 -2528 1712 -539 -1593 3062 317 -3602 1775 872 -2525 2888 124 -3846 1980 1324 -1989
4345 -1989 2111 17 -3023 1876 2012 -2359 166 1083 -2606 1021 2743 -2876 -904 2196 -2187
4360 -2187 851 2849 -3374 -690 2461 -1406 393 1794 -2663 -546 2742 -662 -1149 1590 -1959
4375 -1959 -1276 3499 -440 -2445 1626 -607 -1091 3461 -978 -2671 1895 -362 -901 2455 -731 -2578
4391 -2578 1746 1170 -1343 929 -93 -2457 1996 2108 -2417 358 661 -2168 2075 1609 -2768 58
4407 58 1038 -1486 1601 1239 -2709 -462 1917 -632 140 759 -2206 -458 2965 -639 -1023 1248 -1781
4424 -1781 64 3129 -1377 -1570 923 -1091 210 2029 -1404 -1929 1168 503 -316 912 -857 -2292
4440 -2292 1755 1071 -1472 748 -564 -1785 2084 791 -1886 299 -244 -691 1684 506 -2013 -330
4456 -330 579 -217 861 414 -2099 -139 1741 -451 106 271 -2113 362 2002 -1018 -374 2 -1067
4473 -1067 846 1415 -654 -1229 197 400 528 1054 -982 -1709 1246 560 -373 929 -1349 -1058 1677
4490 1677 329 -547 322 -1007 -111 1466 276 -1207 -494 358 310 897 697 -1334 67 1154 72
4507 72 583 -428 -1581 455 1044 160 178 -559 -447 851 1120 -18 -993 -278 145 554 850 -377 -1141
4526 -1141 487 332 386 343 -1345 -495 819 -51 293 -280 -818 114 297 832 -315 -1035 219 -224 345
4545 345 402 -895 -201 451 185 470 -354 -791 165 234 538 -215 -264 105 -492 517 578 -1005 -181 572
4565 572 -175 610 -107 -791 -91 278 90 32 -384 -291 -292 631 395 -442 483 66 67 1346 -101 -839 612
4586 612 -141 -29 1150 -215 -684 477 123 -92 412 -230 -729 378 855 -751 291 453 -845 761
4604 761 715 -1199 735 434 -813 625 447 -1459 -118 813 -278 62 774 -775 -488 1349 -427
4621 -427 -599 1164 -1188 -359 1354 -774 -416 1157 -978 -478 1117 -761 -523 787 -311 -580 689
4638 689 -61 -1332 832 334 -1275 1039 -15 -1435 1325 334 -1561 1046 -15 -1336 1081 -49
4654 -49 -966 396 497 -1251 180 1084 -1309 237 1317 -1856 -130 1545 -1768 280 1236 -1575
4670 -1575 223 1429 -1306 -36 1159 -1194 -41 1450 -678 -626 1379 -580 -1158 1784 -930 -1317
4686 -1317 2291 -383 -1367 1903 -652 -1205 2110 -231 -987 1319 -343 -1082 1229 358 -1427 974
4702 974 680 -1657 1197 876 -2352 842 1229 -1984 1385 643 -2208 1121 964 -1700 600 751 -1378
4719 -1378 311 1516 -1701 -81 1574 -1354 -231 1915 -1846 -794 1946 -1609 -265 1926 -1734
4734 -1734 -774 1949 -1290 -456 1752 -1017 -897 2227 -357 -1494 1591 -141 -1718 2085 154 -2151
4750 -2151 1943 56 -2010 2271 -134 -2486 1999 553 -1729 1227 280 -1877 1267 1411 -1811
4765 -1811 826 1036 -2159 1061 2036 -2323 648 1714 -2264 861 1824 -2370 359 1891 -1604 332
4781 332 1714 -1517 -418 2043 -943 -631 1861 -1445 -959 2622 -1087 -1193 2403 -1319 -1023 2370
4797 2370 -1348 -1465 2215 -662 -1165 1837 -279 -1762 1570 409 -1922 1284 522 -2324 2047 602
4813 602 -2525 1621 253 -2631 1620 959 -2316 1265 1080 -1838 787 1081 -1963 368 1666 -2161
4829 -2161 -75 1940 -2327 -160 2335 -2008 23 2108 -2201 -252 1945 -1852 -181 1800 -1560
4844 -1560 -480 1765 -1095 -1007 2041 -704 -1074 2271 -579 -2052 2288 -691 -1982 2334 -462 -1909
4860 -1909 2234 -374 -1719 1791 -196 -1801 1706 530 -1848 1378 715 -2156 1084 1316 -2469
4875 -2469 1255 1357 -2293 1161 1445 -2395 890 1123 -2071 778 1456 -1711 81 1410 -1451 16
4891 16 1816 -1813 -844 1937 -1379 -721 2082 -1859 -932 2368 -1286 -901 1838 -1381 -725 2085 -629
4908 -629 -1165 1368 -401 -1207 1626 -48 -2002 1365 226 -1710 1868 2 -2308 1831 472 -1670
4924 -1670 1363 -67 -2116 1158 715 -1435 578 679 -1622 997 1501 -1943 168 1272 -1650 724
4940 724 1710 -2349 149 1503 -1282 513 1035 -1894 -16 1758 -648 -220 749 -970 -506 2081
4956 2081 -643 -1253 1700 -528 -633 2295 -1054 -1535 1771 -519 -895 1698 -761 -1102 1634 508
4972 508 -1047 830 -271 -1323 1375 825 -1868 711 378 -1783 1494 572 -2247 681 493 -1241
4988 -1241 1301 320 -1966 396 1360 -630 184 731 -1535 49 1931 -847 -724 1080 -1402 257
5004 257 1725 -1578 -902 1046 -726 471 1390 -1264 -1007 1078 100 32 677 -801 -942 1544 351
5021 351 -1324 874 -504 -964 1848 -55 -1538 370 -485 -503 1478 101 -1252 528 625 -298 678
5038 678 253 -1454 532 1579 -540 219 471 -1513 693 1294 -1116 67 165 -537 916 674 -968
5055 -968 -421 447 177 320 427 -892 -725 1329 354 -278 488 -1301 -495 1567 55 -688 333 -689
5073 -689 503 850 -95 -870 -258 172 300 402 11 -1255 118 742 -227 312 -338 -1633 633 923
5091 923 -557 78 -480 -418 756 405 -251 -700 21 40 182 399 -848 -787 469 329 162 295 -1329
5110 -1329 -169 648 263 -165 -398 -485 213 627 67 -295 -144 18 243 668 52 -844 159 500 53
5129 53 577 -536 -652 591 47 217 101 -692 40 -18 742 149 -570 134 318 385 657 -398 -527 157
5149 157 236 520 176 -571 -61 196 473 221 -604 -6 -141 34 976 -276 -794 240 -228 400 330 -952
5169 -952 -385 224 205 140 -353 -414 -135 383 629 -547 -368 -134 -384 606 531 -566 272 74 -221 539 -84
5190 -84 -821 426 318 169 70 -247 -513 -128 758 -37 -495 335 -383 109 1010 -563 -447 731 -469
5209 -469 208 643 -472 -161 336 -328 49 472 -540 -495 621 59 -646 735 102 -658 1202 -45
5227 -45 -753 1011 -222 -584 754 -140 -836 493 143 -540 272 333 -705 267 739 -1095 342 662
5245 662 -1156 151 732 -1228 311 557 -1214 327 432 -870 205 614 -566 -383 677 -426
5261 -426 -718 1017 -543 -743 1073 -373 -812 1365 -729 -681 1103 -816 -718 947 -596 -560 901
5278 901 -296 -601 751 109 -1062 904 379 -1445 925 547 -1289 1059 129 -1346 1003 389 -1033
5295 -1033 860 318 -666 403 966 -1038 380 877 -1058 -67 1158 -1316 -144 1429 -1249 253
5311 253 1168 -1384 -442 1333 -1070 153 800 -893 -185 1052 -391 -573 1204 -541 -779 1458 -457
5328 -457 -1551 1537 11 -1144 1717 -488 -1198 1348 -221 -1001 919 -126 -1233 985 370 -1199
5344 -1199 463 503 -1152 794 1049 -1933 673 1133 -1509 833 1033 -2040 534 1042 -1218 303
5360 303 505 -1534 218 1190 -1033 -264 1032 -1212 -422 1850 -824 -701 1512 -1162 -430 1781 -1249
5377 -1249 -1041 1705 -564 -642 1548 -639 -855 1037 -80 -1005 1278 -133 -1165 1695 80 -1684
5393 -1684 1157 190 -1322 1878 213 -1756 1303 333 -1189 975 466 -1437 452 918 -1196 377
5409 377 926 -1554 315 1479 -1378 28 1051 -1477 153 1380 -1353 179 966 -1080 -43 1045
5425 1045 -1261 -507 1269 -816 -873 1558 -642 -861 1524 -394 -1084 1542 -796 -1165 1869 -548
5441 -548 -1332 1555 -15 -919 1284 31 -1236 796 359 -1051 1103 559 -1621 1035 792 -1948
5457 -1948 757 395 -1603 979 635 -1573 559 522 -1295 469 807 -1181 29 1221 -1384 13
5473 13 1296 -1066 -447 1402 -1095 -262 1691 -1142 -284 1391 -884 -219 1223 -857 -701 1119 -448
5490 -448 -829 1050 -216 -984 1318 -151 -1175 1462 500 -1388 1444 81 -1229 1230 -59 -1086
5506 -1086 1252 518 -1104 793 496 -1109 700 706 -1325 115 1133 -1489 474 1035 -1630 362
5522 362 1282 -1243 530 837 -1278 244 897 -942 -220 994 -1024 -109 1231 -798 -599 1270 -728
5539 -728 -574 1539 -732 -855 1399 -704 -468 1179 -716 -786 1132 -435 -895 487 -179 -980 1079
5556 1079 332 -1227 611 -10 -1070 1114 548 -1272 852 493 -1116 913 192 -1384 493 403 -471
5573 -471 446 701 -977 392 873 -675 -309 916 -884 290 1245 -1255 -48 881 -755 215 648
5590 648 -1055 -102 829 -145 -269 516 -518 -681 1067 218 -659 593 -445 -813 1384 -33 -1101
5607 -1101 775 -281 -325 1024 -258 -864 701 -74 -353 373 143 -912 352 774 -555 258 368
5624 368 -817 769 549 -1040 3 374 -655 561 471 -741 -258 272 11 66 324 -896 -481 763
5642 763 -149 -450 503 -1016 -340 1162 -524 -591 262 -421 194 757 -98 -506 29 265 160 650 -147
5661 -147 -720 383 585 -451 333 -273 -912 649 506 -609 382 -459 -416 828 317 -274 -270 -39 116
5680 116 328 648 -396 -469 717 54 107 67 -741 161 787 -232 -15 -105 -456 517 560 -109 -279 -224 -57
5701 -57 458 220 -91 -507 90 285 -28 228 -277 -609 494 434 -95 -336 -616 127 260 230 -172 -640 -184
5722 -184 38 141 354 -443 -157 277 65 275 24 -622 -30 314 424 -25 -277 -186 56 404 340 -297 -234
5743 -234 323 -39 478 -49 -601 -71 242 227 111 -452 -481 -15 355 390 77 -212 99 147 684 116 -628
5764 -628 86 217 110 586 -455 -358 416 137 116 -161 -213 -384 355 529 -221 -219 29 -238 253 635 -643
5785 -643 -219 322 -356 161 215 -793 40 84 200 268 252 -292 -129 340 278 -170 290 -72 -455 474 -143
5806 -143 -412 320 -475 -342 471 -247 -537 223 -86 -177 117 -70 -371 179 237 -567 62 163 -421 279 509
5827 509 -797 292 232 -357 501 329 -571 205 218 -308 -113 452 -97 -231 559 -543 -110 542 -392 -124
5847 -124 851 -335 -388 447 -375 -171 397 -357 -551 425 -195 -292 365 153 -680 442 149 -713 601 183
5867 183 -609 683 76 -664 704 87 -673 347 -208 -782 477 300 -407 350 306 -230 5 548 -822
5886 -822 172 752 -616 41 626 -567 120 708 -820 -32 464 -601 18 383 -346 -61 647 -164 -408
5905 -408 767 -309 -635 745 -167 -619 871 -408 -556 701 -174 -461 734 -425 -463 644 204
5922 204 -762 575 357 -831 471 371 -1169 475 465 -800 780 293 -1044 540 320 -677 442
5939 442 347 -801 272 808 -454 29 401 -591 226 995 -748 -346 946 -686 -143 998 -855 -266
5957 -266 1052 -635 -69 844 -629 -217 873 -76 -315 404 -292 -845 887 150 -636 725 -155 -730
5975 -730 953 -113 -1025 1078 -11 -494 929 -114 -1049 435 289 -421 245 215 -904 361 617
5992 617 -984 -87 672 -908 466 857 -1152 196 479 -590 158 713 -938 -230 416 -370 -60 636
6010 636 -577 -517 1316 -323 -438 1000 -602 -422 1357 -625 -340 1113 -505 -212 717 -231 -537
6027 -537 502 101 -418 546 192 -864 965 445 -724 598 98 -1185 1083 444 -971 234 135
6044 135 -892 664 389 -828 32 505 -372 150 673 -1109 -223 809 -625 -115 1030 -1017 -20
6061 -20 999 -590 -136 549 -673 -44 568 -625 -307 639 -404 -539 918 -219 -471 676 -318 -570
6079 -570 951 -384 -681 1044 -109 -772 602 -337 -318 531 160 -404 403 271 -687 445 488 -989
6097 -989 208 604 -888 701 532 -990 283 642 -951 279 404 -540 169 268 -458 69 525 -675
6115 -675 -398 779 -565 -374 1272 -709 -64 992 -685 -248 553 -529 -59 788 -71 -149 754 -164
6133 -164 -564 299 38 -834 644 141 -612 672 124 -957 650 177 -441 462 38 -733 490 29
6151 29 -553 73 197 -546 260 635 -664 -63 494 -662 292 702 -994 95 544 -553 80 551 -562
6170 -562 79 594 -268 -273 188 -427 -134 726 82 -515 658 -308 -526 980 -36 -473 630 -327 -508
6189 -508 525 -493 -444 361 -183 -293 402 -139 -523 569 223 -469 226 235 -501 269 139 -539 216 98
6209 98 -552 514 -14 -616 229 243 60 93 102 -396 47 728 -123 -195 239 -607 115 606 -324 -111 178 -370
6231 -370 348 469 -426 -176 191 -362 -102 442 -150 -366 55 248 -363 236 -94 -716 867 101 -532 314
6251 314 -291 -303 590 -154 -550 97 -207 35 -2 -65 -594 -155 199 -225 -104 117 -485 176 658 -303 89
6272 89 -30 -353 347 265 -334 -14 -168 57 196 144 -301 -242 390 152 -138 381 -623 -239 536 -286 -238
6293 -238 274 -347 101 129 -179 44 -16 168 302 85 176 -372 -313 308 119 90 -182 -491 262 52 214 260
6315 260 -291 0 225 141 -219 -379 -270 61 206 89 -344 -312 -42 148 -99 252 -457 -171 72 -223 77
6336 77 -286 -204 232 -26 307 -153 -557 -98 90 77 421 -470 -45 -50 41 224 6 -373 234 115 -29 66
6358 66 -195 -19 36 296 220 -303 -119 -62 51 450 281 -287 -143 152 -86 143 -285 -138 50 186 210 -76
6380 -76 86 -175 -141 441 157 -509 261 -233 -4 133 -283 -82 201 101 243 -55 30 -162 -48 76 -6
6401 -6 49 15 -380 204 190 -541 123 -23 -53 343 22 -372 303 -136 -13 144 22 -35 36 328 84 -107 142
6424 142 -191 -161 743 -90 -212 205 -281 29 253 -293 -159 242 -283 -173 133 -1 39 173 81 -325 141
6445 141 -40 -399 552 -95 -352 450 24 -264 632 54 -220 232 -170 -192 306 322 -559 206 324 -315 8
6466 8 375 -295 -70 489 -468 235 394 -520 82 90 -338 -11 293 -206 -43 407 -203 -20 493 -11 -179
6487 -179 455 -206 -216 796 -156 -176 429 -106 -236 347 -318 -240 297 148 -340 358 108 -239 419 5 -510
6508 -510 322 -26 -518 406 76 -572 412 63 -387 103 -132 -340 82 9 -278 142 385 -162 49 463
6528 463 -753 -159 339 -358 6 631 -544 -448 370 -353 154 599 -356 1 482 -141 -189 286 -269 -314
6548 -314 556 29 -499 380 -90 -547 661 -189 -720 603 -28 -650 172 -154 -390 385 339 -325 143 197
6568 197 -345 200 402 -723 244 496 -598 366 336 -771 133 584 -598 426 303 -176 -37 236 -414
6587 -414 -120 412 -329 -185 577 -328 -577 371 -170 -108 879 -76 -531 627 -232 -159 513 -243 -261 404 -17
6608 -17 -266 118 -52 -478 446 158 -588 307 -8 -651 554 14 -528 39 17 -303 391 80 -721 6
6628 6 134 -271 263 290 -280 -166 525 -637 32 365 -371 -33 707 -555 -159 319 -213 312 237 -441 -107
6649 -107 202 80 -154 447 -348 -623 367 149 -340 356 -102 -386 822 104 -421 296 -62 -240 329 203
6669 203 -256 257 173 -116 67 -27 -577 29 287 -489 552 147 -849 96 449 -283 512 97 -241 266
6689 266 350 -394 98 264 -36 45 434 -446 -158 224 -89 -212 534 -421 -245 349 -399 -251 487 -368 -174
6710 -174 205 -120 -54 -30 59 -378 461 23 -427 378 -38 -487 271 107 -510 508 238 -387 294 146 -377
6731 -377 258 241 -351 254 122 -140 99 451 -414 -95 367 -325 350 297 -721 -58 368 -401 77 579
6751 579 -427 -108 500 -158 -136 245 -98 -217 482 -187 -102 420 109 -226 518 -168 -4 390 -229 -100
6771 -100 149 -128 -138 459 -91 -221 234 193 -321 159 185 -388 50 132 -412 148 270 -439 162 -138 -292
6792 -292 229 -56 -313 126 66 -214 -3 187 -402 -229 272 -393 -151 303 -51 -200 66 -213 84 137 -203
6813 -203 -54 169 -175 46 77 30 -118 305 19 -116 259 -16 -131 251 270 -182 306 -4 156 272 146
6834 146 -266 95 -17 198 11 -25 -150 139 126 -157 -290 106 -450 13 226 -355 52 110 -128 408 255
6855 255 -189 28 133 -179 -38 132 -242 85 81 380 -160 333 -16 16 518 -75 -82 202 27 -147 60 46
6877 46 -148 -40 143 170 18 -142 -252 0 189 -1 50 -38 -500 -102 111 -282 -191 -329 -365 495 33 -221
6899 -221 60 -252 -169 86 77 -200 -241 219 -93 -19 163 -69 -167 -30 -10 31 -194 -133 287 -114 129 -38 -42 15
6923 15 130 -56 204 -114 -52 288 100 86 -12 -127 144 66 273 116 -316 -88 20 128 -120 -217 -344 283
6945 283 128 366 44 -256 198 142 -184 240 -263 29 116 -84 162 -69 216 -10 72 40 -31 -115 35 -102
6967 -102 -78 60 -351 -243 269 -254 55 181 -140 -107 168 78 55 -257 22 -141 59 365 -301 -69 113
6988 113 -133 143 -195 -252 500 27 -71 159 -46 -50 276 157 -265 -179 146 -115 -26 507 -502 -124 123 -57
7010 -57 100 315 137 87 142 240 293 82 258 -144 163 66 -27 22 51 -294 108 -1 -302 302 -229 -15 287
7033 287 -134 157 308 117 291 169 101 -511 -116 18 -138 108 185 -8 59 344 -342 32 110 -440 374
7054 374 65 -401 165 36 -117 123 -11 -425 69 314 -52 -340 91 -40 -149 139 -65 -148 148 -321
7074 -321 8 275 -210 -119 194 -171 76 92 261 -107 71 377 -150 250 79 -218 28 65 -362 520 272
7095 272 -312 335 317 -412 440 -25 -111 -80 61 73 -85 226 -71 12 327 -87 -53 418 -35 -113 99 -367
7117 -367 239 315 -94 195 -34 -165 84 180 -35 -245 501 -22 -341 33 -188 -278 405 -60 -58 281 -106 -285
7139 -285 366 -117 -435 373 80 72 -235 30 -241 -70 -25 -95 136 151 -246 211 32 -462 127 106 -163 35
7161 35 -164 -273 -196 249 -26 8 176 -153 -82 406 -129 -179 81 -159 -220 151 -233 -90 534 -236 14 52
7183 52 -168 -137 388 -4 -40 -209 -110 -231 250 -58 -227 291 23 -269 375 200 -408 399 81 -113 56
7204 56 116 -193 30 217 -172 259 359 -45 -9 366 -39 111 117 -299 42 229 -281 -8 93 -222 -83 111
7226 111 -113 -365 -8 -234 30 131 -280 -226 218 -155 -252 76 -125 -58 293 -106 -174 290 64 -156 172
7247 172 -8 -131 217 157 141 188 87 -195 141 209 -191 155 104 -401 295 -21 40 153 115 -37 31 308 -42
7270 -42 132 -88 -26 14 176 -356 -226 270 -69 -13 352 -247 96 352 -5 92 142 -113 -134 241 -61 -49 93
7293 93 -55 97 224 -184 -336 12 125 -218 216 -26 -1 99 20 -361 154 212 -150 199 141 -296 271 -102
7315 -102 -11 209 161 -92 -207 74 -75 175 214 -202 56 265 -87 -11 88 -235 -74 -3 89 97 251 -358 75
7338 75 315 -237 69 414 -34 -331 362 -106 -54 86 -91 8 240 -47 -113 14 106 8 -206 120 -356 -30
7360 -30 -34 -210 -253 -144 -190 -9 51 -161 243 -229 45 200 -91 133 124 96 -45 -186 -127 -16 64 171 -81 -98
7384 -98 310 -69 248 99 60 167 139 -118 -58 111 -3 60 109 39 -175 198 -244 -161 -132 -211 -6 94 65 -5
7408 -5 218 -318 -23 332 -195 159 -157 11 -198 38 -236 -134 107 -114 147 -84 96 -253 230 47 -213
7429 -213 211 -31 -95 78 -44 -195 31 -127 77 143 25 211 -259 -51 29 -408 154 -14 -72 12 -64 -124
7451 -124 -31 -147 -126 33 -104 -209 -14 -144 42 -23 -108 88 -39 -59 -30 -59 49 -134 194 99 -123 268 76
7474 76 -20 198 -148 76 -190 -18 197 80 -86 -40 224 -33 176 -166 -3 79 -75 -11 83 -76 212 -6
7496 -6 35 -126 -8 -74 -157 27 -106 -240 -50 49 -71 25 -186 -131 -164 38 200 -211 -137 186 -35 62 205 96
7520 96 155 51 -256 -33 20 52 -97 -69 12 -206 77 -5 -40 -114 73 -79 150 110 83 141 69 63 80 -222 13
7545 13 108 8 91 -157 124 190 155 242 22 -80 200 182 323 134 -220 -78 13 48 -6 -9 218 40 -42 141
7569 141 -136 81 14 -65 86 197 -55 -189 65 137 -140 93 193 -30 23 178 141 91 -35 24 -5 134 -186
7592 -186 -145 -23 -136 192 145 35 -142 -402 71 -112 -16 185 7 37 -144 -242 -29 -207 69 103 -207 -69
7614 -69 -9 109 189 131 -177 -68 -36 -6 -25 43 42 -30 -35 225 -288 -36 23 -264 133 -76 66 87 320 11 163
7639 163 25 -62 62 -93 207 -58 -151 134 82 -153 1 149 -4 -116 -228 219 -83 -94 -155 12 -109 -89
7661 -89 25 -21 159 127 13 288 70 -4 17 453 -126 141 359 66 -121 -102 86 213 77 -109 -48 48 7
7684 7 164 76 -91 -113 21 -23 -133 87 -84 236 -317 -54 -41 -23 -110 30 24 130 18 -105 -278 -37 -30 -40
7708 -40 -68 235 156 -238 145 188 -292 106 124 -129 283 -106 -58 51 250 -226 -129 31 178 126 129 -84 -195
7731 -195 124 35 -130 42 -98 273 87 -94 -97 -85 -24 42 -71 -1 134 176 51 -195 366 -14 193 248 -198
7754 -198 55 271 110 -133 297 24 19 228 -71 -183 87 9 -317 -143 218 -77 -158 -148 2 -254 -144 -24
7776 -24 515 -33 -298 224 203 -75 273 115 116 143 -368 -61 114 -102 -206 72 47 -149 -45 350 -247 76
7798 76 148 80 304 -228 -137 35 298 -374 53 238 80 173 25 -211 -177 201 -254 -494 277 -51 -182 -18
7820 -18 -11 -185 -104 99 47 -111 -111 -126 185 45 68 98 -64 -324 -18 142 -56 34 335 -130 61 143 -38 265
7844 265 94 -175 51 173 59 72 32 -34 73 -204 -38 -1 -242 25 22 77 145 -35 -13 -93 157 116 -39 278
7868 278 91 9 -171 184 5 298 119 196 88 -48 -53 -59 -103 -134 -95 54 47 -79 174 38 109 18 248 27
7892 27 101 -2 -139 -72 -17 -79 -42 -222 31 18 306 -99 -45 43 -51 -62 -232 -89 18 -24 -64 -19 -155 -115 137
7917 137 193 -71 100 -105 -84 82 -263 14 -63 -13 -75 284 15 6 -66 92 172 -147 93 123 87 -34 109 38
7941 38 252 -17 28 115 93 -209 -229 360 92 23 -143 136 -63 30 63 -31 -49 -260 -31 -69 12 104 69 80 7
7966 7 78 87 228 56 -180 -183 28 -151 -27 0 194 -35 47 82 -108 105 -36 -174 -29 -98 -84 314 -163 -160 70
7991 70 131 -87 164 -105 -255 22 47 15 95 -40 6 -89 -54 -99 -303 181 -168 96 -12 13 103 128 352 6
8015 6 -5 -174 46 -96 124 103 -108 -120 43 -23 -120 -70 -95 78 -101 -20 -79 -38 78 -44 -133 -137 -61 69 25 4
8041 4 -92 -134 207 -34 189 -106 -42 216 -56 -407 43 18 -152 65 -42 -137 -119 53 12 89 3 -34 -81 15 -15
8066 -15 -33 -187 -105 -51 69 -56 34 133 -66 14 16 260 191 -181 208 16 90 -159 15 -84 106 84 77 -207 -66
8091 -66 -25 84 173 81 27 -3 -111 154 35 -50 1 -32 35 -182 238 -29 91 108 168 160 -1 -70 -292 334 -22
8116 -22 69 104 -118 78 -247 -63 209 129 -45 -85 -1 -39 -163 161 163 -27 -160 -20 146 -107 -65 -180 207
8139 207 -43 -182 46 52 109 -85 -15 -87 129 -56 101 -17 -473 99 -61 -258 188 123 -24 184 -31 30
8161 30 183 -188 6 28 31 192 -157 -116 21 25 212 155 175 182 -165 135 97 178 138 -52 99 118 7 -82 97
8186 97 192 10 39 27 30
8191C0
$$ Imaginary data points
##PAGE= N=2
##DATA TABLE= (X++(I..I)), XYDATA
0 0 0 0 0 0 0 0 0 8 -8 8 -8 8 -16 24 -32 37 -48 56 -66 84 -104 120 -143 168 -198 235 -275 315 -362 418
30 418 -481 550 -627 708 -801 904 -1018 1144 -1279 1428 -1589 1769 -1965 2179 -2408 2663
46 2663 -2938 3242 -3577 3940 -4340 4779 -5265 5806 -6410 7086 -7851 8724 -9731 10908
60 10908 -12305 13991 -16072 18725 -22230 27100 -34357 46437 -71397 232988 -607307 -285334
72 -285334 529139 -494303 200544 664602 -627350 -393058 549964 -123873 83760 356940
82 356940 -693784 -207182 848612 -223489 -322960 457013 -476094 -280378 930510 -185035
92 -185035 -665130 438597 -39466 -281161 568846 -140414 -534782 389713 32371 -279553
102 -279553 484438 -138062 -600611 498399 182221 -500787 428721 68605 -732545 414725
112 414725 459516 -519907 105253 127266 -484249 375932 405245 -544423 -28536 216342
122 216342 -309128 350773 337497 -727460 -52183 593096 -284019 -7417 348260 -577715
132 -577715 -71386 691634 -247443 -262890 285256 -291343 -936 522294 -307986 -279627
142 -279627 376157 -176371 -121696 489666 -248696 -390638 460429 -28309 -298529 431609
152 431609 -99507 -448858 390563 102920 -282785 288307 -99514 -381006 408187 162718
162 162718 -358905 158471 875 -318912 401932 216974 -530351 53391 261347 -240095
172 -240095 219220 163453 -519934 85812 388156 -236767 32746 118816 -378321 142810
182 142810 379813 -313103 -94566 234324 -243306 25754 357495 -289458 -174666 325979
192 325979 -164265 -98958 337998 -217366 -202324 313244 -117131 -116302 307349 -190961 -238487
203 -238487 315326 -8583 -174211 215089 -123396 -246191 339039 83252 -302668 123268
213 123268 12039 -186468 302564 46413 -372109 138226 143175 -164043 173121 10221
223 10221 -313066 172083 208577 -214092 32790 91805 -210550 117506 205859 -246720 -14272
234 -14272 190653 -179110 33943 200141 -216168 -16957 201531 -173345 -4201 211088
244 211088 -167934 -73567 183613 -98593 -35014 190506 -143789 -132452 222230 -18487
254 -18487 -113351 140877 -107271 -113639 257096 -24912 -194346 122728 -17484 -76329 188398
265 188398 -56502 -198919 139850 71516 -112648 76330 -9410 -149427 135783 88687
275 88687 -177930 43430 74660 -128636 85617 67645 -168661 60723 95315 -135064 33363
286 33363 82871 -108737 22085 73627 -108919 13033 115098 -95237 -48740 95799 -55890
297 -55890 -6465 101203 -113969 -52200 141883 -36114 -52064 61025 -72592 -9261 125488
308 125488 -51128 -88128 63470 10355 -23572 59558 -39778 -76817 94439 34464 -84659
319 -84659 35351 8300 -48551 79911 -380 -89726 57242 36644 -48470 23810 2512
330 2512 -35316 45616 24869 -60530 1261 53011 -18545 -6806 18060 -42675 21997 59780
342 59780 -52389 -24852 37350 -7668 16228 8874 -48249 4780 44474 -416 -27150 -10711
354 -10711 9010 12159 15530 -16469 -38437 24572 31046 -20918 -11734 -10315 1032 30287 -6283
367 -6283 -30622 -7342 18558 21645 -21063 -21745 6846 929 22449 -3410 -49105 14172 32907
380 32907 -15860 -6242 -10611 -14543 28427 18393 -36825 -22026 32479 8168 -15757 10781 -28227
393 -28227 -8492 63045 -24059 -49366 40448 -3632 -8756 39468 -41702 -29529 64160 3325
405 3325 -42762 17734 1951 -17393 46625 -1547 -68745 42385 44073 -54413 23844 13292
417 13292 -58333 61773 31393 -85996 29761 45544 -48446 26861 20686 -65769 34714
428 34714 62836 -69491 -14287 63555 -41241 3196 59922 -83935 -8694 107018 -59695
439 -59695 -38790 67843 -55567 1409 91898 -79377 -51918 95033 -18179 -40969 60404
450 60404 -48627 -49946 109623 -15160 -96815 74581 -379 -67999 95095 -20607 -104474
461 -104474 99955 13945 -96405 74118 7474 -89007 77077 18932 -103313 66118 50097
472 50097 -108846 35980 59585 -95491 50347 62237 -136858 35119 108455 -102526 10064
483 10064 62181 -112892 46535 114705 -121602 -31410 97389 -60785 7387 94977 -116000
494 -116000 -44743 149201 -46864 -62631 97934 -78868 -43160 158308 -63815 -95852 120489
505 120489 -40165 -60958 131519 -49068 -99429 121984 -10276 -95054 115477 -686
515 -686 -123809 101388 26236 -111672 110342 19575 -155622 99032 67611 -118347 78728
526 78728 17859 -148603 110256 97411 -146019 19575 61275 -105560 79603 100226 -171523
537 -171523 -12931 133763 -81722 14814 87521 -160682 3118 169097 -102416 -37753
547 -37753 99890 -118846 -2838 163158 -104852 -79297 125514 -63809 -52358 146044
557 146044 -67212 -108892 128385 -30463 -78471 144771 -55642 -132731 141525 -3776
567 -3776 -94936 133544 -50653 -152161 157040 53668 -135832 68708 1837 -123921 139816
578 139816 75851 -176558 29841 67226 -92695 111743 49797 -206370 60644 132459 -117882
589 -117882 50693 64514 -181009 53607 167465 -122949 -31454 94143 -106696 15308
599 15308 148477 -111054 -54310 113969 -88954 -635 157591 -128186 -77461 155091 -71373
610 -71373 -41510 161855 -106277 -122058 163511 6093 -82087 92315 -65882 -99392 165246
621 165246 20825 -126737 70676 -33894 -82465 190431 -3739 -206141 99738 59880
631 59880 -107146 121851 14423 -198192 83274 120704 -102371 27823 21866 -133491 86947
642 86947 109146 -137262 17957 64830 -141472 78014 141144 -175640 -22318 128285 -111298
653 -111298 16506 141541 -135501 -67251 123982 -40311 -3297 89261 -129715 -50850 161894
664 161894 -40640 -55371 96921 -118562 -59868 218416 -37654 -154600 96814 -17079
674 -17079 -56793 155297 -33766 -156062 87392 42237 -47892 91474 -50489 -135221 135206
685 135206 61092 -122058 76346 8843 -150311 126300 101420 -158926 26069 63992 -107815
696 -107815 76409 88273 -132029 2390 65835 -74924 68932 76168 -158950 -3457 129898
707 129898 -77582 11932 93895 -156417 -25911 182249 -55789 -67286 66399 -87030
717 -87030 327 152670 -72758 -92339 74529 -35832 -1871 126451 -94026 -116482 132074
728 132074 11306 -74603 96311 -50336 -117812 134299 36388 -105777 57580 -15082 -83982
739 -83982 112420 26354 -110556 48837 10678 -82756 101065 45274 -141966 29292 69553
750 69553 -81091 62230 57578 -147537 15783 108906 -62147 17468 31901 -120528 40387
761 40387 120183 -78871 -28205 47042 -76716 34371 120480 -99458 -69986 96098 -28445
772 -28445 -10233 93317 -89807 -65857 118425 -14361 -42472 69454 -64892 -48746 116059
783 116059 -12471 -68905 62923 -27162 -59117 102755 9688 -95453 49663 10525 -62490
794 -62490 88554 17026 -111100 42599 38298 -51962 65359 3975 -109751 49431 68811
805 68811 -56800 16933 11396 -83479 48800 84623 -79641 -23184 45829 -51630 32777 69946
817 69946 -94630 -23693 75531 -38977 4638 51547 -78913 -16262 82634 -32787 -26723
828 -26723 49331 -47359 -28055 79258 -20850 -48662 52019 -27947 -38953 80631 -13291
839 -13291 -62464 47626 -12087 -32371 71506 -14211 -71434 42307 19079 -29271 40455
850 40455 -10300 -66964 47043 44586 -49311 10803 8355 -49918 49994 40689 -69303 5207
862 5207 31927 -33795 31521 25323 -61411 7848 45143 -28126 2331 27218 -40259 -887
874 -887 48370 -28678 -13345 39184 -32982 -12128 50348 -24372 -17253 36011 -29797 -10963 48577
887 48577 -17197 -27555 24418 -8946 -8654 36617 -14548 -39511 29005 14105 -20534 20533
899 20533 -11610 -34819 39884 14373 -36222 11330 317 -18056 30565 2701 -35750 9899
911 9899 15580 -14135 6651 5600 -24456 7443 21196 -22452 -2197 18043 -20166 1590 16625
924 16625 -21031 3646 16744 -20310 -1884 14793 -7319 -1035 5338 -10929 -2065 17474 -2302
937 -2302 -16092 6461 2269 -2378 13919 -9828 -15769 17063 5394 -6367 2461 -7896 503
950 503 13576 -223 -8526 -2445 6879 4692 -1899 -495 -5102 2232 12108 -5084 -6689 5401
964 5401 1528 3412 93 -5489 1159 4843 4857 -5228 -7040 9443 1715 -3172 4764 -9329 -168
979 -168 15148 -7731 -8044 6763 -1896 1586 5978 -8004 -7375 11193 4914 -12334 2240 3908
993 3908 -9781 12023 2022 -22456 12456 10264 -17137 7277 1035 -15856 15275 6346 -21640
1006 -21640 3266 12258 -10666 1710 8346 -18920 2421 23709 -20378 -8879 20943 -16078
1018 -16078 -86 21836 -26649 -4711 29132 -16545 -8813 18602 -15239 -4124 25543 -14833
1030 -14833 -18156 26627 -2047 -18996 23369 -7297 -22017 34887 -3072 -32305 28481 1542
1042 1542 -23062 29339 -4520 -29687 30417 9010 -29837 17087 9577 -26360 20882 15519
1054 15519 -37151 14701 26355 -34936 10853 23749 -37101 15703 28019 -41146 8259 31626
1066 31626 -32425 3726 25921 -32652 3458 36566 -32002 -13219 37607 -20987 -10584 37919
1078 37919 -32732 -18704 51846 -21626 -26070 39048 -23462 -17153 48920 -23499 -33909 41859
1090 41859 -6621 -27430 36769 -11469 -38565 43288 5642 -45064 33629 6002 -45476 39660
1102 39660 11022 -51373 34542 14008 -49325 32333 19831 -48152 22783 20821 -46190 22765
1114 22765 33592 -49987 4401 37261 -39220 11248 38969 -55635 -416 54027 -37654 -3064
1126 -3064 37086 -48749 2589 59103 -39544 -21194 43022 -27696 -8381 53455 -34672 -34997
1138 -34997 55659 -11777 -28928 49995 -25565 -38292 62864 -10124 -42055 50946 -15291 -42696
1150 -42696 59216 -996 -50090 42261 1962 -47553 48005 17070 -59073 27349 20525 -47151
1162 -47151 41024 22016 -70260 26168 37398 -48418 29240 20959 -70963 26676 54355 -50918
1174 -50918 -175 30108 -49380 15631 56766 -52768 -20230 45566 -32901 2780 52130 -58503
1186 -58503 -20807 64849 -33147 -15691 53780 -48572 -27537 69531 -20611 -36162 46348 -23726
1198 -23726 -34137 61232 -6907 -47592 41157 -11255 -36769 66353 -7251 -66360 48907
1209 48907 7175 -44613 58665 -847 -75417 44541 36057 -45223 24400 6877 -57954 40988
1221 40988 43761 -55757 7979 21828 -50156 42418 46013 -78473 3754 53042 -46523 17086
1233 17086 47214 -68262 -7602 63313 -29456 -8979 36855 -46710 -8269 62957 -29488 -22280
1245 -22280 44478 -43112 -16230 78728 -32548 -48947 54484 -20323 -27400 68882 -21760 -60556
1257 -60556 45408 8545 -24692 41239 -22916 -53381 56274 18728 -45766 32516 -10459
1268 -10459 -57276 67586 29549 -76846 19722 22644 -45289 44535 25489 -71510 11208 36708
1280 36708 -31606 24067 17171 -65669 16994 52567 -44489 5887 35034 -64948 6830 72046
1292 72046 -45757 -21270 41780 -41730 323 62912 -38235 -31414 37054 -20206 1346 52226
1304 52226 -44461 -40489 58237 -3958 -24146 46522 -34505 -47743 71910 11144 -49462 27899
1316 27899 -11882 -30447 61223 4023 -55167 23720 6540 -24394 48093 641 -65151 30513
1328 30513 32498 -39378 28102 14777 -64847 26387 46966 -42888 9013 17468 -50162 25502
1340 25502 44309 -43855 -3038 22205 -37591 20301 47515 -51128 -21539 43425 -21800 983
1352 983 43911 -49971 -27582 57839 -10088 -16503 27983 -39675 -15450 60064 -12269 -33799
1364 -33799 24024 -18143 -14096 53544 -11956 -50384 30174 7629 -24385 39025 -7402 -51573
1376 -51573 34568 17937 -29908 26669 -5176 -43515 35528 22245 -34654 13609 4561 -36609
1388 -36609 30074 31336 -42038 -1704 20610 -27682 22053 31143 -49154 -5441 34671 -19572
1400 -19572 11762 21111 -46764 -302 44412 -16240 -8021 16656 -30017 424 46360 -18026
1412 -18026 -26722 23676 -12177 -5425 40295 -21373 -31037 32024 -3374 -11713 30686 -18818 -27609
1425 -27609 32564 4120 -18522 19519 -8646 -26693 28969 13194 -27157 10693 1515 -25026
1437 -25026 28741 15430 -36188 6544 10813 -18588 23609 8919 -37592 5652 20838 -12840
1449 -12840 7492 5862 -30011 6188 29453 -16229 -8269 11671 -20521 5633 28710 -23073
1461 -23073 -12546 18840 -12856 2011 21174 -21562 -11440 20603 -5791 -4650 15318 -12900
1473 -12900 -13592 20560 596 -12417 13749 -7631 -15814 23329 2831 -17461 11083 -4335
1485 -4335 -10771 22115 1229 -19809 6479 4646 -5068 12212 409 -19429 6367 14640 -8092
1498 -8092 2462 3158 -16056 9762 15819 -14386 -950 6310 -9607 8677 9262 -13483 -1191
1511 -1191 8303 -4361 1549 6777 -7890 -4026 10050 -2681 -3924 8692 -6339 -5927 11072
1524 11072 -2676 -3809 6729 -7126 -3352 9694 -1241 -4868 646 -2236 -292 5965 23
1537 23 -8448 -39 4889 -2135 2283 -1214 -8641 4736 5089 -4706 -61 -1744 -2157 4464 516 -2871
1553 -2871 -2132 732 2378 -1731 -430 3 -2828 2772 611 -3669 2351 655 -1704 686 -348
1568 -348 345 389 603 -522 -2652 3721 1936 -4635 3038 148 -2932 6445 -1554 -5677 5300 1452
1584 1452 -2505 3155 -980 -3261 4053 3499 -5508 118 5416 -4218 1424 5516 -8627 2108 9086
1599 9086 -8593 -146 6649 -7225 3073 6722 -9036 -436 8208 -4343 -2707 6240 -5041
1612 -5041 -3193 10871 -4807 -8891 10635 -2682 -7072 11584 -5856 -8637 13568 -3649 -9541
1625 -9541 10054 -2496 -8101 10061 -1509 -11052 9079 3545 -12366 6695 4463 -13531 9032
1638 9032 5800 -17254 8364 8348 -16018 7324 6424 -15354 8074 9269 -15765 3147 10905 -12048
1652 -12048 1903 11251 -14711 -561 17071 -13132 -4349 16254 -13111 -2650 18655 -14939
1664 -14939 -5835 19245 -11101 -6585 16607 -9930 -6928 18175 -7478 -12258 17742 -2383 -13468
1677 -13468 17158 -3089 -15945 20397 178 -19196 17630 779 -16940 18854 721 -20195
1689 -20195 15621 6005 -17986 12384 6551 -19526 11119 11526 -21185 7563 14327 -22048 6688
1702 6688 16091 -22719 5776 16894 -23367 4117 18974 -20418 618 17296 -19265 -516
1714 -516 21401 -17649 -8267 21624 -12636 -7344 22889 -16617 -12873 27237 -10203 -14048 22169
1727 22169 -13462 -12690 27476 -9048 -18996 21105 -4431 -15884 22602 -3038 -23062 19789
1739 19789 4365 -21150 18452 3413 -26280 19537 8764 -24952 17157 7071 -27197 17460
1751 17460 13404 -24943 10928 11720 -24385 11164 19750 -24943 602 18952 -19956 5831 22405
1764 22405 -27471 -2615 26688 -18809 -231 22014 -26663 -3350 31404 -16441 -10639 21348
1776 21348 -16031 -7256 29817 -12723 -18772 23137 -7137 -12400 27552 -11613 -22878 27891
1788 27891 -3299 -18807 26972 -8070 -26310 27415 4034 -23063 18657 186 -25066 21674
1800 21674 10893 -25899 10852 6586 -23413 21053 13217 -33664 9572 16212 -24477 15613
1812 15613 15271 -35646 5705 25881 -20163 1365 14057 -25758 3428 27928 -19317 -7849
1824 -7849 18017 -20229 1390 30648 -24668 -14517 28408 -15118 -7401 29794 -20115 -19166 28591
1837 28591 -4887 -12953 21144 -12826 -17934 27693 16 -18554 19192 -8277 -20818 33004
1849 33004 3269 -31105 18687 3334 -21810 27655 6121 -33624 12806 13755 -16052 15253
1861 15253 3357 -29568 14607 20503 -21112 6530 9190 -28906 14775 28080 -29248 -3757
1873 -3757 19811 -21095 7212 25361 -26392 -8243 21499 -11724 1980 18887 -24249 -8954
1885 -8954 27451 -10032 -8030 21126 -20915 -14423 34950 -5864 -20870 18535 -11089 -12973 30967
1898 30967 -4600 -24649 14390 -1618 -9094 24467 -7323 -28699 18762 9596 -16642 17142
1910 17142 -2061 -30809 21684 17947 -24600 6730 4726 -22415 19227 15805 -26359 2355
1922 2355 9814 -15784 14597 14162 -28511 -93 20921 -14383 3748 17057 -26928 -4085 28623
1935 28623 -11739 -5301 14768 -20602 -1808 28317 -11551 -11802 12952 -12598 -1221 27020
1947 27020 -12319 -20501 17787 -585 -7740 21878 -10657 -23820 22626 6905 -13677 13453
1959 13453 -8548 -18240 24306 6695 -19173 8264 -1179 -13586 20554 7844 -24673 4729
1971 4729 10010 -13201 13206 8949 -26623 4368 17010 -13183 7142 7067 -23925 5859 19512
1984 19512 -12793 -991 6968 -17841 4786 21748 -13619 -10541 11337 -8999 1357 20223
1996 20223 -16046 -14627 17366 -2940 -2632 14307 -16060 -11777 20541 206 -9117 8753 -9096
2009 -9096 -9068 20053 1778 -16429 6774 87 -9036 17308 2184 -20124 7860 5877 -9087
2022 -9087 13100 531 -19296 8632 9686 -8531 6052 1130 -15662 7788 13993 -10238 -1389
2035 -1389 4965 -11555 7262 15508 -14225 -5008 9583 -7080 5612 11150 -15429 -4753 12759
2048 12759 -2560 256 6452 -11659 -4110 14928 -1075 -7497 5654 -5916 -4240 15104 -2341
2061 -2341 -11518 7097 -2024 -3867 12240 -3615 -11305 6565 1733 -3976 7167 -2376 -10793 5832
2075 5832 6414 -5701 2269 -259 -10003 7023 8301 -9247 -173 1884 -6725 7509 5690 -10477
2089 -10477 -1568 4340 -2359 3587 2620 -8804 -1975 8093 -1314 -2058 2614 -6411 -1075 9307
2103 9307 -3233 -4280 3764 -4068 233 7285 -3739 -3782 3051 -1071 137 4255 -1797 -4430 2837
2118 2837 2596 -1764 2869 -941 -5509 4645 3216 -3012 1824 -1246 -3024 4897 2148 -2735 -565
2133 -565 -202 560 2648 1311 -3276 -1795 2998 983 -233 990 -3211 -280 4067 -900 -969 264
2149 264 -1659 1265 1565 -682 -979 -1047 831 355 -566 1000 -1678 -1112 2041 -586 -2 573 -1969
2166 -1969 -294 1206 96 -715 -668 -28 -912 1075 1588 -3137 -540 2204 -2168 1633 1029 -4551 1703
2183 1703 2304 -2903 366 857 -2249 769 2322 -2480 -1663 2745 -899 -1833 3505 -2227 -2597 5357
2199 5357 -2157 -2868 4878 -1974 -2030 4608 -2561 -2527 4349 -592 -3148 3493 379 -3463 3978 1203
2215 1203 -5492 3880 2629 -5911 3773 2039 -6265 4751 2495 -6456 3937 2664 -5874 3103
2229 3103 3163 -5178 1862 4205 -5667 140 6241 -5223 -563 6130 -6801 -553 8385 -6664 -2033
2244 -2033 7125 -5823 -783 7278 -6152 -2965 6921 -3185 -3507 6493 -3102 -5433 8291 -1474
2258 -1474 -7307 7565 -794 -7340 8448 -1245 -8741 8535 -74 -8104 7245 379 -7894 6262
2272 6262 1699 -8466 5224 4043 -8923 3692 5464 -9600 3673 6430 -10936 3617 7537
2285 7537 -10304 2466 7005 -9795 2641 7756 -9147 85 8508 -7279 -811 9090 -7632
2298 -7632 -3046 11275 -6386 -4823 11502 -6525 -5003 12311 -6218 -6090 11995 -4817 -6510
2311 -6510 10739 -3499 -7045 10624 -1715 -9147 9636 828 -9702 9218 1639 -11474 9773
2324 9773 3494 -12097 8490 3190 -11745 8556 4681 -12180 6559 5431 -10970 5141 6796
2337 6796 -11275 2999 8665 -10965 1460 9991 -11733 -125 11576 -11116 88 10924
2349 10924 -12276 -1333 12406 -9664 -2545 10730 -8860 -3611 12882 -6561 -7517 11294 -4721
2362 -4721 -6342 13043 -5715 -10313 13296 -2249 -9248 12661 -4210 -11223 13641 -273 -11244
2375 -11244 10109 65 -11077 10556 3341 -12702 6819 4437 -11543 8341 6041 -14839
2387 -14839 5950 7722 -12821 7246 7575 -15520 4645 10983 -11186 2691 8262 -12262 1615
2400 1615 12767 -9372 -2879 9964 -9253 -171 14404 -10823 -6077 13478 -7641 -2807 14486
2413 14486 -10772 -7947 14933 -3977 -6540 10910 -6492 -7930 13820 -1004 -9842 9407 -2617
2426 -2617 -9424 13998 -430 -14146 10628 1375 -11658 12876 1892 -16059 8378 5498 -10287
2439 -10287 7191 2634 -13958 5950 8860 -10558 3295 5127 -13604 6203 12927 -14498 -687
2452 -687 9783 -11542 3780 12476 -14364 -3820 11683 -6713 -107 9327 -11289 -4156 13973
2465 13973 -4987 -4785 9748 -9172 -6072 16927 -4334 -10579 11061 -4779 -6930 15721 -3452
2478 -3452 -12292 9342 -309 -5712 11342 -2753 -12620 10083 3903 -8312 8403 -228 -14448
2491 -14448 11228 8859 -12852 4662 3532 -12196 10091 8812 -13893 1153 5886 -7646 6931
2504 6931 6808 -13875 133 10853 -7041 1520 8477 -13598 -1548 15393 -7133 -4284 8381
2517 8381 -10062 -1262 14453 -6721 -6980 7408 -5593 -1365 12265 -6392 -10057 9548 -414
2530 -414 -4946 10589 -5153 -12527 11673 3171 -8691 7198 -3745 -10306 12444 3714 -10490
2543 -10490 4093 -762 -7293 10501 4093 -13250 2237 5697 -6608 6789 4637 -14679 2145
2556 2145 10160 -7289 2454 4280 -12301 3569 10859 -7547 -877 4094 -8312 2971 11292
2569 11292 -7553 -5367 7140 -3988 270 10846 -8087 -7533 10172 -1364 -2228 8301 -7756
2582 -7756 -6606 11896 -108 -4892 5173 -4843 -4929 11092 1485 -9193 3433 589 -4631 9368
2596 9368 1313 -12043 4354 4410 -4986 6498 -292 -11223 5589 6075 -5542 2854 392 -8577
2610 -8577 4815 7612 -6693 -1511 3059 -5905 3548 8118 -8572 -3309 5891 -4289 2387 6483
2624 6483 -9338 -3187 7469 -2042 -236 3610 -7078 -2578 8676 -426 -4616 2748 -3452 -2506
2638 -2506 9256 -1068 -7624 3882 -344 -2170 7525 -2742 -7792 4831 1841 -2187 3972 -1755
2652 -1755 -6160 4340 4439 -3843 670 357 -5108 4607 5222 -6076 -37 1973 -3859 4471 3992 -6675
2668 -6675 -319 3004 -1501 2606 2105 -5466 -1119 5289 -453 -918 1869 -4259 -815 6662 -1382
2683 -1382 -3306 2510 -2633 583 5863 -2894 -3143 2126 -158 258 3149 -2270 -3514 2225 2082 -1479
2699 -1479 1118 -1140 -3572 3502 2391 -3393 1062 -561 -2520 3636 1037 -3243 -243 93 -369
2714 -369 1803 643 -3075 -1247 2013 340 28 736 -3030 -562 3300 -828 -630 20 -2470 1161
2730 1161 2501 -1201 -1232 -537 -92 1171 1120 -511 -1720 205 1480 -349 565 -368 -1439 1397 1020
2747 1020 -548 220 -727 -543 1397 639 264 -1010 -382 1019 183 836 206 -1697 933 1189 -505
2764 -505 839 -574 -843 1215 1094 -390 -500 -7 135 267 1335 -725 -1655 2029 257 -694 1679
2781 1679 -1222 -1089 2490 -765 -806 1163 -887 -594 1228 6 -1382 986 271 -1770 1352 1161
2797 1161 -2654 1370 1100 -3052 1854 975 -3334 1203 865 -2402 1236 1008 -2367 823 1650 -2179
2813 -2179 144 1967 -2337 -448 3161 -2527 -970 3437 -2805 -779 3757 -2950 -937 3650 -2688
2828 -2688 -1178 3203 -1738 -1515 3354 -1015 -2322 3545 -166 -3334 3388 2 -3705 4238 -27
2843 -27 -4209 3860 223 -3743 4007 331 -4110 3317 1203 -3602 2556 1990 -4474 2180 2913 -4598
2859 -4598 1609 3819 -5014 1492 4304 -5461 1089 4019 -4904 946 4446 -4411 -225 4284 -3831
2874 -3831 -590 4361 -3533 -2298 5223 -2579 -2860 5436 -2993 -3244 6517 -2605 -4074 5588 -2196
2889 -2196 -3210 5549 -1985 -4572 5065 -684 -4189 4594 102 -5481 4436 1453 -5955 4018 1793
2904 1793 -6837 4422 2458 -6964 3879 2587 -6560 3751 3210 -6301 2255 3821 -5943 1661
2918 1661 4903 -5943 353 5641 -5873 -375 6617 -5894 -661 7126 -5609 -1032 6738 -5215
2932 -5215 -1578 6884 -4333 -2507 6556 -3336 -3337 6521 -2166 -4557 7108 -1464 -5385 6894 -1096
2947 -1096 -5601 7341 -842 -6551 7123 241 -6645 6021 911 -6328 5309 2116 -7073 4052
2961 4052 3168 -7129 3515 4341 -8045 3092 5269 -8025 2713 5309 -8057 2258 6039
2974 6039 -7485 1006 5686 -6794 179 6641 -5813 -1674 6650 -5141 -2162 7696 -5175 -3750
2988 -3750 7779 -4452 -3229 8378 -5296 -4794 8647 -2733 -4603 7088 -3075 -5329 7446
3001 7446 -585 -6460 5493 -315 -6363 7191 830 -8505 5857 1792 -7427 6762 1808 -9272
3015 -9272 5335 3770 -7197 3853 3268 -7832 3052 5776 -6514 1349 4707 -7413 2061
3028 2061 7513 -7690 -406 6863 -6847 642 8262 -7821 -1996 7682 -4431 -862 6618 -5843
3042 -5843 -3213 8158 -2572 -3531 6316 -3982 -4145 9683 -1994 -6567 7187 -2131 -5538 9083
3056 9083 -1275 -7994 6153 776 -5166 6505 -394 -7743 5267 3218 -6003 4230 1672 -8549
3070 -8549 5381 5341 -8434 2621 3613 -8031 4558 6013 -8640 631 4612 -5661 2436 5130
3084 5130 -7844 -948 6771 -4461 -393 5752 -7673 -2092 9383 -4083 -3784 6302 -5683
3097 -5683 -2570 9440 -3756 -5141 5634 -2565 -1926 7895 -3223 -6619 5855 376 -4106 6649
3111 6649 -1738 -7883 7180 2944 -6104 4970 0 -7433 7456 3461 -7053 2594 1034 -5288
3125 -5288 5927 3603 -7959 1353 4138 -4473 3340 4330 -8841 416 7477 -4557 731 4288
3139 4288 -7729 897 7749 -4673 -1604 3721 -5052 631 7337 -4565 -4065 4921 -2276 -1408 7068
3154 7068 -4041 -6166 6311 -372 -3561 5536 -4115 -5591 6858 570 -4281 3444 -2381 -4285
3168 -4285 6751 1726 -6404 1870 1102 -3942 5289 2222 -8222 1842 3862 -4088 3837 1601
3182 1601 -7922 2343 5243 -3944 986 1366 -5744 2347 5818 -4283 -1640 3098 -3663 1014 6426
3197 6426 -4872 -3259 4669 -2105 214 5350 -5441 -3109 5713 -903 -1322 3289 -4107 -2467 6124
3212 6124 382 -3626 2186 -1356 -2669 6285 634 -5860 2359 663 -2513 5328 -291 -5955 2907
3227 2907 2641 -2083 2705 -419 -5020 2614 3881 -2745 120 909 -4079 2449 4678 -4183 -1214
3242 -1214 2244 -3028 2384 3772 -4904 -1273 2853 -1338 1118 2228 -4185 -1686 4141 -185 -1200
3257 -1200 1205 -3071 -1691 4922 -354 -3262 1775 -1748 -946 4629 -1124 -3642 1344 160 -241
3272 -241 2822 -1103 -3459 1668 1999 -1091 928 -360 -3021 2419 2529 -2511 220 297 -2527 2883
3288 2883 2013 -2956 -341 456 -792 1937 985 -2398 -757 1955 115 316 1301 -2361 -620 3272
3304 3272 -258 -768 773 -2109 284 2885 -888 -1489 88 -500 898 1571 -853 -1730 58 1111
3320 1111 -178 1005 -454 -2135 1171 1444 -864 485 -749 -975 1528 500 -788 -525 -339 195
3336 195 827 351 -628 -1152 593 609 -32 397 -1001 -775 1063 76 -81 -326 -971 299 764 325 -161
3355 -161 -1306 190 343 163 484 -862 -735 1034 95 -63 383 -1068 -107 917 -133 -585 -561 -83
3373 -83 -205 437 883 -1331 43 883 -1153 808 998 -1703 686 1088 -1059 702 450 -1335 202
3390 202 1172 -327 -139 820 -576 -550 1773 -752 -1118 1928 -719 -808 2354 -1434 -1074 1872 -690
3407 -690 -831 1549 -821 -719 1483 -50 -1449 1577 490 -2085 1330 703 -2547 1715 999 -2698
3423 -2698 1873 513 -2731 1623 644 -2412 1219 1194 -1876 735 1430 -2196 155 2093 -2261 -411
3439 -411 2312 -2488 -273 2802 -2801 -656 2790 -2466 -287 2710 -2249 -927 2404 -1689 -1108
3454 -1108 2391 -1437 -1753 2775 -758 -2275 2940 -909 -2757 3414 -442 -3042 3509 -401 -2785
3469 -2785 3421 302 -2989 2556 543 -2731 2110 1135 -3272 1778 2672 -3422 1420 2452 -4052
3484 -4052 1332 3400 -3820 1272 2721 -3633 1252 2802 -3295 332 2779 -2799 139 3112 -2797
3499 -2797 -1148 3692 -2276 -1612 3864 -2790 -2041 4565 -2246 -2060 4124 -2514 -1962 4287 -1797 -2529
3515 -2529 3396 -923 -2784 3655 -460 -4125 3136 956 -4123 3273 573 -4864 3394 1680 -4628
3530 -4628 3174 1349 -4641 2690 2060 -4189 1689 2212 -3943 1201 3051 -4173 325 3828 -3756
3545 -3756 -5 4155 -4434 -324 4577 -4149 -290 4316 -3855 -589 4392 -3011 -1314 4220 -2769
3560 -2769 -2015 4651 -2046 -2826 5018 -1514 -3479 4870 -1227 -3517 4988 -992 -3874 4945 -834
3575 -834 -3962 4369 82 -3816 3391 1089 -4272 3058 1744 -4426 2889 2529 -5063 2548 2954 -5236
3591 -5236 2604 3133 -5448 1826 3219 -4956 1049 3377 -4429 666 3983 -3825 -507 3895 -3472
3606 -3472 -1040 4881 -3717 -1812 5239 -3590 -1757 5715 -3263 -2539 5185 -2432 -2717 4653 -2214
3621 -2214 -3036 4460 -831 -3452 3646 -635 -3994 4702 480 -5191 3904 280 -4654 4781 868
3636 868 -5473 3612 1478 -4193 3028 1374 -4915 2365 2699 -3768 1448 2639 -4902 1709 4471
3651 4471 -4978 352 3803 -5029 1171 4991 -4986 -337 4282 -3435 150 4095 -3565 -1626 4267
3666 4267 -2055 -1362 4224 -2832 -2698 5684 -1370 -3442 4680 -2103 -3113 5739 -1156 -4226 3624
3681 3624 -611 -2628 4434 -454 -4296 3040 1020 -3444 3116 452 -5477 3510 2643 -4587 2434
3696 2434 1274 -5133 3331 3160 -4872 986 1639 -3818 2313 2721 -4588 -176 3123 -2846 786 3440
3712 3440 -4775 -1089 5349 -2795 -958 3626 -4320 -991 5540 -2295 -2087 2731 -2715 -492 4678
3727 4678 -1966 -3242 3094 -669 -1717 4236 -1456 -4792 4074 1196 -2950 3568 -1085 -4295 4554
3742 4554 1364 -3347 2260 -415 -3068 4082 1726 -4094 986 1342 -2632 2705 2264 -5122 303
3757 303 3150 -2678 1791 2076 -5177 958 3851 -2324 259 1630 -3860 1096 4027 -2359 -1606 2218
3773 2218 -1835 194 4411 -2660 -2919 3233 -893 -543 3531 -3448 -2872 3999 -12 -1149 2361 -2595
3789 -2595 -2285 4036 495 -2790 1105 -634 -2082 3785 1057 -4406 1095 1083 -2120 3364 538 -4779
3805 -4779 1836 1755 -1586 1888 -495 -3829 1610 3130 -1840 -690 440 -2881 1355 3570 -2765
3820 -2765 -1457 1850 -1985 1426 2913 -3456 -1159 2394 -936 639 1811 -2790 -1400 3039 148
3835 148 -863 1068 -2011 -1283 3782 134 -2446 1637 -822 -994 3631 -517 -2960 1255 380 -122
3851 -122 2410 -898 -2549 1237 1574 -665 489 -389 -2554 1795 2256 -1848 -181 311 -1933 2281
3867 2281 2055 -2529 -529 566 -562 1722 1183 -2246 -742 1639 329 171 606 -1955 -820 2570
3883 2570 -154 -1061 507 -1707 -105 2285 -915 -1312 267 -755 462 1592 -847 -1752 279 775
3899 775 153 451 -579 -1945 1168 1320 -875 292 -724 -1200 1845 804 -1178 -476 -499 -125 1283
3916 1283 176 -1039 -883 698 372 473 504 -1430 -671 1536 -64 -123 -48 -1483 522 1304 27 -106
3934 -106 -534 -186 616 524 194 -842 -400 896 353 325 5 -1154 222 806 155 98 -772 -370 788
3953 788 487 184 -563 -383 761 194 465 122 -1340 151 547 -405 402 -556 -1004 724 -72 -187 -365
3972 -365 -377 8 118 954 -396 -1104 581 -388 -391 1109 -1106 -871 918 -355 -295 665 -1044 -763 960
3991 960 -25 -332 501 -272 -770 935 458 -1155 339 420 -1171 1076 320 -1749 956 486 -952 1188
4009 1188 94 -1388 603 787 -709 35 864 -1100 3 1580 -1206 -369 1593 -1122 147 1567
4025 1567 -1733 -196 1624 -1129 -70 1639 -1112 -495 1631 -546 -767 1375 -513 -1429 1913 -190
4041 -190 -1848 2072 -137 -2062 1960 -116 -1847 1970 -295 -1662 1515 -34 -1515 1278 444
4056 444 -1804 1062 1100 -1897 715 1040 -2349 785 1471 -2555 1191 1337 -2557 913 1888 -2427 306
4073 306 1758 -1893 37 1773 -1694 -588 2455 -1653 -865 2193 -1777 -1201 3110 -1561 -1462 2689
4089 2689 -1545 -1217 2808 -1141 -1589 2367 -688 -1608 2186 -287 -2324 2029 416 -2477 2092 209
4105 209 -3191 2281 1166 -3194 2068 761 -2911 2309 962 -2689 1262 1036 -2304 1421 1645 -2822
4121 -2822 349 2328 -2253 545 2605 -3143 249 2893 -2652 273 2828 -3256 -31 3088 -2203
4136 -2203 -467 2577 -1792 -967 2918 -1425 -1825 2960 -847 -2106 3335 -1200 -2750 3509 -785
4151 -785 -2360 3171 -1047 -2650 3108 -326 -2220 2443 -24 -2597 2223 702 -3291 1784 1208
4166 1208 -3297 1758 1539 -3789 1825 2075 -3704 1721 1913 -3697 1189 2171 -3068 579 2133 -2870
4182 -2870 179 2816 -2255 -599 3325 -2754 -794 3654 -2532 -1088 3802 -2712 -819 3782 -2022
4197 -2022 -1376 3537 -1326 -1911 3187 -1161 -2288 3211 -74 -2444 3143 -104 -3139 3296 323
4212 323 -3493 3163 200 -3445 2892 523 -3252 2529 1184 -3296 2129 1684 -3076 1349 1895 -3058
4228 -3058 1204 2815 -3506 920 2961 -3896 909 3138 -3554 326 3180 -3198 55 2738 -2654
4243 -2654 -494 2878 -1986 -1137 2930 -2060 -1984 3516 -1467 -2274 3589 -1937 -2042 3946 -1118 -2624
4259 -2624 3263 -797 -2121 3087 -585 -2879 2469 48 -2718 2322 315 -3383 2562 1427 -3622
4274 -3622 2019 1157 -3575 2621 1812 -3694 1705 1485 -2833 1947 1765 -3227 674 2373 -2300 658
4290 658 2533 -3176 -259 3753 -2444 -443 3131 -2982 -186 4220 -2427 -897 2593 -1931 -665
4305 -665 3264 -1818 -1890 2889 -713 -1189 3030 -1006 -2771 3423 196 -2559 2811 -518 -3091 3288
4321 3288 602 -2814 2101 -401 -2313 2797 872 -2970 1301 748 -2223 1665 1300 -3443 670
4336 670 2376 -2465 968 1753 -3576 1041 2558 -2418 175 1147 -2697 779 2754 -2300 -1027 1610
4352 1610 -1577 -101 3102 -2340 -2031 2995 -1149 -683 3039 -2513 -1947 3062 -205 -1178 1907 -1551
4368 -1551 -1343 2811 180 -2272 1311 -341 -1714 2943 306 -3287 1549 999 -1720 2485 237
4383 237 -3379 1944 1812 -1424 1303 -44 -2721 1794 2058 -1488 -117 507 -1785 1023 2832 -2142
4399 -2142 -928 1706 -1529 1244 2268 -2980 -885 2290 -795 393 1374 -2317 -668 2370 -74
4414 -74 -983 626 -1190 -1186 2417 -113 -2219 1026 -581 -863 2830 -724 -2489 1548 161 -299 1519
4431 1519 -812 -2253 1219 1116 -1170 263 -143 -2095 1505 2039 -1811 -229 223 -1109 1671 1281
4447 1281 -2503 -164 720 -639 1055 405 -2080 -602 1598 -92 -212 141 -1649 -543 2348 -116
4463 -116 -795 530 -1048 252 2196 -884 -959 558 -306 900 1507 -1055 -1443 483 837 174 632
4480 632 -451 -1511 1456 1293 -906 147 -388 -1135 1799 731 -1229 -105 -260 7 1446 275
4496 275 -1136 -570 776 637 83 261 -1344 -178 1582 -295 -139 23 -977 818 1091 -496 -312
4513 -312 -541 -521 880 788 -272 -873 -182 530 102 450 -524 -1301 801 768 0 206 -963 -534 854
4532 854 214 -340 -520 -739 499 382 246 -523 -1252 269 537 242 229 -753 -631 962 492 37 -177
4551 -177 -865 294 646 502 -141 -705 290 378 200 694 -1126 -341 1060 -179 -33 129 -700 94 600
4570 600 250 -131 -228 -242 43 698 260 -671 202 337 -299 883 128 -1086 1008 244 -285 552 -480
4589 -480 -624 695 518 -289 -21 5 -453 301 921 -631 -505 882 -596 143 1287 -1278 -20 935
4607 935 -529 221 443 -1071 -258 909 -311 -595 529 -72 -551 1099 -48 -1092 1081 -158 -970
4624 -970 1308 -288 -1296 979 -310 -929 1059 -206 -887 1005 358 -757 567 487 -1283 370
4640 370 1039 -1272 509 711 -1556 587 634 -1550 676 1349 -1325 546 880 -1276 540 981 -928
4657 -928 -71 1441 -687 -575 1676 -789 -692 1833 -1149 -756 1776 -858 -529 1762 -1138 -637 1431
4674 1431 -724 -650 1359 -334 -1294 1237 86 -1163 1091 141 -1914 1693 649 -1899 1354 119
4690 119 -1936 1420 362 -1636 1280 453 -1446 1106 1044 -1728 370 1216 -1704 77 1278 -1984
4706 -1984 232 1818 -1973 -155 1421 -2214 199 1720 -1701 -406 1017 -1181 -116 1691 -1060
4721 -1060 -841 1842 -425 -1157 2157 -964 -1608 2160 -475 -1714 2221 -1042 -1614 2237 -426 -1273
4737 -1273 1734 -199 -1566 1722 281 -2066 1151 820 -2081 1195 1083 -2518 1052 1351 -2249 1444
4753 1444 775 -2322 1283 1328 -1851 729 865 -1820 739 1884 -1599 -297 2022 -1546 -511 2121
4769 2121 -1750 -787 2400 -1299 -366 2130 -1660 -872 2167 -1267 -821 1649 -1134 -893 1829 -430
4785 -430 -1727 1507 -560 -1686 2254 -267 -2250 2181 68 -2106 2131 -188 -2330 1870 493
4800 493 -1712 1207 -7 -1961 1302 1203 -2089 596 986 -2285 800 1968 -2635 352 1816 -2499
4816 -2499 785 1730 -2431 363 1750 -1799 242 1770 -1584 -195 2059 -1449 -1045 2226 -1177
4831 -1177 -1027 2699 -1125 -1070 2690 -1030 -1463 2489 -1050 -1462 2325 -680 -1577 1915 -309 -1375
4847 -1375 1951 295 -1555 1540 424 -2228 1891 640 -2348 1777 707 -2546 1395 705 -2042
4862 -2042 1462 980 -2278 635 1084 -2008 474 1201 -1848 8 1867 -1996 -212 2097 -2224 -82
4878 -82 2301 -1906 -8 1924 -1677 -102 1803 -1377 -712 1557 -968 -582 1695 -873 -1509 2194
4894 2194 -483 -1510 2191 -801 -1717 2261 -310 -1579 1756 -404 -1400 1889 -112 -1911 1398
4909 1398 525 -1375 1295 524 -2074 843 1267 -1915 897 983 -2404 927 1634 -1890 744 1018 -1606
4926 -1606 899 1409 -1644 -3 1262 -1066 519 1744 -1756 -771 1909 -795 -577 1970 -1805 -884
4942 -884 2626 -876 -554 1430 -1199 -488 2119 -480 -1265 963 -495 -686 1646 -252 -2059 1222
4958 1222 463 -1505 1620 -235 -2115 1837 689 -1417 1376 -111 -1729 1035 761 -1469 564
4973 564 209 -1209 701 1279 -2072 -372 1464 -1170 547 1566 -2441 -261 1323 -958 434 794
4989 794 -1797 -26 1515 -563 -708 568 -935 -315 1625 -489 -1340 995 -204 -541 2147 -896
5005 -896 -1805 1436 119 -597 1222 -981 -1021 1157 596 -730 266 -378 -714 1257 1072 -1427 366
5022 366 404 -933 1478 582 -2010 467 482 -496 1099 -221 -1390 111 876 -237 -69 126 -1058
5039 -1058 1 1508 -540 -834 713 -1118 167 1594 -1079 -784 632 -415 560 884 -1267 -632
5055 -632 538 270 -136 202 -882 -767 1212 779 -1216 435 -333 -698 1428 -203 -1243 12 -340
5072 -340 -230 1111 -316 -1112 -92 442 110 173 -68 -844 -51 1242 -422 94 18 -1011 467 982
5090 982 -778 -285 102 -306 530 543 -687 -597 337 521 277 -39 -535 -674 860 640 -371 33 -798
5109 -798 -364 1126 72 -303 -330 -443 433 636 -107 -277 -345 184 463 265 -220 -843 -159 739 227 69
5129 69 -175 -315 647 553 -120 -262 -650 234 513 299 121 -710 -159 357 34 548 -440 -734 510 514 51
5150 51 -67 -341 -292 391 300 14 -577 -315 276 43 327 -253 -885 633 493 -118 211 -811 -507 673
5170 673 237 95 -43 -497 -262 490 143 -669 -393 223 -160 135 202 -907 123 667 -382 398 137
5189 137 -750 315 459 -7 7 -178 -369 -82 521 -153 -599 265 -52 -308 995 -631 -780 839 -96
5208 -96 -232 487 -237 -477 775 -8 -150 443 -45 -647 594 665 -670 326 366 -1113 768 425 -1219
5227 -1219 317 272 -902 657 221 -1006 339 209 -470 65 295 -582 15 874 -599 -356 939 -938
5245 -938 -214 1003 -777 -106 1090 -808 47 825 -637 -120 706 -706 -162 797 -220 -534 834
5262 834 71 -925 956 -92 -1048 950 72 -1057 1257 48 -972 684 105 -956 391 296 -1019
5279 -1019 445 402 -940 108 937 -1146 314 1088 -1223 634 1030 -1204 579 1010 -1457 230
5295 230 818 -844 292 947 -548 -492 941 -716 -334 1167 -839 -681 1540 -334 -733 1452 -749
5312 -749 -763 1565 -570 -1126 1432 -318 -520 1005 8 -1141 844 481 -1016 831 344 -1704 985
5329 985 588 -1623 1180 284 -1532 1024 380 -1310 655 251 -1542 860 852 -1077 -30 754 -1102
5346 -1102 123 1402 -1752 -510 1597 -988 -50 1410 -1575 -276 1680 -1000 -217 1161 -794
5361 -794 -160 1491 -370 -1186 1066 -536 -921 1705 -539 -1676 1562 32 -1092 1670 -518 -1106
5377 -1106 1797 90 -1186 1236 0 -1462 1279 616 -1449 389 619 -1548 617 1069 -2019 720
5393 720 1236 -1514 845 1019 -1716 634 1052 -1208 658 1016 -1472 -87 1350 -898 -388 1330
5409 1330 -1329 -502 1730 -929 -873 1601 -1043 -675 1816 -1138 -863 1457 -737 -458 1472 -968
5425 -968 -1153 1347 -128 -1392 1167 85 -1341 1394 123 -1741 1518 301 -1595 1510 257
5440 257 -1473 1045 456 -1288 1039 450 -1251 690 870 -1366 277 1031 -1245 393 1107 -1544
5456 -1544 224 1430 -1357 273 1536 -1551 37 1182 -1063 -35 1233 -1126 -458 1152 -564
5471 -564 -705 1271 -773 -888 1601 -647 -982 1410 -700 -963 1568 -358 -1104 1223 -423 -1078 967
5488 967 38 -875 686 407 -1346 937 495 -1436 1050 606 -1607 891 716 -1557 560 623 -1549
5505 -1549 632 796 -1099 353 740 -1203 22 1134 -1388 -166 1155 -936 -209 1150 -1365 -653
5521 -653 1486 -1095 -284 1263 -1062 -418 1204 -474 -700 926 -317 -465 1042 -216 -1174 1062
5537 1062 103 -822 1272 -223 -1325 1417 450 -975 1027 -78 -1141 1217 165 -727 298 306 -744
5554 -744 894 672 -1334 336 860 -809 553 656 -1415 360 1262 -1104 312 538 -1175 427
5570 427 867 -815 -157 670 -803 85 1202 -375 -659 959 -242 -205 1101 -814 -784 1157 -362
5587 -362 -481 720 -668 -498 682 -71 -743 404 -121 -660 972 442 -1250 219 266 -868 671
5604 671 46 -1585 416 557 -720 814 -66 -1014 595 621 -417 207 508 -729 232 1219 -273 -505
5622 -505 578 -586 296 848 -1132 -419 869 -405 370 863 -705 -414 427 -62 -109 220 -528 -446 867
5641 867 126 -850 411 -245 -259 1194 -84 -731 642 -103 111 509 -349 -736 347 429 -9 333 9
5660 9 -472 374 716 -397 -171 281 -550 551 426 -791 -214 233 -103 800 175 -560 -6 138 41 173
5680 173 -145 -497 -380 603 421 -575 64 -371 -122 718 -14 -520 -107 -378 256 348 -443 -429 -70 271 181
5701 181 322 -216 -584 63 541 -10 34 -452 -703 773 243 -422 -98 -170 8 905 -29 -273 -532 -228
5721 -228 287 250 -86 -257 -71 604 63 -5 95 -538 214 664 109 155 -194 -254 310 266 156 62 -390 62
5743 62 84 -25 -22 -433 254 393 219 224 -102 -260 212 201 140 -191 -359 202 122 294 186 -702 -83 408 -209
5766 -209 517 -152 -776 482 435 -236 30 -290 -261 114 284 -23 -590 83 -48 303 684 -465 -735 417
5786 417 -50 -210 -4 -570 -220 522 -227 -74 76 -5 -90 312 254 -418 -215 200 -329 437 282 -754 340
5807 340 -36 -65 433 -11 -524 141 221 -192 304 -66 -170 -74 537 -230 44 283 -67 117 599 -829 -36
5828 -36 790 -686 56 768 -538 -100 418 -186 -119 227 -163 -416 470 -111 -408 429 -196 -513 791 113
5848 113 -387 545 -79 -476 888 -378 -485 616 182 -481 320 110 -413 6 504 -403 140 464 -639
5867 -639 136 516 -708 446 409 -921 277 467 -571 154 244 -785 124 255 -428 -517 426 -362 -397
5886 -397 763 -265 -365 973 -600 -582 952 -785 -505 737 -483 -380 904 84 -389 626 -107
5903 -107 -215 521 22 -911 594 -37 -1146 671 116 -799 796 226 -754 538 248 -777 581 146
5921 146 -435 109 399 -355 199 580 -1070 -53 1075 -856 167 671 -1154 165 862 -545 125
5938 125 701 -792 206 924 -616 -397 579 -381 -288 973 -328 -559 960 -285 -459 1067 -542 -848
5956 -848 993 -329 -307 737 -587 -534 995 67 -595 332 -94 -876 705 656 -765 381 615 -916
5974 -916 521 490 -1447 720 654 -1002 311 257 -895 196 586 -756 -274 528 -987 -30 895 -624
5992 -624 -430 986 -502 -409 1089 -763 -129 1161 -578 -216 630 -739 -353 1019 -169 -834 622
6009 622 199 -564 1100 -30 -768 654 76 -709 967 -142 -1173 938 -109 -318 511 150 -908
6026 -908 466 684 -649 269 305 -1032 461 856 -769 258 622 -897 260 1015 -1137 229 668
6043 668 -930 270 604 -1001 -142 822 -251 -151 758 -449 -442 811 -510 -591 694 -505 -442 1034
6061 1034 -359 -481 946 -154 -542 676 -35 -642 516 251 -885 544 -115 -1152 766 386 -1014
6078 -1014 755 243 -1019 663 253 -795 436 390 -649 487 377 -800 54 773 -350 310 571
6095 571 -764 205 1037 -603 -16 936 -765 18 769 -762 -259 846 -625 63 881 -317 -364 594
6113 594 -80 -582 604 -167 -835 756 110 -690 803 -173 -760 728 -159 -565 595 -296 -563 309
6131 309 94 -497 478 131 -750 207 448 -744 84 333 -883 434 351 -908 335 222 -735 650
6149 650 448 -627 38 264 -671 47 616 -420 -323 767 -410 -228 929 -767 -553 793 -714 147
6167 147 478 -447 -212 529 -75 -326 429 22 -466 534 -85 -774 561 -133 -563 372 209 -779 688
6186 688 452 -770 722 -193 -459 455 34 -330 101 315 -430 99 566 -429 210 649 -388 140 609
6205 609 -796 -159 314 -336 190 374 -599 151 522 -239 -92 -5 -221 -267 389 26 -356 77 -445 -401 907
6226 907 -222 -579 466 -193 -67 383 -374 -178 538 -61 -69 -31 -124 -173 159 305 -211 -281 192 -761 243
6247 243 334 -910 14 -36 -370 668 265 -544 -26 164 -1 4 -8 -94 53 467 -56 -55 311 -118 -172 736
6269 736 -371 -345 384 -184 248 366 -237 -398 172 247 484 116 276 -116 275 243 -4 8 -30 -524 482
6290 482 244 -237 210 -225 -124 114 135 -112 -203 -34 184 87 161 -350 -92 177 -52 -280 -197 -302 135 361
6312 361 -125 32 18 -342 320 84 -80 -172 -48 -22 98 103 -26 -200 183 298 17 -15 -37 -291 237 -28
6334 -28 13 102 -333 398 223 15 -28 22 34 321 178 1 -292 -199 73 -7 -73 31 -618 113 14 -208 -56
6357 -56 -412 152 156 147 325 -243 -141 333 175 104 137 -424 -2 326 -122 -20 -51 -193 26 293 309 -391 92
6380 92 104 102 269 7 -503 235 346 -203 352 -187 95 369 -61 106 125 -246 35 114 207 70 -296 119
6402 119 85 95 199 -543 24 476 -233 101 240 -234 -133 282 -366 9 -58 -147 -177 37 130 -197 87 -334
6424 -334 -298 409 -93 -636 472 -106 54 340 -331 -442 96 8 57 -21 -126 -310 2 309 -190 110 315
6445 315 -84 356 509 -398 244 191 -610 188 178 -323 -131 104 -227 -56 -16 -281 -296 496 -248 -246 390 -212
6467 -212 -104 423 -331 -353 614 -369 -145 455 -316 -5 287 -343 -99 -134 -6 -142 334 -71 -502 269 -92
6488 -92 -519 403 68 -560 477 247 -677 500 103 -212 193 550 -182 365 281 -284 75 267 -579 119
6508 119 336 -659 121 473 -633 30 601 -687 402 589 -622 358 446 -414 -240 173 -207 -485 510
6527 510 -353 -381 532 -33 -500 895 -264 -253 389 -148 -27 459 -62 -10 450 116 -577 309 58 -330
6547 -330 397 221 -562 328 566 -396 364 103 -614 488 545 -381 200 387 -515 324 570 -212 195 358
6567 358 -258 -49 743 -537 -74 611 -691 -39 667 -505 -79 464 -278 -181 305 -542 -186 434 -103
6586 -103 -100 252 -127 -273 418 -26 -637 675 265 -384 635 120 -471 356 -51 -230 355 -100 -746 432
6606 432 335 -264 271 131 -393 139 349 -865 149 391 -565 393 680 -626 226 338 -245 299 151
6625 151 -832 53 306 -243 -214 542 -358 -214 833 -388 -264 402 -674 -114 704 -329 -272 393 -360
6644 -360 -84 568 -166 -202 294 20 -94 366 172 -480 449 92 -613 518 73 -548 318 218 -663 571
6664 571 86 -442 305 43 -558 201 215 -257 119 310 -330 -303 700 -418 -193 237 -302 29 501 -553
6684 -553 44 566 -256 78 656 -551 -177 247 47 -7 365 -187 -477 267 0 -327 599 -140 -232 634
6704 634 117 -263 388 -87 -196 243 77 -268 266 398 -462 -45 254 -561 237 356 -247 242 254 -640
6724 -640 502 290 -496 187 414 -118 195 192 -326 -27 343 -353 157 330 -141 -218 445 -236 -181 303 -263
6745 -263 -11 411 -338 -155 489 -9 133 436 -427 -190 34 -62 -214 279 325 -444 540 -109 -541 181 88
6766 88 -522 225 -75 -458 319 -25 -567 208 -24 -268 87 434 -304 -145 201 -129 47 196 -233 30
6786 30 357 -205 10 118 -408 -145 234 -39 84 112 -42 -108 303 -7 -69 264 -142 -171 144 37 -187 385
6808 385 207 -285 319 9 -180 69 -106 -183 173 213 -200 -1 195 -343 -287 185 -405 171 108 -225 55
6829 55 88 -46 244 -185 8 242 1 -47 227 -63 114 -24 366 -45 -308 111 -8 -152 130 -260 73
6850 73 47 -253 18 227 -213 -237 165 -278 -179 -101 -183 -8 171 93 -390 43 -3 -269 364 154 -255 204 40
6873 40 29 574 -41 -153 -108 -86 31 20 66 -208 39 184 96 -218 1 -332 -16 195 -252 3 -162 -302
6895 -302 376 116 -162 60 43 182 -142 167 146 -185 -70 415 -85 51 94 -132 106 123 -107 281 -235
6916 -235 150 -70 -202 110 -123 191 107 -151 -206 -377 -164 185 -89 97 234 -206 186 107 -36 -87 -76 -112
6938 -112 203 127 -253 -159 -55 240 -72 36 71 -352 187 123 -14 -175 -184 -81 -70 37 119 -87 47 1 -138
6961 -138 269 157 -316 254 238 -133 156 -40 -122 37 -22 61 88 -158 275 238 22 -56 88 153 -118 103 341
6984 341 -229 -117 1 -66 276 179 64 11 148 -154 150 -27 -237 0 69 161 -138 54 -283 75 173 -167
7006 -167 -364 122 132 -384 232 -180 157 178 -75 74 165 30 137 110 44 -106 104 103 -211 299 325 -416 183
7029 183 -136 -180 202 98 -183 204 -25 -45 -9 -217 -139 38 -40 106 -171 173 25 -56 246 -161 -5 45
7051 45 -425 41 236 -248 34 374 39 -2 105 -185 -38 -111 -105 -159 183 -56 -240 213 21 -265 362 116
7073 116 39 163 2 -84 -57 -41 -115 79 13 -79 -81 207 83 -75 450 -169 95 39 -43 -167 272 133 326 120
7097 120 -356 -97 145 -60 0 142 -20 -52 117 -267 -81 354 -86 -185 272 -136 -365 384 -451 -214 355
7118 355 -111 -51 304 -169 -118 234 241 -111 84 104 -337 230 -25 5 272 213 -262 235 14 -237 174 79 -193
7141 -193 178 213 -189 -184 -106 -257 -4 247 -550 -48 406 -252 -59 144 -163 199 360 -171 116 231 -240
7162 -240 36 248 -204 -82 -12 -364 -163 312 -190 -335 191 114 39 419 -174 -122 457 -171 -262 305 -231 -167
7184 -167 309 -336 138 -25 272 -226 14 275 -221 220 203 -20 76 287 -352 244 259 -98 99 112 -245
7205 -245 34 355 -83 -143 -3 31 32 187 -371 -186 24 -177 62 529 -96 -87 143 -414 -187 321 -216 -3
7227 -3 350 -92 -244 -78 -129 -332 83 283 -71 293 -64 -203 288 33 -434 54 86 -176 507 12 -192
7248 -192 124 149 83 -31 381 -204 2 410 -285 28 473 -128 13 561 -156 -54 417 14 185 90 -84
7269 -84 -101 229 -148 62 -160 -121 -194 153 122 -393 188 -130 -65 196 35 -242 -78 -235 -204 474 -26 -92 54
7292 54 244 104 -68 -106 -230 39 403 -28 -22 167 -446 213 14 -368 136 45 -93 186 259 39 123 -33
7314 -33 -90 -60 358 -183 -8 180 -213 -120 95 -257 -223 275 -62 -106 128 -39 -50 90 -2 -343 -115 -290 -270
7337 -270 -66 95 -220 68 139 -402 143 -22 -189 39 203 -67 118 -17 -306 167 -127 -155 46 348 -108
7358 -108 74 362 -317 96 226 -81 76 136 -280 120 151 -118 271 66 84 138 -31 -43 -85 -220 -79 -108
7380 -108 257 208 -189 89 -217 -109 440 -210 -72 327 -191 -48 -7 -201 -95 -129 224 -56 37 220 17
7401 17 44 177 28 257 19 -406 63 117 -88 95 133 -60 80 61 119 -124 -134 238 91 131 75 -65 65
7424 65 -82 -2 187 -53 -107 36 -255 13 -136 -258 -93 222 -153 148 106 63 -51 12 -47 -141 146 -123 -94
7447 -94 274 230 -305 188 -40 -255 164 -184 -118 47 215 -95 -31 -132 40 -36 233 -57 -114 31 -123 -38
7469 -38 296 -6 73 39 -317 57 -31 -87 51 -207 -78 -81 -73 -162 -44 175 145 36 -106 -129 -206 363 171 58
7493 58 201 3 -46 215 -269 -126 222 75 145 165 82 -89 151 160 30 -40 -212 81 191 -291 48 135 -204
7516 -204 -219 50 -241 50 145 254 409 9 147 238 0 159 167 71 -124 150 -38 133 42 -139 74 178
7538 178 -77 31 141 -165 -95 -111 -239 214 -91 -79 -20 133 87 -175 151 -254 -69 -57 -93 -36 -101 -213 130
7561 130 -236 -118 -240 -169 -80 -72 -219 -129 -64 50 46 -118 -71 104 -28 106 138 -64 -150 9 5 144 -136 96
7585 96 -59 265 -223 30 -5 -101 109 -175 11 6 52 -304 -51 -441 -132 -73 224 14 -163 42 160 -6
7607 -6 28 144 64 40 51 -45 -115 50 -17 -5 -147 26 -18 51 126 -281 -193 -189 166 -59 67 -39 48 -57 41 90
7633 90 -175 -64 171 -84 46 -145 -246 205 207 142 325 171 45 -69 77 86 -134 -52 -82 2 262 -80 -131
7656 -131 12 -169 -28 17 -161 -143 -36 5 -240 14 -277 -65 -168 186 -161 41 117 -45 -47 -149 -128 -244
7678 -244 2 -188 -192 -228 80 115 6 -99 78 55 -20 111 -73 49 -38 180 -48 70 73 -142 -238 -29 55 -281
7702 -281 41 163 34 78 -100 -267 -190 105 -289 99 -124 -194 87 68 -496 183 -131 -138 208 11 12 2 117
7725 117 -172 -122 150 -28 23 177 82 -120 225 -106 -17 61 -69 196 156 -28 78 -42 59 -115 90 79
7747 79 -168 218 78 -125 -33 -34 -254 323 -71 -200 185 71 -111 -17 223 328 114 -50 -115 151 215 80
7769 80 42 -94 -164 39 8 -46 -53 19 -240 285 221 2 36 302 182 -69 -328 -106 -72 51 -62 -39 -77 -135 -120
7794 -120 54 -47 -39 134 -275 118 149 25 -30 1 64 -40 59 155 25 47 81 -125 -228 5 -154 283 -49
7817 -49 -207 217 202 -199 -64 27 -70 100 -128 -129 87 159 131 248 -68 66 -47 -62 -67 -11 92 15 194 304
7841 304 -103 83 4 -191 218 116 34 82 -45 21 -100 -77 -121 100 42 -88 93 87 -37 -194 265 -316 172
7864 172 132 -86 56 213 88 66 157 46 51 47 -52 -160 282 -41 -83 -47 144 -106 40 -179 -147 296 21 -96
7888 -96 -49 83 58 -113 -228 77 14 -33 -123 -14 -37 133 170 -50 -218 57 256 60 51 73 56 -92 -18 -52 -162
7913 -162 -184 45 -39 -183 -91 -82 104 27 -45 55 -6 -60 49 -7 -21 101 -278 -42 255 15 -110 -151 -196 -226 -160
7938 -160 204 121 -170 28 -11 13 252 -162 0 -46 -26 -34 -71 -190 315 -29 -75 -217 -9 71 195 -113 -66 111
7962 111 -198 -58 -226 -181 -120 102 -11 80 52 183 -36 -52 168 -17 -132 -61 88 83 -137 358 60 -24 51
7985 51 -241 -60 44 -255 -14 -185 -37 -122 94 -177 194 -40 -8 -99 91 225 75 4 1 125 -116 2
8007 2 -132 40 -159 35 174 -16 -5 -403 4 -23 -26 5 -87 -97 -11 1 152 300 -57 39 -56 89 60 195 -106
8032 -106 193 204 -78 104 -43 197 248 83 -56 -19 84 -9 8 242 -110 -30 -53 112 -22 92 129 -60 45
8055 45 -115 36 119 159 -112 451 -11 -92 -111 -75 -168 -5 -57 -232 -244 52 63 33 42 42 -20 -39 22 87 118 -103 -188
$$ [...]
8191F4
##END NTUPLES=NMR FID
##END=
