##TITLE=1H_41-2026-Bay
 200.13Hz, DMSO-d6.
 8 sc
 
 24.4.2026
##JCAMPDX= 6.0         $$ Bruker NMR JCAMP-DX V2.0
##DATA TYPE= NMR FID
##DATA CLASS= NTUPLES
##ORIGIN= UXNMR, Bruker Analytische Messtechnik GmbH
##OWNER= pz
$$ XWIN-NMR		Version 3.5
$$ Fri Apr 24 14:41:24 2026 Russian Standard Time (UT+4h)  she@DPX200
##.OBSERVE FREQUENCY= 200.131
##.OBSERVE NUCLEUS= ^1H
##.DELAY= (6, 6)
##.ACQUISITION MODE= SIMULTANEOUS
##.ACQUISITION SCHEME= undefined
##.AVERAGES= 8
##.DIGITISER RES= 18
##SPECTROMETER/DATA SYSTEM= spect
##.PULSE SEQUENCE= zg30
##.SOLVENT NAME= DMSO
##.SHIFT REFERENCE= (INTERNAL, DMSO, 0, 14.3821)
##AUDIT TRAIL= $$ (NUMBER, WHEN, WHO, WHERE, WHAT)
$$ ##TITLE= Audit trail, XWIN-NMR		Version 3.5
$$ ##JCAMPDX= 5.01
$$ ##ORIGIN= Bruker BioSpin GmbH
$$ ##OWNER= she
$$ F:/spectra/data/she/nmr/H-C/1/audita.txt
$$ ##AUDIT TRAIL=  $$ (NUMBER, WHEN, WHO, WHERE, WHAT)
(   1,<2026-04-24 14:38:13.93 +0400>,<she>,<DPX200>,
      <created by zg, POWCHK disabled, PULCHK disabled
       configuration hash MD5:
       00 E9 B6 7A A2 85 ED C7 34 08 36 98 17 FE 4E 26
       data hash MD5: 16K
       D9 BA 1E F1 6F 28 C2 CD FE A9 9F 9C AE DC DD 60>)
$$ ##END=
$$ 
$$ hash MD5
$$ E5 1C 9E 6B 4F B5 E5 86 E1 F0 C9 0D A3 94 42 FA
##$RELAX= 
##$RELAX= 
##$RELAX= 
##$RELAX= 
##$RELAX= 
##$RELAX= 
$$ Bruker specific parameters
$$ --------------------------
##$DU= <F:/spectra>
##$EXPNO= 1
##$NAME= <H-C>
##$PROCNO= 1
##$TYPE= <nmr>
##$USER= <she>
##$AMP= (0..31)
100 100 100 100 100 100 100 100 100 100 100 100 100 100 100 100 100 100 
100 100 100 100 100 100 100 100 100 100 100 100 100 100 
##$AQSEQ= 0
##$AQ_mod= 1
##$AUNM= <au_zg>
##$AUTOPOS= <>
##$BF1= 200.13
##$BF2= 200.13
##$BF3= 200.13
##$BF4= 200.13
##$BF5= 200.13
##$BF6= 200.13
##$BF7= 200.13
##$BF8= 200.13
##$BYTORDA= 1
##$CFDGTYP= 0
##$CFRGTYP= 5
##$CHEMSTR= <none>
##$CNST= (0..31)
1 1 145 1 1 1 1 1 1 1 1 1 1 1 1 1 1 1 1 1 1 1 1 1 1 1 1 1 1 1 1 1 
##$CPDPRG= <>
##$CPDPRG1= <>
##$CPDPRG2= <>
##$CPDPRG3= <>
##$CPDPRG4= <mlev>
##$CPDPRG5= <mlev>
##$CPDPRG6= <mlev>
##$CPDPRG7= <mlev>
##$CPDPRG8= <mlev>
##$CPDPRGB= <>
##$CPDPRGT= <>
##$D= (0..31)
0 0.7 0 0 0 0 0 0 0 0 0 0.03 0 0 0 0 0 0 0 0 0 0 0 0 0 0 0 0 0 0 0 0 
##$DATE= 1777027093
##$DBL= (0..7)
120 120 120 120 120 120 120 120 
##$DBP= (0..7)
150 150 150 150 150 150 150 150 
##$DBP07= 0
##$DBPNAM0= <>
##$DBPNAM1= <>
##$DBPNAM2= <>
##$DBPNAM3= <>
##$DBPNAM4= <>
##$DBPNAM5= <>
##$DBPNAM6= <>
##$DBPNAM7= <>
##$DBPOAL= (0..7)
0.5 0.5 0.5 0.5 0.5 0.5 0.5 0.5 
##$DBPOFFS= (0..7)
0 0 0 0 0 0 0 0 
##$DE= 6
##$DECBNUC= <off>
##$DECIM= 32
##$DECNUC= <off>
##$DECSTAT= 4
##$DIGMOD= 1
##$DIGTYP= 9
##$DL= (0..7)
0 120 120 120 120 120 120 120 
##$DP= (0..7)
150 150 150 150 150 150 150 150 
##$DP07= 0
##$DPNAME0= <>
##$DPNAME1= <>
##$DPNAME2= <>
##$DPNAME3= <>
##$DPNAME4= <>
##$DPNAME5= <>
##$DPNAME6= <>
##$DPNAME7= <>
##$DPOAL= (0..7)
0.5 0.5 0.5 0.5 0.5 0.5 0.5 0.5 
##$DPOFFS= (0..7)
0 0 0 0 0 0 0 0 
##$DQDMODE= 0
##$DR= 18
##$DS= 0
##$DSLIST= <SSSSSSSSSSSSSSS>
$$ [...]
##$SUBNAM0= <"">
##$SUBNAM1= <"">
##$SUBNAM2= <"">
##$SUBNAM3= <"">
##$SUBNAM4= <"">
##$SUBNAM5= <"">
##$SUBNAM6= <"">
##$SUBNAM7= <"">
##$SUBNAM8= <"">
##$SUBNAM9= <"">
##$SW= 18.0517599122864
##$SWIBOX= (0..15)
0 0 2 0 0 0 0 0 0 0 0 0 0 0 0 0 
##$SW_h= 3612.71676300578
##$TD= 16384
##$TD0= 1
##$TE= 0
##$TE2= 300
##$TE3= 300
##$TEG= 300
##$TL= (0..7)
0 120 120 120 120 120 120 120 
##$TP= (0..7)
150 150 150 150 150 150 150 150 
##$TP07= 0
##$TPNAME0= <>
##$TPNAME1= <>
##$TPNAME2= <>
##$TPNAME3= <>
##$TPNAME4= <>
##$TPNAME5= <>
##$TPNAME6= <>
##$TPNAME7= <>
##$TPOAL= (0..7)
0.5 0.5 0.5 0.5 0.5 0.5 0.5 0.5 
##$TPOFFS= (0..7)
0 0 0 0 0 0 0 0 
##$TUNHIN= 0
##$TUNHOUT= 0
##$TUNXOUT= 0
##$USERA1= <user>
##$USERA2= <user>
##$USERA3= <user>
##$USERA4= <user>
##$USERA5= <user>
##$V9= 5
##$VALIST= <valist>
##$VCLIST= <CCCCCCCCCCCCCCC>
##$VD= 0
##$VDLIST= <DDDDDDDDDDDDDDD>
##$VPLIST= <PPPPPPPPPPPPPPP>
##$VTLIST= <TTTTTTTTTTTTTTT>
##$WBST= 1024
##$WBSW= 4
##$XGAIN= (0..3)
0 0 0 0 
##$XL= 0
##$YL= 0
##$YMAX_a= 332900
##$YMIN_a= -430964
##$ZGOPTNS= <>
##$ZL1= 120
##$ZL2= 120
##$ZL3= 120
##$ZL4= 120
##$ABSF1= 10
##$ABSF2= 0
##$ABSG= 5
##$ABSL= 3
##$ALPHA= 0
##$AQORDER= 0
##$ASSFAC= 0
##$ASSFACI= 0
##$ASSFACX= 0
##$ASSWID= 0
##$AUNMP= <proc_1d>
##$AZFE= 0.1
##$AZFW= 0.1
##$BCFW= 1
##$BC_mod= 2
##$BYTORDP= 1
##$COROFFS= 0
##$CY= -3
##$DATMOD= 1
##$DC= 2
##$DFILT= <>
##$DTYPP= 0
##$F1P= 0
##$F2P= 0
##$FCOR= 0.5
##$FTSIZE= 0
##$FT_mod= 4
##$GAMMA= 1
##$GB= 0.15
##$INTBC= 1
##$INTSCL= 1
##$ISEN= 128
##$LB= 0.25
##$LEV0= 0
##$LPBIN= 0
##$MAXI= 10000
##$MC2= 0
##$MEAN= 0
##$ME_mod= 0
##$MI= 1.114404
##$NCOEF= 0
##$NC_proc= 0
##$NLEV= 6
##$NOISF1= 3.799351
##$NOISF2= 2.8
##$NSP= 1
##$NTH_PI= 0
##$NZP= 0
##$OFFSET= 14.38212
##$PC= 1
##$PHC0= -4061.32
##$PHC1= 7.79229
##$PH_mod= 1
##$PKNL= yes
##$PPARMOD= 0
##$PSCAL= 0
##$PSIGN= 0
##$REVERSE= no
##$SF= 200.129724274929
##$SI= 16384
##$SIGF1= 3
##$SIGF2= 2
##$SINO= 400
##$SIOLD= 16384
##$SREGLST= <1H.CDCl3>
##$SSB= 0
##$STSI= 0
##$STSR= 0
##$SW_p= 3205.1282051282
##$SYMM= 0
##$S_DEV= 0
##$TDeff= 0
##$TDoff= 0
##$TI= <>
##$TILT= no
##$TM1= 0
##$TM2= 0
##$TOPLEV= 0
##$USERP1= <user>
##$USERP2= <user>
##$USERP3= <user>
##$USERP4= <user>
##$USERP5= <user>
##$WDW= 1
##$XDIM= 8192
##$YMAX_p= 0
##$YMIN_p= 0
$$ End of Bruker specific parameters
$$ ---------------------------------
##NTUPLES= NMR FID
##VAR_NAME=  TIME,          FID/REAL,        FID/IMAG
##SYMBOL=    X,             R,               I
##VAR_TYPE=  INDEPENDENT,   DEPENDENT,       DEPENDENT
##VAR_FORM=  AFFN,          ASDF,            ASDF
##VAR_DIM=   8192,          8192,            8192
##UNITS=     SECONDS,       ARBITRARY UNITS, ARBITRARY UNITS
##FACTOR=    0.0002768,     1,               1
##FIRST=     0,             0,               0
##LAST=      2.2672688,     0,               0
##MIN=       0,             -430964,         0
##MAX=       2.2672688,     332900,          0
$$ Real data points
##PAGE= N=1
##DATA TABLE= (X++(R..R)), XYDATA
0@%%%%%%%%%%%%%%%lMrJ6j6J6j7J8k2K9l3L5m1M8n4O0o8P6q5J00j12J23j36J51
39H0j66J84k05K25k48K74l02L33l67M05m44M86n37N95o59P31q12R06j019J152
59F12j314J518j777K116k582L255m295O068r579J8724p9370j37311L42508j635
73A36938p8658J83898j22129k1966K34817o0859o5739O4355l8762K7703L6318
84B95916m0905l6920m1330N9521k2495j35761J00694K816j94299Q0271K8508j10382
96a4366Q1862q8408j17801J64052k4004q7805N1879j04423K9965J48012j02574
107f3611m7457J0721k3266J50987l4269j72674J14426K8700o5098R9868o9369
118g1042q1221J11597k1935l1242M2644n5746O919L0710k9792K8095l191J720
$$ plain form
0 0 0 0 0 0 0 0 0 0 0 0 0 0 0 0 0 -3 1 -8 8 -8 8 -9 9 -13 16 -17 18 -23 25 -29 31 -37 39 -46 54 -58 65 -71 80
39 80 -86 98 -107 118 -130 144 -158 175 -192 213 -231 255 -282 313 -346 385 -427 479 -540 612
59 612 -702 816 -961 1155 -1427 1828 -2467 3601 -5978 12746 -66624 -203935 138573 136938
73 136938 58280 242178 120049 98083 332900 272041 206302 270657 231895 259598 295916
84 295916 255011 218091 176761 236282 213787 78026 178720 181536 -12763 67508 96016 -14366
96 -14366 67496 -20912 -138713 25339 1335 -86470 -34591 -139014 -109049 38963 -63611
107 -63611 -111068 -100347 -123613 27374 -6895 -179569 -65143 -36443 -101541 -1673 -71042
118 -71042 -152263 -40666 -62601 -93843 -51199 -106945 -100026 -69316 -99108 -71013 -74204 -72484
130g2484M484o8928J08186Q7110j62879L1885J03074o7710J05923K3798j69206
141g6747J11559J04631p9248N9970l5502q5990J49029L9068j11635l35J7279K2554
153A14633P542m6075Q965k0059k8236M6716m3468k9772M6486p3804j6265O1526
165B8189o2711J3757K7148j16370L8755R8238o5429l3198j3029K186Q8628k4137
177a7973p1038K6827k944L6782M7040q0994j4149N3132j638L4553k4695o1105
189g6202P4766K3131n7612K9242J2422j2833J3675k1744J9635L2172l2052K623
201G223K496q455N4181o545n2220J5220R176L2206K5854q6760j5122Q5034q301
214E3987l0993p373k6258L3480K3228l9082o751m180r79K9895k3867k9495K2991
$$ plain form
130 -72484 -68000 -136928 -28742 58368 -104511 -72626 30448 -37262 68661 92459 -76747
141 -76747 34812 139443 60195 120165 84663 -1327 147702 186770 75135 74800 92079 114633
153 114633 122175 76100 85065 65006 36770 83486 40018 10246 56732 -17072 -33337 28189
165 28189 -34522 -20765 6383 -109987 -71232 27006 -38423 -71621 -84650 -82464 6164 -17973
177 -17973 -89011 -62184 -65128 -28346 18694 -62300 -76449 -23317 -24955 9598 -15097 -76202
189 -76202 -1436 21695 -35917 -6675 5747 -7086 6589 -15155 4480 36652 4600 7223
201 7223 9719 1264 55445 48900 -3320 11900 21076 53282 79136 -7624 -22746 62288 53987
214 53987 22994 15621 -10637 22843 46071 6989 238 -3942 -4921 24974 1107 -28388 -5397
227e397P097o869j6801j3498M2333M038n3002J0160L1999n46J238k6727q467L9471
241E029O361j3038j1970k0733L0748L4337l4058k9633J3313K9001J0547l5600
253a5696j6188L5848P002j6979l442k227J2481J0919j5403p790Q428J2565J5272
266B4790k1219k4182L1278L0939j8336k8993J896L2822J4565l0364j7687J5199
278A0708J3272J133j2756j7702M407J6112J199k1025j7129J6478K0812k1532k7204
291c3227J1688K4941n650k8784p609K4713J3305j4221j6390n57J6948J7730o346
304c459k2849k442K9268J9290k0892k4429J6863L0554m080k4027j422K1660R745
317B3780j2902r185O695J1696M235j0509j2232O571J9740J198k6225j3827K5162
$$ plain form
227 -5397 1700 -5169 -21970 -35468 6865 10903 -42099 -31939 60 -486 752 -25975 -34442 5029
241 5029 11390 -1648 -13618 -34351 -3603 30734 -3324 -32957 -19644 9357 19904 -15696
253 -15696 -31884 3964 10966 -6013 -9455 -11682 799 11718 -3685 -11475 -3047 9518 24790
266 24790 3571 -20611 10667 41606 23270 -5723 -3827 28995 43560 13196 -4491 10708
278 10708 23980 25113 12357 -5345 -938 15174 16373 -4652 -21781 -5303 15509 -6023 -33227
291 -33227 -21539 3402 -2248 -31032 -38641 -13928 -623 -14844 -31234 -31791 -14843 2887 -3459
304 -3459 -26308 -28750 518 19808 -1084 -25513 -8650 21904 17824 -6203 -7625 14035 23780
317 23780 10878 1693 8388 20084 24319 13810 1578 8149 27889 29087 2862 -10965 14197
330A4197K1001k1138k8594O270K7083M198k4032j5050J1374J3913O2j3145j5818
343a9679O702J9649l177k0854o627J7302J5310j7965k0594J7493K1110r588j7147
356a8065k744J8450J3998j4434j5291M615J2771J3904q981k6659O037K8384L332
369A5317j9102j8700J4083K8823j1816k3444P116J1173O754m109j6514P527J6251
382A3359l586l099q453K706K7764n044k6126O955J7656J1648r023l0480J2546
395F823L0008j2622j4834p197l023K4023m084k9676J884J850P179O138l4410o475
409c4416K9567q254j5837n899m521K6467l683l1395J5843J1880j419J0807j9743
422c0603N9L5536m970n355r79p816L5613R576l7543J1261J8569R98J1873k7189
$$ plain form
330 14197 35198 14060 -14534 -8264 18819 23017 -1015 -16065 -4691 9222 9284 -3861 -19679
343 -19679 -12977 6672 3495 -17359 -23986 -6684 8626 -9339 -29933 -12440 8670 -918 -18065
356 -18065 -20809 -2359 11639 -2795 -18086 -13471 -700 13204 4223 -22436 -16399 11985 15317
369 15317 -3785 -22485 -8402 20421 8605 -14839 -7723 3450 10204 6095 -10419 -2892 13359
382 13359 9773 6674 -1779 927 28691 23647 -2479 4476 22132 33780 24757 -5723 6823
395 6823 36831 24209 9375 2178 -845 23178 19094 -10582 -8698 -6848 331 6469 -27941 -34416
409 -34416 -4849 -13103 -28940 -34839 -39360 -12893 -16576 -47971 -32128 -20248 -21667 -10860 -30603
422 -30603 -30544 4992 22 -5333 -6312 -14128 21485 31061 -6482 4779 23348 24346 36219 9030
436I030n820M0149j5033j6313J0204j9671J8955J5910m1197r04J8973q870J0425
449A5838k3563k0071L8709j345k1627J800r746K2095J2625l6497J2090J1680j3905
462a1917K8629k0144k4790M8029q974k3341K3688k0657J0783L2666n0450l455
474a9933M2008j9189J004p113k6131L8604P659l2436O735j4257J4299L2545l9451
487a5656j0519K4249r096K2406p521l7909L9918P342k6484K4078j5217k054L2601
500B6138l5250L571L4532l2295J3908N770m1145M9904J3083n9428K4145K978j3357
513g446M8285l8910m3779N4751K225j3640P438l5371J1364L2667j3937n795j9607
526b1755M905L6128k8959m583K2637l6645K4339K0575n3835M1373J8873o6083
$$ plain form
436 9030 3210 43359 28326 12013 22217 2546 21501 37411 -3786 -4690 14283 5413 15838
449 15838 -7725 -27796 10913 9568 -12059 -10259 -20005 2090 14715 -21782 -9692 1988 -11917
462 -11917 16712 -3432 -28222 19807 10833 -12508 11180 -9477 1306 33972 -16478 -19933
474 -19933 22075 2886 3890 -3223 -29354 9250 16909 -15527 -8792 -23049 -8750 23795 -15656
487 -15656 -26175 -1926 -11022 11384 3863 -34046 5872 13214 -13270 10808 -4409 -6463 26138
500 26138 -9112 -5541 28991 -3304 10604 16374 -24771 25133 38216 -21212 2933 5911 -7446
513 -7446 40839 1929 -41850 12901 15126 1486 8924 -26447 -15083 17584 3647 -2148 -21755
526 -21755 -16850 19278 -9681 -14264 8373 -28272 -3933 16642 -37193 4180 23053 -43030
538d3030L9081K2580m1757M1766j5523m7362O0230R500l1640J2067k4837J5490
550c435M4877k9679j6880J283J658M3778j6565l9357K7141q947P703K7096m7557
563h884j909L4170k9632J2521Q296l5664K5652n318k6883M1324j4207k7141K4733
576b942k8236J5422M5932n8944q336L9182k2555L0652R578o5334K9192M3149k2171
589D589Q469j7752j4251M1679M048j4293p567j1918K9068J477k5907K4060j9237
602B465j5516M3141k9826j4280M3036m3873j4539M9463k8709k125J8139m7395
614d0019K0429M2512l1319q927j746l537M0443m772k8808N522l090L0039J5032
627C1759m5242O290K0767j1036K4829j5250l0970L4886n73j8736K0575j6695p131
$$ plain form
538 -43030 -3949 18631 -23126 18640 3117 -44245 15985 25485 -6155 5912 -18925 -3435
550 -3435 41442 11763 -5117 -3834 -2176 41602 25037 -14320 12821 3874 11577 38673 -8884
563 -8884 -10793 23377 -6255 6266 14562 -21102 4550 -768 -27651 13673 -534 -27675 -2942
576 -2942 -31178 -15756 30176 -28768 -37104 2078 -20477 10175 19753 -45581 -16389 26760 4589
589 4589 13058 -4694 -18945 22734 26782 12489 4922 -6996 22072 23549 -2358 21702 2465
602 2465 -13051 30090 264 -14016 29020 -14853 -29392 20071 -8638 -10763 7376 -40019
614 -40019 -19590 22922 -8397 -17324 -19070 -22607 17836 13064 -15744 -10222 -13312 16727 31759
627 31759 -13483 -7193 13574 2538 27367 12117 -18853 16033 15460 -3276 17299 604 -6527
640f527J8621k2416P497J5046k5663L092l44r182L2360j4887l2549K5388J671
653g893N503J4661l8452k02M0363o951m823l520j7927K9585J5465k3209R47l877
667c30O181K1492j8704q163J4849r782O886L039j9838J5862J873k3616J4633M454
681H836r970Q191j8355l383K6307p276j2966k231o178K1850R891k7297l265R647
695f199M319J5825k0231j5491K3113L255k918j23j5775R758J6235j4681n25K680
709g58l601R558o392p688J2386k060p608L721m442R199O842j6384j898J1135M128
724F138K618j2080q270J7093Q841q228p042q526J3926J5416j5684r486O975K435
738D126Q980m794j6364P475R945n861l100l511K322N969n210p042L462M849J565
$$ plain form
640 -6527 12094 -10322 -2825 12221 -13442 -10350 -10694 -19876 12484 -2403 -34952 -9564 -7893
653 -7893 -2390 12271 -26181 -26383 13980 7029 2206 -1314 -19241 10344 25809 2600 3547 -330
667 -330 5851 27343 8639 476 15325 5543 12429 15468 -4370 11492 13365 -10251 4382 8836
681 8836 -1134 7057 -11298 -14681 11626 4350 -8616 -10847 -17025 4825 14716 -12581 -15846 -6199
695 -6199 -1880 13945 -6286 -21777 1336 4591 1673 1550 -14225 -4467 11768 -2913 -3438 -758
709 -758 -4359 5199 -1193 -8881 3505 1445 -6163 -2442 -6884 2315 9157 -7227 -9125 2010 6138
724 6138 8756 -3324 -11594 5499 14340 6112 -930 -9456 4470 19886 4202 -5284 1691 4126
738 4126 13106 8312 -8052 -577 9368 3507 407 -3104 -782 5187 -23 -7065 -3603 1246 2811
753B811p670n513J1094L595o689m658m082R079J1692j2092j0197Q097Q619R06
767D992o153r043M517J3179O1j0734m048P240Q279n161o402M76M123N711l621
782C416r874N849Q249n197l937K1K577O454l723r103K443R244op536n078M614
798a587O524K40p707o264P903Q362n136q357Q58O279M525k749r286J039J0432
813E076p67o484k615M162O014k499o160j360P595L749o184p084N574P796j646
828E167o158n393L878R231k361j0142R20O719L611l292q191J951P920K451o774
843d63n253M105P439k694o888J83L619N635k418j0420L053J0737k615n241m281
858e502K008R338j078j0617k02N218M629j260q602N61P461J460m780m084J78J0121
$$ plain form
753 2811 -4859 -10372 722 4317 -2372 -7030 -11112 -2033 9659 -2433 -12630 -4533 4086 4992
767 4992 -1161 -10204 -5687 7492 7553 -3181 -7229 11 8290 3129 -3273 -2797 1326 7037 3416
782 3416 -6458 -609 7640 2443 -1494 -1473 1104 7558 3835 -5268 -2825 6419 6413 -1123 -6201 -1587
798 -1587 4937 5177 -2530 -8794 -891 7471 2335 -6022 -5164 1115 5640 2891 -6395 -5356 5076
813 5076 4309 -2175 -4790 -628 5386 2887 -3273 -4633 2962 6711 527 -6557 -983 6813 5167
828 5167 -991 -6384 -2506 6725 4364 -5778 -4858 1861 5472 2180 -6011 -4060 3860 6311 -463
843 -463 -5716 -1611 5828 3134 -3754 -3571 48 5683 3265 -7155 -4102 6635 4020 -1221 -5502
858 -5502 -3494 5844 4766 -5851 -6053 -835 3794 2534 -6068 -5507 1954 3414 -1366 -5450 -5272 4849
874D849o08r537K205L321K772J587r195r62J1113j123n746n74j569Q891K630j1899
890c845K99N703K487J160r367k101J1305k87m944k879k385R254L444j1064N63
905b657M281P70N054q305m964J1706m02o451J504m570P202N351j3839N86P787
920C053l056M032o503p951J2681J857r468J186l938N419Q907j4073k153Q253k170
935c924N662m876q391J3397J340o964L999n075M336J1167j3664j899J1655m817
949A946M515j029j2190J4207O116j3200L447j821L64J2101j1719p679J0614k484
963C188K081j300j2455R687N750j0351L282m529p46J3634j2328o158J2835o598
977d008K135L868j5233J0746R797j5914M927J858n390J4506p445j2344J4739l00
$$ plain form
874 4849 4241 -5296 -3091 230 3002 4589 -4606 -5568 5545 4422 -1324 -1898 -3467 5424 8054 -3845
890 -3845 -3546 2157 4644 5804 -3563 -5664 5641 5354 410 -2469 -4854 4400 7844 -3220 -2657
905 -2657 1624 2394 7448 -857 -5821 5885 5483 -968 536 -4034 3168 8519 -5320 -4734 3053
920 3053 -3 4029 -2474 -10425 2256 4113 -5355 -4169 -8107 -2688 6219 -7854 -10007 -1754 -3924
935 -3924 1738 -3138 -11529 1868 3208 -3756 243 -4832 -496 10671 -2993 -4892 6763 1946
949 1946 6461 5432 -6758 7449 13565 365 3812 1991 2355 14456 2737 -4942 5672 3188
963 3188 5269 3969 -8486 1201 6951 -3400 -118 -4647 -5393 8241 -4087 -10245 2590 -4008
977 -4008 -1873 1995 -13238 -2492 7305 -8609 -3682 -1824 -7214 7292 -153 -12497 2242 1942
991A942k013L461j2678O846J1780j1271N3J09l719J4093o594j0857J1454l190
1005e84J286P274j6245O120J2747j4188L132L992r058J4006l458j5003J5773N23
1019F317q843J0339j1549J892J6300j3373l675P053o311J0157N41j7626Q808M323
1033D353k435L381j1795O86J4534r924j267L131j0039J2162K138j7030J2131O44
1047F70q742J1783r615n519J8325r690p751J3695p354K456O444j5863P805R404
1061F048p791K302m527k706J5978o188q052N834o093J0745N902j8048N297P663
1075F364o049P905m865j0823J5858k730p949Q836p334J176Q766j3357M660Q085
1089H543j1376M647J393r025J4391l128j4685J0061Q83l24O094j5037j172J4428
$$ plain form
991 1942 -71 3390 -9288 -2442 9338 -1933 -1880 -1771 -5490 8603 2009 -8848 2606 -584
1005 -584 702 7976 -8269 -2149 10598 -3590 -458 3534 -5524 8482 5024 -9979 5794 6317
1019 6317 -2526 7813 -3736 -1844 14456 1083 -2592 4461 -1850 8307 8848 -8778 30 4353
1033 4353 1918 5299 -6496 -5810 8724 -1200 -2467 664 -9375 2787 4925 -12105 26 670
1047 670 -8072 3711 -5904 -11423 6902 -2788 -10539 3156 -4198 -1742 4702 -11161 -3356 6048
1061 6048 -1743 559 -3968 -6674 9304 3116 -4936 898 -5195 5550 11452 -6596 -1299 6364
1075 6364 315 8220 3355 -7468 8390 5660 -2289 6547 -787 389 9155 -4202 458 8543
1089 8543 -2833 1814 3207 -5818 8573 5445 -9240 821 1704 1380 7474 -7563 -8735 5693
1103E693m927j31l931p640J2920K596r663J921m777K923J1582j3266r9P526o542
1118e815N031L807j2012P811L765j1731R765J170n347O955p479j713J3415n377
1132B245k469J79n318J1809L984j3617J844L975J031P702q422q685R810J627q39
1147D856J047r299L173P347o392K329k207l239Q091m772l089O754m788k594N120
1162B337o443N832M704j3458K246P499k831K743m371q392J0478M490o039j263
1176b468n489M245Q556o618m226P22K43P222k18r087L832J926n27L409l849o42
1192b969N103l971l68M401j603J550k085l194Q269J041n692J731l511L400Q356
1207A0458p137p348O202K942M60P94r551R17P771n24m489k134P9L820m20k282
$$ plain form
1103 5693 766 635 -3296 -10936 1984 4580 -5083 -3162 -7939 -5016 6566 -6700 -6799 727 -5815
1118 -5815 -784 3023 -8989 -1178 2587 -9144 621 1791 -3556 3399 -4080 -5793 7622 2245
1132 2245 -224 -45 -5363 6446 10430 -3187 -1343 2632 3663 11365 2943 -5742 4068 5695 4856
1147 4856 5903 -3396 -223 7124 732 3061 854 -2385 5706 934 -2155 4599 -189 -2783 2337
1162 2337 -4106 1726 6430 -7028 -4782 2717 -114 2629 -1742 -10134 344 4834 -1205 -2468
1176 -2468 -7957 -3712 4844 -1774 -6000 -5278 -5035 2187 1969 -7118 -3286 -1360 -1887 1522 -2327 -2969
1192 -2969 2134 -1837 -2205 2196 593 2143 58 -3136 5133 6174 482 2213 -1298 2102 10458
1207 10458 3321 -4027 2175 5117 5577 6371 -3180 -2263 5508 4984 495 -1639 -1560 2260 1840 -442
1223d42k34j469L150N05n110K965K330l965P76N87r86M621k200n858M099L551
1239B320k42k432m222K351N275p44l347l797J616O943k247n475R19J044K824J578
1255B364n417j303N287K45k520m81K54K302M21k432l72J915K416k282l082K649
1271c6L619j708j358j635J19N612p56o511O16M000N31n89l425j456M240K109l775
1288d03k307R13L605p50k443o02J27L201k4m256J42M910m92j369r31j62K479J866
1306C504l592n92L024J323q45l408J30K377J809j090k882p98M108J37m578J055
1322c18P92R15q17k575j908L534J418m371j92M90J851J234j083l543J917J917
1338g39O62l993M27L632L2j278q31q96L142L093m698k96K995Q5N21j282j744K983
$$ plain form
1223 -442 -676 -2145 1005 1510 -3600 -635 1695 -2270 -1494 -907 -1893 2728 528 -5330 -1231 2320
1239 2320 2078 -354 -4576 -2225 3050 2306 -1041 -4838 -3222 3721 1474 -4001 -3082 -2038 786 2364
1255 2364 -3053 -4356 931 1176 -1344 -1825 -1571 731 1152 -1280 -1652 263 2679 397 -2685 -36
1271 -36 3583 1875 517 -1118 -999 4613 3857 -2654 -2038 1962 2493 1904 -1521 -2977 1263 3372 -403
1288 -403 -2710 -1797 1808 1058 -1385 -1987 -1860 1341 1317 -2939 -2797 2113 1621 252 -679 -841 1638 3504
1306 3504 -88 -680 2344 3667 2822 -586 -456 1921 3730 2640 -242 -1040 3068 3205 -1373 -318
1322 -318 474 1389 572 -2003 -3911 -377 1041 -3330 -3522 -3032 -1181 53 -1030 -4573 -2656 -739
1338 -739 -77 -4070 -3643 -11 21 -1257 -2088 -2984 158 3251 -1447 -1743 1252 1337 1858 576 -1168 1815
1356A815K121k523j763l66K997P35k728j301J446K000k33k943k233M415J603l118
1372g6J47j331J230M089m153k103J606K053R92j746k842L191J441k686l53j061
1388a602L040K234m370p79K231p05J344j413m120L855K562k679j438m8K58M268
1404B638l109k958J285J828J785j807l953M081J758j980mj670q2M579k725k877
1420c211L842o62O66M65l748K232M020l643j229J208k38L466k351l172K820J263
1436A728n8K57l749K084M126m060K28k51q49N087j169n926M123k66J30J357m569
1453a777O45M640k943j542J646l223M538n34n731K419J810r47J704l760j56N701
1469B490k996j535J320j357L485O47m939J940J818q05K460m417k93O151l468j094
$$ plain form
1356 1815 3936 1413 -350 -716 2281 3016 288 -1013 433 2433 2200 -743 -2976 1439 3042 -76
1372 -76 71 -1260 -30 4059 -94 -2197 -591 1462 2454 708 -2134 1057 2498 -188 -541 -1602
1388 -1602 1438 3672 -698 -1477 754 49 1393 -20 -4140 -285 2277 -402 -1840 -1888 -1630 2638
1404 2638 -471 -3429 -2144 -316 1469 -338 -4291 -210 1548 -432 -436 -2106 -2188 2391 -334 -3211
1420 -3211 631 -31 635 1100 -2648 -416 3604 -39 -1268 -60 -298 3168 817 -2355 465 1728
1436 1728 1670 1927 -1822 262 4388 328 556 305 -544 4543 3374 -2552 1571 1305 1435 2792 -1777
1453 -1777 -1132 3508 565 -977 669 -2554 1984 1450 -4281 -1862 -52 -999 705 -3055 -3211 2490
1469 2490 -506 -2041 -721 -2078 1407 2054 -2885 -945 873 68 2528 -1889 -2182 3969 501 -593
1485e93J623k857K943K087o685K060K972k440J897k376l067O376j867k986K155
1500g58j679J845K697n496K388K418j318J969j970j825N261j121l320L700l009
1515b18K493L438o625M99M661l589K697j507l714M610j42n274L207j544l54L967
1531B605n909P1L813k948Q21o04k599M321L3l528K795j831J506M048n141k85M526
1548A694k881K073j84m453M930K408l852J927j447j13M403l812j574L458j863
1563G14K60Q85m034K743J938m264J512j52q56K727j736l224N366p48j908J933
1579A156l764L449K393l618m11J416j005M098k143k979L358n94n99J647m960Q67
1595a689M328k419k034J879l105L397K63n034L980O01k776K760l304J368L444
$$ plain form
1485 -593 1030 -1827 1116 3203 -3482 -1422 1550 -890 1007 -1369 -4436 1940 73 -2913 -758
1500 -758 -2437 -592 2105 -3391 -1003 1415 97 2066 96 -1729 3532 2411 -909 2791 -218
1515 -218 2275 5713 -912 -413 4248 659 3356 1849 -1865 2745 2603 -2671 536 -1008 -1362 2605
1531 2605 -3304 -3233 580 -2368 -1547 -2151 -4750 -429 -396 -3924 -1129 -2960 -1454 2594 -2547 -2832 1694
1548 1694 -1187 886 702 -3751 1179 3587 -265 1662 215 102 4505 693 -881 2577 714
1563 714 974 1859 -2175 568 2506 -1758 -246 -398 -1254 1473 -263 -3487 1879 1131 -777 1156
1579 1156 -2608 841 3234 -384 -795 621 -384 3714 1571 -1408 1950 1356 757 2404 -2556 -1689
1595 -1689 2639 220 -1814 65 -3040 357 620 -4414 -434 167 -2609 151 -3153 -1785 1659
1610A659l683k06K462m50J123j094m829M205K380j776O46k963Q63N054k691j279
1626e79J328j855L802p71l346K116J31m34J998l350l3M259k806j524K919j576
1642B79n31K026l164K066J602k583m02N77o44L467j893j844O91O98J709m29m139
1659b514J325K252j447J113j872j902M160l33k104R60j479J123J724k785M21K312
1675I54k086O38k47n79K242r04k799K362O00j97O56k594N69L107l51q35j598n28
1693a590L444L45k908p5O86J395J256k921k09J408k87O94m30j780J541R13j573
1710i1P58Nm92P38j903J2K813n97k019J51Q1J595M26k709l36J281P61L65j781
1729i42j393J932J534j010j077j291K112J463k092K8L50k3J102o30r80J122J82
$$ plain form
1610 1659 -2024 -2230 232 -218 905 -189 -5018 -813 1567 -209 437 -2526 -1663 3391 700 -579
1626 -579 749 -1106 2696 1925 -1421 695 826 392 2390 -960 -993 3266 460 -1064 1855 279
1642 279 -252 1774 -1390 676 2278 -305 -707 -130 -774 2693 800 -1044 -353 345 2054 1625 -2514
1659 -2514 -1189 1063 -384 729 -1143 -3045 1115 782 -1322 -362 -1841 -718 1006 -1779 -1358 954
1675 954 -1132 -494 -741 -1320 922 18 -2781 -419 181 -16 640 -1954 -1385 1722 1371 536 -1062 -1590
1693 -1590 1854 2199 -709 -784 -98 1297 2553 -368 -577 831 544 1238 808 -972 569 1482 -91
1710 -91 667 672 180 918 -985 -973 1840 1243 -776 -625 -544 1051 1477 -1232 -1568 -287 474 839 -942
1729 -942 -2335 -403 1131 121 -956 -2247 -135 1328 -764 -736 -386 -409 693 63 -917 205 387
1746C87n22N68r81J217P46j689l13J318O55K86j958o62K276P67j471r86k33J361
1764G66J041j617j042R02L53J029j240j824J306J106o57r62n42R31J001j610o72
1781a731Q32K41L02l22r98J258P00r20m4n84R96J563j254j165P79J151L53j098
1799E9r60R13J282p60r26J9P91O34k32j825J012l24J209p34j118J360J440j729
1817A11m25m36N03K212j572m19O79O28L26k00j504J100Q18j37p06r41L01J912
1835B250j306j759R30N40j90p21j162M20P01o82j122l94m9J509m79j225K41O28
1853a870J085k97j786J254J798o33M9lK3J960j23j006Q63Q0P49P41j162M5J313
1872C080q58l63r09N42Q06n39j912L37J031m68r95j447M63J321j080p38P78j185
$$ plain form
1746 387 -135 433 -548 669 1415 -274 -587 731 1386 1672 -286 -948 1328 2095 624 -362 -595 766
1764 766 1807 190 -852 50 403 1432 192 -1632 -326 780 123 -839 -1381 -450 551 -1059 -1731
1781 -1731 -899 -658 -356 -678 -1676 -418 282 -638 -682 -1266 -270 1293 39 -1126 -347 804 1157 59
1799 59 -901 12 1294 534 -392 -373 418 1052 820 -1005 7 -317 892 158 -960 400 1840 111
1817 111 -314 -750 -247 1965 393 -26 653 1281 1607 1407 -97 1003 1821 1684 978 37 338 2250
1835 2250 944 -815 115 655 465 -256 -1418 -998 -297 -979 -2101 -2495 -2544 -1035 -1514 -2739 -2498 -1870
1853 -1870 -785 -1082 -2868 -1614 184 -449 -400 -403 -380 1580 1457 451 1314 1394 2143 2884 1722 1767 3080
1872 3080 2222 1859 950 1492 2298 1759 -153 184 1215 747 -248 -1695 -1232 89 -991 -1729 -951 -2136
1890b136J927J15j455k46J071M26R01j036q13K253j29o46j41m77J923P2j106P40
1908A243m24l40N79j243l16J719q24r38n01j80J606m79k000J32J740k58L08j413
1926a589j78J951k89l81k15p61J747J094j857L38J346j03P68p34j116J726o88
1943A059q43J011m37p9M29j439o7R86l80N09j202j189K179M32j809J07o63J320
1961g6Q99k403J5J384n79Q17p7j716J773Q05r99K39q00L72J664j516n88J540q18
1980f4N04m04j131J488J81j226N36k27o0J726j668r36J603p1P35n37j719J479
1998B09J299j502j41K61j70J431r39p31R27n52M67N61j960Q91J369j795L63q1
2016i3O7J264j647r14J916l98o60O46j156M38J428j461K47J05p79K176r58j704
$$ plain form
1890 -2136 -209 -94 -1549 -1795 -724 -298 603 -433 -1246 1007 878 232 91 -386 1537 1609 503 1243
1908 1243 819 479 1058 -185 -501 1218 394 -544 -1045 -1225 381 -98 -2098 -1966 -226 -484 -176 -1589
1926 -1589 -1767 184 -105 -486 -701 -1462 285 1379 -478 -140 1206 1103 1871 1137 21 1747 1059
1943 1059 216 1227 790 711 1140 -299 -366 620 240 749 -453 -1642 537 969 -840 -733 -1396 -76
1961 -76 823 -1580 -1565 -181 -760 57 -20 -1736 37 842 -157 82 -718 -346 1318 -198 -786 754 -64
1980 -64 440 36 -1095 393 574 -652 -116 -343 -403 1323 -345 -1281 322 251 986 449 -1270 209
1998 209 1508 6 -135 126 -44 1387 448 -283 644 92 559 1120 -840 51 1420 -375 -12 -93
2016 -93 -26 1238 -409 -1323 593 195 -465 181 -975 -537 891 -570 -323 -218 -997 1179 221 -1483
2034a483J383N16l57K70j538P52J324j442K68m7k92J086k24j306J089M11l95L49
2052C64j435M18K200j257p87J048o63J687j048j238J464M00q05O97r55o90K310
2069A710j248m44N21j146J525m40j120P02k40p00P86m07n46J433o91r59P10l3
2087e87l34J019j397j7Q96K57O96j483j47K971j053j014K6R27L87K1j992O48J053
2106H77k06N55r34q04J512k2j441J165q24O88O19j330j187K517o32j79j015K01
2124d40O29K82n77J01l10P07J80n76j319K116r99m10M44j045K411l03j733P68
2142g4o17O43R2o70K54M36k43O32n17p75N17J666j551n4l46J137Q61j501j091
2161a201J483J096p36n45Q14J180j926l6K97l80K38Q57p45j099O13P67m06l27
$$ plain form
2034 -1483 -100 416 59 329 -1209 -457 867 -575 -307 -354 -646 440 216 -1090 -1 410 15 364
2052 364 -1071 -653 1547 290 -497 551 -112 1575 527 -711 753 1153 348 1045 90 -600 1710
2069 1710 462 18 539 -607 918 478 -642 60 -180 -880 -94 -501 -1047 386 -305 -1264 -554 -587
2087 -587 -921 98 -1299 -1316 -420 -163 533 -950 -1097 1874 821 -193 -167 760 1147 1168 -824 -176 877
2106 877 671 1226 292 -512 1000 978 -463 702 -122 566 1185 -145 -1332 1185 553 374 -641 -440
2124 -440 189 471 -106 -5 -315 392 572 -4 -1323 793 -206 -616 -172 -1217 1194 891 -842 -74
2142 -74 -691 -48 44 -626 -372 64 -179 453 -64 -839 -322 1344 -207 -261 -607 530 1391 -110 -1201
2161 -1201 282 1378 642 97 911 2091 165 129 426 46 284 1141 396 -703 -90 677 271 -56
2179e6j259P86J582j056j110J748q27N26M79r53p38J438j519O03k78j17R35l84
2197b00j026Q33L35L54r96j32O88O38n10m19N0J27J019o79l79K12m64J381q65
2216c3n45M70M69k81J21K90l83P22k98m30N74k63J88J66o71J1Q15p63m2k68J57
2237FO27m01n34k67L64J44m67o18N42O37j1o34Qj62R57k79q13N17J34M77K1p46
2259d98L28O48m21ll82J81N59j69l56m4L91j01N02j286Q05P68n92m27K25j159
2279a031J351j49j197N33N21m87J192j242j35J139K47n42o01J69O46M19j396j40
2297g03Q94P22r93j20l43O41P3q6l20Q1r5o5k16j044N50J171p93J48j29j02M60
2318b69L63j010L73O35O1p14L6L77M76J69q22j51K91N07j69r2l91N90K38n02k12
$$ plain form
2179 -56 -1315 -529 1053 -3 -1113 635 -192 334 813 -140 -878 560 -959 -356 -634 -751 184 -200
2197 -200 -1226 -393 -58 296 -700 -832 -144 494 -16 -435 -385 -258 761 82 -297 -85 -549 832 -33
2216 -33 -578 -108 361 80 201 491 108 830 532 102 676 413 601 767 96 107 922 159 117 -151 6
2237 6 633 232 -302 -569 -205 -61 -528 -1146 -604 33 22 -612 -604 -766 191 -88 -901 -384 -250 227 248 -498
2259 -498 -170 478 57 54 -328 -147 412 243 -113 -157 234 133 635 -651 154 922 330 -97 128 -1031
2279 -1031 320 171 -1026 -493 28 -459 733 -509 -644 495 742 200 -401 -232 414 833 -563 -703
2297 -703 191 913 -80 -200 -543 98 171 85 -235 -154 -249 -314 -530 -1574 -1024 147 -646 -498 -627 -729 -269
2318 -269 94 -916 -543 92 153 -561 -525 -148 328 497 -325 -476 -185 322 153 61 -330 260 498 -4 -216
2339b16N00J43r4k86k83N44l3N7k57p4L37R1l96m91N40j95K49n36Q0N37j48k22
2361a53j32k14P53Q7o79p9K06J06L77m24o02Q78J48j93l17Q3J07O71q07p7L18
2382E7l7M36l19l90M81J41k98J36k39K25j60J41m86J01N46k97k63l23J89O52o01
2403c08k61J75J75N14l72m92K79L04L11k85l14K43N33k35j80Q2K95J23l71l95
2423a79L41Q5k72J28n1J0J78m34rk92K90L76m84m80J70N40J23l35m50J95N92O5
2445A07l08l2j30O96j47m90J85J23Q1N46o31K68m2j40J01Q1k56N94m48n66L93
2466a5J98j28j41m70K34O93k28n01j22L46L77j54o41L84mM59q2n53J08N69o4j75
2488I0L88l29K56J53o43K74J15j90K55o93K80M34j37m53J57l10L88L44o11l7L18
$$ plain form
2339 -216 284 427 333 47 -236 308 275 332 75 1 338 429 33 -458 82 -113 136 -400 -320 217 69 -153
2361 -153 -285 -499 254 341 -338 -417 -211 -105 272 -152 -754 124 272 79 -238 -155 -48 623 -184 -261 57
2382 57 20 456 137 -253 228 369 71 207 -32 193 33 174 -312 -211 335 38 -225 -548 -359 293 -308
2403 -308 -569 -394 -219 295 -77 -569 -290 14 325 40 -274 -31 502 267 87 169 464 587 216 -179
2423 -179 162 247 -25 103 52 62 240 -194 -203 -495 -205 171 -313 -793 -623 -83 40 -295 -745 -550 42 107
2445 107 -201 -233 -363 333 186 -304 -119 4 85 631 0 268 226 86 187 268 12 606 158 -408 -15
2466 -15 183 55 -86 -556 -322 371 143 -358 -480 -134 243 89 -552 -168 -172 287 205 -348 -240 329 265 90
2488 90 478 149 405 558 -85 189 304 114 369 -324 -44 390 253 -200 -43 -353 35 379 -232 -269 49
2509D9K0j6j89m73R14L9m73K05j18L67L8m38NO21p55M08j47l90N29J2o7l56p8
2532b93L33J85m16K18K3N0j70k02k69P98J35n94J48j10M02J75m19j57q3J18K37
2553A09j3n9L19k2l01O8j49K82Jm85oL60o7q6Q7l41L68J49l94J83q1m5O10o01
2577a14j45K21mK07m3n11N34K44m59l05K97l62J77K04o35P28pj81J65m47P74J98
2599E36q89L05k61j7P0J16K12n10M75j14J57l89L52N03l45k38k0l58QN36j45J88
2621A72J90l63J09j65l06Q05o45K63j05k44J51K65n98N81JO1j49j28Q9L05k5l18
2643e4j31k9L88j79j95L86k96J31m03J57K9M14J58o91L61k02J98k43O6R5r1K97
2665A66k08j22K8K68M6k25j37L19M6J28l14k00J42M20k48j16jj2p6K57j79K1j81
$$ plain form
2509 49 69 53 -136 -609 305 344 -129 76 -42 325 363 -75 -70 551 -204 204 57 -333 196 208 141 -215 -293
2532 -293 40 225 -191 27 50 100 -70 -272 -541 257 392 -202 -54 -164 238 413 -6 -163 -246 -128 109
2553 109 96 37 356 334 33 101 -48 234 235 -250 -256 104 37 -49 38 -303 65 214 -180 3 -78 -123 487 -114
2577 -114 -259 -38 -42 165 122 -389 145 389 -70 -375 -78 -440 -263 -59 -694 34 27 -154 11 -436 338 536
2599 536 -353 -48 -309 -326 -256 -140 72 -438 37 -77 80 -309 43 546 201 -37 -57 -415 -407 129 -16 172
2621 172 362 -1 108 -57 -363 442 -203 60 -45 -289 -138 127 -471 110 111 172 23 -105 -16 289 264 -54
2643 -54 -185 -214 174 -5 -200 186 -110 21 -382 -225 -196 218 376 -315 46 -156 42 -201 -135 -40 -131 166
2665 166 -42 -164 -136 132 178 -47 -184 135 181 309 -5 -205 -63 357 109 -7 -8 -20 -96 161 -18 3 -178
2688a78o2J98m7J73k44l4J70j64R3K67j59M3j35P4K55m28K21k1l6P5olJ20J1k63
2713h0Q0K84l14J85l87K1N5J50P8l28q8K19K11j61l59L81q4N76k12n64O01n6J80
2736C88n32J15J02L10m09o2J90O5M9p7l98O46j14j84l70R0L0L32l50J48L04l84
2758a11J07k24Q7J89K12k38r1j83K84J10K1j33K00l71N49m40P6J11K29K04n29
2779E9j65O8M35l60k95L71K43k68k22p3o5K48k10K6j85J57K13j7k87K16K53l11
2801a69N29n81j9M37k15j7l00K68J51j1j44N8j00M02l30K41ok37J52k03J91k5
2823G2K14l95R6j26K58j19K3R8j48J26M5j73K37l73K93j35j54J54k2J65j36m3
2845d3j29K03J03l36P1K83J79j90m34K34J98k13K32l08K88N42j032L80l30J69
$$ plain form
2688 -178 -240 -42 -89 84 -160 -194 -24 -188 -95 172 13 56 -79 -5 250 -178 43 22 -14 61 55 52 172 183 -80
2713 -80 0 284 -30 155 -232 -211 -156 -6 72 -256 -344 -125 86 -75 -434 -53 -137 439 227 -337 264 208 388
2736 388 -144 -29 73 383 -26 -88 102 167 216 139 -259 387 273 89 -281 -191 -161 171 -179 -31 273 -111
2758 -111 -4 -228 -141 48 260 22 -69 -252 32 142 163 30 230 -141 408 -32 44 155 384 588 59
2779 59 -106 -38 397 37 -258 113 356 88 -134 -207 -272 -24 -234 -208 -393 -236 -23 -40 -327 -111 142 -169
2801 -169 360 -221 -240 197 -18 -35 -335 -67 84 73 -71 -13 -113 289 -41 200 194 -43 109 -94 97 72
2823 72 286 -109 -13 -139 119 0 23 121 -27 99 144 -29 208 -165 128 -7 -161 -7 -29 136 0 -43
2845 -43 -172 31 134 -202 -131 152 331 141 -293 -59 139 -74 158 -150 138 680 -352 28 -302 -133
2865a33K74R6r8k99O5K95Q3l23K2M30j42m32j2K50L02j38k85k29N16l15J52P1
2887A50m45M61k82J59o2N2k3R6O8J03n1j99J56j87j80J28K67m38Q4M07k28K96
2909C32k30l89N81k75J13j13k5m5K49k03q2n3L28r0Q8n01N21Mn20K44j80L41K34
2932C29J7m47J46l01L09j91L3K20k50K78n59N85m4j50m0j54J11L3J38K1k64l0
2954b10lL36k47K25O5k10J38J1l09J19K59J91m89K34m77M19j88R0R5O4J20j68
2976F5r4k87M42m4j16K39j77j53k8K14j87R1JJ56j2O5q9m4p9O3j09M1j37k91Q2
3001c88J13L09j07J81m93L27k1L7l7K3q2n3J24k02L77k18l8j61K89k2j85J83n8
3024a02K44j42P7k05j05O55k39k11q8J62J83l22L0l88N75K08m48J44l97M27J01
$$ plain form
2865 -133 141 237 139 -160 -95 200 283 -40 -18 412 270 -162 -174 76 378 240 -45 -274 242 -73 79 150
2887 150 -295 166 -116 43 -19 33 10 106 174 277 226 27 183 -4 -184 -56 211 -227 -143 264 36 332
2909 332 102 -287 294 19 132 19 -6 -51 198 -5 -87 -140 188 98 186 -315 206 210 -310 -66 -246 95 329
2932 329 346 -101 45 -256 53 -138 -105 115 -135 143 -416 169 125 -25 -65 -219 -108 -75 63 84 -180 -210
2954 -210 -213 123 -124 101 166 -44 94 105 -204 -85 174 365 -124 110 -367 52 -136 -46 49 113 233 65
2976 65 -29 -316 126 82 -34 205 28 -125 -153 61 -126 -35 -34 122 110 175 86 42 -37 26 -83 -42 -179 -470 -388
3001 -388 -275 34 -73 108 -385 -58 -79 -42 -79 -56 -138 -191 -67 -269 108 -110 -148 -309 -20 -42 -227 -44 -102
3024 -102 142 0 77 -128 -233 422 183 -28 -116 46 229 -93 -63 -451 124 332 -116 28 -369 58 159
3045A59q0J5l3m2J23l38m8J2M64m37J69j1K03k58K48k14Q3q2p1N9M3J91l68J53
3069f0l7J49l36J42j47K67k41L20k46J11P3J81j23O7o5p1L9J22l77J70k1J64O3
3092A44l16K76L2p4j00L42k41k4J9k33K62j27m22L28L11k52l56M66mJ20j43j60
3114a52J11J17l32M41k10J63k31P7P1J47k50kK55l41J46J84qp8Mj16Q0k87P4n0
3138a87K91k80J06J26M2k0l27J24NR1j2k38L64K26l36j4k21J20N17m07j89K62
3160D3j05m8J72j58j26J32L69K53p30N3K61k06K00j55J9J81k31RJ06J56l5n20
3182c60M99k63K83j53j11J66Q0p5k7M6j34j83J37M55o15J81R3kJ61l10J86m9k54
3205b49J76K20J1j39K54k87k84L23J0j63L34k45J08J91l39K0r8P5L8Q1J91p4j13
$$ plain form
3045 159 79 94 61 19 142 -196 -244 -232 232 -205 -36 -47 156 -102 146 -68 15 -67 -138 -79 -36 155 -213 -60
3069 -60 -97 52 -284 -142 -289 -22 -263 57 -189 -78 -5 176 53 120 55 -16 23 145 -232 -62 -83 81 144
3092 144 -172 104 136 62 -38 304 63 39 58 -175 87 -40 -462 -134 177 -75 -431 35 31 151 8 -152
3114 -152 -41 76 -256 185 -25 138 -93 -16 55 202 -48 -50 205 -136 10 194 186 108 112 -4 76 -211 -137 -187
3138 -187 104 -176 -70 56 98 78 -249 -125 -120 -29 -41 -279 85 311 -25 -39 -260 -140 377 -30 -219 43
3160 43 -62 -110 62 -96 -222 -90 279 532 -198 -145 116 -90 110 -45 -26 155 -76 -67 39 195 160 -360
3182 -360 139 -124 159 6 -105 61 141 66 39 85 -49 -232 -95 360 -255 -74 19 17 178 -132 54 5 -249
3205 -249 -73 147 158 19 273 -14 -298 25 35 -128 206 -39 69 260 -79 -59 -157 -82 -44 37 228 154 41
3228D1l40L74M1p5J32pk54o3J13J76k70J53Mo9oJ28n7MJ55j11j95N2L9J21k46
3253a60Q0r8N07k16j95p5K24K3J13k04R9m3o50N03oQN3J73k85K97M8P5m75J60
3277d4P9k09N88l58j34K34k08J12J00R0n5j33k23KK23L93m22J3j96QM77j29o1
3300A47k51P4J5J33k01j7j19J19J42j80M5J39K1Q5k32J62j58R5l15K04J77k27
3322a42j7p9J84k0J32m7k28R4J17R0k58R7K76o2l61K71k18K04J10J1m8k45J54
3345A5j12R0J41j1j0m47M49j60k35K73J21J1j74R0K06j19m35K54j09L56j33o1
3367@n4M4j98K83jJ69j47o8J05l78M99k93j45K35l8Q6k16J52j52RJ20O5Q5o1k25
3392a24j02n8K51J00J86m2l15K9N6L3m9J6J50l67M11Qj19J51j33q6K43j18q7J98
$$ plain form
3228 41 -299 75 116 41 173 166 -88 -151 -38 138 -132 21 25 -44 -50 78 21 25 180 69 -126 -74 -35 86 -160
3253 -160 -80 -178 329 113 -82 -157 67 90 203 -1 98 55 -595 -92 -98 -90 -37 136 -149 148 196 271 -204 -44
3277 -44 35 -174 414 56 -78 156 -52 60 160 250 195 62 -161 -159 64 457 35 48 -148 -140 337 208 147
3300 147 -104 -30 -15 118 -83 -100 -219 -100 42 -138 -93 46 67 152 -80 82 -76 19 -296 -92 85 -142
3322 -142 -159 -238 -54 -74 58 11 -217 -123 -6 84 -174 -77 199 137 -224 47 -171 33 143 154 106 -139 15
3345 15 -97 -7 134 123 113 -334 115 -45 -280 -7 114 125 -49 41 247 128 -307 -53 -162 194 61 0
3367 0 -54 -10 -208 75 74 243 96 28 133 -245 254 -39 -184 51 13 99 -117 35 -117 -108 12 77 162 101 -124
3392 -124 -226 -284 -33 67 253 211 -104 -75 -19 14 -35 -19 131 -236 175 183 64 215 82 -4 239 121 34 232
3416B32k69K30L5k71L4K03j12rk90J30J68J0K09k30j46pJ23K6j83Q5j2r0J33k1
3440b2K8q2j07J62J66l03J99l3l19K39p1J71J32j34P6k60P1J18J52k37m1L62q8
3463A79j69j71J95M2r1l66J68K74k14j3J76nK62j12l77L17J46k54K87l48L83l48
3485c9o6M45l62o2J87k33K67m2k07P5J35J00m81L66j87J83j3l8J45j85l1j58K12
3508A1n6J37k11K60l0k58O3J15j62K46m6QJ71m47J13L50j36k19O2O7r2j02K3N17
3532C84l13l3l4j46J20J59j04l53O27n43L55o1m92N07k04M2M13p17J31N41n34
3553b55M53k38N4L5Q5k26j22K74J9k77k09M49Q0k97N42m26P3P5n4l31L17j54J45
3576A2j92P0M09m21J3K54r6j47j0L63j69J4J8j70j18K40M5j78n0M20n48j24J70
$$ plain form
3416 232 -37 193 228 -43 -9 194 82 73 -217 -87 81 91 300 70 -76 -83 40 66 -117 -32 -44 -134 -1 -22
3440 -22 6 -76 -183 -21 145 -158 41 8 -311 -72 -143 28 160 26 102 -158 -87 31 183 -54 -95 267 179
3463 179 10 -161 34 76 -15 -381 -213 61 -153 -166 10 5 267 155 -222 95 241 -13 274 -74 309 -39
3485 -39 -105 340 -22 -84 103 -130 137 95 -112 -37 98 198 -283 83 -104 79 66 28 173 -12 -43 -201 11
3508 11 -45 92 -119 141 111 -147 -84 31 -131 115 69 77 248 -199 -86 264 128 -91 -29 38 -54 -156 -133 384
3532 384 71 38 4 -142 -22 137 33 -320 307 -236 119 58 -434 73 -131 -89 324 -393 -262 279 -255
3553 -255 198 -40 14 49 134 -92 -214 60 79 -198 -407 42 122 -175 367 -59 14 89 35 -296 21 -133 12
3576 12 -180 -110 299 -122 -109 145 49 -98 -108 255 86 100 118 -52 -170 70 115 -63 -113 307 -241 -365 -195
3599a95L36k96J35O3k77K9K27N8N3l11m4M04J45l51J65l67J08K97k15K6k74P1
3621b13N9M18j87j91N7K36j52j03J7j19Q3L3Mj82L02j14j35L34J9q0q2j16J40
3644B8K2q9N8o8j07M49%m10j03R7J10l2q2n1JJ80l8Q7J14k16J1J37k66K01j36
3669a03J58j80j20L13j4k29o7K58R3K89l86J87n6J14l83J13l04K82J66j24k55
3690b48M0j71M51M7m27L10J07J6r1J71m49J07J91j02N5j88K83l26K20J38k50r6
3712b12J96J38k73K87m54j85P03J9m82j81j26L74J34O8K51k23p20M73k23K5N38
3733A27j83J03M89j706P81O79Q6r64L66K91m11O58r69k38M4P66J94o22J066n66
3753ip43M99L1J45J03j73K80J17k21M03Ln38N48o91lN33J52l83L05o22l82J119
$$ plain form
3599 -195 141 -155 -20 43 -234 -205 22 80 133 -178 -222 182 327 -24 141 -226 -118 179 -36 -10 -284 -213
3621 -213 -154 264 77 -114 -57 179 27 -76 -59 -178 -95 -62 -58 -240 62 -52 -187 147 166 86 4 -112 28
3644 28 50 -39 19 -49 -156 293 293 -117 -220 -123 -13 -45 -127 -178 -177 3 -35 52 166 -50 -39 98 -168 33 -103
3669 -103 55 -125 -245 68 54 -175 -242 16 109 398 12 199 143 257 -126 -13 -317 -35 131 7 -248
3690 -248 -208 -379 72 119 -308 2 109 125 34 205 -244 -137 54 -48 7 -181 102 -224 -4 134 -116 -212
3712 -212 -16 122 -151 136 -318 -503 200 219 -263 -444 -570 -196 -62 6 257 34 -686 -213 -436 -411 127
3733 127 -56 47 536 -1170 -389 290 376 -588 -222 69 -342 316 -653 -891 -847 -81 113 -509 557 -9
3753 -9 -752 -253 -222 -77 26 -147 133 250 29 432 435 -103 445 -246 -249 284 436 53 358 -264 -646 473
3775D73n65l08j33N35j87m32K22K70L50o40Q78p33K72P77p89l52R41j021O3K75
3795a04o7J28k85K53N2L00j92k23l47K80J11P6K27R2K94p77K3K55j85K84q25N61
3817f9O71l08j74n00L1L86L15j04M8N42p59L1r93J204j34M05n78o89Q61l24p6
3838b14L79kj59j79O88n91O6L46O47n62r27K64P47O40j998L51P43p0q15j3Q48
3859A89n00N90j46k19L70j36l77k85L10M76m67J54K80k30J92k68K23n69k53L88
3879b78L63n44l43R37o2n56P66j49j04o94P51n52M42K31n2j59m0J03K3M1r8K01
3901B27k92k23K55p69Q57L90k70k35n12N12L31j7n48k50P64P58m46N03q33kj69
3922C1Lo63O49k65k95J382j111Q56P14j964P44K11k32m8k86L95K01r00L09M05
$$ plain form
3775 473 -92 -400 -533 2 -185 -617 -395 -125 225 -415 463 -270 2 779 -10 -362 579 -442 -379 -104
3795 -104 -171 -43 -328 -75 -23 277 85 -138 -485 -205 -94 -18 209 301 595 -182 -159 96 -89 195 -630 -69
3817 -69 602 294 120 -380 -349 37 352 248 296 838 79 110 -883 321 187 592 14 -675 186 -138 -214
3838 -214 165 163 4 -175 513 -78 -12 334 981 419 -508 -244 503 1143 -855 -504 239 169 -646 -659 189
3859 189 -311 279 133 -86 284 148 -229 -514 -204 272 -195 -41 239 9 201 -67 156 -413 -666 -278
3879 -278 85 -459 -802 135 73 -483 283 134 30 -664 87 -465 -23 208 156 -3 -43 60 83 124 26 227
3901 227 -65 -288 -33 -802 55 445 175 -60 -572 -60 271 254 -294 -544 220 978 532 1035 202 200 31
3922 31 34 -629 20 -245 -540 842 -269 587 1301 -663 81 292 60 12 -274 121 322 -578 -269 136
3942A36k29J21j17K93k86j61N91l43j3L8j68J5K80m90L85j2j91K16j20Q9J88j25
3964I7l0m6kJNj29l12M18L02p4k17pk47L9M26m27P40m82K29L39q23k75O93k3m00
3989b05k06L03O53o52K78l81l94R25o06n84L31m05J115n02j26N03J76m67N15k63
4009HL10K36j021Q91q63j6M13j33P4j06K61q48L37M7L0R62l48l22m18M57k76J31
4031a94l62O89L34j66l73M8m15M22N36o03J94k02L59k63J37o03Q40l57n87K81
4051b85j54O96k06k39L40l38J56m31N83m96N02l42o3J52n67j5L55L02L8Q8J57
4072B33n59K42M89o67L05l37M48j81j38Q0k4M5J42k45K59l17K25K16j26j77q1
4093a68J22J86k09P6J9j36J70j21j98M22k23l0P8K04j79J29o1j5K71m33j24L50
$$ plain form
3942 136 -93 28 -89 204 -82 -243 348 5 -8 30 -138 -123 157 -333 52 40 -151 65 -55 34 222 97
3964 97 67 21 19 20 25 -104 -416 2 304 230 13 6 -241 -202 224 -203 537 55 284 623 -200 -475 218 195 -205
3989 -205 -411 -108 545 -107 171 -210 -604 321 -285 -869 -538 -943 172 -330 -456 47 223 -244 271 8
4009 8 318 554 -467 424 -439 -455 -42 -175 -101 -207 54 -794 -457 -410 -380 582 234 -88 -506 -49 -325 -194
4031 -194 -556 133 467 301 -72 -24 -439 -17 519 -84 110 -92 267 4 141 -462 378 21 -566 -285
4051 -285 -439 257 51 -188 152 -186 -30 -461 122 -374 128 -214 -277 -125 -692 -707 -352 -50 -12 76 233
4072 233 -326 -84 405 -262 43 -294 154 -27 -165 -85 -109 -64 78 -167 92 -225 0 216 90 -87 -168
4093 -168 -46 140 -69 7 26 -110 60 -61 -259 163 -60 -90 -12 192 13 142 81 66 337 -96 -220 130
4115A30J73k67M3m0l65K01N10l67n97J70J63j15j12J468k55j232R08r5n33N47
4135C35j162Q61m4j49K1k89O06l96P71O2p42JR1Q5j39K54j87L53l75K32r2m82
4157c85q0k55P11k07m80Q91J05K40l48k36J75n21N79q4K12j239O45K58l71l55
4177g45N39n68J030n76k0r8N64k5M12l84j99M79j099J54O25l17J338j393l84n34
4197a201R27l42k63J619j198N49l37J038j551Q65L03k84j013J359j233O99J32
4214F9N79j017P86p11l64J5J810j565M93O22j607R22l8n10L64Q36k78o32R30n61
4234A43j58K29j70q5n61n74R24P26m94k89R34q89m33j10Q11K79j036Q4Q19q18
4254f68j70K28k38j95J345k84L68l46q05J915q80j75M48l20p04N92L15l25j92
$$ plain form
4115 130 303 36 79 39 -326 -125 385 18 -579 -409 -246 -361 -473 995 740 -492 416 321 -212 335
4135 335 -827 34 -10 -159 -138 -427 179 -217 554 616 -126 -125 -34 51 -88 166 -21 332 -43 189 97 -385
4157 -385 -465 -720 -9 -216 -696 195 300 540 192 -44 131 -390 189 105 317 -922 -277 -19 -390 -745
4177 -745 -206 -774 256 -320 -340 -438 126 101 513 129 -70 409 -690 -536 89 -228 1110 -283 -667 -1201
4197 -1201 -274 -616 -879 740 -458 91 -246 792 -759 106 409 125 -888 471 -762 -63 69
4214 69 648 -369 417 -294 -658 -643 1167 -398 95 717 -890 32 -6 -516 -152 684 406 -226 704 143
4234 143 -15 214 44 -41 -602 -1176 -252 474 -20 -309 625 -264 -697 -807 4 283 -753 -669 150 -668
4254 -668 -838 -610 -848 -1043 302 18 386 40 -765 1150 270 95 543 223 -481 111 426 101 -91
4273i1j8K25m41P61K79p79r7K71J7j3j99J06p2K73j25j9O5J8j61n4n0k50K7K14
4297a13K2j6R6N7j38Q0l8j59K46m15K75J51k71K96l70M69j69q9J48k23M85p6j44
4320A04j72K40R4m0k54m9K54j8n7j51k13K65j13J23J05k58P1j13L44J14n69L19
4342B6P7j07l7K1r2L15Q8k08K70o12L98k80N8l03O06j32K60k00m2j89K85j82M5
4365F5j80K27r2j73K24l52L34j42n2K97k82J76ln4R9l3m50N01P6m0K55m28Nk18
4389b40K57N6J15k9j39Pj24J41Qk08J41J22j32j44l7J05K8L9J03J25p7m2J04j23
4413E6R6L8l57K70kK58m08K1P1k98L24k3L8j05P1j06J74k39K24j03KQ6j14J44
4437A18R1o68L93K60j62Q3j81J9j59L19o6j33k18M79j36M7J1KJ63l09l18K76n0
$$ plain form
4273 -91 -109 116 -325 436 715 -64 -161 110 127 114 -85 21 -51 222 97 78 143 161 0 -54 -104 -354 -327 -113
4297 -113 -91 -107 -11 46 -92 -12 -50 -209 37 -378 -103 48 -223 73 -297 172 3 -86 62 -161 324 248 104
4320 104 -68 172 266 226 -28 -77 177 159 102 -49 -262 3 -110 13 118 -140 -69 -182 162 276 -293 26
4342 26 103 -4 -41 -20 -112 203 291 83 353 -259 139 -141 -83 -386 220 88 348 148 106 -83 202 20 65
4365 65 -115 112 20 -153 71 -281 53 -89 -141 156 -126 50 47 -7 92 59 -391 110 186 146 401 -27 -22 -240
4389 -240 17 73 188 159 20 27 -97 44 52 -156 -15 107 -25 -169 -206 -101 -73 -34 69 194 117 75 179 56
4413 56 152 190 -167 103 101 359 -49 -28 43 -255 69 46 84 -21 50 -56 118 -121 103 0 2 88 -26 118
4437 118 209 -459 -66 194 32 115 -66 -47 -206 113 47 -86 -304 175 39 86 97 99 262 -47 -365 -89 -139
4460a39L44k53O2n7J4L1J22k94J49j55J35R6q6j40Q7J43j97L89n11K18R7m38K53
4483a30j08J69P4P1j32o0p0j76J49L52j36J03k43P8R2J6J8j66J00%q6N1O1o5n4
4508i2R2m2J6N1n3J82n1j66j2qK87j36l04L4K69l26L47j47J61N9k40Q8j06J85
4532H8l3j90k16L85k7j13J34K77m12j64M4k5K77Q5k14P4L35m24P7K49m09L40k45
4555a07m1K08k01L15l58K45K37l27K66j35P8m13J50q8K38o2j97K34rq9K9j52K37
4578E8k20J12J28l1j02K27l17K90j29M00o54K87J07l06k8R4J82m8Q0l01K48l0
4600D7K62n77L53k30N8K62l73J08o0J55k1l04L39m0m1J29j41J09m8j42l5O5j62
4623b87M35n7j10K31o9j65l1L16j45j45J52k49J84k36L1M9Q0J14o7j57J35N1n5
$$ plain form
4460 -139 205 -48 14 -43 -29 2 124 -170 -21 -176 -41 55 -31 -171 -84 59 -138 251 -260 -42 55 -383 -130
4483 -130 -238 -69 5 76 -56 -116 -186 -362 -213 139 3 106 -137 -59 33 49 67 -99 1 1 -85 -34 27 -38 -92
4508 -92 0 -42 -26 25 -28 154 103 -63 -75 -83 204 68 -236 -202 67 -259 88 -59 102 161 -79 9 -97 88
4532 88 55 -135 -351 34 7 -106 28 305 -107 -271 -227 -252 25 110 -104 -30 305 -119 -42 207 -202 138 -107
4555 -107 -148 60 -141 174 -184 61 298 -29 237 102 180 -233 -83 -171 67 5 -192 42 33 -56 -27 -179 58
4578 58 -162 -50 78 47 -55 172 -145 145 16 416 -238 49 156 -150 -178 -84 98 50 130 -171 77 47
4600 47 309 -268 85 -145 -87 175 -198 -90 -150 5 -16 -320 19 -21 -62 67 -74 35 -13 -155 -190 -125 -287
4623 -287 148 91 -19 212 143 -22 -53 263 118 -27 125 -124 60 -176 -145 -96 -16 98 31 -126 9 60 5
4646Ej60J53N9l1K8K59m07J6N8K07K4m90J90L35l90L21Q8n54M79k99K36j3j68
4669e4J41J90k72j4J19j54n0j18L11n7j0L5j68l7J12J53r0R5j65J31l66M12j23
4692B1j05J01K2k05k0K62o0k4q7J29j38j77K91N7O9l28J73j25jJ79Q2P2n6j65
4716c3n5L67k54J8J00l0k20M9J02j97O7p0L36k42J81j29ml44L75MK48l89J04r2
4740a08J88o1j20l9L50k41m2N6j48K56o3rj01o0J20J76j27P8k08k0N5j08K78j85
4764h3j49k3K17N3q8N5j43L21k23Qj82K78J51j38L3j53l2N4N7Oq0J94n19N01l21
4789b06K68o5J1J22n6j24N5k5k72L34K8k2K59l09j56K31j30p6K16M5o2k72pM57
4813B44l82M0N12l07j69K95k60j48M60k29k39L67k58M6P5Q3j04j9J48j13j1L6
$$ plain form
4646 5 -155 -2 57 26 54 313 -94 -78 -20 187 211 -279 -89 246 -144 177 265 -289 190 -109 127 114 -54
4669 -54 87 277 5 -9 110 -44 -94 -212 99 42 32 67 -101 -138 -26 127 37 132 -33 98 -268 144 21
4692 21 -84 17 39 -166 -186 76 16 -8 -95 34 -104 -281 10 67 136 -192 -19 -144 -145 34 116 188 132 -33
4716 -33 -88 279 25 43 143 113 -107 -58 44 -153 -86 -156 180 -62 119 -10 -14 -358 17 21 269 -120 -16 -108
4740 -108 80 19 -101 -140 210 -31 -73 -17 -165 91 28 19 -82 -142 -22 154 27 105 -103 -123 -68 -176 102 -83
4764 -83 -232 -255 -38 15 -73 -18 -161 160 -63 -55 -237 41 192 54 87 -66 -98 -44 13 19 -61 133 -386 115 -206
4789 -206 62 -3 8 130 74 -50 5 -20 -292 42 70 48 307 -2 -158 73 -57 -133 83 128 66 -206 -213 244
4813 244 -138 -98 414 107 -62 233 -27 -175 285 56 -183 184 -74 -28 47 130 26 7 155 42 31 67
4835F7j45K6K12k11o0J75k10j40K79j34K40j74j55L76k66J96P3N2Qj61q9J6K59
4858B34j21JO8L1k39O7j94J55j09J07R1oj03j40M9J63J7k42J97j83J21K49k90
4881g7L13k92J83q4P8k77p3J58K58j70K8p6K9J69j82n7j56n1J73k3J69J10j08
4904D2j20J2L85m79J26J9LJ29O2l08O28l45k38l0j73K73m5j21J48K20j77l74M63
4927A00m0K46j71l94K54K8J86k89O6rl3o3J10J09m59J21j43P44n31N72l11l35
4949b42O6L8J54p0L56k84l22N26J16k52p2k81M62p95Q0O07L8j41k14N04n62M36
4971A48l5q3k12Q67j005M33m66L11J57J6k51K78l54N11m38L30j10K29k23J99l9
4992B63p43N10j80J10L9l01M04J70j96l0k01K37j52K48nn7j67J2J52k05n0N32
$$ plain form
4835 67 -78 -52 160 -51 -111 64 -146 -286 -7 -141 99 -75 -230 146 -120 76 149 201 209 48 -41 -25 234
4858 234 113 114 182 213 -26 41 -153 2 -107 0 91 85 -18 -158 -109 54 71 -171 26 -157 -36 213 -77
4881 -77 236 -56 127 43 121 -156 -229 -71 187 17 45 -31 -2 167 -15 -72 -228 -279 -106 -129 40 150 42
4904 42 -78 -66 319 -160 -34 -15 -12 117 179 -129 499 154 -84 -114 -287 -14 -59 -180 -32 188 11 -363 100
4927 100 60 306 135 -259 -5 23 209 -80 -14 -23 -56 -119 -9 100 -359 -238 -381 363 -168 404 93 -242
4949 -242 -176 -138 16 -54 302 18 -304 222 338 86 14 -267 195 -600 -520 87 125 -16 -230 274 -288 148
4971 148 113 30 -182 685 -320 113 -353 -42 115 131 -120 158 -196 315 -123 207 97 326 103 302 263
4992 263 -480 30 -150 -40 -1 -302 102 272 76 46 -155 82 -70 178 173 116 -51 -39 113 -92 -142 390
5014C90l17j21O2M3o7K98J65l09J4k79M18l62o5K83j22q6L14j61l10K39m5m1O3
5037DK9r5m5o7R8J15R2L79o95L00j18J76J1j6k26O4L9k30l0J77k40J00L25Q7l62
5062a28L7j04m3K54J13k97J42J13L38q50Q1J75j03K94J40k55J20p8N34j79M79
5083G83q50j27l59N88J24m94J29J209j389M02M41l42J29m7J48J4p01J1N04q31
5103f58M10O8L74O00q35J58l40O23q80M32o56J067J19o14J56n40j43N92l84M54
5123CO23q14L73n21M7k84K81L13R0n99k4J240j107K80Q3O20r29L18j142J310m32
5144b71j73j32Q17j55j93m74P03k0n4K98J24q8q42O33n53J53l16J091r39O32l87
5165a46L90j13J83o23N27O12o89L60m03r59J184m45k89K59O38o02O56J91m30p2
$$ plain form
5014 390 73 -48 14 57 -10 288 453 144 158 -121 297 -65 -130 153 31 -55 259 98 -212 27 -18 -59 4
5037 4 33 -62 -107 -174 -76 39 131 510 -185 115 -3 173 184 168 -58 6 45 -185 -215 -38 -278 -178 147 234 -128
5062 -128 -91 -195 -238 16 129 -168 -26 87 425 -425 -344 -169 -272 22 162 -93 27 -51 483 304 783
5083 783 -67 -194 -553 35 159 -335 -206 1003 -386 16 457 115 244 197 345 359 -342 -331 173 -658
5103 -658 -248 -180 194 794 -41 117 -223 400 -480 -48 -704 363 482 -132 24 -516 -659 -67 -451 3
5123 3 626 -188 185 -336 -289 -573 -292 21 111 -488 -512 728 -379 -99 -16 604 -325 -7 -1149 161 -271
5144 -271 -444 -576 241 86 -107 -581 122 102 48 346 470 382 -460 173 -380 -227 -543 548 -391 241 -146
5165 -146 244 131 314 -309 218 830 141 501 98 -861 323 -122 -411 -152 486 -116 540 731 301 229
5185B29J38r62O61M97j839Q92k66R18M73Q8o04n97P58k55P79r80M26j475M30R31
5205B42l54o31L26l72N6j56P42O88J60j702N90K49K14K7p49L65O41N13r00q7K80
5226A42j08L51O81j145M73p73K40M86r7j26R42r99m47K78k26P08n87J70L20o60
5246c77K47J49J28J86q35j89j2j25R15K13l08o26M20J30k96Q36l77j219J035q6
5266a91J200r30m56O90K16j162L92J76l18j55O08r50K094o30p83N68j460R83R17
5285H09j94m98l56O48j090Q41K39K78j366M60K84L6j248J171J96j190K271j858
5303e67K73l6j38J27N98o48P0l66j38N78j50P5P44k92M87k065Q18M49n21R59j155
5324h98J077o0n91L87P65l21p84J64L30M53o41O0J71k74o10J336o28N0k35m83
$$ plain form
5185 229 367 -595 66 563 -1276 -384 -650 268 741 829 225 -372 386 131 910 -70 356 -1119 -689 242
5205 242 -112 -743 -417 -789 -733 -889 -147 541 701 -1001 -411 -162 52 79 -670 -305 336 849 -51 -138 142
5226 142 34 385 1066 -79 394 -379 -139 347 250 124 1066 67 -380 -102 -328 380 -207 -37 283 -377
5246 -377 -130 19 147 333 -502 -691 -703 -828 87 300 -8 -634 -214 -84 -380 456 79 -1140 -105 -191
5266 -191 1009 79 -377 313 529 -633 -241 -65 -383 -538 70 -880 1214 584 -199 369 -1091 -108 809
5285 809 615 117 -239 409 -681 160 399 677 -689 -229 55 91 -1157 14 210 -980 1291 -567
5303 -567 -294 -330 -468 -341 257 -391 -321 -687 -825 -247 -397 -322 422 130 617 -1448 -630 -181 -702 257 -898
5324 -898 179 119 -472 -85 680 359 -425 -261 69 522 -119 -59 112 -162 -772 564 -64 -14 -249 -732
5344g32O72K59m06Q9P32k20m85m64L50P99q85J235k14p50K83j0n97O51n52J4L05
5365G4J48j83N60n23j40P9k55M7k87o7K60L64o4l01L70l77K31P2L54n14J57j51
5387a46L01R4j6k27j47K90m08N02j74k94P50l45o89O46q3o0QJ49l40j79K20n2
5409b00L58j21k03L31J99m39k39M57l93K32j97Q0L57rk41L08l27J51r0l1M4qP4
5432I3k35J96l10M24j52k98L76j41k7nQ2J83j21J70k94J05K90l02p2J91k93J79
5454C9j42K62j60J97k29p4K21j39j0k8J38J32k18K57R9l21j8p9J08k08L43k36
5476f6J27j47J64kj66K6K86m5j89J65j88J08j20p8J50j63k3J67k85K78Oq9K89
5499B05k45J41o1r4J63n85O32l1n7k28K80J35k98j07J3J88L0q8J84l23K70j78
$$ plain form
5344 -732 -60 199 -207 -118 614 394 -91 -555 -205 594 -291 944 730 -20 263 253 -344 307 -245 -231 74
5365 74 222 39 599 76 -64 15 -240 -193 -480 -547 -287 77 13 -288 82 -295 -64 8 362 -152 5 -146
5387 -146 155 249 233 6 -141 149 -259 243 69 -225 525 180 -509 137 54 -6 2 151 -189 -368 -148 -200
5409 -200 158 37 -166 165 364 -75 -314 143 -250 -18 -215 -135 222 213 -28 280 -47 104 14 -17 27 19 93
5432 93 -142 54 -256 168 16 -282 94 -47 -74 -79 3 186 65 235 -59 46 336 34 -38 153 -140 39
5454 39 -103 159 -1 196 -33 -107 114 -25 -35 -63 75 207 -11 246 345 24 6 -73 35 -173 170 -66
5476 -66 61 -86 78 76 -90 -64 222 177 -12 153 -35 73 -47 -125 25 -138 -161 6 -279 -1 5 -84 205
5499 205 -40 101 40 -54 109 -476 156 125 68 -160 120 255 -43 -150 -137 51 81 -7 177 -146 124 -54
5521e4j84K27k41K23m7R8J32k7l20K90m8J5N4l65K39L98k60k15m2K54l00J03m9
5544a19L41m46J44j26nN64k81j81m6p7L28K02k63j01K01l8k56K23O9O1k49M3K5
5567A3P7J21j56q1k93L47J86r6j70K00k42J96j10K32k68l8P3KK1L6L0NJ17j60
5591D2M8m4j36J98k68J38J07P2o5k39R0L39j98j90J43R9Q5j30k84K62j89j23K56
5614A3m40J36L43k23K67l11L02j83K36k53qJ37j39K18M3l7q7k51K37j72M42m63
5636a93o1J75J1%J47p7K5P3J53l28K25K58l69j54K49k46K03n9j71P9r2J18NPn8
5661h0j54J49P4O7N8j65J90k8K43r7n3l14L22k43J18J77k59O4k1R4k80L61j78
5684D5j05P7pL6q9K5j57R3L37l36K28j51n7j5J37j13L8k00J83K4K21k69L8OR2
$$ plain form
5521 -54 -238 -11 -252 -29 -76 22 154 127 -193 97 49 64 118 -247 -8 390 130 -85 -127 127 -173 -70 -119
5544 -119 222 -224 -80 -206 -211 353 72 -109 -155 -232 96 298 35 -66 135 97 -159 64 133 194 -55 -12 13
5567 13 90 211 55 -26 -319 28 214 118 -52 148 -94 102 -8 224 -44 -82 -9 -7 14 50 80 85 202 42
5591 42 90 46 -90 108 -160 -22 85 157 92 -147 -57 282 84 -106 37 136 221 91 -193 69 -120 -243 13
5614 13 -427 -291 52 -171 96 -215 87 -96 140 -113 -121 16 -123 95 138 101 14 -237 0 -172 270 -193
5636 -193 -254 -79 -68 -68 79 2 27 100 253 -75 150 408 39 -115 134 -112 91 32 -139 -60 -152 -34 -29 -22 -80
5661 -80 -234 -85 -11 56 114 -51 139 111 354 257 204 -110 212 -31 87 264 5 69 48 142 -138 223 45
5684 45 -60 17 10 46 -43 -18 -175 -82 255 -81 147 -4 -61 -76 61 -52 -14 -214 -31 -7 214 -55 -17 -11 81
5709H1k56K01j33P5J16J29l70J29K00j27P0j16K42n53L15N9J43k34L8j79Q3j06
5731a93J97o8K17J33k44jM7j27L1r0J72J52j47j12l8L19k01l14N22j22j08l0k03
5754b08J03j08K32K12j87O9o16Q67J36n01P6j8J41m72O57m35Mj09K49M13n26n4
5776g5R1m13M96j21J86o1j81J39r9K88n1k46L5q8M5K74m6k16j91J67K56k76M8
5799c9Q4k63K32K28k10j0l52L14J95k25N0J35l70J50p3K86J9j01PQ9r4k9j45r9
5823b21K76J98l87q5L05j29K0J93l89p7O15l01J2j07J69n3j22PM8M6J27j24o9
5846d8J07L9k87J97l1p2j70L90j42K23p2j73l76N02k3r8j21K15K13k13q9J1j54
5869a72P8O0q1P6L4K29m83M21Jk11J51j31K5r6P7j08J13k6L0K7j55J78l21L61
$$ plain form
5709 81 -175 26 -107 -32 84 213 -157 -28 172 45 115 -1 241 -312 3 62 205 -29 9 -170 -87 -193
5731 -193 4 -64 153 286 42 41 88 -39 -8 -98 74 226 79 -33 -71 248 47 -267 255 133 25 -5 -208
5754 -208 -105 -213 19 231 44 113 -503 364 500 -1 75 57 198 -274 383 -52 -48 -157 92 505 -21 -75
5776 -75 16 -397 99 -22 164 103 -78 61 -38 250 199 -47 -12 -100 -55 219 173 -43 -234 -67 189 -87 -39
5799 -39 45 -218 14 242 32 22 -330 -16 179 -46 4 139 -231 -81 -154 132 151 50 57 146 52 23 -122 -221
5823 -221 55 253 -134 -219 86 -43 -23 170 -219 -296 319 18 30 -77 92 39 -83 -76 -28 18 145 21 -48
5846 -48 59 98 -189 8 -23 -95 -265 125 -17 206 134 -39 -415 87 64 -34 -155 60 273 60 -29 -18 -172
5869 -172 -94 -34 -115 -39 -5 224 -259 162 163 -48 103 -28 -3 -99 -22 -130 -17 -43 -13 14 -141 37 -284 77
5893G7O7m02K25K29n86J88P2J14J3l3q1k4J93r7P1KJ2K39j45j62J27k98K58P0
5917A29j04J67k69K52M6k33K45j74k56O7j0O6J13r1R6Qj28m9J24l5j9J27M1k39
5941a26nK60j28K03M3k05R9N0k70q5N4J73r6J03L7k93K71j24j97L40j69J01p5
5964c9k1P1j22J51L7R0Ql94N4K67p3N9l12K48j63J05n7q1j45M85l79M39j21k17
5988a10J29O9J02l35j5K61R1l75L11k08L8k86K8K56J18J43l23R3j54R2j40L04
6010H9j1J38k94M58o25K79j48L4k72L56P9l07K46J21k77l0L47l65j12j60Q05o88
6032c37L96m32L44K80k02J73j2q59P72j32n29J093q57M41l93K83O36o02L31q21
6052d27j70J337o52k70k60L00Q70k79o88k66J666j309k48P13m38P2J49N27j38
$$ plain form
5893 77 144 -258 -33 196 -390 -202 -130 -16 -3 -36 -117 -141 52 -45 26 28 40 279 134 -28 99 -199 59 129
5917 129 25 192 -77 175 221 -12 233 59 -197 -130 -140 -74 39 -52 44 52 -76 -125 -1 -36 -55 72 113 -126
5941 -126 -131 129 1 204 247 42 141 191 -79 -164 -110 63 -33 70 107 -186 85 -39 -236 104 -65 36 -39
5964 -39 -60 11 -111 40 77 167 175 -219 -165 102 29 88 -224 24 -139 -34 -91 -172 -317 168 -211 228 107 -110
5988 -110 19 88 190 -145 -160 101 192 -183 128 -80 -42 -328 -300 -44 74 217 -106 -13 -167 -75 -215 89
6010 89 78 216 -78 380 -245 34 -114 -80 -352 4 83 -224 22 143 -134 -164 183 -182 -294 -454 351 -337
6032 -337 59 -373 -29 251 49 222 210 -649 123 -9 -538 555 -302 139 -254 29 665 63 394 -427
6052 -427 -597 740 88 -182 -442 -142 728 449 -239 -505 1161 -148 -396 317 -121 -49 100 627 489
6071D89j345m12J476p28Q89o21N89k6N4R60j365K83m49Q10p12K91k01n45J435
6090H72o64Mq60M71K60j13k70K05P2jpO3p58P75p44Q76l41o00P96N43n72l51k30
6113e74O03m3m4J83J93k79j3k09J50K31q38R23J32k90m80L53N0J1j56n44N26J39
6135B4l36K92q0N7j35l47K36N94m33j02n28N39N83J5J02l46l06O93l19l43J23
6156a7nK2l8qj27K00J49K26k70J09l46J21K7k25M01k75J55j07m02K52j86O3M14
6179A33l31Q3j5O9k6K14L30m65M8j27j24O8K72j48n65N65K00m32J78l04O7K67
6201d3j63K85k72n1J70l70K94r8j97K48M2L43l12K62l20p5R74o63J26M05q07J61
6223f1J45K44o76K28K26l57M96m3O7o02O87K90j113N14J49q6l21Q6N5J53n0O2
$$ plain form
6071 489 -856 -1268 208 -520 369 -252 337 311 365 1325 -40 243 -206 604 -108 183 -18 -563 872
6090 872 208 212 -648 -177 83 -30 -300 -95 -23 -24 -31 32 -726 49 -695 181 -160 -760 36 579 7 -344 -574
6113 -574 29 -14 -58 125 318 39 26 -183 -33 198 -640 283 415 125 -355 -2 48 59 -97 -641 -115 24
6135 24 -312 -20 -100 -43 -178 -525 -289 305 -128 -230 -758 -219 364 379 481 135 -171 522 203 -140 -17
6156 -17 -22 0 -38 -46 -173 27 176 402 132 241 -105 16 43 -182 219 -56 99 -8 -410 -158 -344 -281 133
6179 133 -198 -115 -130 -61 -87 127 457 -8 40 -87 -211 -143 129 -19 -584 -19 181 -251 -73 -377 -310 -43
6201 -43 -206 79 -193 -244 -74 -444 -150 -248 -445 -197 -155 188 -124 138 -182 -257 717 54 180 585 -222 -61
6223 -61 84 328 -348 -120 106 -251 245 202 269 -333 354 644 -469 45 194 108 -213 -127 -72 81 31 93
6245I3l49J44q2L6O89L4n07K47L98j115J086m04o7m89Q23n94j45M17j1j9q11N1
6267e75QJ194l71l58L31m94q3K50l21J81O98j25j108J427p22lP3q5J82M74j592
6288a019R42J4L07m92M12j57L05m56J96m21K42K68j97L69n98M21l87L49k8Q9k72
6309a13j4j48K36KQ4o1n3L22m0j71k02Lk00M37J12K00k34k25j74O83n91K49J27
6332B29L12o45N04p04J79P0K2J59k49J75J69n56l56J120j62m33L30l47O24m47
6352fj86J38K68m9M76j273J53K78J03R70o39l23k42P62j011O96j4L54m55K1n67
6373e46J045j63K95o22l98k76R27j29n64j30k40O36m03O75k28L15k70k48J36M6
6393a42j90J41r26J130l8j23n84J61J022j272M47M03l1K05l0o22k97P05o09L56
$$ plain form
6245 93 -256 -112 -194 -158 531 565 58 305 703 -412 674 270 203 -286 537 -57 -202 215 204 185 -626 -575
6267 -575 -567 627 256 -102 229 -265 -348 -98 -419 -238 460 335 -773 654 -68 -71 2 -83 99 573 -1019
6288 -1019 -77 -63 244 -248 164 7 312 -144 52 -369 -127 141 -56 313 -285 136 -251 98 70 159 -113
6309 -113 -127 -275 -39 -37 47 -14 -67 255 215 44 -158 -155 -355 82 194 394 160 -65 -239 444 -147 102 229
6332 229 541 -104 400 -304 -125 -55 -33 126 -123 52 221 -335 -691 429 267 -166 164 -183 441 -6
6352 -6 -192 -54 214 165 641 -632 -479 -201 -98 872 233 -90 -332 430 -581 115 101 455 0 21 -546
6373 -546 499 336 631 9 -389 -665 262 133 -431 -561 -801 -165 -568 107 -121 194 -76 -324 -188 -142
6393 -142 -332 -191 -1117 13 -25 -148 -732 -571 451 -821 -374 29 -2 203 173 -449 -746 -41 -650 -294
6413b94P85j41p44O76o61k95L25J012j113j22K17M72P71j023K98j73O66j405O
6432g43O75K7k76N74n5l49l07n06M86j026N89P02P50l26M97p99N8J81J45m28M92
6453C61p34P16r93O64N7N45n56k41R2M40j092N19J05q7J76j4n12j23Q07j71M79
6474D38N7k63p99J123n12J70R6l55J26m54K94P53l53P78j459P71j27j487J226
6493B3M81j075J850j873J121J62q20n16P69k12m77J05RN2N04k45J54q05J017N16
6513G40p52O53r94M84K20N09m96J40o74M24O91q40m17O93l75p21J178o70j063
6532a270J672n60P56n01j020P21P80j059Q5n3N61J37l56J95k72l95r2Q72O92o61
6552B32o04M57m68R27p82R0Q00r31k09L31M65J35l40k15L72K03k50j46l58K51
$$ plain form
6413 -294 491 350 -394 282 -379 -674 -349 663 -450 -572 -355 117 888 -135 163 -10 656 -749 -743
6432 -743 -68 -41 -317 257 202 -147 -454 -960 -474 -1500 -911 -209 541 215 712 -87 -29 152 297 -131 361
6453 361 -373 343 -650 14 71 616 60 -181 -89 351 -741 -222 -117 -204 -28 -42 -554 -677 130 -41 438
6474 438 495 232 -567 556 44 214 310 -45 81 -373 -79 674 321 1099 -360 411 284 -1203 23
6493 23 504 -571 1279 -594 527 689 -131 -647 122 -90 -567 -462 -453 -401 103 -142 12 -793 224 740
6513 740 -12 641 -353 131 351 860 364 504 -170 254 945 105 -312 381 6 -715 463 -207 -1270
6532 -1270 402 -158 598 97 -923 -202 578 -481 -396 -449 112 249 -107 88 -184 -579 -671 201 893 232
6552 232 -372 85 -383 544 -238 -148 652 -279 -488 -157 308 443 103 -112 260 463 213 67 -291 -40
6572d0j67J48j6K8k5%K9R3k49L03m27J7M27j54M4k08K36l65M14j91M29l06j73
6595a53j61J53J87Ll3o0J22j51J69n5j92N07l31j40K80K6j17J3K18m32L20k14
6617d1l30L89K42k81j46K93O7J22l70M3pM6L9KO8pq7L1J17j06R3j48k61K11K3
6642BK3m0k83L27J96n4j80k30J55o7L39N9k90J21N5J5j81M8r8k52P4N7J72q6Q1
6667c7K05q3k21J59Q7l31K14n7j09J40J37P4q0j67L18p9l5j65mK0o4J43j15j89
6691b39L39Q5l23J44j24Q5Q7p9r2M2j92K8M18j93J03j67l9J84M3J40m27K08m2
6714a1nm5Q1J22j62K10k32j17K03K46m42j3Nm8L57j85J32K9k64K2J92J2K9j12
6738Dj08J18M3J86l79m5p3J05J52J9J68P5j32J4k37J87L24m76J56l33K81L24l62
$$ plain form
6572 -40 -207 -59 -75 -47 -72 -72 -43 50 -199 104 -323 -306 121 -33 11 -197 39 -326 88 -103 326 20 -153
6595 -153 -314 -161 26 29 -4 -64 58 -93 76 21 -171 336 5 -135 145 171 54 67 285 -147 173 -41
6617 -41 -371 18 260 -21 -167 126 193 315 -55 -12 -19 27 66 68 136 129 42 73 190 84 177 29 -232 -21 2
6642 2 25 -15 -298 29 225 171 -9 -239 -84 -151 188 247 -43 78 133 148 -33 15 -83 -335 -261 -204 -32 -118 -37
6667 -37 168 85 -136 23 110 -221 -7 -64 -173 -33 104 178 98 -69 249 170 135 -30 -34 -14 -78 65 -50 -239
6691 -239 100 185 -138 6 -118 -33 54 -25 -117 -75 -267 -239 179 -14 89 -78 -117 67 110 250 -177 31 -11
6714 -11 -16 -61 20 142 -20 190 -42 -159 44 290 -152 -165 -160 -208 149 -36 96 125 -139 -117 75 87 116 4
6738 4 -104 14 57 243 -136 -181 -254 -149 3 22 190 265 133 147 -90 97 421 -55 101 -232 49 373 11
6761A1J41k04k3n8J47p8j3N5K59l35R7l5Q3k54R6k18M96k1j76L7qP9k24K25jl6
6787D2j99Q1O3L3k36K05p1j2o9L04k37J05J94L8q4k77J43k0J39j96N7Q7k22K57
6811A25NO2P7m76K33J67k90N6LK92k05m6j76J30R0m9k33RR5m0J83r2KR3j74L19
6837A60l63K86P8k29J04j45R1J64j64J98k05L5o3j89M71r7l14K2L48K1m3k18N6
6860DJ17K0Q2k71j92M28k35O0j8k75N74l35J27N2N7Q3m80R2N3PJ69k50K39J01
6884B09k00K08o08L96l7N4j15Q7m5p2q1J33K45j97p0J12o5j69L28j89m3J65j86
6907a40J15K28N6j68P2k53Jj84Q4K57r4J0k42N36j2j70j10k1j46k15M23j13l1
6930a17J11j24J20J69l36J7J04k58p3M58p7J27l9P0m6j8J0j02q2J57j2J05l85
$$ plain form
6761 11 152 -52 -75 -133 14 -64 -77 -22 237 -98 -1 -36 47 -207 -111 -329 167 146 -30 7 -1 78 -146 79 78 42
6787 42 -157 -76 -13 20 -216 -11 -82 -94 -163 141 -96 9 203 241 157 -120 23 3 142 -54 3 90 -132 125
6811 125 130 192 269 -207 26 193 -97 -41 -38 254 49 3 -173 -43 47 -2 -235 -226 -131 -171 12 -80 -78 15 -159 160
6837 160 -203 83 161 -68 36 -109 -18 146 -18 180 -25 10 -53 -242 229 132 -182 -160 188 209 166 -52 4
6860 4 121 141 223 -48 -240 188 -47 13 -5 -280 294 -41 86 138 195 278 -202 -110 -57 -50 119 -131 108 209
6884 209 9 217 -391 5 -32 22 -93 -6 -51 -123 -204 -71 174 -23 -93 19 -46 -215 113 -76 -119 46 -140
6907 -140 -25 203 259 91 163 -90 -89 -273 -189 68 -26 -16 -258 278 266 96 -14 -35 -181 -396 27 -86 -117
6930 -117 -6 -130 -10 159 -177 -160 -56 -314 -387 71 -6 121 82 152 106 88 98 -4 -86 71 59 164 -221
6953b21K47r3m5K13p6j93K42j80o4j23L03n2J49K1po8N8r8o5J66L2j2j05l9oJ02
6979H6j55m5L9n1M17p5p1O1l07N8J94n47N90r6q3j01N0J92k25J13N5j7Pl10K84
7004F3j6p1Q0k56K82M9j57J55k1q7K81l04n4J20n3j90k8J07P4k20L22q1N8Kj0
7029D5J55n9m1k21j31M53k25k25M01l5k20J78M3l75M56j18l86K88j04K27k69K35
7051G2k3Q8j10j90J63Jl7R6J17k05J84k29RJ14O3n27L07J08R2l39O25m11K64j70
7075F2K61l65j5P59p30N33n54M35q08K00K64M5m98L69j67L94M42q71K91K92o65
7096c26J01K17Q8o2l94M33j54q7Q85n35l87p22M66J443j354P02n39j3J29M42n78
7117b45L63J22j42j30L34K55n96j48J24K87o38N02n87K43lN62k06l7m2l67K70
$$ plain form
6953 -221 26 -67 -112 101 25 -168 74 -106 -170 -293 10 -42 107 128 121 53 111 13 -52 114 146 134 29 -10 -16 86
6979 86 -69 -114 -75 -126 291 216 145 206 -101 -43 151 -396 194 98 15 -86 -36 156 -69 44 99 82 89 -221 63
7004 63 47 -24 56 -200 82 131 -26 129 108 21 302 -2 -56 64 11 -179 -207 -100 -26 -246 76 -5 53 55 45
7029 45 200 141 100 -121 -252 201 -24 -249 152 117 -103 75 118 -257 199 81 -305 -17 -121 106 -163 72
7051 72 49 137 27 -163 0 1 -36 60 177 -28 156 -73 -64 50 113 -414 -107 1 93 -246 379 -32 232 62
7075 62 323 -42 -57 702 -28 505 -49 386 -422 -222 42 87 -411 -42 -209 185 627 -244 47 339 -326
7096 -326 -225 -8 80 18 -376 57 -97 -184 701 166 -221 -943 -477 966 -388 314 -225 -238 -109 333 -245
7117 -245 118 240 98 -32 302 557 -39 -187 -63 224 -414 88 -499 -256 -259 303 97 60 18 -349 -79
7138g9K08Qj66M7l9R9k48L82m83J54L47k9j70J53m18L28j71J06J17k67K01j69
7160h9J96k88J20M3q5J20J63j01k92P3K47n85M49L35o72M28j11k8M4r3J17j07
7182a16J38N0R3l9j07j71qK1j7N3K51l12J34K47k04J10k14J93l1N4Q6k87J09k9
7206Dj16k1J65q3J85j89M9J34J5k58J34j4j82J94K4m9J2J31j18l7N6P2P3m45K54
7231a0r9j58K38j78K0K90K75l03j55p3J07J83r5q5rL84j82n9j16K3J36o7J40k27
7255b0K3J79R9m88J94j41K04J05J05l37K50l0p8k0J50l81R6O0O4L4qK35m04M09
7279C00l08n4P9k51M30j53M7n3j58K82j28m7j78J82r2K15j79r2J96j55J41J09
7301A33J8n18L22j28K31l6j2Oo8O3n1j64L18k36K98k03N3o4J26m0l91M79m41M14
$$ plain form
7138 -79 129 137 -29 18 -21 78 -170 212 -271 -117 230 201 31 184 -234 94 -77 29 146 -121 80 -89
7160 -89 107 -181 -61 -18 -103 17 180 79 -213 -140 107 -478 -29 306 -366 62 -49 -77 -33 -126 -9 -116
7182 -116 22 72 165 126 19 -152 -160 -139 -156 -103 148 -164 -30 217 13 123 -91 102 71 125 211 -76 33 4
7206 4 -112 -133 32 -51 134 -55 -6 128 143 -115 19 5 -177 17 41 -8 4 135 17 -20 36 108 181 -264 -10
7231 -10 -109 -267 -29 -207 -187 103 378 75 -80 -153 -46 137 42 -43 -52 332 150 91 -25 -2 134 67 207 -20
7255 -20 3 182 281 -207 -13 -154 50 155 260 -77 173 143 65 45 195 -186 -90 -30 34 68 60 295 -109 300
7279 300 -8 -62 17 -234 196 43 90 37 -121 161 33 -14 -192 -10 -102 113 -66 -158 38 -117 24 133
7301 133 151 -367 -45 -173 58 22 10 16 -52 11 -40 -204 114 -122 176 -27 26 -38 88 48 -343 136 -305 109
7325A09N0q7p6pk0n6P4p0K94L6j33k55j97M57k77M0J84p8n7J48O7m11L97k04L29
7350B57j09j45rK69k54k97K78q1J59k16K47l27J71P6j70J70J36J46m10M01k80
7371A2k84K60j15J60J17l17M5L16l46M2N8j52K89L5k61j94M26PMj01J59j87K22
7394A95p0K36l35r6l2QK84k52n0L93l11J37k57J23J6j84K20k9j34J5K94j56J24
7417A39j18k59L37l30L37N0o7j14M6kj47L14K05l72j95K83m47L62lM4Q3j60J2
7440bQ5j96K35k85J67j21J95O7j82P6k10P3J55P0j91K47k42J99J68k79n2R8j66
7463i1n7QK01J7q5K62m36L28j21J38l38K73o2J04n8l11L27p9j40K0n9J25J26o6
7487B6K34l36o8K24k1L4J01m25J42j9K03m2j30Q0J81k3j93K3J91l23J09L9L67
$$ plain form
7325 109 159 72 -4 -11 -31 -87 -13 -83 211 247 114 -141 -338 119 -158 -118 66 -12 -69 79 146 -265 132 -72 257
7350 257 148 3 -6 263 9 -288 -10 -91 68 -148 99 -228 -57 19 -151 19 155 301 -109 292 12
7371 12 -272 -12 -127 33 150 -167 -122 194 -152 -110 -52 -204 85 120 -141 -335 91 98 102 1 160 -27 195
7394 195 125 361 26 -70 -102 -94 190 -62 -112 281 -30 107 -150 -27 -11 -195 25 -4 -138 -123 171 15 139
7417 139 21 -238 99 -231 106 156 89 -25 21 19 -128 186 391 19 -176 107 -340 22 19 63 146 -14 -2
7440 -2 83 -113 122 -163 4 -117 78 145 -37 39 -171 -98 57 127 -64 183 -59 140 308 29 -23 75 -91
7463 -91 -148 -140 61 78 -7 255 -181 147 26 164 -174 99 37 141 83 -228 99 20 -120 -100 -159 -34 92 26
7487 26 260 -76 -144 80 59 93 194 -231 -89 -108 95 53 -77 3 184 161 -32 -9 182 -141 -32 7 374
7510C74m15RK46m12K31j34N0O3j01K12j35l9j12L47q5O2l12K61j96L39j97K02
7532B58m82J68J28k12K09j91K57J01l65L59j08o4j36M8J87j40J13l7j88J44r1
7553d2o1J55j12j08k1K13l06J53J62j02L50j48j62J24m9k02L11l15J31J81j61
7574ij47k20L05L33n32L94L3j21p2j39K9j27M58l16j6K12k15L36l79K6J86K53
7596B72m62J18o6J32L98l58J80k42r6K44J12P0n37R9K27m40J19O6J90km7K22j03
7619I6m32N53j04MJ17j21J97m31L37Q9m39J91j9N6O0m89M51K40m70J71Q0l2J26
7642B31L1j64j12O6j8k2k5j59J2K96o1j35kJ25J43k23J39j80J65o7J55k35p1j88
7666b99N1K18K6P1m7J6J03N6k35J5J6mj84K03o5j4J57j84O9oK3l9K2M8o8J57j75
$$ plain form
7510 374 -41 -32 214 -198 33 -101 -51 12 -89 123 -12 -51 -163 184 99 161 -151 110 -86 253 56 258
7532 258 -224 -56 72 -140 69 -122 135 236 -129 230 122 58 -78 -30 157 17 130 93 -95 49 -42
7553 -42 -103 52 -60 -168 -189 24 -282 -129 33 -69 281 133 -29 95 46 -156 155 -160 -29 152 -9
7574 -9 -156 -376 -71 262 -270 124 157 36 -36 -175 -146 -273 185 -131 -147 65 -150 186 -193 -167 19 272
7596 272 -190 -72 -138 -6 392 34 214 -28 -124 120 232 302 -235 -136 91 -349 -230 -164 26 24 -23 199 96
7619 96 -336 217 113 117 234 113 310 -121 216 305 -134 57 38 94 154 -335 116 356 -114 57 137 105 231
7642 231 262 98 -14 52 34 12 -13 -172 -160 136 75 -60 -62 63 206 -17 122 -58 107 40 195 -40 -111 -299
7666 -299 -248 -30 -4 67 20 36 139 195 -40 -25 -9 -13 -197 6 -59 -73 84 -100 -31 -37 -14 -53 -31 17 -51 106 -69
7693f9J21Q3o3j32k9k8J61J83k1k15n4k45L72j16J05J86k26Q4r5M1m0J56M8l04
7717i7K3K83j00J47L2l33K18p5l7J37k12K0M3j75J98L7q1j28J82n8j3k51J58P4
7741hj2N1p0n2K53j00j13l4M0o2L03J6k41J69j48M5K74k50j2P2m07L71o3L08j092
7766g62O30r1N07l52N58q76P94q00Q60r26N46m58o30O24K04K8n77J526l15p62
7786b72q72J736q6o00m63N55L8K93K10n00J64J18j022Q32K07J45n59m1M58q38
7806d97J035n30k85l39P27j37Q11m47k35r6j25j55J12j91L14O14o77j7j36J59
7826i5L89p98O40o74J62P10l99j36j9k25K02K14j43N15l28k44K54K42j27k4p31
7847f15P50m36K8N78m68O04k17m69O30j104P10j75O06j064K42J17l25L58k8l18
$$ plain form
7693 -69 52 135 72 -60 -89 -117 44 227 206 -9 -63 -308 64 -52 53 239 13 97 2 43 3 159 207 -97
7717 -97 -74 209 109 256 288 -45 173 98 61 198 -14 6 49 -126 72 109 28 -100 82 24 11 -240 -82 -8
7741 -8 -20 31 -39 -91 162 62 -51 -85 -45 -107 196 212 -29 140 -8 37 311 61 49 121 -286 85 22 330 -762
7766 -762 -132 -223 284 -68 490 -386 408 -392 468 -458 88 -370 -1000 -376 -172 -144 -721 805 490 -272
7786 -272 -1144 592 506 -94 -557 -2 36 329 539 39 203 321 -701 131 338 483 -76 -117 341 -497
7806 -497 538 8 -277 -616 111 -26 785 338 103 7 -118 -273 -161 -352 -38 576 -101 -118 -254 -95
7826 -95 294 -504 136 -538 -376 334 -65 -201 -220 -445 -243 -29 -172 343 15 -229 25 267 140 116 -615
7847 -615 135 -301 -273 305 -163 441 224 -245 385 -719 -9 -184 422 -642 -400 -283 -608 -250 -278 -596
7867e96O53l09l71Q37l86n2n7O25j100J65O98l26M50k19j4L12j39n19K53l3K27
7888I9j72K13l23K58L40r9m92N82o28K44J16K2J64J2j069Q33j99n4L65l62j41
7909b91j76L97pO99P7l79j072O99P70q71n27M17l4j52QL60k90Q88p03P37o07j09
7931a66J95k87O1N14k10j08j033J264L17r09O69m99K87k80J55R7K07J07o95J36
7951a78Q54m32l03L93p17q8M84O03p43R17o46m78j10q6J028q95Q50p87l43M92
7971a85K73l70n58J369j83q73R07j018J342j53L57p54m20m93O58Q2L63j97J9M46
7991F12j035P20q93J357j105M88J82l32j24M1K65J95o13K0O23q76N16k14N3K4
8011i6J03p7K17l07J58l67K21K72k01J34p7k5K17m43M90j80j70M11k44K20m80
$$ plain form
7867 -596 57 -252 -623 214 -172 -224 -281 344 -756 -591 107 -219 231 12 -2 310 171 -348 -95 -128 99
7888 99 -73 140 -183 75 415 316 -176 406 -222 22 138 160 324 336 -733 100 -99 -153 212 -150 -291
7909 -291 -467 -70 -77 622 699 320 -752 -53 717 -154 -681 -264 -298 -450 -442 -82 -372 516 -187 550 -57 -166
7931 -166 29 -258 -197 317 107 -1 -1034 230 547 -362 307 -192 95 -185 -30 67 274 381 -314 -178
7951 -178 676 244 -59 334 -383 -471 13 616 -127 790 144 -334 -444 -530 498 -397 453 -334 -677 -185
7971 -185 88 -282 -840 529 346 -527 380 -638 704 551 908 154 -266 -759 -101 -19 344 147 166 612
7991 612 -423 297 -596 761 -344 144 326 -6 -130 -89 176 371 -242 -222 401 -475 41 -173 -120 -96
8011 -96 7 -70 147 -160 -2 -369 -148 124 -77 57 -20 -45 172 -271 219 39 -131 280 36 256 -224
8032b24O28k74j20j52N99l91j64M35n74K90k90J53K16l15J63L07k76j77L93j47
8052H0J1l44N0K74K14j46j70k39J39l4j66K17N44l70K7J39M3k59L19J5k86m23
8074c65K05k82M51j76O36o24n9L72p23K05p4N18l80L65J78K29k02j004N43j15
8094c02m45M43J091j073N32J23l24K74o32k72Q59K15j01l94l74J161j115Q6j29
8113c77o5N68K10j76j95r2J75M96l41k19o83N50N80j4n56j89kK42J18L5m26K55
8135a06L30k33J48K89o09R3l08O41n32K74j7K14J36l00J64J0k85J73J40n28j3
8156c19K58L7p36P22K70m51j36K22K86l11M4K33nl35M0Q0M05k38j84L85k27M7
8178H7O1j23N2j08O1P6k6K0j07J61o8N9p0
$$ plain form
8032 -224 404 130 10 -142 457 66 -98 337 -237 53 -237 -84 132 -183 -20 287 11 -166 227 80
8052 80 91 -253 -203 71 285 139 -31 -270 -131 -165 -331 -114 430 60 87 226 269 10 329 344 58 -365
8074 -365 -160 -442 9 -167 469 -155 -214 158 -565 -360 -434 84 -296 69 247 476 274 -730 -187 -302
8094 -302 -747 -304 787 -286 246 369 45 319 -313 -585 274 489 388 -6 -380 781 -334 -248 -377
8113 -377 -442 126 336 160 -35 -127 48 544 203 -16 -699 -149 431 417 -139 -328 -330 -88 30 65 -361 -106
8135 -106 224 -9 139 428 -181 -88 -396 245 -287 -13 -30 184 320 20 184 194 -91 82 222 -306 -319
8156 -319 -61 -24 -760 -38 232 -219 -355 -133 153 -158 -114 119 114 -221 -181 -101 304 66 -118 267 40 87
8178 87 148 25 77 -31 30 106 80 100 -7 154 86 145 75
8191G5
$$ Imaginary data points
##PAGE= N=2
##DATA TABLE= (X++(I..I)), XYDATA
0@%%%%%%%%Qj5J5j6K3l1L3m1N5p0Q6j02J18j42J70k02K38k77L22l70M27m92N64
31C01o43P31q29R38j059J190j334J493j667J857k065K292k540K812l108L431l786
48a986M173m597N065n580O151o785P489q283R185j0213J1400j2792J4450j6460
62h783J8963k2178K6475l2554M1880n8179R4951l32113q7080K06018k78364J71554
74b59410o1793o7638K40048M0896j41607J17160J4791M6390R9950Q834j3574J9880
86D3927O2498P5905p4571Q1245P6455j66073N5396J53355j15668K3554j0026j35048
98G0949J47812N3927j67408K4344m2955k9221J52856q6963j30869M9448j8173
109B3747Q1355J5540j94600O2100R6170j07911O3140K313j22816Q8169K0247p4535
$$ plain form
0 0 0 0 0 0 0 0 0 0 8 -7 8 -8 15 -16 17 -24 31 -39 47 -55 63 -79 91 -111 127 -150 172 -198 229 -263 301
31 301 -342 389 -440 498 -561 629 -705 788 -879 978 -1087 1205 -1335 1477 -1631 1800 -1986
48 -1986 2187 -2410 2655 -2925 3226 -3559 3930 -4353 4832 -5381 6019 -6773 7677 -8783
62 -8783 10180 -11998 14477 -18077 23803 -34376 60575 -271538 -358618 -152600 -430964 -259410
74 -259410 -321203 -388841 -148793 -107897 -249504 -132344 -117553 -71163 28787 37621 24047 43927
86 43927 106425 182330 107759 189004 265459 99386 154782 308137 192469 216023 205997 70949
98 70949 218761 272688 105280 129624 86669 57448 210304 123341 -7528 41920 23747
109 23747 105102 120642 -73958 -11858 84312 -23599 39541 41854 -80962 7207 27454 -47081
121d7081N5689k8894m2964L6670l1614J0931J5200m3881q920m9767M7245R9643
133A2257j56179n2289J38531o1544J5267P1130j63409M1627J58340r5572P095
144h4746M2360q9790J08570Q5887j16977J1709P0313O933J5297j9463K2286L0084
156H2463l0345L6456L027l3236O3871l0925n5024P4445k4690k5867N1158r2673
168A8660j2768J14776o0366o6291K0651j0894M7459q213q6846K9890J9650j4783
180i075L3121n7728l1073P0263j3982j5640J141m7506N3892L7917q4661R601M6256
193g474j9690K487j7415n726M0447k0671j3481J4956j9012L2085J5733n1694J5750
206c3705K5934J620K4648m8336j8505R0058m527n7125J8508P664K0589K2543m5318
$$ plain form
121 -47081 8608 -20286 -63250 -26580 -58194 -47263 -32063 -75944 -84864 -134631 -87386 12257
133 12257 -143922 -196211 -57680 -119224 -103957 -32827 -196236 -154609 3731 -91841 -84746
144 -84746 -42386 -132176 -23606 62281 -54696 -42987 27326 34259 49556 30093 52379 82463
156 82463 52118 88574 91601 58365 122236 91311 36287 110732 86042 60175 111333 18660
168 18660 5892 120668 60302 -5989 14662 3768 51227 43014 -43832 -13942 5708 -9075
180 -9075 24046 -33682 -64755 5508 -8474 -24114 -22973 -70479 -16587 21330 -63331 -53730 -7474
193 -7474 -27164 -24677 -42092 -47818 -7371 -28042 -41523 -26567 -45579 -13494 2239 -49455 -33705
206 -33705 -7771 -6151 18497 -29839 -48344 41714 37187 -19938 -1430 6234 26823 49366 4048
219D048o998L1464J090J3512j9940l3919L5166K4020k2403j9643j2791L3167J8099
232D4872n3082l704L5077j1470o920o906j1779K6205K699k4295K441k784J3604
245C958K1317l4158k5272L2540K4287r492l8132j1661M4459J3702l5523j1369
257b5344M790J4569J4312j9453j9223R449J2317J0957j3818k5626J9453K9137
269A1520j7780k0693J0869K4226O645k5570o465L0370J2320j1715j1947j760J9262
282A9282J7153j0496k1977n529K6518K1613k5049l3503J5124L1919n276l0332
294e53j1381J8839J2471j5291j5547q84P244O261p936j6594j23J8041N487k2644
308b2610j4913K2642K3186j7224k7901Q344L0191N763k3351j3028J3796J9868
$$ plain form
219 4048 -2950 28514 29604 43116 23176 -10743 24423 48443 26040 6397 -6394 26773 44872
232 44872 -8210 -11914 23163 11693 4773 -2133 -13912 12293 14992 -9303 -6862 -9646 3958
245 3958 25275 -8883 -34155 -1615 22672 13180 -24952 -36613 7846 21548 -13975 -25344
257 -25344 -20554 -5985 8327 -11126 -30349 -20900 -8583 2374 -11444 -37070 -17617 11520
269 11520 -6260 -26953 -16084 8142 14787 -10783 -17248 13122 25442 13727 1780 20 19282
282 19282 36435 25939 3962 -1567 24951 46564 21515 -11988 3136 35055 29779 -553
294 -553 -11934 6905 19376 4085 -11462 -12346 -5102 1159 -6777 -23371 -23494 -5453 34 -22610
308 -22610 -37523 -14881 8305 -8919 -36820 -28476 1715 7478 -15873 -28901 -15105 4763
320D763L787j4410j3258R280K4262M791k2496j2642K2791K1439j5977k1455J0534
333A409K2211j786k0210m511J7722R245j0880j1387j708J1893J4254j2229k3604
346i581K840K3751R087k4831k4752J8859K7024j2502k3548l039J5741J3939j1637
359A351j6504N283R037N724m367j7940L869K2890m534j9462n595J5165J9663j7398
373b818k6889J5820K0754m644j2925j4949R276K2884p916j5282o232L380K5858
386F317Q72l1437M345K2889P006l994j8705Q649L1418j0268j4967J1652L424J3089
400C0290J658k4363R568K0227l919q41k1582l466L6726p037l2870j672K903J7353
414B2975j196m1829K764J8519r939k45j5442j5631K6874l138j8686N592p835J3708
$$ plain form
320 4763 8550 -5860 -19118 -9838 14424 19215 -3281 -15923 6868 28307 12330 -9125 1409
333 1409 23620 21834 1624 -2887 14835 24080 13200 1813 105 11998 26252 14023 -9581
346 -9581 -6741 17010 26097 1266 -23486 -4627 22397 9895 -13653 -16692 -951 12988 1351
359 1351 -15153 -9870 -833 4891 524 -17416 -13547 9343 4809 -14653 -20248 -5083 14580 -2818
373 -2818 -29707 -13887 6867 2223 -10702 -25651 -16375 6509 -1407 -16689 -22921 -19541 6317
386 6317 7189 -24248 -19903 2986 9992 5998 -12707 -4058 27360 17092 2125 13777 17201 30290
400 30290 31948 7585 17153 37380 33461 32620 11038 7572 44298 37261 4391 2719 5622 22975
414 22975 21779 -20050 -17286 1233 -8706 -8951 -24393 -40024 -13150 -16288 -34974 -29382 -37217 -23509
428b3509J4670l5050O741L2626j1852P49q065m540M3459n620l2698K1396L464
441A771Q438K3999l7474j0064L8803l690j593j0895k4178L4059J3026l3293K467
454A376l057N785J6893k9574j410K3962k1846J0448L590k9053L7146N575m4524
467b4689K6288O210r604L1859l6990j9262N8796q539k1074P643k2443K7132K4413
480C9740m1717j630N372k659L1617k8365k9395L2499o603o48Q106l6292K0834
493i141K2148l9588J5501Q374k0777K7029k1263j6061M7072k0671j4161K4746
505C208l3976K8182L8486o3529O984L5030k3170L3197j1002n4986N1762K3283
517C3469l5334J0996j4960k936L8934j6037j4848J448k794L0286j7494k2557L4264
$$ plain form
428 -23509 -8839 -43889 -37148 -4522 -16374 -15625 -23690 -28230 15229 9609 -23089 -1693 1771
441 1771 10209 34208 -3266 -13330 25473 21783 20190 9295 -14883 19176 32202 -1091 1376
454 1376 -1681 4104 20997 -8577 -9987 13975 -7871 2577 6167 -22886 14260 19835 -24689
467 -24689 1599 7809 -1795 30064 -6926 -26188 32608 24069 2995 10638 -11805 15327 39740
480 39740 -1977 -3607 1765 -894 30723 2358 -27037 5462 -1141 -1789 6317 -29975 -9141
493 -9141 13007 -26581 -11080 -2706 -23483 3546 -17717 -33778 13294 -7377 -21538 3208
505 3208 -30768 -2586 35900 -27629 -20645 14385 -8785 24412 13410 -41576 10186 33469
517 33469 -1865 9131 -5829 -8765 30169 14132 -716 732 -2062 28224 10730 -11827 22437
530B2437k0953o127L5008m6244J1652M4973o6504Q023N0580m8985J5039J5931
542A4830n8199M2348L0982n2172P296J20n336M0451k3894l0699K0139K686K2336
555A0888l360m4963K9852J7428j7422K6243k5639j5516M9339j9278j2559K6885
567B1898k6020J0627J9812l6800K6995R603m0720K5944o176j2615M4168m1074
579d358l1907N4596j6518p110K0443n4241J2057N7791l4535j3838O085j4918L6905
592A0452O054l0941K318K494K0838J1095l4283J5017J0241k3616L5998p540l6179
605a8052M6371j5066l4348N2702j4187k9899L0507k7922k701M6769l4887k5259
617b5972J8013m068K2276l527m0751J2263J4222J0052J0976m1167k011M1434j1017
$$ plain form
530 22437 1484 -4643 30365 -15879 -4227 40746 -25758 -17735 32845 -16140 -1101 14830
542 14830 -43369 -1021 29961 -22211 -14915 -14795 -20131 20320 -3574 -34273 -14134 -11448 10888
555 10888 7528 -37435 -7583 9845 -7577 18666 -6973 -22489 26850 7572 -4987 21898
567 21898 -4122 6505 26317 -10483 16512 26115 -14605 11339 5163 -7452 36716 -4358
579 -4358 -36265 18331 1813 -5297 15146 -39095 -27038 30753 -3782 -17620 -11535 -26453 10452
592 10452 16506 -14435 -12117 -9623 11215 22310 -11973 3044 13285 -10331 25667 18127 -18052
605 -18052 28319 13253 -21095 31607 17420 -12479 18028 -9894 -12595 34174 -713 -25972
617 -25972 -7959 -12027 10249 6722 -34029 -21766 -7544 2508 13484 -27683 -29694 11740 723
630G23L821l9l1084L1580K1626l1554J4303J059j5999K6369q849r473K1340k1431
644B392l785J6151j3444J4497m682l8382K4245J7074j8117O107k4552j1153M6087
657A2438n840k7623L205q648K0932K1523l1386p726J2789L910J8257j1348j9285
670a8802K0989Q02j478J3542j6259M206J4874k0218J0431J3992j8834M235k121
683E359q253K5569n258k3850M293J388J3082P231k9607o940K1874K145M975j5495
697c487j9264K3052J2260j3408j353r211L373J9556j1655q707R173o286O816J848
711B707j1151J1113J465j3773N842K373J824M537j4788m738J7450J629m467r000
725h977q948J8997J0531j3818o343k355J0328J5484j4445j3747J1961N383J858
$$ plain form
630 723 4544 4505 -26579 5001 26627 -4927 9376 10435 -5564 20805 11956 2483 23823 2392
644 2392 -1393 14758 1314 15811 11129 -27253 -3008 14066 -4051 2056 -22496 -33649 12438
657 12438 6598 -21025 -17820 -26468 -5536 15987 -15399 -23125 -10336 -6426 11831 483 -18802
670 -18802 2187 2989 1511 15053 -1206 3000 17874 -2344 8087 22079 3245 7480 5359
683 5359 -2894 22675 17417 -6433 -2140 -752 12330 19561 -10046 -16986 4888 7033 12008 -3487
697 -3487 -22751 301 12561 -847 -2200 -11411 -8038 11518 -137 -8844 329 -5957 859 2707
711 2707 -8444 2669 4134 -9639 -3797 -1424 400 4937 -9851 -14589 2861 4490 23 -8977
725 -8977 -17925 1072 11603 -2215 -8558 -10913 -585 14899 454 -13293 -1332 4051 5909
738E909Q00j4090O084J3400p220m299K037J266M395l562o896N942N753k735p328
753e44n693J1645O608j1786n575L39O605R491r975j4260R045R554k531n514o335
768h926K126J1321j160j1548r66P169P006o726o626L903N624J702m172q301P165
783b409J0283o272p962K806M309N150l290r767L298J0772J606q873m282N007P203
798G579q63q101l057O283P590p865n918K776P300j97n078o112K864J0490l324
813D367j0327M19N797N301m720p164n51P560N098p450p338N161P877j339n670
828b979k997L206P241j925r439K959O315O95l458m755K062Q376n10o939k996O095
844I51O597l105r417L257N901K683l641q305K029J1241j713p082k094R56P416
$$ plain form
738 5909 6709 -7381 -1297 12103 4883 584 2621 3887 8282 4720 -2176 3766 9519 6784 -544
753 -544 -6237 5408 12016 230 -5345 -5006 1599 11090 1115 -13145 -4100 5454 2923 -2591 -8926
768 -8926 -6800 4521 3361 -8187 -9153 -1984 5022 -1704 -8330 -4427 1197 2899 -1273 -9574 -2409
783 -2409 7874 1602 -6360 -3554 755 5905 2615 -7152 -3854 6918 8524 -349 -4631 376 7579
798 7579 6716 -1385 -4442 1841 9431 1566 -4352 -1576 5724 5527 449 -5663 -2799 7691 4367
813 4367 -5960 -5541 256 5557 837 -6327 -6878 682 5780 -1670 -9008 -3847 4030 2691 -2979
828 -2979 -5976 -2770 4471 2546 -6893 -3934 2381 3076 -382 -5137 -3075 5301 4791 -2148 -5144 951
844 951 7548 4443 -4974 -1717 4184 6867 3226 -5079 -3050 8191 6478 -604 -2698 -1742 5674
859E674N57r708o74O548J971l050o483O95Q391j339o332k607K333P019n91j1678
875i274K476P963K32j689p101j635J2625O6r277K40J203N959L792j1166j416R556
891B554R10n99m865l317J0390K254q864K72Q47M516L685j1832k72R828k060j19
907C328m234n474J2404K873j1746J672J46L817O354j1756l245J1205j389q71j834
922A250p991J0656M672j1353K72J604N02O163q264o342J0958o72k747j018p589
937i899R913M890j3240J829J950M82R336j0168p757J4330j838k464L422j0921
951a0135Q693J1600j4496N00O249l309R650n206j0586J3207K114n965L180q370
965b874N541J0503j3411l20L829l696J0675p412j2585J5334q10o596P097j1866
$$ plain form
859 5674 6231 -3477 -4151 2397 4368 1318 -5165 -4470 3921 2582 -3750 -6357 -4024 2995 2404 -9274
875 -9274 -6798 1165 1397 -292 -7393 -9028 3597 3663 -5614 -5374 -4171 1788 5580 -5586 -7002 2554
891 2554 3464 2865 -2000 -5317 5073 7327 -1537 -1265 -418 4098 7783 -4049 -4321 5507 3447 3328
907 3328 -906 -6380 6024 8897 -2849 -1177 -1031 2786 9140 -2616 -5861 5344 3955 3084 1250
922 1250 -6741 3915 8587 -2766 -2494 -890 -388 5775 -2489 -8831 2127 1455 -1292 -2310 -9899
937 -9899 14 4904 -8336 -6507 -4557 -4075 5261 -4907 -12664 1666 -172 -2636 786 -10135
951 -10135 -1442 10158 -4338 -3838 2411 -898 8752 3546 -7040 6167 8281 2316 5496 -2874
965 -2874 2667 13170 -241 -561 3268 -428 10247 2835 -9750 5584 4774 -1822 5275 -6591
979f591L036J5258j5826k527R737q208Q134K80j5937J2790N691j0043M968o006
993e244Q00J4487j1733n326Q188l896Q044j837j5659J2203M780q290P742r229
1007d970k508J7577j1880n681J0759r478O727N271j7941J1205P517j3928P748
1020D18j406n129J5537r328r757J3554k344N40L555j3419N992J2289r112J478
1034B868m486k010J4934m919r967P293m954M895R119j8944O058J0144j3991Q672
1048D712J8j3913J6776l209j5339J5321k044p602R147j0525P53J4297j0733k515
1062d856J283m523J1628m30j4822Q052O53P29R569j7128q97J6614p366J336J416
1077A258j2250J3216N061j3758Q782j676m823J0514p157l032J3284j0066j689
$$ plain form
979 -6591 -3555 11703 -4123 -6650 3087 -5121 3013 3293 -12644 146 5837 -4206 762 -5244
993 -5244 -4444 10043 -1690 -7016 1172 -2724 5320 3483 -12176 27 4807 -3483 4259 -4970
1007 -4970 -7478 10099 -1781 -7462 3297 -6181 546 5817 -12124 -919 6598 -7330 418
1020 418 -988 -6117 9420 92 -9665 3889 1545 2085 5640 -7779 -1787 10502 1390 2868
1034 2868 -1618 -3628 11306 6387 -3580 3713 -1241 3654 12773 -6171 -113 10031 -3960 4712
1048 4712 4730 -9183 7593 4384 -10955 4366 2322 -5280 3867 -6658 -5905 8392 -2341 -4856
1062 -4856 -3573 -8096 3532 3102 -11720 -3668 -3015 -2286 7283 -9845 -10742 5872 -1494 -158 1258
1077 1258 -10992 2224 7285 -6473 2309 633 -4190 6324 -833 -3865 9419 -647 -2336
1090b336P340q027Q421L657j7655R509P883p050M937q730m398J6127k604q510
1104a436J759n332R413O728j3380Q84J846j238R896p947q536J1264m116j850P393
1119E348j1093J759P840j1533M349O738r031L567o08n692J1928j591j0784M469
1133d334j697O169O128j4154j618J0139n72K899l346j0350J2004N781n814P22
1147A957n508M59J1351n763l384L375l471M508k21o230P824j441o208O933k139
1162B042p80N973r077k383J1121k352k352j657n621P740P256q509m096J320J601
1177B26P575o537o561M489L46L285l06q338K476N295l725J085j285k657M068k221
1193b785k753N215j855j617J476m598O177K807p431J169K569n03O502m712q267
$$ plain form
1090 -2336 5004 -3023 5398 9055 -8600 909 8792 1742 6679 -2051 -6449 9678 7074 -1436
1104 -1436 323 -5009 4404 11132 -2248 -1364 482 -756 9140 1193 -7343 3921 -195 -2045 5348
1119 5348 -5745 -3986 3854 -7679 -3330 3408 -5623 -2056 -2664 -8356 3572 1981 -8803 -4334
1133 -4334 -6031 138 6266 -7888 -9506 633 61 2960 -386 -10736 1268 7049 1235 1957
1147 1957 -3551 -3092 8259 2496 -888 2487 -984 3524 3303 -2927 4897 3456 -2752 4181 2042
1162 2042 1262 7235 -1842 -4225 6896 4544 2192 535 -5086 2654 9910 1401 -2695 -1375 226
1177 226 7801 1264 -5297 -808 -462 2823 2517 -5821 -3345 1950 -1775 -690 -1975 -4632 -564 -2785
1193 -2785 -5538 -323 -2178 -3795 -2319 -6917 -740 2067 -5364 -4195 -1626 -2129 4373 -339 -8606
1208h606Q861L792j726N39o036J407Q612k189n184m46J279M189n15m413M38M20
1224D22K483Q43n368J519M000m348j6K258k204K794q84n370L403M801k953k668
1240a288j311K091N288k296m173p67K319N206j956o853J794L658J95J50m497j766
1256d206O113N83m843R7L23J443R57k470p90J729J385j591l313K877L474k479
1272g11k044J095N05L640k28o096J180N434q7j784j688j057M404J558l960k908
1288b747K816K959n69l734J95J104J672K23m602J38M061L2l736O57l35Q70J836
1305H40k813l301N634J753k515k558J720K167J747k294j464J025L643l6m832J110
1321a74L283O77n70k803j184L917J748m103k432L123J018j03k045k381J732L013
$$ plain form
1208 -8606 255 4047 2321 2860 -3176 -1769 6843 4654 -530 -976 303 4492 3977 -436 2 422
1224 422 2905 3748 -1620 -101 3899 -449 -465 1793 -411 2383 1499 -3871 -468 4333 1380 -1288
1240 -1288 -2599 -508 4780 2484 -1689 -2456 -137 5069 3113 -3740 -1946 1712 1907 2057 -2440 -4206
1256 -4206 1907 2490 -2353 -2256 -1933 -490 467 -2003 -2793 -1064 321 -1270 -4583 -1706 1768 -711
1272 -711 -2755 -1660 -1155 2485 2257 -3839 -2659 2775 2688 904 -784 -1841 2563 4121 161 -2747
1288 -2747 69 3028 2459 -1275 -1080 24 1696 1919 -2683 -2545 1516 1548 -2188 -1531 -1866 -996 840
1305 840 -1973 -5274 360 2113 -402 -2960 -1240 927 2674 380 -1084 -59 3584 3548 -1284 -174
1321 -174 3109 3786 3216 413 -771 3146 4894 791 -1641 1482 2500 2397 352 -2029 -297 2716
1337B716k088k861j143M201R65l265j064n08K130K821m159k338L449R16n2j489
1353a769k330M089J386k207j615R22K715P11l264q29K864R32j013j768j873L914
1369H65K909m989j187J588J062L081l316l648L483J995K32k036k448L427J297
1384B315j417j369O75j15L857k917k182L473l95r73K76j925J826L253l968r56
1400e42R58N63J864k049l864L021J543l27j221l946K542M216l380j629N44p53
1416b460M139j994m101L269J191j596J630k691O64L956l112j891K143l10K535
1431A372j037m199K971K358j589J73k137O75M678l279j349K294r39L345l94o466
1447c523L581K101j196J015j705j499N072k154l264K753j021K126J373n923K015
$$ plain form
1337 2716 628 -2233 -3376 825 1790 -1475 -2539 -3047 -917 1904 -2255 -4593 -1144 -228 -280 -1769
1353 -1769 -4099 -10 1376 -831 -2446 -1524 1191 1902 -1362 -2191 673 1605 592 -1176 -3049 865
1369 865 3774 -1215 -2402 -814 248 3329 13 -3635 -152 1843 2075 39 -2409 1018 2315
1384 2315 898 -471 204 89 3946 1029 -1153 2320 1925 952 1228 -697 1129 4382 414 -542
1400 -542 416 979 2843 794 -3070 -49 1494 1167 -54 -4000 -1458 2758 -622 -2251 -1707 -2460
1416 -2460 1679 -315 -4416 -1147 44 -1552 78 -2613 -1949 2007 -1105 -2996 -853 -1163 1372
1431 1372 335 -3864 -893 1465 -124 49 -2088 -1413 3265 -14 -1363 931 -8 3337 2943 -3523
1447 -3523 58 2159 963 1978 273 -1226 3846 1692 -1572 1181 160 2286 3659 -2264 -249
1462b49M111l857L61q91j165M570k271l829K406j061J914J394n076J490M127l501
1478a527J777j562k006O480j989l561L707j867R60L680o604J225N546l524J24
1493H59M40m148N288M41n459K352j25j57K357m528l57M346k650LK89l814N226
1510C63N88n484L697l66q97N458n447j125N342k359K00J843l322M214K212n714
1526g97K232K510l297L811l315j852N523k556r10L5k662K551J424m790L27K266
1542E00k193K944l612k566N505q68j372L37k447K227L912m892N03K525k370M015
1558B148k379k889M927l67r96K463l252J96N515o221K63J883j579J228M18m808
1574c450M493J052k565P43k218J612K693l476n65K177j303K537j136m367M795
$$ plain form
1462 -249 3862 5 366 -525 -1690 2880 609 -3220 -814 -1875 39 1433 -3643 -2153 1974 -1527
1478 -1527 250 -1312 -3318 3162 1173 -2388 1319 -548 412 4092 -2512 -1287 4259 735 859
1493 859 1299 -2849 2439 2880 -2579 -227 -352 -509 1848 -2680 -3037 1309 -1341 -1338 -1049 -4863 363
1510 363 951 -4533 -836 -1202 -2099 3359 -2088 -3213 2129 -230 -30 1813 -1509 2705 4917 -797
1526 -797 1435 3945 648 4459 1144 -708 4815 2259 1349 1384 -1278 1273 2697 -2093 -1766 500
1542 500 -1693 1251 -2361 -4927 578 -290 -1662 -1325 -3772 -1545 2367 -2525 -2022 503 -1867 2148
1558 2148 -231 -3120 1807 1440 444 2907 -345 -149 5366 -855 -592 1291 -288 940 1358 -3450
1574 -3450 1043 2095 -470 273 -1945 -333 2360 -1116 -1681 496 -807 1730 594 -3773 1022
1589A022J209j874J847j496j957N844l335j357K742j636J138L33l973K130K224
1604B861l158J636r63j134L591m188j160K872n30N8p8l044K109K889m253N24n8
1621b026M76L373k301k608J711L40K030N83m558J264L208k960J455J3k073L825
1637A752r22l850M172j140q49J528j580L51M563l271j368P22r24K802m62l498
1653a974K011J074J041l36l800Q15M033p56k145O70j730L062M87l171Q07L53o84
1670b43K231k268j166L036j669j010J753j790J735l20k610J637J855j827J21j285
1686a820J9K697k16k461Q8J08K312P91l589q6J962R71L82k070j171K964r75j06
1704b00P62j916J398J695k074J52J469j516R99o83j278K661n73j935M94J250P23
$$ plain form
1589 1022 2231 357 2204 708 -1249 4595 1260 -97 2645 1009 2147 2480 -1493 637 2861
1604 2861 -297 1339 376 -758 2833 -1355 -2515 357 -173 -115 -193 -3237 -1128 1761 -2492 -1968 -2026
1621 -2026 -1550 1823 -478 -3086 -1375 -1035 995 1578 -2980 -1716 1492 -1468 -13 0 -2073 1752
1637 1752 830 -3020 1152 12 -837 691 -889 -538 4025 754 -614 108 -816 1986 1524 -1974
1653 -1974 37 1111 2152 1816 -1984 -1169 2864 2108 -37 633 -1097 1965 2452 -719 88 441 -243
1670 -243 1988 -280 -1446 1590 -79 -1089 664 -1126 609 289 -2321 -684 1171 -656 -535 -1820
1686 -1820 -1801 896 680 -1781 -1693 -1585 727 1518 -2071 -2157 -195 776 1158 -912 -2083 881 -94 -200
1704 -200 562 -1354 44 1739 -335 -183 1286 -230 769 86 -1192 1469 896 -1039 -545 705 1428
1721A428J49k800J62K251J96k09j740j249K606J137j617j073p39J719J436k226
1737e69j080J509l28M23k31j018J154L01j283N74j00q1Q27r63o49J676L98o92
1755a32j018k91K179R18j964m75N16J461Q47j809r64J102Q34K75p74j358J187
1772E34J596j089q05r3O98N35j091p93R69P7k99n76m45P92L93r83m73K0O64J046
1792F77j385j509J478J215n46j002m14J315J096q80p61o22J136M51o08o58M26
1809e91R34M07o68j151O05J224j330n64l97J792j47p06j077P11J621m15O4j350
1827a038Q41J097J33n61j89K77J836r79j336J110R73k14q82k43O97J375j330q46
1845G21K93m19P30l95j906R6R00j26q47j847L00J902r04j261n2L58J007l9j226
$$ plain form
1721 1428 1577 -1223 -1061 1190 1386 1177 -563 -1812 794 1931 314 -759 -1498 221 1657 -569
1737 -569 -1649 -140 -468 -45 -276 -1294 -140 161 -1122 -548 -648 -729 98 -865 -1514 162 560 -132
1755 -132 -1150 -1441 738 1656 -308 -783 -267 1194 2041 232 -732 370 1204 1479 705 -653 534
1772 534 2130 1041 236 143 841 1376 285 -508 461 538 239 -337 -782 10 403 -580 -1053 -1033 -369 677
1792 677 -708 -2217 -739 476 -70 -1072 -1486 -171 925 45 -716 -1338 -202 249 -359 -1017 -591
1809 -591 343 750 82 -1069 -464 760 -570 -1134 -1531 261 114 -592 -1669 -958 663 248 312 -1038
1827 -1038 -197 900 1033 472 283 560 2396 1417 81 1191 2164 1950 1068 825 1522 2897 1567 721
1845 721 1014 595 1325 930 -976 -880 20 -106 -953 -2800 -2500 -598 -1502 -2763 -2815 -2457 -1450 -1489 -2715
1864b715P26Q23k80O91o29o6J809M87o98L37K58R51j063j07P08O94n05J23q18
1883G26m44K040r87q53m39K76O47L09k232p28J641K09m51r24N5Q41K50j901J485
1902d80p22M62J128j195J40J120l04J028n92o24J758m2k158J027L92O75J09k630
1920i08M88J731r30l96q55q98J793M4j342k9m44P26J352k085o20J938q4l90J23
1939g86l86J283J45j125J108j38L93O70p74o15J945o80J47n81j016J870R38k746
1957c48L56M60n9J473k097q71J617l07l64L62j455P25J425j589K8K17r7J494j236
1976b66r63J876j78p88K34q17J003R03j758P5Q47n55J054j073j098J442N28n46
1994h0K3j557J078J929k230l75R15j06Q22l38j102J342J48k61O51j072J58J698
$$ plain form
1864 -2715 -1989 -1166 -1446 -755 -1384 -1450 359 846 148 485 743 1694 631 524 1232 1926 1421 1544 726
1883 726 282 2322 1335 482 43 319 966 1275 -957 -1685 -44 165 -286 -1210 -1155 -314 -64 -1965 -480
1902 -480 -1202 -740 388 -807 -667 453 149 1177 585 -39 1719 1677 -481 546 938 1613 1722 -908
1920 -908 -420 1311 381 -15 -870 -1768 25 69 -1273 -1302 -1746 -1020 332 -1753 -2373 -435 -519 -909 -786
1939 -786 -1172 111 256 -869 239 101 494 1164 390 -225 1720 1040 1187 606 -410 1460 2398 -348
1957 -348 8 468 409 1882 -215 -1086 531 224 -140 222 -1233 -508 917 -672 -644 -427 -524 970 -266
1976 -266 -1229 647 469 -319 -85 -902 101 1004 -754 -679 168 -387 667 -406 -1504 -62 466 -80
1994 -80 -57 -1614 -536 1393 -837 -1212 -297 -403 419 81 -1021 321 469 208 859 -213 -55 1643
2012A643j437m94P22K37P99o56j858J316J053j766Q17m61k70J645j241r19R68
2029I8o80J321K18k435J272J117r98L93j018L30J448r68q16R86n72J84P29j899
2047a290O86J323j304P22n63j172K482q93j660J501Q4L8K13j477J359Q64j089
2064a76N9M8J07Q59Jj602J033L31L11J023j928J81O77k07n29J56o93J293r4j676
2084h26O19K68j052J128j094J80J032l43j068L10p32J921J24k658J353O76L44
2101A82k30p15j84J061k84k0O94j003P49P25j664N28Q72n64P45p75p47J802j7
2120A155j452K17m65N86J322j506L21N17k19P72j206l02J127m24k28o94n51J138
2138A08J112k215M08P94j24L51o89r31J441o91p31J417q80L61P02q73o68Q13Q
$$ plain form
2012 1643 206 -288 434 671 1470 814 -1044 272 1325 -441 376 -85 -355 1290 49 -870 98
2029 98 -582 739 957 -1478 -206 911 -87 306 -712 -382 1066 98 -718 268 -304 -120 609 -1290
2047 -1290 -604 719 -585 137 -426 -1598 884 -9 -1669 -168 -84 -46 167 -1310 49 913 -176
2064 -176 -117 -69 38 897 898 -704 329 660 971 1994 66 247 924 717 188 344 -349 944 850 -826
2084 -826 -207 61 -991 137 -957 -777 255 -88 -1156 -846 -1578 343 467 -2191 -838 -162 182
2101 182 -48 -763 -947 114 -170 -190 504 -499 250 975 -689 -161 711 147 892 117 -630 1172 1155
2120 1155 -297 -80 -545 41 1363 -143 178 695 476 1248 42 -260 867 443 215 -479 -1030 108
2138 108 1220 -995 -587 207 83 434 -255 -1186 255 -436 -1167 250 -630 -269 433 -440 -1108 -295 -287
2157b87m24j77K44R56K05o65l14K1K05O94j267J164L27k39N5p92r78K109M16q81
2177C72p46r25K195O3j246J41N38K9N32p42k73P73j449MO67K25J79K56q58m25
2197f90J034L51m69o15p23Q19N26q71j58L10j61J070m53q29O82J57K60l66p23
2216h49J86O48j79m98P5J06P49m31j63N88PJ14j9l64R7O40m53l51L40M81L02k37
2238G89o89Q0O37j23n06m80L67P31m81o78J48n3P91p31n15K61M49J46l28m57Q3
2259e59P80j41n98J91J27L46j88n92O23l19K42Q4p11N84J168n38j43j109J314
2278E61k95O6j182L52J240p01J16m55p66J232M30j040k09K69M65K15k18p30J346
2297F96L52j235j86q9J362m74n94M88L75n29R1R88k443J476M63j027N25n67J081
$$ plain form
2157 -287 -711 -888 -644 312 517 -148 -462 -441 -236 458 -809 355 682 443 498 -294 -1272 837 1253 372
2177 372 -374 -1299 896 959 -287 -146 392 421 953 211 -62 711 -738 -734 -67 158 337 593 -265 -690
2197 -690 344 695 226 -389 -1112 -293 233 -638 -796 -486 -647 423 -30 -859 -177 -20 240 -126 -849
2216 -849 -663 -15 -194 -692 -617 -511 238 -193 -356 232 239 353 334 -30 67 707 254 -97 243 724 1026 789
2238 789 100 180 817 694 188 -292 75 806 325 -353 -205 -258 533 -198 -713 -452 -3 143 -185 -642 -559
2259 -559 221 80 -518 -327 -200 146 -42 -634 -11 -330 -88 -4 -715 -131 1037 499 356 -753 561
2278 561 266 332 -850 -498 742 41 157 -298 -1064 168 598 -442 -651 -382 83 298 80 -650 696
2297 696 1048 -187 -373 -462 900 426 -168 320 695 166 257 1245 -1198 278 741 -286 239 -328 753
2316G53j242L68j29k00P01j51m50n13J131m18l07m3L78k6J07l70K05j43N03P5
2336B29l29p11P14K66O1k37m89R89l28j14l25M41k67K28k33QL63j9K79l91n25
2357c90Q55N1p04K72q3N23j91n87j16O47l2q1m24k46N47J20k49j79j26K76L44
2378B27l50p04O78J75N0o1j36K16J33j84n0J56l13O12m10j95J95J37j51J85n42
2399c32M93N22o39o10M84K60J59k43q04N94JK87k85l61J90M85j96K9m38JL47K50
2421A94l55K13L67j40l87K30J34M38l29l77N7n9O63m93o63M96K76m6m57k49M85
2442bK75n81j79m4K26M57k21l87N3K83j88K16k37jO39k51n3K31q7P3J25o26P92
2465E13O6m27J81k34k60R91o19m37J17KL25J20r54M28K98l58M2k88J88K38R5m36
$$ plain form
2316 753 -489 -121 -250 -450 251 100 -350 -863 268 -150 -457 -500 -122 -148 -41 -411 -206 -349 154 229
2336 229 -100 -811 -97 169 230 -7 -496 493 165 51 -274 167 -100 128 -105 -97 266 247 526 135 -390
2357 -390 465 516 -188 84 1 524 333 -254 -370 277 245 164 -260 -506 41 161 -88 -267 -393 -117 227
2378 227 -123 -827 -149 26 76 15 -121 95 228 44 -6 150 -163 449 39 -156 39 176 25 210 -332
2399 -332 161 683 44 -566 -82 178 337 94 -710 -116 -115 172 -113 -474 -284 201 5 34 -404 -403 -56 194
2421 194 -161 52 419 279 -108 122 256 694 365 -12 45 -14 649 156 -507 -11 265 219 -238 -487 -2
2442 -2 273 -308 -487 -531 -305 152 -69 -456 -403 -120 -308 -92 -329 -330 309 58 5 236 149 222 347 -279 513
2465 513 579 152 333 99 -161 830 211 -226 -109 -107 218 338 -616 -188 110 -248 -206 -494 -306 -68 27 -409
$$ [...]
8191a41
##END NTUPLES=NMR FID
##END=
