##TITLE=1H_41-2025-Bay
 200.13MHz, DMSO-d6,
 8 sc
 
 28.3.2025
##JCAMPDX= 6.0         $$ Bruker NMR JCAMP-DX V2.0
##DATA TYPE= NMR FID
##DATA CLASS= NTUPLES
##ORIGIN= UXNMR, Bruker Analytische Messtechnik GmbH
##OWNER= pz
$$ XWIN-NMR		Version 3.5
$$ Fri Mar 28 14:11:26 2025 Russian Standard Time (UT+4h)  she@DPX200
##.OBSERVE FREQUENCY= 200.1313
##.OBSERVE NUCLEUS= ^1H
##.DELAY= (6, 6)
##.ACQUISITION MODE= SIMULTANEOUS
##.ACQUISITION SCHEME= undefined
##.AVERAGES= 8
##.DIGITISER RES= 18
##SPECTROMETER/DATA SYSTEM= spect
##.PULSE SEQUENCE= zg30
##.SOLVENT NAME= DMSO
##.SHIFT REFERENCE= (INTERNAL, DMSO, 0, 14.3821)
##AUDIT TRAIL= $$ (NUMBER, WHEN, WHO, WHERE, WHAT)
$$ ##TITLE= Audit trail, XWIN-NMR		Version 3.5
$$ ##JCAMPDX= 5.01
$$ ##ORIGIN= Bruker BioSpin GmbH
$$ ##OWNER= she
$$ F:/spectra/data/she/nmr/H-C/1/audita.txt
$$ ##AUDIT TRAIL=  $$ (NUMBER, WHEN, WHO, WHERE, WHAT)
(   1,<2025-03-28 14:10:20.76 +0400>,<she>,<DPX200>,
      <created by zg, POWCHK disabled, PULCHK disabled
       configuration hash MD5:
       00 E9 B6 7A A2 85 ED C7 34 08 36 98 17 FE 4E 26
       data hash MD5: 16K
       93 B5 F0 E0 25 96 A6 41 19 65 16 ED 9E 13 61 5A>)
$$ ##END=
$$ 
$$ hash MD5
$$ E6 E9 65 9D BF 8D C4 F0 98 ED BA F4 6C 95 C9 94
##$RELAX= 
##$RELAX= 
##$RELAX= 
##$RELAX= 
##$RELAX= 
##$RELAX= 
$$ Bruker specific parameters
$$ --------------------------
##$DU= <F:/spectra>
##$EXPNO= 1
##$NAME= <H-C>
##$PROCNO= 1
##$TYPE= <nmr>
##$USER= <she>
##$AMP= (0..31)
100 100 100 100 100 100 100 100 100 100 100 100 100 100 100 100 100 100 
100 100 100 100 100 100 100 100 100 100 100 100 100 100 
##$AQSEQ= 0
##$AQ_mod= 1
##$AUNM= <au_zg>
##$AUTOPOS= <>
##$BF1= 200.13
##$BF2= 200.13
##$BF3= 200.13
##$BF4= 200.13
##$BF5= 200.13
##$BF6= 200.13
##$BF7= 200.13
##$BF8= 200.13
##$BYTORDA= 1
##$CFDGTYP= 0
##$CFRGTYP= 5
##$CHEMSTR= <none>
##$CNST= (0..31)
1 1 145 1 1 1 1 1 1 1 1 1 1 1 1 1 1 1 1 1 1 1 1 1 1 1 1 1 1 1 1 1 
##$CPDPRG= <>
##$CPDPRG1= <>
##$CPDPRG2= <>
##$CPDPRG3= <>
##$CPDPRG4= <mlev>
##$CPDPRG5= <mlev>
##$CPDPRG6= <mlev>
##$CPDPRG7= <mlev>
##$CPDPRG8= <mlev>
##$CPDPRGB= <>
##$CPDPRGT= <>
##$D= (0..31)
0 0.7 0 0 0 0 0 0 0 0 0 0.03 0 0 0 0 0 0 0 0 0 0 0 0 0 0 0 0 0 0 0 0 
##$DATE= 1743156620
##$DBL= (0..7)
120 120 120 120 120 120 120 120 
##$DBP= (0..7)
150 150 150 150 150 150 150 150 
##$DBP07= 0
##$DBPNAM0= <>
##$DBPNAM1= <>
##$DBPNAM2= <>
##$DBPNAM3= <>
##$DBPNAM4= <>
##$DBPNAM5= <>
##$DBPNAM6= <>
##$DBPNAM7= <>
##$DBPOAL= (0..7)
0.5 0.5 0.5 0.5 0.5 0.5 0.5 0.5 
##$DBPOFFS= (0..7)
0 0 0 0 0 0 0 0 
##$DE= 6
##$DECBNUC= <off>
##$DECIM= 32
##$DECNUC= <off>
##$DECSTAT= 4
##$DIGMOD= 1
##$DIGTYP= 9
##$DL= (0..7)
0 120 120 120 120 120 120 120 
##$DP= (0..7)
150 150 150 150 150 150 150 150 
##$DP07= 0
##$DPNAME0= <>
##$DPNAME1= <>
##$DPNAME2= <>
##$DPNAME3= <>
##$DPNAME4= <>
##$DPNAME5= <>
##$DPNAME6= <>
##$DPNAME7= <>
##$DPOAL= (0..7)
0.5 0.5 0.5 0.5 0.5 0.5 0.5 0.5 
##$DPOFFS= (0..7)
0 0 0 0 0 0 0 0 
##$DQDMODE= 0
##$DR= 18
##$DS= 0
##$DSLIST= <SSSSSSSSSSSSSSS>
$$ [...]
##$SUBNAM0= <"">
##$SUBNAM1= <"">
##$SUBNAM2= <"">
##$SUBNAM3= <"">
##$SUBNAM4= <"">
##$SUBNAM5= <"">
##$SUBNAM6= <"">
##$SUBNAM7= <"">
##$SUBNAM8= <"">
##$SUBNAM9= <"">
##$SW= 18.0517328524113
##$SWIBOX= (0..15)
0 0 2 0 0 0 0 0 0 0 0 0 0 0 0 0 
##$SW_h= 3612.71676300578
##$TD= 16384
##$TD0= 1
##$TE= 0
##$TE2= 300
##$TE3= 300
##$TEG= 300
##$TL= (0..7)
0 120 120 120 120 120 120 120 
##$TP= (0..7)
150 150 150 150 150 150 150 150 
##$TP07= 0
##$TPNAME0= <>
##$TPNAME1= <>
##$TPNAME2= <>
##$TPNAME3= <>
##$TPNAME4= <>
##$TPNAME5= <>
##$TPNAME6= <>
##$TPNAME7= <>
##$TPOAL= (0..7)
0.5 0.5 0.5 0.5 0.5 0.5 0.5 0.5 
##$TPOFFS= (0..7)
0 0 0 0 0 0 0 0 
##$TUNHIN= 0
##$TUNHOUT= 0
##$TUNXOUT= 0
##$USERA1= <user>
##$USERA2= <user>
##$USERA3= <user>
##$USERA4= <user>
##$USERA5= <user>
##$V9= 5
##$VALIST= <valist>
##$VCLIST= <CCCCCCCCCCCCCCC>
##$VD= 0
##$VDLIST= <DDDDDDDDDDDDDDD>
##$VPLIST= <PPPPPPPPPPPPPPP>
##$VTLIST= <TTTTTTTTTTTTTTT>
##$WBST= 1024
##$WBSW= 4
##$XGAIN= (0..3)
0 0 0 0 
##$XL= 0
##$YL= 0
##$YMAX_a= 52067
##$YMIN_a= -83683
##$ZGOPTNS= <>
##$ZL1= 120
##$ZL2= 120
##$ZL3= 120
##$ZL4= 120
##$ABSF1= 10
##$ABSF2= 0
##$ABSG= 5
##$ABSL= 3
##$ALPHA= 0
##$AQORDER= 0
##$ASSFAC= 0
##$ASSFACI= 0
##$ASSFACX= 0
##$ASSWID= 0
##$AUNMP= <proc_1d>
##$AZFE= 0.1
##$AZFW= 0.1
##$BCFW= 1
##$BC_mod= 2
##$BYTORDP= 1
##$COROFFS= 0
##$CY= -3
##$DATMOD= 1
##$DC= 2
##$DFILT= <>
##$DTYPP= 0
##$F1P= 0
##$F2P= 0
##$FCOR= 0.5
##$FTSIZE= 0
##$FT_mod= 4
##$GAMMA= 1
##$GB= 0.15
##$INTBC= 1
##$INTSCL= 1
##$ISEN= 128
##$LB= 0.25
##$LEV0= 0
##$LPBIN= 0
##$MAXI= 10000
##$MC2= 0
##$MEAN= 0
##$ME_mod= 0
##$MI= 1.114404
##$NCOEF= 0
##$NC_proc= 0
##$NLEV= 6
##$NOISF1= 3.799351
##$NOISF2= 2.8
##$NSP= 1
##$NTH_PI= 0
##$NZP= 0
##$OFFSET= 14.38212
##$PC= 1
##$PHC0= -468.4861
##$PHC1= 6.792212
##$PH_mod= 1
##$PKNL= yes
##$PPARMOD= 0
##$PSCAL= 0
##$PSIGN= 0
##$REVERSE= no
##$SF= 200.129724274929
##$SI= 16384
##$SIGF1= 3
##$SIGF2= 2
##$SINO= 400
##$SIOLD= 16384
##$SREGLST= <1H.CDCl3>
##$SSB= 0
##$STSI= 0
##$STSR= 0
##$SW_p= 3205.1282051282
##$SYMM= 0
##$S_DEV= 0
##$TDeff= 0
##$TDoff= 0
##$TI= <>
##$TILT= no
##$TM1= 0
##$TM2= 0
##$TOPLEV= 0
##$USERP1= <user>
##$USERP2= <user>
##$USERP3= <user>
##$USERP4= <user>
##$USERP5= <user>
##$WDW= 1
##$XDIM= 8192
##$YMAX_p= 0
##$YMIN_p= 0
$$ End of Bruker specific parameters
$$ ---------------------------------
##NTUPLES= NMR FID
##VAR_NAME=  TIME,          FID/REAL,        FID/IMAG
##SYMBOL=    X,             R,               I
##VAR_TYPE=  INDEPENDENT,   DEPENDENT,       DEPENDENT
##VAR_FORM=  AFFN,          ASDF,            ASDF
##VAR_DIM=   8192,          8192,            8192
##UNITS=     SECONDS,       ARBITRARY UNITS, ARBITRARY UNITS
##FACTOR=    0.0002768,     1,               1
##FIRST=     0,             0,               0
##LAST=      2.2672688,     0,               0
##MIN=       0,             -83683,          0
##MAX=       2.2672688,     52067,           0
$$ Real data points
##PAGE= N=1
##DATA TABLE= (X++(R..R)), XYDATA
$$ [...]
1798I2j33K57J90n24O6K5J50l75L21K30j49k32k2NP7J6Mj13M42k18m9l59L01J74
1822A76k78j89K93J74P4J08m52P2n8Mo6K71j71O9J70j8q3r0l2l3l4J62J9n6jl9
1848hl8Q9J98j17l1K01j20k64R2J4K84m92k7L31k38J29k9j10K02k97K74n0n02
1871e09P11q3l34J44J31k10J50oj7J84M7j81j29J51J11j51J45k5j82K02k31J81
1893I9r2j2L71m16o3J82Q2k96%K35k21P5L57o05Q3K88L1l69M05L2J66m08O3J52
1917A39k06J38m72K46j4M19p45L74J81K04k62J32j90L72l64n3P3q4K28k2l91J81
1939a16P2k94K46OK43m37M01n7k61J48L19k84J8J66L2k78K96k66n1O8M4k46K19
1962a2K42P5k60l74N64j47j02J98k36n7R9k32k16K84K23j29j82L58m14M25N2j21
$$ plain form
1798 92 -41 216 406 -118 -52 -27 123 -252 69 299 150 -82 -104 -99 -22 -6 -2 -115 327 109 60 -299 2 176
1822 176 -102 -291 2 176 250 358 -94 -22 -80 -76 -142 129 -42 27 197 179 96 6 -26 -59 -93 69 88 32 31 -8
1848 -8 -46 43 241 124 93 294 174 -90 2 16 300 -192 -219 112 -126 3 -26 -136 66 -231 43 -7 -509
1871 -509 202 119 -215 -71 60 -150 0 -6 -23 161 208 27 -102 49 160 9 154 129 -53 149 -82 99
1893 99 7 -5 366 -50 -113 69 151 -145 -145 90 -131 -56 301 -304 -221 67 98 -271 134 166 332 -76 -13 139
1917 139 -67 71 -401 -155 -169 250 -495 -121 60 264 2 134 -56 316 -48 -101 -28 -112 116 94 -297 -116
1939 -116 -44 -338 -92 -86 157 -280 121 64 -197 -49 270 -14 4 170 202 -76 220 -46 -97 -29 15 -231 -12
1962 -12 230 305 45 -329 235 88 -14 184 -52 -109 -10 -242 -458 -174 49 -80 -262 96 -318 107 159 38
1984C8j57L59j85ql28L50o7r8J55O1j2o1j40K67l03K23N9m51L72L36o84K66P7
2007F9O5q2L7j42l79M60M94n02m32Q05m4p62L68K98k66K43k36p9r8K49p8k48J76
2030h4K39r2l00M28J8m26K39M3m44M90J70l71j78K67J86q0j14J77l54J43Q4j35
2052i4j57L00N33q83R2K17O5N8o6j28m8K46o3k73M04k06k01K8J47l4J18j40P8
2075gjl7J77k44j6N22m93r9qJ21K42l7O1k24j77L97k07k39L30O9j38J12m39N11
2099A76j9j10Q0j02o2N06m79j8K93k63L8k13q2K08k9L62l93J26J38k5k34n3K95
2122A40o2J51j31j30L60k02j48r4J30K10j32k2ML4l30N6J10J46ol3j43Q3K22l77
2146a64%l9J98j04J25n5j66K70J4m6k43L37J26j30j83q0n3J76J95k45j2J61k94
$$ plain form
1984 38 -119 240 55 47 -281 69 2 -96 59 120 108 47 -93 174 -129 94 153 -298 74 410 -274 -8 69
2007 69 134 52 89 -53 -432 28 522 20 -412 393 349 -413 -45 253 -13 230 -6 -85 -183 66 -12 -260 -84
2030 -84 155 63 -237 191 209 -217 22 65 -379 111 281 -90 -268 -1 185 105 -9 168 -186 -43 41 -94
2052 -94 -251 49 582 -301 -209 8 73 131 65 -63 -111 135 72 -201 203 -3 -204 -176 -29 -63 55 -85 -7
2075 -7 -8 -45 132 -112 -128 394 -99 -198 -206 -85 157 120 181 -43 -220 177 -30 -269 61 130 -8 104 -335 176
2099 176 157 47 127 25 -37 469 -10 -28 265 2 40 -173 -255 -47 -76 286 -107 19 157 132 -102 -155 140
2122 140 78 229 98 -32 328 126 -22 -116 14 224 92 70 74 108 -222 -166 -56 90 84 51 -92 -9 213 -164
2146 -164 -164 -203 -5 -109 16 -39 -205 65 79 33 -210 127 253 123 -60 -140 -193 -17 178 -67 -79 82 -212
2169b12O2p2L75j55J14q1j73J1P9JL3n6O7O2p1N2j2k19J04N9n7K80l81PL91k48
2195d0j25OM0K16j62k0K80j31P5p5l3j29o3L39j33j93MJ48Q7jj44R3q8J68k39
2220a20R3j33L71j97K97l36P7J36j73Q4r4J15j15j18J88J19k73O6r2L17r5r4o0
2243c7QJ00j14r1N8Ll3J56k7Ok41K94k41L36m01J89j20N5J13M5K07Lk05N9r0k29
2269a97Q4k4K81l56J91r8k07m4M47nJ22j18l6q9q7L51j96J25Q2m63K48J9N6j96
2293a10K9j72J9K38k09O87o90J29N1J76j88k75J34r8M16j13l57m7K35J59mJ7K36
2316B63p21K50N00m04L17n0k49J00q8J65N1m48J60J30K78l04N9O8k0K81m26n3
2338a41P4J0P1J9j80J9R3N7J24j05p8r2K19j27j5R7j6J20J20l51j32L67J03o3
$$ plain form
2169 -212 -150 -222 153 -2 112 31 -142 -131 -52 -51 -18 -74 -7 55 -16 36 24 -195 -91 -32 -89 191 -190 -183 208 -40
2195 -40 -165 -159 -119 97 -65 -85 195 64 139 64 31 -98 -161 178 45 -148 -144 4 91 90 -54 39 -49 119 -120
2220 -120 -27 -160 211 14 311 -25 52 188 15 99 5 120 5 -113 75 194 -79 -13 -105 212 117 23 -37
2243 -37 -29 71 -43 -134 -76 -73 -106 50 23 29 -212 82 -159 177 -224 -35 -155 -100 13 58 265 268 63 122 32 -197
2269 -197 -113 -137 144 -212 -21 -119 -326 -370 77 72 194 76 40 -49 -136 215 19 144 226 -237 11 30 86 -110
2293 -110 -81 -253 -234 4 -205 482 -208 -79 -28 148 -40 -315 -181 -279 137 24 -333 -380 -145 14 10 27 263
2316 263 -458 -208 292 -112 205 155 -94 6 -82 83 134 -314 -154 -24 254 -50 9 77 57 338 -88 -141
2338 -141 -67 -57 14 33 -147 -128 -35 22 146 41 -37 -129 90 -37 -52 45 29 149 269 -82 -214 153 256 193
2362A93P4o74K94q9J15J58K58k82j24J85k00n8K58o4j20K38m20J67j45K82o0l48
2384c62O00L6l54R3j29K4J13j58Q4J60J0l23L14r9r0k51K73j46J99J82l21M9L49
2407B53Q1k92l8J37j84K4K47m00j09K25K00k48J73k1m6QJ54n08P1L92q8J48p8
2430A01J21k86l7j29L75j55j94L65k23J10k27K01J39j66J74k96J15J57K2k90j3
2451a36P7j32J17o0M65l53K59l03K23L8j93q9p3L07p6k8k88K50j05L1L6j3P3J37
2475A64k65J05n4j11Q4M7N6j89K80k39J01r8m8J37j50M2J24J17r2L1j60J61P4
2498A17k65J66J38j23j13K31j57K5l73L56J5M3j34K28k69n0L12j65RR9k3J65j84
2521D8l7J16j78N2j2K72l94r0K84LJ21k69J08j63n5L18j58R0p8J82k37J37K4j50
$$ plain form
2362 193 267 -407 -113 -202 -87 71 329 47 -77 108 -92 -150 108 44 -76 162 -258 -91 -236 46 -14 -362
2384 -362 238 274 -80 13 -116 -92 21 -137 -53 107 117 -206 108 9 -81 -332 -59 -205 -6 176 -145 -96 253
2407 253 334 42 4 141 -43 -19 228 -172 -281 -56 144 -104 69 48 2 10 164 -344 -273 119 31 179 101
2430 101 222 -64 -101 -230 145 -10 -204 161 -62 48 -179 22 161 -5 169 -127 -12 145 167 -123 -136
2451 -136 -59 -191 -74 -134 331 -22 237 -66 157 195 2 -87 -160 147 71 43 -245 5 -100 -69 -33 -46 27 164
2475 164 -101 4 -50 -161 -77 -30 26 -163 117 -122 -21 -119 -167 -30 -180 -138 -14 103 11 42 -118 43 117
2498 117 -148 18 156 33 -80 151 -6 19 -354 2 17 60 -74 154 -115 -165 147 -18 -9 90 67 232 48
2521 48 11 127 -51 1 -11 261 -133 -223 61 64 185 -84 24 -139 -194 124 -34 56 -22 160 -77 60 84 -66
2545f6K08m18K93l61K99j58J71K16j57k24K94q6j35j4L14j51j03L56L6j04j51
2566E9j36R7r5L29m31R3o1J00O6N6K6q2K2j92J91j46N5k16L46l1j44K11R8J0j77
2591D8Q9m02L11R1K5j97N8J75k63J71r1n7j08L18j87k6j23J4KL56l45L81m28J87
2615aJ28K3n4L8k44L45k01L8j7j87Q5m1N74l30j30k1k06J23PK29k64M9J00PLl3
2641B0M8J38j99r6M1o4K86J40l06q7J9M9m1K8QK0J42l21P9L5l5oJ65j66L27j7
2667B07m50L23P2j03P8j56N7o0m8J9j4M5J86k33L22k44J38Q7k30K95j91J84k87
2690cK74l17j99L72k10k1J63j9k12J57J36k39O9K49m82M22k49K95k63J78m2j08
2712d9L3K6j15J04j70L70Oj94L16n63J55J2j08J88m05M54j25P2j36K40n0j80J0
$$ plain form
2545 -66 142 -276 17 -344 -45 -203 -32 184 27 -197 97 11 -124 -138 176 25 -78 278 314 210 59
2566 59 -77 20 -75 254 -177 -84 -145 -45 21 77 103 21 43 -149 42 -104 -49 -265 81 50 -94 117 215 225 48
2591 48 137 -265 46 137 162 -35 23 198 -65 106 15 -42 -150 168 -19 -45 -168 -154 -152 204 -141 240 -188 -1
2615 -1 127 150 96 134 -110 235 34 72 55 -132 -47 -88 486 156 26 5 -201 -78 -71 158 -106 -57 43 50 53 20
2641 20 68 206 7 -89 -48 -112 174 314 8 -79 -60 -11 -52 -24 -16 4 146 -175 -96 -61 -96 -102 63 -103 224 207
2667 207 -243 80 152 49 127 -29 28 -32 -80 -61 -75 -30 156 -77 245 1 139 226 -4 291 100 284 -3
2690 -3 271 -46 -245 127 -83 -104 59 40 -172 -15 121 -118 -49 200 -282 140 -109 186 -77 101 59 -49
2712 -49 -16 10 -105 -1 -171 199 205 11 327 -236 -81 -69 -177 11 -394 60 -65 7 -129 111 61 -119 -109
2735a09j9K7K17rk03o9L11k33K1Q3k0J58j36P7j99M3PL77j76J39m85K72q9J44
2759A29r5o6j67K33n0J2K3p6o2L53j45j18J60l18L78l33l11N97j21O3J16o84N05
2782B3K12k56K9k43L8L51j86J65p5k21K90j00o1j00L35n60R8L38K4j21J94k58
2804h4K18m5j5r4j04J41P5J40n5j8l08K98j22J8O2l35J85J63j23j90K22n0K37
2827B16q8k3oj92K07j96N1j36O4K13j54k7K02k6j91LJ00o8q1L51j16j15J41o1
2851F8j79Q4N0M5K03j56k43K35p0o0j41K42n6R3l22O6J98k25J22q1J19p6J14J2
2875D2j14J62l7j17J36j36K76m5l76J45K5R0J45j19m5k01K04L9j32K79k98J74
2897I7n0J18n3j40J10p7r5K03j35J06l5J64K9J45l26K92k81K3k22r7K07J55k29
$$ plain form
2735 -109 -128 -101 116 107 -96 -165 146 -87 -66 17 -3 155 19 96 -103 -60 -53 324 148 287 -198 74 -15 129
2759 129 34 -32 -199 34 -16 -4 19 -57 -119 234 89 -29 131 -187 191 -142 -453 144 23 86 202 -482 23
2782 23 235 -21 8 -235 -197 154 -32 133 58 -163 127 27 -34 -134 201 -359 -261 77 101 -20 174 -84
2804 -84 134 89 74 -20 -124 17 92 232 177 159 -149 149 27 45 107 -228 -43 120 -3 -193 29 -21 216
2827 216 128 105 99 -93 114 -82 -31 -167 -103 110 -44 -71 131 105 -86 -83 17 -51 -132 219 103 -12 129 68
2851 68 -111 -27 23 68 271 115 -128 107 37 -23 -164 78 22 115 -207 -141 57 -168 -46 -127 -8 -84 30 42
2875 42 -72 90 53 -64 72 -64 212 167 -209 -64 -39 51 196 77 32 -169 35 74 -58 221 -77 97
2897 97 47 165 112 -28 82 5 -90 113 -22 84 49 213 242 387 61 353 72 95 -127 -224 -17 138 -91
2920i1K29Mj17J68k83R3l20J56J39j06J61J15j65k19M9J85P8MJ34l05l7J94k53
2943a87J25J41r0k9K69n22M06k19K18n5Lj08n4M4P9j22P0P2N2k39M7o3M21m57
2967a98R6L8p5J83k07J37J54j51O3J07j15J55l01K60j77L38l79K90Q0l66KK07
2989A41J23l18J96l7j15j06K57q1k23K01P5J21QJ9l16Q1ok15lM39l38j23L71K22
3013C73l88O0J26l16k5J64o8J23j01J61l70M89o1n3j81n9P8K31p6q4Q0p7J59m54
3037b69P7L21k93K19j07p5J51J8m6q2J6lJ89Ok98M3J30J2q9j24K18J00j49K23
3061A88j13k28L98j22l83K01q2K92k68J52K1k57M57l19q0K47j72l2j17K80k58
3082a95J38K28p8q4o9J87n3k97J51r8o7M21k11J79k80K58n7N1o4o3j18l6Q1J68
$$ plain form
2920 -91 138 142 25 193 -90 3 -317 -161 -22 -128 33 148 -17 -236 -187 -2 76 80 214 -91 -128 66 -187
2943 -187 -62 79 -11 -40 229 -293 113 -106 112 57 60 -48 -102 -58 21 -101 -31 41 93 -146 -99 -162 259 -198
2967 -198 -102 -64 -139 44 -163 -26 128 -23 40 147 32 187 -114 146 -31 307 -72 218 298 -68 -66 141
2989 141 264 -54 142 105 -10 -116 141 60 -163 38 113 234 242 261 -55 26 20 -195 -198 241 -97 -220 151 373
3013 373 -15 45 171 -145 -170 -6 -74 49 -52 109 -261 228 167 114 -67 -126 -48 183 107 23 103 26 185 -269
3037 -269 -192 129 -164 55 -52 -127 24 42 -4 -86 -70 -73 116 122 -176 -133 -3 9 -80 -204 14 114 -35 188
3061 188 75 -153 245 123 -260 -59 -141 151 -117 35 56 -201 256 -63 -143 104 -68 -100 -217 63 -195
3082 -195 -57 171 93 9 -60 127 74 -223 -72 -170 -237 184 -27 152 -128 130 73 124 60 -3 -121 -157 -76 92
3106I2k06M5J86j53K99l49K50n4o3M1o2k77K37K0J3K12k50k00J64k12J64K14j44
3129c3j24J2Pr9L99j83K11K0R2l08M4NK82p94O91K1j66r7L7J84N9j38l24K83k94
3154b13J94k60M02p8q1K85pk9r7q9P6r6k0N9oJ5j1R8q0q7J66k35n5J3J28n7j55
3181b20J58K64l84j91K28K36j15J83r2j54J20n0l62K60J75j66J0K05J34n33L01
3202GJ51k02Q7pn3K65r1k79N5N6K0J17j65K6j0j07J89j86O7J72L1Q9m5l04kj32
3228b51N27j3q0k8L6j15j08L01l71q4K87q8j62J37N5n4o4K01m51L49j0M6j20O1
3252Ak75J54j51K8N43l71J66m0k05L63k47p8J46j60J28J0j36n3J13k36J94j28
3274b34K29j57L33j63J79k29o0r1M12k08q6K66k11n0K19K9M9m96J33K39k98O5
$$ plain form
3106 92 -114 -69 117 -36 263 -86 164 110 47 88 26 -251 -14 6 19 231 -19 -219 -55 -267 -103 111 -33
3129 -33 -157 -145 -138 -237 162 -21 190 210 302 -6 38 43 325 -469 222 243 77 -20 17 201 260 122 -202 81 -213
3154 -213 -19 -279 123 45 -36 249 242 213 116 27 103 7 -13 46 40 55 44 142 62 -25 141 -94 -149 -136 -8 -65 -220
3181 -220 -62 202 -182 -373 -145 91 -24 159 67 -87 33 -17 -379 -119 56 -110 -100 105 239 -294 7
3202 7 158 -44 43 36 -17 248 157 -122 -67 -11 9 126 -39 -13 -23 -130 59 -127 -60 112 143 232 187 -117 -119 -251
3228 -251 276 263 183 155 191 76 -32 269 -102 -186 101 13 -149 -12 43 -11 -75 126 -325 24 14 60 -60 1
3252 1 -274 -120 -271 -243 300 -71 95 55 -150 213 -34 -112 34 -126 2 12 -124 -177 -64 -300 -106 -234
3274 -234 -5 -162 171 8 187 -42 -102 -193 219 11 -75 191 -20 -70 149 178 227 -269 -136 103 -195 -130
3296a30K3J46j58J4M2J17j28j46Q0L2O0M2j2j00o2m6K79K21l55j51N31n16K79
3319F2k10J13k18JL07j62q0P4J46OJ77r6j56J74j51K27m56L33j91j47J62On8m0
3343a77K9L06k11Q6n8j42K35p0M8k29L33j55Q4O3n45L02jJ39K3k19J12R1p1k7
3367e4k0k23K27n6O9P9k59L18j80J06L6l17K42J48o2j42K8o9J93J07J7l73L49
3390A64n0R7l70L02J84k41l8K51m22P5J67O6k33p0Q9N4N5K8J77l20J12j40J38
3413G5J52l10J71m1N0m9k0N8n9j94J84j73J81K6m7K16j51j42L40m00q0K53qr3
3437f1Q4l5j2j98J95m2R8j26J09J46j13k1K6k30RJ80j75J81J87p3k99J55R1k39
3461a63l80N01J69j65m74K76J17K91j23j48Q9m7K33j85j61K49m5J33k06j3rJ57
$$ plain form
3296 -130 -107 39 -119 -105 -63 54 -74 -220 -140 -108 -48 -6 -18 -118 -180 -226 53 274 -81 -232 299 -217 62
3319 62 -148 -35 -253 -252 55 -107 -187 -113 33 39 216 120 -36 138 -13 214 -242 91 -100 -247 -85 -79 -137 -177
3343 -177 -148 158 -53 33 -25 -167 68 -2 46 -183 150 -5 79 142 -403 -101 -102 37 60 -159 -47 44 -27 -54
3367 -54 -74 -297 -70 -126 -57 22 -237 81 -99 7 43 -274 -32 116 54 -88 -60 -129 64 171 188 -185 164
3390 164 114 211 -159 143 327 86 48 299 -123 -48 119 185 -48 -118 -29 25 80 108 285 -35 77 -63 75
3413 75 227 -83 88 47 97 48 28 86 27 -167 17 -156 25 51 4 220 69 -73 267 -133 -213 40 32 -61
3437 -61 23 -12 -24 -222 -27 -69 29 -97 12 158 45 24 50 -180 -171 9 -166 15 202 129 -170 -15 76 -163
3461 -163 -543 -42 127 -38 -512 -236 -119 172 49 -99 -10 -57 176 -9 -170 79 34 167 -39 -52 -61 96
3483I6J65k15l1Q3l11L51P1k97O0p4n4K3J64j09J69j34L09l17o6J36r4n8M3l0
3507a20J11M3j75m2k2J17K47j47j41K0J71k39K11q0l5O3M39k61m33L57o8K2j21
3530h3K13q2O6J63k16O9j32J74l13L01j84J22j35J61j62k7L37j66o9j15K75J30
3552C27l38J16j99j00k33O91k64J11J57m69M60l21J36k33M2M2J52N5k23O7o3n5
3574a42L22m07L14Q8j22J74l07O0j6J13J91m98J28K98k54j58J69K0J67r3K14k51
3596A0P6M4j48j84J95q4K9K40j20j32J19j12J46j18l74L89k44M31J08k83M2Kp9
3619d7m4j08N10l85M7p2J37j66R0J39j19Q5j18L18m11L50m18M78l10M44m59M5
3641a4R8m5j40O1K2L52m16J23R0l25K67k82L98l12J88j3k71L04k06rK95j18K33
$$ plain form
3483 96 261 46 15 98 -213 138 209 -88 -28 -102 -156 -133 31 -78 91 -43 266 -51 -117 19 -75 -133 -90 -120
3507 -120 -9 34 -141 -183 -205 -88 159 12 -129 -109 62 -177 34 -46 -81 -18 421 160 -273 84 16 38 -83
3530 -83 130 48 114 277 61 130 -2 172 -141 160 -24 98 -37 124 -38 -65 272 106 37 -78 197 327
3552 327 -11 105 -94 -194 -427 264 0 111 268 -201 259 -62 74 -159 -117 -75 77 132 -91 -24 -87 -142
3574 -142 180 -227 87 175 53 227 -80 -20 -36 77 268 -230 -102 196 -58 -216 -47 -27 140 47 261 10
3596 10 86 130 -18 -202 -7 -91 -62 178 58 -74 45 -67 79 -39 -413 -24 -268 163 271 -12 30 32 -47
3619 -47 -91 -199 311 -74 -27 -99 38 -128 -38 101 -18 67 -51 267 -144 206 -212 266 -44 400 -59 -14
3641 -14 84 39 -101 -40 -18 334 -82 41 131 -194 73 -209 189 -123 65 52 -219 85 -121 -130 165 47 280
3664B80k59qk2q9L03l08l7P8j5r9N3J38Q0k4Q5j96M3o9Q7l3K7O2j66j46K88r3
3690d0J40k23k02K60J62R1m4l09q5K89K42l17L9rr6NJ43l0J91m17K64R0n5j44
3714e5M1k08J99l9J37N1k30J58m7o0K03l66K02P5l19M02j66L24k81r0J83j22J52
3737A44n8o2P2j86K17j54j3M3m2k78N03k75n5j01J43J45p%j88J37j44L80l1j72
3761A8o2J24K23l76J94j38p8L05j61k09Q1L01o9j55R0k71K1n7K12K81l41K03j82
3784d6K33l66L33jn06K15N5j00j38K57J1J43l35J20K75p2J20k65M02j95oKj76
3807d0J53j09o5j22K42K17m26J22J73k50k59J79M05j96m0r0J00o8p2K31R4m5q8
3830D6k22K60J13l84K26K00k41n6k57J95J23J50l80L97j82j32o6K96K66k57j57
$$ plain form
3664 280 21 13 -9 -98 205 -103 -140 -62 -77 -176 -123 15 95 71 156 -40 3 -66 21 -12 15 77 -89 -235 53 -40
3690 -40 100 -123 -325 -65 97 188 144 -165 -250 39 281 -36 3 -6 -102 -97 46 16 207 -210 54 144 89 -55
3714 -55 -14 -222 -23 -62 75 126 -104 54 7 -53 150 -216 -14 61 -258 144 -22 302 21 -69 114 -8 144
3737 144 86 24 96 -90 127 -27 -40 3 -39 -317 186 -89 -144 -245 -102 43 36 36 -152 -15 -159 221 190 18
3761 18 -44 80 303 -73 121 -17 -95 210 49 -160 -79 222 153 -2 88 -183 -162 -219 -7 274 -67 136 -46
3784 -46 187 -179 154 153 -353 -138 -83 -183 -321 -64 -53 90 -245 -125 150 78 198 -67 335 140 134 136 -40
3807 -40 113 4 -61 -183 59 276 -150 -28 145 -105 -364 -185 220 24 -16 -106 -6 -74 -146 85 179 134 46
3830 46 -176 84 197 -187 39 239 -2 -58 -315 -120 3 153 -227 170 -12 -144 -210 86 352 95 -62
3851f2j8J72J47k31o2l2K21k79q9K01j17J62L8j53r5K13l02M30j90K3K44j90j52
3874a21K60l77K39J1k15K82O2p2j79l6j38K98QK03j89M4j79L84l62r9J75m3Q5
3897D1M2j77O2P3j71J87j88M6L74l21k05O9K16J97R5j63P4j93j7j13J44k65K22
3920B9j70N2J68k16K2J17j68J74R0j80l0J5M6L31j85m4M6m17L42K7r9qJ09m04
3944c53M01m8p1J98j26R0J23m31L70l04j51L99L9k62m9J93K8n6lK04k40m13N02
3967D0m25M52p4M5j1j32L1J7J13K1k63K76L5ql10K13q6N2j24K65j69M6R3r7k55
3992b55J36L35j79Q9O4n38L44J10j94K33j31M7k37J20R7o7QK32k49O8L67n52K53
4015A01q1J03n8J61l72M9J13k68L84j2l89K79K48l96M77l17N0k10L21l97L17J14
$$ plain form
3851 -62 -80 92 239 8 -54 -86 135 -144 -233 -32 -149 13 51 -102 -197 16 -286 144 -46 -23 221 31 -121
3874 -121 139 -238 1 12 -203 79 141 69 -110 -146 -284 14 22 225 36 80 -99 285 -77 -176 -1 -44 41
3897 41 83 -94 -32 41 -130 57 -131 -85 289 -32 -237 -168 48 245 340 177 251 58 41 -72 72 -193 29
3920 29 -141 -89 79 -137 -115 2 -166 8 98 -82 -112 -97 -51 280 95 51 97 -320 22 49 -50 -58 51 -353
3944 -353 48 0 -71 127 1 91 214 -217 153 -151 -302 97 136 -126 -175 18 46 -10 -13 191 -49 -462 40
3967 40 -385 67 -7 38 27 -105 -74 -57 56 77 -186 90 125 117 -193 20 -66 -14 -138 127 -42 4 97 0 -255
3992 -255 -119 216 37 126 190 -348 -4 106 -88 145 14 61 -176 -56 41 -26 -18 214 -35 33 400 -152 101
4015 101 20 123 65 226 -146 -97 16 -252 132 120 -269 10 258 -138 339 22 72 -138 183 -214 103 217
4037B17l50K11k84K43k31J51p3J40j50j12L13k81K08n5O8K66k34P5J16k16m2o
4059b6P5o9K53k28j53M43l56J29J94l54K50q9n7l1L1j23o7K81p1r7l37N83k67
4082h6N1O1R6j29k4m1J6J5K19l29j01K74J7j72j85L04K43k26J84m71J90n5J18
4105c1k7l11N23j68R4j36K55l19J8J45J86j91j12K11j56l4O9j53J23O1j55k2L44
4128B14Q0l62j3L63k94J04K7k19Rj0j12R2O2j0K74k14r0k27K34P0M18m53l1j7
4152a05J09j92L82j02l69L46Q5k34j57J63N8n9j4r4oP8J17qj5J49l15P0J19Q4
4176I0j27Q0j31M00m06J80QR1n67M18q5O7l6J04j17K65k22J01l8j08nL31m6m94
4200b47L25n2J24k02J33o8L1n7k72M01l8M9k26J4P8J83k10j11o1J08K65M8j4k34
$$ plain form
4037 217 -133 78 -206 37 -194 -43 -116 24 -126 -238 75 -206 2 -53 15 281 47 122 238 22 -20 -26
4059 -26 49 -20 233 5 -148 295 -61 68 262 -92 158 69 12 -19 12 -111 -178 103 32 -65 -402 181 -86
4082 -86 -35 26 122 -7 -31 -72 -56 -41 178 -151 -252 22 39 -133 -318 -14 229 3 187 -284 -94 -149 -31
4105 -31 -58 -369 154 -14 80 -56 199 -120 -102 43 229 38 -74 137 -19 -53 16 -137 -14 47 -108 -130 214
4128 214 294 -68 -81 282 -12 92 119 -100 -91 -101 -213 -121 -59 -69 205 -9 -99 -326 -92 -22 396 -57 -88 -105
4152 -105 4 -188 194 92 -277 69 154 -80 -237 -74 -16 -75 -89 -183 -189 -111 6 -2 -17 132 -183 -113 6 90
4176 90 -37 43 -88 312 -94 86 94 185 -382 36 -49 18 -18 86 -31 234 12 113 75 -33 -38 293 247 -247
4200 -247 78 26 150 -52 81 13 44 -13 -285 116 78 127 -99 -85 -7 176 -34 -145 -206 -98 167 215 201 -33
4224c3K53j18P0j98l3J26l9J62p0j28PlJj4q5L22l42l3J23J89j48q8K20J3k30
4249g6pP0L1j99L15j46j40lJ30R7n2n5K80l87o7R3M3K14n3r7K11l78K14K9j7r1
4275d1J06k86J42J36J09k21k0J59m04N10l26N5K27k57OJ07j16J52K8O4m6k10J02
4298b4K65k97JJ3P9o4K81k94J45K84m53l1J37j54M30m22O9R2Nk16J4K81j22LP1
4323I3l5j44o9J84o5n6j56N30k58K16j44j88M07n00M48j67k13Q1O8j84O8J08q
4346A6q9k12K86o5k1m1k08M35o2k83L33l04K41k10K31j27l2N9O8J61m10%Q1K01
4370D8j30r4M8L3oK38l15M6J51n2j22K13j08m6K6j45J12J28J08l2J37j84j13j00
4394a59K09P8j16N4o9q1J86l14O3L26l8k00J22L5kp5j73M18l84L22k38M6J0O4
$$ plain form
4224 -33 220 102 172 -26 -59 67 28 190 120 -8 -1 -4 -3 -17 -102 220 -122 -155 -32 157 9 -79 141 154 -76
4249 -76 -83 -13 18 -181 134 -12 -152 -155 -25 72 20 -35 245 -142 -209 -116 -73 141 88 -9 202 -176 38 67 50 -41
4275 -41 65 -221 -79 57 166 -55 -75 84 -320 190 -136 -81 146 -111 -105 2 -114 38 66 130 84 -126 -24
4298 -24 241 -56 -55 -42 37 -27 254 -40 105 389 -64 -95 42 -112 318 -104 -35 57 62 -154 -140 141 19 22 93
4323 93 58 -86 -155 29 -36 -92 -248 282 24 240 96 -92 315 -185 263 96 -117 -36 32 -152 -84 24 16
4346 16 -73 -285 1 -64 -85 -126 -334 101 39 -244 89 -215 26 -184 47 -80 -112 -53 15 176 -234 -234 -153 48
4370 48 -82 -176 -128 -95 -101 137 -178 -132 19 -33 -155 58 -50 -96 -70 -215 -103 25 133 101 238 54 -59 -159
4394 -159 50 128 12 66 -3 -84 102 -212 -149 177 139 -61 61 96 94 19 -154 264 -120 202 -36 10 20 84
4418H4k83L73l77K56k10J05J53l8k00K5M60n15J25M6J83M1l74K33k47L11J30k84
4440cj21rM24m76L15k05j10K43j31j3J39o9kj76M77m39m0J16Q9L54l54J05R6l87
4464a77K79n3J12j86J70j82j62K65L9P9k22M3J24k16K09J13j85k54Q3K17r4J01
4486A03q1j33J93k25M7N4j41J42k49M44j33r7k4k5J41N3k4P5j28lK79m11K19j63
4510h7J10J84j89j23J30k16J51m2J10J06m2m14J46J14J10j29L28j37j25O6k92
4531b41K07J86J4k10L67k11P5P0k84J29j65K1L4J66k53J74j08n6%J17r0m3K49
4554A48k12J78j56l71K64J00J52j65J36j63k37L80j22k6J13j3M3P1j86J23j43
4575h6L3j00K5o3L52j03M2M8j0l31N04l61k52L94P7l4k52K24L30l33k12K31k34
$$ plain form
4418 84 -199 174 -203 53 -157 -52 101 63 -137 -112 348 -167 -42 4 187 228 -146 87 -160 151 281 -3
4440 -3 -124 -133 291 -185 130 -75 -185 58 -73 -86 53 -16 -18 -194 283 -156 -196 -80 9 363 9 114 210 -177
4464 -177 102 49 161 -25 145 -37 -199 66 105 184 -38 5 129 -87 122 235 50 -204 -121 96 2 103
4486 103 22 -111 82 -143 -96 -42 -183 -41 -290 154 21 -76 -100 -125 16 69 45 120 -8 -11 268 -143 76 -87
4510 -87 23 207 18 -105 25 -191 -40 -82 28 134 92 -322 -176 -62 48 -81 247 110 -15 51 -241
4531 -241 -34 152 166 -44 323 112 187 257 -27 102 -63 -42 -8 158 -95 79 -29 -85 -85 32 -58 -101 148
4554 148 -64 114 -42 -413 -149 -49 103 -62 74 -89 -326 54 -68 -94 19 6 49 120 -66 57 -86
4575 -86 -53 -153 -128 -191 161 58 100 148 138 -193 311 -50 -302 92 169 135 -117 107 437 104 -108 123 -111
4598a11L34j83n7J89k20K7k9n6K53l32K86k4j04k5J69k03k3m0J36J82l06J51j64
4621a50k5J24j1J9J05M5o6Q2l13K45N4jl22K68q1J81K44l91J22m68J34J25K8j72
4645b24L63j54j28k69M58n1q5Q2MM1l21K41J12j16L72k60n0j62J92o6l47J37K34
4668CK31k09j99M15j3j48j44N8n0j3M46m01M5j01P8pK59k19l04K48k6MJ08j02
4692d1J39j4j80L99k49L08k28k62J28Q7O6l40O7MK56k95J59J33j73R7l5n2J79
4715A53J77k68P8J14k52M2J4m2k04L27Oj60k0l0N7R6N7j59J66ol89K27O7m13L58
4740dL5k22L36j28J1m3j08j8L26j49j4Q6R1k08k3J61l97L39N7k43P7lM0q7r0M75
4766B97l38K0k0J29l42L04M1N9l07O9J73OJ77m19k6K08k78Q1K10j47J20j72L7
$$ plain form
4598 -111 223 40 -17 172 -48 -21 -50 -106 147 -185 101 77 -27 -52 117 -86 -109 -149 -13 169 -137 14 -150
4621 -150 -175 -51 -62 -43 62 107 41 123 -190 55 109 108 -214 54 -27 154 398 7 129 -339 -205 -80 -52 -224
4645 -224 139 -15 -143 -412 46 -5 -90 -8 -4 37 -284 -43 69 -47 325 65 15 -147 45 -21 -368 -231 3
4668 3 234 25 -174 241 228 80 -64 -6 -56 -69 377 -24 21 -80 -2 -9 250 31 -273 -25 -51 -47 61 -41
4692 -41 98 84 -96 303 54 362 134 -128 0 87 153 -187 -120 -116 140 -155 4 137 -36 61 26 -26 153
4715 153 330 62 140 254 2 44 58 16 -188 139 145 -15 -35 -65 -8 88 145 -14 152 146 -243 -16 51 -362 -4
4740 -4 31 -191 145 17 28 -15 -123 -141 185 36 22 108 199 -9 -32 129 -268 71 128 -115 -38 -41 -1 -88 -178 297
4766 297 -41 -21 -41 88 -254 50 91 150 -157 -88 85 91 268 -151 -177 31 -247 -166 44 -103 17 -155 -118
4789a18n2j1J88q8l6J92J11j01q6J08k2K0j12m1O1J30k24q6J25J8NJ63p9l32R0
4814a77K50k24K55J48k13q3k68N03l90L07k55L45j34j18O2K9j11J90k16J96mj92
4836a00M03n19J82K76p7n11K68N4P7m7J31l9k67Q3O2N5j6N8q5j8k94L97%q4j25
4861a36Q3j86R1K34j78K6q1J20L17k39N1P7j73p3K05j19O8r8R2j93J63k82M54
4884B23j34J85p23L63M21l88o6L2R1R4j61j7J47l11L55n24L55J51q8J21q1M8l89
4907b96J88j45k0L60l07J21m6J76o4M29l86J0m7q4J36L7J7K20M8l22K9r4J42k28
4931a26L49j34K25l29J20J82k01K21m4l88K51j5k14K74j39K35q2k90L37k67K31
4952A96j74k79J65P4P6j83R0K86j19k8l62J53K67k96QJ00n5K9P5k32K28J26k26
$$ plain form
4789 -118 -170 -181 7 -81 -117 75 186 85 -1 107 85 105 -7 -48 13 143 -81 -167 -42 -24 -19 144 65 -267 -177
4814 -177 73 -151 104 252 39 -44 -312 191 -199 108 -147 198 64 -54 8 37 -74 116 -100 96 92 -100
4836 -100 303 -216 -34 242 165 -346 -78 -24 53 6 137 98 -169 -86 -24 31 15 73 -12 -30 -324 73 73 -11 -136
4861 -136 -53 -239 -148 86 -92 -66 -147 -27 290 51 102 179 6 -67 138 19 87 -11 81 -112 51 -231 223
4884 223 89 274 -449 -86 335 -53 -119 -87 4 98 -63 -80 67 -244 111 -413 -58 93 5 126 45 93 -296
4907 -296 -108 -253 -273 87 -220 -99 -145 31 -33 396 10 20 -27 -111 25 62 79 299 347 25 54 -40 102 -126
4931 -126 223 89 314 -15 105 287 86 307 263 -125 126 111 -103 171 32 267 185 -105 232 -35 196
4952 196 22 -257 -92 -18 58 -125 -35 251 132 104 -258 -105 162 -134 -126 -26 -81 -52 23 -209 19 145 -81
4975h1RJ33j40L13k24l6j99K09K47k69J28j96l19L10J26j23m9K55l8J4k77L03
4997I6L2k17J94o9k79J76J12J06j47J70j70L8K79n15k4K85J67n24M69J1k45Q0
5019B5J26l44J55j5J42q5n4P5m2j81R8J58k83K90o1Q0j99K01k25K09k1N8j44r3
5043a30L08k52K2J49M7p7r2J9q0m4K34R8Q0k54M2k17J97q0K1j1k13K40j88M25
5067B44n90M04Kk00K24N8j48M2n2J30j02p1J95k52J38pj70m5r2M5K2M37R9k20
5091I1r2QJ47k10L48l67L11k04l32K64J85l5n8J1K12j13l5k1j31N6M04n24J72
5114H7OJ32j25n1l08J91r0K6K20P6j46j45K59l23K16M1o2n3R1q8K6N1K9j75J8
5139i7RK23J42l66J11N1k08M99m52J9Q8o4J50J30l45l01L89kQ1m3rj06J14k72
$$ plain form
4975 -81 -72 61 -79 234 10 -26 -225 -16 231 -38 90 -106 -425 -115 11 -112 -161 94 56 70 -207 96
4997 96 128 -89 105 36 -243 -67 45 151 4 174 4 42 321 -194 -218 67 234 -290 179 190 -55 25
5019 25 151 -193 -38 -53 89 4 -50 25 -17 -198 -100 58 -225 65 4 84 -115 86 -139 70 49 107 -37 -130
5043 -130 178 -74 -52 97 144 67 -25 -6 -86 -130 104 202 282 28 70 -147 50 -30 -9 -20 -233 7 -181 244
5067 244 -346 58 60 -140 84 142 -6 36 -16 114 12 -59 136 -116 22 15 -155 -200 -292 -247 -225 212 311 91
5091 91 -1 7 154 -56 292 -75 236 32 -300 -36 149 114 56 67 279 166 131 110 -21 35 439 -85 87
5114 87 93 225 100 49 -259 -68 -158 -132 88 164 18 -127 132 -191 25 66 4 -49 42 -46 -20 31 60 -115 -97
5139 -97 -88 135 277 -89 22 73 -135 364 -88 -69 19 -45 105 235 -110 -411 -22 -24 57 14 5 -101 13 -259
5163b59O5K83j00J78k81R4J04Q5l65K04K47j18k69J42k2m5J57o8K49q2j16j40
5185e7J00k15M5K14J03p6N3J26p8l49N8L08k25O3j54J84k55K28J55l81N7k7Q1
5208d2j58K80Q9j47J47j99j18J09NJ45k74K41l36L63K9r4L37n30J73LR3R0k87
5231h1J61j2l58J64R1MK29k12J16r8O3J26k23o9M0L25j45j14j2M1J33k1k09K51
5255A90l86J14J45O0j29R8j57o8J66J04k05R9k16J74K21l81N5l0O6r5K23K3o4
5278GQ0n1p8J29j53L8j19L43l71Q3J51j55J01j46L64k78J77Q4m49J48N2J46q6
5301A7l3J29n3k3k18O2L7J80L3r1k4K68k75j82P0KL0O5P7j19J1k86M18k19R8N7
5327C1j95K77l9j43J25j51J33L66m07L9k12J71m2r7J96j3R4O5k84j77L40N9n7
$$ plain form
5163 -259 -194 89 -11 167 -114 -20 84 169 -196 8 255 137 -132 10 -12 -57 100 32 281 199 83 -57
5185 -57 43 -172 -127 87 190 114 167 293 215 -134 -76 232 7 70 -84 100 -155 73 228 -153 -96 -123 -42
5208 -42 -200 80 169 22 169 -30 -148 -39 -34 111 -163 78 -258 105 134 40 377 -153 20 23 116 206 -81
5231 -81 80 68 -290 -126 -35 -31 198 -14 102 4 67 193 -30 -99 -59 266 121 7 -5 36 169 148 -61 190
5255 190 -196 -82 63 123 -6 92 -65 -133 33 137 -68 31 -185 -11 210 -171 -116 -146 -80 -175 48 71 7
5278 7 87 36 -42 87 -66 -28 -147 196 -175 -92 59 -96 5 -141 223 -55 122 206 -243 -95 -43 103 17
5301 17 -16 113 60 37 -181 -119 -82 98 131 40 16 284 9 -173 -103 -101 -71 -6 71 -48 -37 -323 95 -124 -26 31
5327 31 -164 113 74 -69 56 -95 38 404 -3 36 -176 -5 -47 -144 52 39 133 198 -86 -263 77 136 79
5350G9J09j74J76p2l4K42j96j52k0r8J04m0P6j24K72k23M5K9J4j05j11J39p4m9
5374a87J14N8O5K8j40k09J83K60l87K53j18L2j15K13R7n9p5j51P8L4%J65j72l8
5398g1p6K73n0k95K95k5J6k2m00M28m37M12n4J35k38O8j98L5K29J75p3j10m1J00
5422G6J04q6j11l9J99k78K70k47L67l30J92%P2n6k12K24j52k0K9LJ63k6mm16L96
5447A18J72k26N9p1J23k67K49n00L19J87j18o7LK6k99L07p1j35K41j81J61N0J69
5470B49l36O9J40k2K3l33K45nO2j05n2K6r2K56K71m72k09J66m3L00P7l93J61j02
5494a19K0j6M79j68l5j53k6R7k98Q5M5K49j22m8P7J7O9K74k74k88J2R2l9pK06
5519A29R8k81n9M68m72Q7Q9J43J00k25J26l1o0k0o0n5l27M60J59j44l38J94L2
$$ plain form
5350 79 188 14 190 118 84 326 130 -22 -42 -140 -36 -76 0 -124 148 -75 -30 -1 13 -92 -203 -64 -138 -187
5374 -187 -73 -15 50 78 -62 -271 -88 172 -215 38 -80 -48 -163 50 147 88 13 -138 -60 -26 -26 139 -33 -71
5398 -71 -147 126 76 -219 76 51 67 45 -355 73 -364 48 -6 129 -109 -41 -239 -204 25 200 127 17 -24 76
5422 76 180 94 -17 -56 143 -135 135 -112 255 -75 117 117 189 133 -79 145 -7 -27 2 5 168 142 138 -278 118
5447 118 290 64 123 52 175 -92 157 -343 -24 163 45 -22 -19 7 -292 15 -56 -191 50 -131 30 80 249
5470 249 -87 -18 122 100 123 -210 35 30 92 -13 -65 -39 -131 125 396 -76 -285 -119 -162 138 215 -178 -17 -119
5494 -119 -99 -115 364 196 161 8 -18 79 -219 -134 -89 160 38 -10 67 84 153 427 153 -135 -123 -31 -70 -77 129
5519 129 227 -54 -113 355 -117 -30 59 202 302 77 203 172 112 92 32 -23 -350 110 269 125 -213 -19 13
5542A3j66K3N4L67l39j37O9K97ok70J87j82J31J98l49K97k59K91j60lj54R9N7
5565E8J8J06r7lk71J40K13k31j57L87k10N5M4q1o7L29n4k80J55q5J17k18J21K
5589ik1J16l5j29J91k75K46k72L2K84k20j11K89K00j73j27n8J60j9k13J68J09
5611A33R1k76M5J51K11n91K50K54l86m7L53k14k2j68L62k62J15p3J00Qk16K17
5633C5p6M5J09m9j25m3p9J24J6J50J0j8l0j52K38k81n4L14r4l13M29k9l57N6J44
5658c0M52m52kp4m4q2K03N6J4j91J04j13J31M1k61J47j07K93J40j19j06N3l27
5681b74L95P9k4o2m5J70j98O5j03k02L97j94m8j10k4m1L94q6j74r0K28Q7k47P4
5705c3J0Q4n2P3Q0K21m35N3k21K50j19J6o8r4M04l05Q7Rk17J25L02k77J60P1m1
$$ plain form
5542 13 -153 -130 -76 291 -48 -185 -116 181 175 -95 92 -90 41 239 -110 187 -72 219 59 56 -98 1 58
5565 58 76 182 85 82 -189 -49 164 -67 -224 163 -47 8 52 -29 -96 233 179 -101 54 -31 86 -132 -11 -9
5589 -9 -30 86 51 -78 113 -162 84 -188 -156 128 -92 -203 86 286 113 -14 -72 88 69 -144 24 133
5611 133 224 -52 -7 144 355 -236 14 268 -118 -165 188 -26 -48 -216 146 -116 -1 -74 26 34 -182 35
5633 35 -41 4 113 64 -61 -104 -183 -59 -43 107 117 99 69 -83 155 -126 -180 134 40 -273 156 127 -230 -174 -30
5658 -30 422 -30 -32 -106 -150 -232 -29 27 41 -150 -46 -159 -28 13 -248 -101 -208 85 225 106 0 53 -274
5681 -274 121 200 176 114 69 239 41 106 3 -199 198 4 -44 -154 -178 -219 175 89 -85 -175 53 140 -107 -33
5705 -33 -23 61 9 82 162 383 -52 1 -220 30 -89 -73 -141 -235 169 -136 -49 -40 -257 -132 170 -107 53 124 83
5730H3K7M3j63k97K86J55j24j2p0LJ67j88K2j56K42j42J28n3M3K9j32J99l7l03
5754b50K55L5nj88J67m6k50K00K30q7J17J00p6%k23m5j60J59J10j44J61k18M20
5777B62k85J07j60j20R3L70j81K89j26j04n7p6j2K4k29J69l1r4K01K80l91RR7
5800C5K39l13k63K02K16K0P0m87Q9l7J70j0j61Q9j22J15J11K08l71L45j24N6l0
5823D7k20J49M50k14k98m61M93o1Qq0J86J09j26K01l36J98n8pk2j36L40j28K14
5846B48j89q5J26R9j49j01K21p1j29K15j62J91R9j26l15O6O2K37l93J47o0J03
5868C4J65k1j88m0Q0j76J48J26J29m50Q8j07M43l21N2j9j31J25J03k45L6K71l2
5891G0O5j01j8M2j04m4L10r7j27j9j3K6J20j92p3K23j73J43k77J97%o9lJ17j21
$$ plain form
5730 83 110 153 -10 -307 -21 134 10 -2 -72 -69 98 -90 -68 -224 18 -124 4 -49 -6 23 -109 90 53 -250
5754 -250 5 40 35 -153 14 -32 -282 -82 148 61 178 278 202 202 -21 -66 -226 -67 43 -101 60 -158 262
5777 262 -23 84 -76 -196 -103 267 86 375 249 145 88 12 0 24 -205 -36 -67 -161 40 320 -71 -62 35
5800 35 274 -39 -302 -100 116 136 206 -281 -192 -229 -59 -69 -230 -141 -263 -148 -37 171 -200 145 21 77 47
5823 47 -173 -24 426 212 -86 -547 -54 -115 -107 -187 -1 108 -18 183 -153 45 -13 -20 -42 -178 162 34 248
5846 248 59 -26 100 199 50 -51 170 99 -30 185 23 214 313 187 -128 -62 0 237 -156 -9 -69 34
5868 34 199 178 -10 -50 30 -146 2 128 257 -193 -105 -212 231 -90 -38 -57 -188 -63 40 -205 -169 102 70
5891 70 135 34 16 58 -46 -90 220 123 -4 -23 -36 -10 110 -82 -155 68 -105 38 -239 -42 -42 -111 -114 3 -118
5916a18M0J42Jr7Nj00M2k53L39j79L32j60k04R1jJ3K29j01r5J02L0p2P5k14K23
5941G0j15k2K3j11L29j05j12l5J9J3j35M72j79j71m1N3k8J1M04n02O2j0l54M81
5965A7J63j95J2L4j36M7K08j41O8j09k3K3J54L9j84j42J34J4J50j04l7K52l34
5988i0J93l7j84J29k00K35J22j33j54K16k90R4K14n9q9j51N4J88nj72J49j05J41
6011F6j52J06nk0j37n4J48Om34R38m14OKN9j00J23L6j47j3j85K07J03k04m1K24
6036A18j27L2N6l65K91Q1J59j81j54P2n1m0M5P4k84J66l1J90Pp4Q1J7j19o5l7
6061a39L06l21M51l60L14n21M41j84j21P3%J64j27k14K60K8j70L83m46L39L7j56
6083C7r6L27k03k71P3K15q1R0N1j30m4K05m33R8k3k99O67j79j31K28l2Lr2J93
$$ plain form
5916 -118 -78 64 65 -32 -27 -127 -85 -338 1 -178 154 -6 -210 -119 -120 -107 122 21 -74 28 58 -14 61 -153 70
5941 70 -45 -67 -44 -155 174 69 -43 -78 -59 -46 -181 291 112 -59 -100 -47 -75 -64 340 -162 -100 -110 -464 17
5965 17 180 -15 -3 31 -105 -58 150 9 77 -32 -55 -32 122 161 -23 -165 -31 -17 133 29 -8 244 -90
5988 -90 103 66 -118 11 -189 46 168 35 -119 97 -193 -99 115 56 -33 -184 -130 58 53 -119 30 -75 66
6011 66 -86 20 15 -5 -142 -196 -48 -42 -476 462 48 54 56 115 15 138 174 27 14 -171 36 139 -65 -106 118
6036 118 -9 23 79 -286 5 86 245 64 -90 -18 -69 -109 -64 10 -274 -108 -139 51 58 -16 65 82 -37 -102 -139
6061 -139 167 -154 297 -63 251 -270 171 -13 -134 -61 -61 103 -24 -238 22 50 -120 263 -183 156 193 37
6083 37 -59 268 65 -206 -133 82 1 91 142 12 -32 173 -260 -162 -185 -484 183 4 -127 101 69 72 -20 173
6107A73k29K03K8k67L16k66m46P47k09n3j05Rr9J49Q1Q9k51O3mJ92P9j97j09J65
6131E9M1k14J24J31n6j51J80J4J09k01p9k69M15n1M6k50K80J58m34O8n3R5M2l7
6155c3j22L02Q8j12q3j01P6Q3k29J80j87J84k58P8OJ66nj55O2O5R2j85M5q3K86
6180A60k73K48j48Q1k21J16O7j73P2J51k27J44o6p9J50M7j86K78p3QK0P2l8k30
6204a00J41k5J6j06K71J35l14r0N4r9K91J85n04M82k57J12l35R8n5J8K9m3L8J97
6228A39n5J36k95L14k43K4k36L38J30j74j39J77j89K19j37j20J61r3j41J48J07
6249G1k33J13oN1L30l57J95m39K16Q0k1n1NJ3j35K02J06j01k41K40j30J41n3j31
6273a35J42r6J92M9j70k5k01K65J86J6M9l57l05O06k21k23L56k33R2j08m8O4N5
$$ plain form
6107 173 -56 147 175 -92 224 -42 -488 259 50 -3 -108 -99 -198 -49 32 121 -130 -67 -71 121 200 3 -106 59
6131 59 100 -114 10 141 85 -66 114 128 237 36 -43 -312 103 52 98 -152 128 286 -148 -80 -133 -38 4 -33
6155 -33 -155 147 235 123 40 -61 15 98 -131 49 -138 46 -212 -134 -128 38 33 -122 -60 5 97 -88 -43 -126 160
6180 160 -113 135 -13 68 -153 -37 30 -143 -71 80 -147 -3 -69 -148 2 49 -137 141 68 76 96 168 130 -100
6204 -100 41 16 32 -74 197 332 18 -72 -18 -117 174 359 -145 337 80 192 -143 -45 -100 -82 -53 -96 -58 139
6228 139 84 220 -75 239 -4 20 -216 122 252 78 -61 116 -73 146 9 -111 50 -43 -184 -36 71
6249 71 -162 -49 -55 -4 326 -31 164 -275 -59 21 0 -51 -46 -33 -168 34 140 39 -202 38 -92 49 -4 -135
6273 -135 7 -89 103 152 -18 -43 -244 21 207 223 272 -85 -390 216 -5 -228 128 -105 -13 -121 -169 -105 -50
6296e0j59M75k07j71J06j06j1J94j32j33K43j85J41L0q6K47j95J14k27J56j96
6317a52K7M04m50r9K10j61L39j05Q6j82K23J0j59P8N0k76q1l6K61K11k62JJ3J84
6341A34k32J6j1J62Pp9L4j93K82l1l62LJ91pL13l09K33k00L3J54k0j12j73Q8k3
6366a02L61j64j49J02j14rJ39k24K4K54j74j57J34L15j45j55k24N06m83M25l40
6387a80P2K49j22ro4K77M0l08j80M27k83k7L6O6mJ21J30j09K71n23J24l9J25j61
6411g1J48L52m84J44m9o0m7J75J6j30K8j75Q0j86L81j93L4L1M1J23k54j20n2N54
6435B86m02o6PQ8J76j77J4p2J95n5j44J67Oj07K26J3j7j25j60L03m7k27j29p6
6459c23K42J11j66K57N3j95P1q2J37J71m22K98j67k5M12n34N31n59M75j95l1k67
$$ plain form
6296 -50 -209 266 59 -112 -6 -112 -123 71 -61 -194 49 -136 5 35 -51 196 1 115 -112 44 -152
6317 -152 -125 279 -171 -270 -60 -221 118 13 99 -83 140 150 -9 69 119 -157 -238 -274 -13 198 -64 -63 -50 134
6341 134 -98 -82 -93 69 76 -3 31 -162 120 89 -273 -270 -79 -86 227 -82 151 -49 -16 138 118 6 -167 -79 -102
6366 -102 259 95 -54 48 -66 -75 64 -160 -136 118 -56 -213 -79 236 91 -64 -288 218 -265 160 -180
6387 -180 -108 141 19 10 -54 223 263 -45 -225 202 -81 -108 -72 -6 -10 111 241 132 403 -120 4 -35 90 -71
6411 -71 77 429 -55 89 40 -20 -67 108 124 -6 22 -153 -73 -259 122 -71 -37 -6 35 158 -96 -216 -268 286
6435 286 -116 -182 -175 -87 89 -88 -74 -146 49 -6 -150 17 23 -84 142 155 138 13 -147 156 109 -118 -247 -323
6459 -323 -81 30 -136 121 174 -21 50 -32 105 276 -146 152 -15 -40 372 -162 369 -190 285 90 59 -208
6481b08J09j21J04L01p6j02j98o0N23o43M26q8j17M6m0Q5J28jJ13k85J9o1J08
6504c8J07j13k45P8o3M29k73p3M26j83K50l56K14j31J65J03k45O4m2k01j10K87
6526E0k02K56J2k7o9o1k4Q7j46J76oJ08r4n0j13k0r5L80l29L21K2Rk94J7n7J21
6552b8o4J25r5L76n12K31j07M4J13l6M4J0j50JL21k01J34k47J71j72J51p5K67
6575C01j60j34j30J17q7Q5n0J46J09l77K76j94J05L24m43k2J61r2J44M2l26L3
6597a72M13l48Q9J57Nj56O3k5K5Pk53M0J08P5p8l3p8j22M54l19P8m4K10q9N6p8
6623a5k04K11M9p2QJ4J12k07J04l6k64K01M7J4k59M30j62K03p3l03L37k36K84
6646A83k52O3Rn6J31j72K03j49j40q5J77J41J2k8O0l05K2L98l04mK04m1n3j01
$$ plain form
6481 -208 -99 -220 -116 185 109 7 -191 -251 272 -371 55 -33 -150 -104 -144 -59 69 68 181 -104 -85 -146 -38
6504 -38 69 -44 -289 -211 -274 155 -118 -191 235 52 302 -54 160 29 194 297 52 116 74 -127 -237 50
6526 50 -152 104 116 89 20 -41 -65 22 -124 52 46 154 60 10 -103 -123 -218 162 -167 154 176 185 -109 -92 -149 -28
6552 -28 -92 33 -62 314 -198 33 -74 -30 83 47 91 101 -49 -48 273 72 206 -41 130 -42 109 34 301
6575 301 141 7 -123 -6 -93 -8 -58 88 197 -180 96 -98 7 331 -112 -134 27 -65 79 121 -205 -172
6597 -172 241 -107 -18 139 144 -12 51 26 51 58 -195 -155 -47 28 -50 -83 -161 -283 171 -148 -70 -114 96 7 63 -15
6623 -15 -219 -8 41 -31 -23 -9 103 -104 0 -36 -300 -99 -52 -38 -297 133 -29 174 101 -202 135 -101 183
6646 183 -69 -6 3 -53 78 -94 109 -40 -180 -265 -88 53 65 37 97 -208 -186 212 -92 -96 108 67 14 -87
6670h7J30LK46j72j16l0r0r4K21j73K50m15J31L62k07K30l95j6L9K42j17j91L88
6693A39r8k23K90KK55l75o4J94J25k39O8j81J56J09j90n4J00r3M23k90J06k1m4
6716I5j78J59M4j32M0qJ1oK6o1r5K20m06M05J47m52J71K17R4k96j71LJ34R5J48
6741B04k67J70k26K9J24l3P0J9j67J45j31N9J14R4j23q6R8K49n33K47m7j90J69
6764a2j99J55PJ52Lk1L0J20n6O0j55p6j6J42j23j51K98k2k11J71r8R5l2j14R8
6789D5j38j99K82j3J25j02K22k13k9Q6j48r7K32j08q4K70k05j3J58l0j72J74k05
6812a62J25l9J97j98j9k7oP0j98J16J98j87j04L00P0n79M04M0Q1r2O5Q7j29j7
6836dK90k34K96l58M2r5J47k61J48J95L1k44j65L4L85j18n4K50n37L39O7k26p2
$$ plain form
6670 -87 43 46 292 120 4 -26 -116 -210 11 -162 88 -327 -196 166 -41 189 -206 -222 -183 59 -58 -249 139
6693 139 41 -182 108 110 365 -10 -74 120 245 6 74 -107 49 158 -32 -86 14 -79 344 54 160 139 95
6716 95 -83 76 120 -12 28 20 31 25 51 -10 -105 115 -291 114 261 -191 -20 197 291 -5 -176 -173 -39 56 204
6741 204 -63 107 -119 -90 34 1 71 90 -77 68 -63 -4 110 204 81 -5 93 342 -191 56 9 -181 -12
6764 -12 -211 -56 -49 103 106 85 115 235 179 239 84 8 -8 134 11 -140 158 136 -75 96 -2 93 61 -53 45
6789 45 -93 -292 -10 -23 102 0 222 9 -20 66 -82 -179 53 -55 -139 131 -74 -87 71 41 -131 43 -162
6812 -162 -37 -76 121 -77 -96 -123 -129 -59 -257 -141 57 -130 -234 66 136 -443 -39 1 82 -10 55 142 13 -4
6836 -4 286 52 348 -10 32 -63 84 -177 -29 166 197 -47 -212 -178 207 89 35 285 -252 87 154 -72 -144
6859a44N84o65J31K19l27N5O3L03k00p2j2Pr9M04l06J13J19p4n4j76p1K75j7L27
6883C83l39J1n6j16J52j78J67J56k92J45l23K40k47K61p3K81k74M2j3j55L69k43
6905a02J59Q9j79j33p7L24J09k11j35N2oP3k4j36L28j13j49K03j4k23K26K19k76
6928Dk66Q5N6J89j29L12m01J79l9N7J53j52J03j33N1j09L7M38l76L55j77l57J07
6951a3K43j98J11m01J49P7n4L20k83O6l6R9r7r5q8J01K36k26K28q8k61P5K99r4
6975G0L5m2l5nj64mP8J31k9j49L4rK07k12J22k40R3K91j41p0j20J88J29K1k13
7000c4L41n93L32j38m3k9L35l97L4L50k04M1k26M29k75p7p8J11k07K31J89k23
7022a31Q5j30J48O8J06l79K85j95K8L4L92j97k97J41K09k1k11k2K08k79N2M2P5
$$ plain form
6859 -144 440 -225 -94 125 -202 -147 -84 219 19 -53 -65 -58 -157 247 -59 54 173 99 45 -131 -202 73 56 383
6883 383 44 55 -1 -117 35 -143 24 180 -112 33 -290 -50 -297 -36 -109 172 -102 -60 -73 -228 141 -102
6905 -102 57 146 -33 -166 -243 81 190 -21 -156 -104 -110 -37 -61 -197 131 18 -131 72 58 -165 61 280 4
6928 4 -262 -177 -121 68 -61 251 -150 29 -10 47 200 48 151 18 69 -40 -3 435 59 414 237 -120 -13
6951 -13 230 32 143 -258 -109 -32 -86 234 -49 17 -19 80 -17 -112 -200 -99 137 -89 139 51 -210 -135 164 70
6975 70 105 63 28 23 -141 -145 -67 64 35 -114 -80 -89 118 -94 28 -212 -119 172 31 -39 -159 29 158 179 -34
7000 -34 307 -286 46 -92 -135 -164 171 -226 -192 158 -46 -5 -231 198 -77 -154 -232 -121 -328 -97 92 -131
7022 -131 -46 -176 -28 40 146 -233 52 -143 -115 -81 311 114 -183 -42 167 146 -65 -87 121 -158 -106 -64 11
7045A1o0L9J13j15L30m33j35L27N4j61k41P1M10k95K07j81P8K23k87K33l11M18
7067B95l41m1L63l36qM39j87l74L03l37L33k16J4K38J58m05J50j13K34k9k22R9
7089A7J47O2j44j72j68O2K15j09J22n6L4k65J45m7R3K46k53K56j36q4p1M9m2P2
7113b7N1K0j27M7q0K44j93k10L47R5j18K83j32n0k00j07J61L57k98J16J1k62j79
7136b51L43j37J24j07l0J97j05l9j03j71K09J9J77o6l61K71n8N5J85l18J43P9
7158E6r7k4J2oL56l83K69k91J87k40k4l2J54K19l95K80J05j28J63j19P0k97L0
7181a35M1Q5k44J21Nj5K69J3k57K7K40k03l1K16MK95m46p4J39o4K0J66k28K13
7205A57j18p3OJ52j84L51k16l65L14M1k4r0L24k32q8j5j9Q2l1o8o9K6M82l53J05
$$ plain form
7045 11 -49 -10 103 -12 318 -115 -250 77 131 -30 -271 -200 210 -85 122 -59 19 242 -45 188 -123 295
7067 295 -46 -87 276 -60 -68 371 184 -190 113 -224 109 -107 -93 145 303 -102 48 -65 169 140 -82 17
7089 17 164 226 82 -90 -258 -196 19 -90 32 -24 10 -255 -110 -157 -64 182 -71 185 49 -35 -106 -57 -99 -27
7113 -27 24 44 -83 -36 -116 128 -65 -275 72 167 49 332 200 150 -50 -157 4 361 63 179 190 -72 -251
7136 -251 92 -45 79 -28 -58 139 34 -5 -108 -279 -70 -51 126 60 -301 -30 -88 -33 152 -166 -23 56
7158 56 -41 -65 -53 -59 297 -86 183 -108 79 -161 -185 -217 -63 156 -239 41 146 18 181 62 132 -165 -135
7181 -135 -94 -9 -253 -132 -127 -142 127 140 -117 -90 150 -53 -84 132 136 431 -15 -89 50 -14 6 172 -56 157
7205 157 39 -34 -28 124 -60 291 75 -290 24 65 41 -49 275 43 -45 -60 -79 3 -28 -96 -165 -139 343 -10 95
7230I5p1k72K50N7K8o6k07R8M8n4P9J93j75M1n8J16q1J36j66j98L70p8K02m97
7254b10J88r7o8L02k2j22J58j22j89K08j21j16L24J73o19M26l19J20p1J22R4q1
7276d2J99k57K73k89J88j55MK14k35Nq5L49k04j23J60m72M58l78L61j80p2K92
7298A1O2j17J47k53L65O8k24k3L8q6n5M2j83N62k01L0l27R1r2PMJ46M6j11jq3
7324a37M3R2N5J86k51%j79K19p3N6J0P9k36K02K39k78Rk87M79l55J87l1K56k63
7348B2J91j08N7q2k79J71J5L2k8J8Mj77J42q9R9J55r8J11N3j0j59Ol6l55J93m3
7374a95K47j68J26J6k9r8M4m8K34P8J4k45j06J23p2K40j0j79J5K8r0K8n2R8K46
7399B45p8j63l01N33j49j95J24k05J82j5J41k94o8L01N4J39r8k60N7r2NK92k99
$$ plain form
7230 95 24 -248 2 59 87 21 -186 -88 -40 -94 -15 178 3 44 -14 102 21 157 -9 -207 163 85 287 -210
7254 -210 -22 -119 -187 115 93 -29 129 7 -182 26 -95 -211 113 286 -333 93 -226 -106 -177 -55 39 -42
7276 -42 157 -100 173 -116 72 -83 -79 135 -100 -95 -180 169 -35 -158 2 -470 -12 -390 -29 -209 -281 11
7298 11 73 -44 103 -150 215 283 59 36 74 -12 -67 -25 -208 354 153 183 -144 -53 -145 -138 -134 12 58 -53 -54 -137
7324 -137 -94 -2 53 239 -12 -12 -191 28 -45 11 21 100 -136 66 305 27 36 -251 228 -127 60 29 285 22
7348 22 213 105 162 80 -199 -28 -13 19 -9 9 13 -164 -22 -111 -12 143 45 156 209 199 40 46 10 -345 -152 -195
7374 -195 52 -116 10 26 -3 -101 -57 -105 129 207 221 -24 -130 -7 -79 161 151 -28 -13 15 -75 -47 -99 -1 245
7399 245 167 4 -297 236 87 -108 16 -189 -7 -22 119 -175 -243 58 112 251 153 -107 -50 -142 -137 155 -144
7422a44L9j03J94Q1j9r7J21P0j51k28J22J24L22l04k52L24q8j37K60jl89jL23
7445F6J81k3r3j9l1M5m0p2q0Q8k61M05j07q3p5j88K95K5l4J51j6j47J70l28L56
7470A85n5m1k86k4K13n7K20r3k11K7j5l5J94J57k32J70k52k9J56P3L7k56M5L30
7494B21k65J57j38KJ33K7l06K05q7P7j11j49M67q9n1m09M63j98m5K81j69k31M56
7517B41j80J52l01j50Q0K67k23L94j38j3j23J20m46K12J47nO5j19J39l52m1M87
7539B13j97k02L05r7o8J31Pr4j4j35K63j27o4K95n65M13J00l58O6K55l15p6M2
7562b22J31K34j36j3kj26K95j49m0j17k20K97J87J8j14J3j54o7Q1k5N0K93n19
7585c05L14J23K6m29J18J62j20Qm3L22k10J92o2J14l84R7J48k04K79j11J15k59
$$ plain form
7422 -144 -105 -208 -14 67 48 -49 72 142 -9 -237 -115 9 331 27 -225 99 11 -126 134 133 -256 -257 66
7445 66 247 224 131 112 81 126 86 14 -66 22 -239 166 59 -24 -99 -287 8 33 -1 150 134 -13 157 -171 185
7470 185 130 89 -197 -221 -8 -65 155 62 -149 -122 -137 -172 22 179 -53 117 -135 -164 -8 65 102 -154 -109 221
7494 221 -44 113 -25 -23 110 137 -169 36 -51 26 -85 -234 233 144 93 -316 147 -51 -96 185 16 -215 241
7517 241 61 213 -88 -238 -158 109 -114 280 142 129 6 126 -320 -108 39 34 99 -20 119 -233 -274 213
7539 213 16 -186 119 22 -46 85 92 -2 -16 -151 112 -15 -79 216 -349 64 164 -194 -128 127 -188 -264 -222
7562 -222 -91 143 7 -6 -8 -134 161 12 -28 -145 -365 -68 119 137 23 36 -118 -185 -104 -129 -79 214 -305
7585 -305 9 132 158 -271 -153 9 -111 -103 -146 176 -34 158 96 210 -174 -77 71 -133 146 35 150 -109
7607a09K74n6q2J63n30J89J33Q8k5q3J73n0k36lM6J04K13N9j24o1J63k39J66l17
7631a44K16K59m83J40M0R1j46P9j20J57K49l58L3J60o02L19P4j13J61j4J95m54
7653b61P0J71q6N46n19k14K98k9n8J33k8j00j58J00K37j37j11K37k24j26J35K5
7675i9Q3m6J4l5n0J88P4k73N2J09l1J8K4L8j1Nl4j27o0L08k67K04j62K26L1k1
7701A58J6m94O31j82q9l0j55L03l45J30K31j56J7k0j11m7J74j47J66q4Q1O7j05
7724IP3p3K94j44N6j80j15J65j72j89N6M4O0J52P5l02J59k18J92K0K26j68K29
7747B49j93j76Q2J76j63L8r3j44K33j02K35J54l27l19M17l7L7k13J39K11k77l4
7769a07K79o8k78M57j58J24j49k43O3QN9K32o7R2l15o8O0n5J80m64N48k31J48
$$ plain form
7607 -109 165 109 27 190 -340 -151 -18 70 45 -38 135 85 -151 -154 -108 -4 209 268 144 83 246 7 173 -144
7631 -144 72 331 -152 -12 28 119 -27 52 -68 89 338 -20 13 173 -429 -110 -36 -149 12 -2 193 -261
7653 -261 -191 -20 -106 440 -79 -293 5 -24 -82 51 23 -77 -235 -135 102 -35 -146 91 -133 -259 -124 -99
7675 -99 -16 -62 -48 -83 -133 55 129 -144 -92 17 -14 4 28 66 55 60 26 -101 -161 147 -120 84 -78 148 179 158
7701 158 174 -320 311 129 40 10 -145 158 -187 -57 174 18 35 15 -96 -143 31 -116 50 -34 47 114 9
7724 9 82 9 303 159 215 35 -80 85 -87 -276 -220 -176 -116 36 111 -191 -32 -250 -58 -38 188 20 249
7747 249 56 -120 -38 138 -25 13 -80 -224 9 -93 142 296 -31 -350 67 30 67 -146 -7 204 -73 -107
7769 -107 172 104 -174 283 125 249 100 -143 -80 -72 -13 219 152 244 -71 -139 -79 -134 46 -418 130 -101 47
7792D7K2k29M34j81k86M06l26J8K66pm14m7N37k72j49J61J29k83L00J30k53Q0
7814H3k8P8O0j11J00l72J23J75k33k03K74j60K50q8K14m35O8j34L58k1L26l93
7836f9O9rN5Q1J48k11k57L20l06J08q5K86l34L6L14r6K12l31K47q4r5J52l44J44
7860d9J69q4k08R7j84L20O4k28L06l70K9Q1m5J5N0N4j31K98k19Q9k95K99j27n4
7884a23J58k00K50m14K90K46K8k70j95J13L16j67k01L30l7J11j67j67q0L14k25
7905i0M2J5K4j18J62k01L03k78K08L4Kj2p4J30k99M75k66K34k73j39Lk7M4K66
7929A65j50J6j68J67k26J51n07M90mMJ26j0k4rK16r4K8j87K40k63P1j8L5J5j51
7954h7j86K15j55J54j61N76p5l12j34N6m6M4K42j49k02K08j70K87P8n62M81j99
$$ plain form
7792 47 69 -160 274 93 -193 213 -113 -95 171 164 -250 -297 240 -32 -181 -20 109 -174 126 256 3 83
7814 83 55 133 193 82 182 -190 -67 108 -125 -328 -54 -214 36 -52 162 -273 -205 -339 19 -2 324 -69
7836 -69 0 -9 46 127 275 64 -193 127 -179 -71 -156 130 -204 -168 146 50 262 -69 178 94 -1 151 -193 -49
7860 -49 120 36 -172 -75 -259 61 125 -103 203 -167 -138 -57 -102 -87 -37 17 -114 184 -35 54 -241 58 -69 -123
7884 -123 35 -165 85 -329 -39 207 235 -35 -230 -117 199 32 -169 161 124 235 68 -99 -179 135 -90
7905 -90 -48 -33 -9 -127 35 -166 137 -141 67 101 103 91 17 147 -152 323 57 291 18 -121 -118 -145 -101 165
7929 165 15 31 -137 30 -196 -45 -552 -62 -66 -62 64 54 30 21 237 143 171 -16 224 -39 32 14 49 64 -87
7954 -87 -273 -58 -213 -59 -220 356 281 -31 -165 -109 -155 -111 131 -18 -220 -12 -182 105 183 -379 102 -97
7976i7J92J46l44K44j30j59J46J06n91M98K00j24k81P8J47m20M31K75l91J80k1
7997H5j82j62K89n4O3K3J85k41j92K68l3Ok24K79n7O7j23P2K46k46O2k5m8K4K2
8022A04l56J85J15K0L3R5j29L2Mj56j20K14q6K3k1k71L03l25M81n7q6j32L3l6
8046a33K3J95k80M49m7j45j13L5Q0M3J9l7r1Q0k46K54m62O73m68K28J10k81N14
8069D00l41jp7L8j58J11k5O2j40L8K33O5m18L33Q4j17k37K32p8m3j67M6P7n9M34
8094B92j77j89P6J53m22M43j89J52l58L24o7J11j66l7J54j46R2l81L79k00K24
8115F8N3k70M15r4j88j44K71j78L51k98K1O8L6q1j04J48j22K76m99L56P2k10q3
8138a36R2K04q9j26Q8J52k95R3k0J01J37j14k86N7L03j73O1J44k32J37P1j69j69
$$ plain form
7976 -97 95 241 -103 141 11 -148 -2 104 -487 11 211 87 -194 -116 31 -389 42 317 -74 106 85
7997 85 -97 -259 30 -24 39 62 247 6 -186 82 49 55 -169 110 53 120 -3 69 315 69 131 106 58 82 104
8022 104 -252 -67 48 68 101 196 67 99 103 -53 -173 41 -45 -22 -43 -314 -11 -336 145 88 2 -130 -97 -133
8046 -133 -110 85 -195 254 207 62 -51 -16 64 107 126 89 -2 78 -168 86 -376 297 -171 57 167 -114 400
8069 400 59 58 -19 19 -139 -28 -53 9 -131 -93 140 205 -213 120 204 87 -150 82 4 -39 -206 -160 -83 -142 292
8094 292 115 -74 2 155 -267 176 -13 139 -219 105 38 149 -17 -54 100 -46 46 -335 44 -156 68
8115 68 121 -149 266 172 -16 -160 111 -67 284 -14 7 75 111 30 -74 74 -48 228 -271 85 157 -53 -136
8138 -136 -44 160 71 -55 33 185 -110 -17 -37 64 201 87 -199 -142 161 -12 49 193 -39 98 169 0 -169
8161a69O3K1k29J23R4J44j13K25k45j8k1R6j08L43k58J75j32r1K09rk59N8K69
8184A68l1l09J37l85N61j99J62
$$ plain form
8161 -169 -106 -85 -314 -191 -97 47 -66 159 -86 -104 -125 -29 -137 206 -52 123 -9 -100 109 100 -159 -101 168
8184 168 137 -172 -35 -420 141 -58 104
8191A04
$$ Imaginary data points
##PAGE= N=2
##DATA TABLE= (X++(I..I)), XYDATA
0@%%%%%%%%%%%%%%Qj6J6j6J6j9K7l2L8m6N3o1P2q5R5j07J23j43J64j85K09k36
36a25K65k98L34l73M14m58N10n66O26o94P67q45R31j025J129j245J373j515J674
55H79j852K052k281K546k856L226l677M237m954N917p283R382j3080K1539q2155
70f8360l779Q7779l2705L657K2672J4940p848j434l1577J021M6989J1337n6410
83a3718l98M7577o116m6748j696J4488R169J3667n466k3303K3013L4525l2193
96A2801m8605K3134L4938j7333j8491J3098Q054O555q77l3837k0528L6410J7658
109A2977l7843r331M2651J4752k5312j0194K891L531J6219k205k7481J2248M1451
122C4354j3375m3249O008K6588o395j1460N558P743J7237J5195k3781k8305K0709
$$ plain form
0 0 0 0 0 0 0 0 0 0 0 0 0 0 0 0 8 -8 8 -8 8 -11 16 -16 22 -24 29 -32 40 -45 50 -57 66 -77 87 -98 111 -125
36 -125 140 -158 176 -197 217 -241 269 -297 329 -365 402 -443 488 -537 592 -653 720 -795 879
55 879 -973 1079 -1202 1344 -1512 1714 -1963 2274 -2680 3237 -4046 5336 -7744 13795 -68360
70 -68360 -72139 15640 -17065 -13408 9264 24204 16356 14922 -16655 -15634 31355 42692 -13718
83 -13718 -14116 33461 27345 -19403 -21099 -6611 2558 16225 10759 -12544 10469 44994 12801
96 12801 -35804 -12670 22268 4935 -13556 -458 7596 14151 13274 -20563 -41091 -4681 12977
109 12977 -24866 -34197 8454 23206 -2106 -12300 -9409 -5878 10341 8136 -19345 -7097 34354
122 34354 20979 -22270 -16262 10326 3931 -7529 -1971 5772 23009 38204 14423 -13882 6827
135F827J5982l3838j9652K4205J4761r136o546n488j398J6602K241k4125L837
148a5728L7912L399k8588k110J4740n863j1252n955m061J3191K0106j0133k0012
161a4354J3957J8528j9296k0193J3115J4272Q25P41l891k478J2928K104k5000
174h742p281K4399Q469j8044l451J2071r09q181p219r522N398J7838k578j4542
188a2294J0962J9070r642j8160K411P931J273M40k872r55J1647N110j9063j1342
202a5484J2899P250j1201l167J0473P051m71n948q456J886J1466j962j1453O715
216d02J6347j941j3652m221K575L78l178o256Q4J2286Q260r558r244Q482O757
231F717p909o966M847R114L833m890q315J02O712l426j2021J201J3945N317o241
$$ plain form
135 6827 22809 -11029 -30681 -6476 8285 -851 -7397 -12885 -14283 2319 4560 -19565 -15728
148 -15728 22184 25583 -3005 -5115 9625 3762 -7490 -13445 -17506 -4315 15791 5658 -14354
161 -14354 -397 18131 -1165 -21358 -8243 6029 6854 7595 3704 1226 14154 16258 -8742
174 -8742 -16023 8376 16845 -1199 -4650 7421 6512 -1669 -8888 -18410 -13012 4826 2248 -12294
188 -12294 -1332 17738 8096 -10064 -7653 278 1551 1991 -881 -1836 9811 14921 -4142 -15484
202 -15484 -2585 4665 -6536 -9703 770 7821 7350 1402 -7054 -5168 6298 4336 -7117 -402
216 -402 15945 14004 352 -3869 -1294 -916 -4094 -10350 -10266 2020 10280 722 -8522 -40 6717
231 6717 -1192 -8158 -3311 5803 9636 4746 -3569 -3467 3245 -181 -12202 -11001 2944 8261 2020
246B020k808M307L855k660q064l447Q474P248n913q431L629O011n279r535j380
261a1973P859P688n17m390L373Q130p71j1016n134P063M991m653n636K477N791
276C282j37q250n319O203Q054j438m485L180Q374L18q629o126L038M371j912o229
292e705J052Q358J810o943n690L152N828j612n040J648P239L434m869o660J778
307b220N402j879n532q1O528L874m764n558J511M466l45m641r63P130N703l452
323E179n761P10L319j687o540l119M957M801j904m301N57N928J338n357j339N094
339A875M506j393m854j332L115M54n867m137L691N734j45l643J381M520L98l507
355G96m024P93M681K5m827p84M825K303m569l125L011L820k3j997k293K102L820
$$ plain form
246 2020 -788 3519 7374 4714 -3350 -6797 1677 8925 3012 -5419 -1790 4221 -1058 -10593 -11973
261 -11973 -4114 3574 3057 -1333 2040 10170 9399 -1617 -6751 312 5303 650 -4986 -2509 3282
276 3282 3145 -5105 -10424 -4221 3833 2395 -2090 1090 9464 9782 1153 -4973 -1935 2436 524 -5705
292 -5705 -4653 3705 5515 -1428 -7118 -3966 1862 250 -4790 -3142 4097 7531 2662 -3998 -2220
307 -2220 3182 1303 -4229 -4310 2218 6092 1328 -4230 -2719 1747 1402 -3239 -4202 2928 8631 5179
323 5179 -582 128 3447 1760 -4780 -7899 -2942 1859 -45 -4346 -3789 2139 3477 -1880 -3219 1875
339 1875 6381 4988 134 -1198 1917 2371 -3496 -7633 -3942 1792 1647 -1996 -615 3905 4303 796
355 796 -3228 -2435 2246 2271 -2556 -3340 1485 3788 -781 -3906 -895 2925 2902 905 -1388 714 4534
372D534l832o561J584M822m05k959P05L445J966o16l037k215L614K661m598k857
388c749N107K857l444k150M60Q32J176p69l404J10M635P9o014j46N324k04k207
405a507J927J149J447K644j718m392J126L718m172n172K846K649k637j96J512
420g76j124J338L264l071k289M922K118n509j074L595j071k980J808k6j599L977
436A503J455n058N11N346k448m448K438J878k980P37K858k736jM745j293m613
452b106L792L020m709m22L147k454k207L279m66m871L088L673m788j255N175j704
468A92l968L480J304n197K156M267m189j422N845L98m530L026K948m710J34M167
484C901l741l752N296O75n673J929M361l373j358M559j600l508M687J880o429
$$ plain form
372 4534 702 -5859 -4275 547 142 -2817 -2112 1333 3299 2683 -354 -2569 1045 3706 -892 -3749
388 -3749 1358 4215 771 -1379 -919 -87 1089 320 -3084 -2974 1661 1740 -4274 -4420 904 700 -1507
405 -1507 420 1569 3016 5660 3942 -450 676 4394 222 -4950 -2104 545 -2092 -2288 -776
420 -776 -1900 -562 2702 -369 -2658 2264 4382 -1127 -2201 1394 323 -2657 -849 -875 -2474 1503
436 1503 2958 -2100 -1589 3757 1309 -3139 -701 1177 -1803 -1066 1792 -944 -945 3800 2507 -2106
452 -2106 1686 4706 -3 -425 2722 268 -1939 1340 874 -3997 -909 2764 -2024 -3279 1896 192
468 192 -3776 -296 1008 -4189 -2033 2234 -1955 -3377 2468 2866 -1664 1362 4310 -400 -266 3901
484 3901 160 -3592 1704 2379 -3294 -1365 2996 -377 -1735 2824 1224 -2284 2403 4283 -2146
499b146R60N518l637m111M441jm007K645J978n187M6N897l332n312N202K883n206
516c369J343M090k475m31N231k245n052N279L585o812r35N919k111m285L094k50
532E76l945L607L032n866k3P006j558o108L114L282m337J43K851l518q12N074
548B518j684o582M075M555n051k205N526n79k189L249l88m237L193L587n025k107
564c344O506M67n212J636K414k864N88K568l469j294O150p58o432K131M239m125
580g99k211L250j053j269L230o10m464K533M640m437l200N297R55l003J468J215
596A542k758J321K553l824k792N694J229n276J215L888k703r19K182j368j130
611a146L868N37m749J468L983l038l349K249O49k430J410R92k598R50L221l006
$$ plain form
499 -2146 -1186 4332 695 -3416 1025 1024 -2983 -338 1640 -3547 -3501 2396 -936 -6248 -1046 1837 -3369
516 -3369 -2026 2064 -411 -842 4389 2144 -2908 2371 5956 -856 -1791 4128 2017 -2268 826 576
532 576 -3369 238 3270 -2596 -2619 4387 2829 -3279 -165 3117 -1220 -1077 1774 -1744 -2556 2518
548 2518 834 -5748 -1673 2882 -2169 -4374 1152 573 -1616 1633 1245 -2992 201 3788 -1237 -3344
564 -3344 3162 3629 -1583 53 2467 -397 191 2759 -710 -2004 4146 3388 -3044 -913 3326 -799
580 -799 -3010 240 -813 -2082 1148 538 -3926 -1393 3247 -1190 -4390 907 1862 -1141 327 1542
596 1542 -1216 105 2658 -1166 -3958 1736 2965 -2311 -1096 2792 89 -830 1352 -16 -1146
611 -1146 2722 3259 -1490 -22 3961 923 -2426 -177 472 -1958 -548 444 -2154 -1204 2017 -989
627i89k982M048J600l268N98K721j235j138J897j450k246L467J403l922K99L862
643B665j159k517J644J86j580P07J421k098o7L522j581l079J903J231k235j8J681
660F26r57k67J373q86k131J442J491k395J30K738l51j132J247r2j459P17J042
677A136j838k97K473J0j691M36J031j284l98R94m86m09J901q50j498N67P47j806
695a262j84J397l23l06P18J9r71J69R91j190m08J557J27m59P56M21p75k88O93
714F82n70n94J260J24p82J81Q66j150o86R99n00r4R19j38o93K34N26j017n47M71
734e09k59n33O33M27j54OL93k31l64N89L25j70J62N50j35n45K59l82j04K60K88
755E06l24N01j67J86p41J70m40j09J25O39k68k91K16N2p12K23q6n03O79M22j96
$$ plain form
627 -989 -3971 77 1677 -1591 -993 1728 493 -645 1252 -198 -2444 1023 2426 -1496 -1197 2665
643 2665 1506 -1011 633 819 -761 -54 1367 -731 -798 2724 1143 -1936 -33 1198 -1037 -1055 626
660 626 -331 -598 775 -111 -2242 -800 691 -1704 -1574 1164 813 -319 928 836 -623 94 1136
677 1136 -702 -999 1474 1484 -207 229 1260 -24 -422 572 86 -323 1578 728 -770 -203 544 -1262
695 -1262 -1446 -49 -372 -678 40 59 -912 -743 248 -942 -1350 207 334 -125 631 1052 277 -11 682
714 682 112 -482 778 902 120 301 1167 17 -669 330 -170 -264 655 517 -176 58 584 -433 -980 -509
734 -509 -768 -1301 -668 -241 -395 -389 4 -227 -591 -2 323 153 315 865 730 185 444 62 -42 218 506
755 506 182 683 516 702 -39 131 -309 -418 -293 346 78 -213 3 55 -657 -434 -520 -1023 -344 78 -118
776a18Q3R9l9l67m5J8K98J13O52r5n1Q1o77j19m1L9J81j82M89J65k94L25m24k36
800a45k16O43m27j88N61p7n63J98j01j77J48N9K95J49j27L72o86M28J29m82L48
821A41P3K33k91O0K56n50O3L6m28J89J64K72l20J53K53n41l01N17q8k71K42M60
843C22k72K26J66p82K96J68l9o91P40O96q82j50N25m0o74N31k7m44Q47K00j068
864c52lP17o56k38N88L79p53j35Q99p18j75P89l6j203R87Q07j019k18P77n85J04
885d4K16Rm00J70R77r91o37J119j1q97O07K01p87R7Q71p49m54J226O9j601Q22
906a87J067r16m88J093o12m99J119j67j223N16R85n60j302J559L75j187L71O02
924E46j237L89J480j188q88J578J99j903K18J545r03l66R85l52p48J587J60k433
$$ plain form
776 -118 -35 64 25 -342 -387 -369 -71 42 694 599 548 629 -48 -167 -208 -169 12 -170 319 484 190 515 91 -145
800 -145 -361 282 -145 -333 228 151 -412 -214 -315 -492 -344 -285 10 159 32 404 -282 146 275 -207 141
821 141 214 447 156 216 472 -78 -15 21 -407 -218 -54 218 -102 51 304 -237 -538 -21 -109 -380 -138 322
843 322 50 276 442 -340 -44 124 85 -606 134 830 -52 -202 323 283 -391 140 113 -331 516 716 -352
864 -352 -355 362 -294 -532 56 435 -318 -453 446 -272 -447 342 306 -897 90 897 -122 -340 437 -148 -44
885 -44 172 181 -219 -49 928 -63 -700 419 408 -489 118 319 -468 -371 500 -249 -703 523 592 -1009 -187
906 -187 880 -36 -524 569 -43 -542 577 410 -813 -297 688 128 -1174 385 760 -427 -56 546
924 546 -691 -302 1178 -10 -898 680 879 -1024 -806 739 -164 -530 455 103 -645 942 1102 -1331
942a331P18J527q04j009R01O17r34K67R46j587j32K147j057j684J598J091j811
959e37j62J449r51l23J434j205j206J738J181k419n6K300q34j423J146N13r35
976b90P69R22k041J49J476o42j910J316J241j238m54J333q11o70J925o32j659
993a216J489J446j951p26J603M2j264R61r0j204R08J215j968o24K449j26j792
1010h48P55J203j109l81J007q49p99J750m7j745O89J528j497m43J186l75p46R87
1028B66J59j559R38J726k053p55J611L09j526O69R42j120J20J471r40p91J694
1045A161J21k065O34J421j115n85Q93l17q57J269J43k093O61J677r55j080J186
1062I9L12j179O61O40j066J34J332j057j216J645M56j488M02Q50n12n90J032M
$$ plain form
942 -1331 -613 914 110 -899 2 619 -315 -48 898 -689 -821 1326 269 -1415 183 1274 -537
959 -537 -699 750 -201 -524 910 -295 -1501 237 1418 -1001 -1057 1243 409 -1014 132 645 -290
976 -290 479 1401 -640 -491 985 343 -1567 -251 990 -248 -702 631 -180 -850 1075 443 -1216
993 -1216 273 1719 -232 -958 645 687 -577 384 294 -910 -2 1213 -755 -1379 1070 944 -848
1010 -848 -93 1110 1 -380 627 -222 -1021 729 682 -1063 -374 1154 -343 -786 400 25 -721 266
1028 266 425 -1134 -196 1530 -523 -1278 333 642 -884 -215 727 -393 -273 1198 258 -533 1161
1045 1161 1282 -783 -149 1272 157 -428 465 148 -709 560 703 -1390 -729 948 -7 -1087 99
1062 99 411 -768 -107 533 -533 -399 933 -124 -1340 305 761 -727 -325 525 13 -577 455 459
1080D59j063R35P37r10m21J470p54r23Q27r2r32O21O52j135k35J351l55j334Q15
1099b87P31j014p8J038n58l85Q10P7j133O27Q53r74j62J088p2j023N67O26o75
1118E6J01K46j07n98P11j0p56K80N56q64m4P64j86m57L96No42L26Q49p34j84M69
1140A77j8o84K53N77m55m41J013m42k57O49m1n76M19M42q25j03Q40k79n81O01
1160B69L18o16m7M46l46l31N92M6l80J51k8l77J12O16o32j01O64k34m52M10j24
1181d4j70J75K16P8k67O9L10l84o8O77m53k67K37K5m93K81M37m63L78k57j69k03
1203c55J98K33l31J63J56Nm32L96R9l41J21J50j65J22K76j73l06J65j24j79K91
1224c1p5K32N5j44J51N1j3k57J21J39Q3nn63L18J46l26l6Q3k70j58Q9lK50J98
$$ plain form
1080 459 -604 331 1068 158 -263 1207 453 -470 357 265 -667 -46 606 -529 -764 587 232 -1102 -287
1099 -287 444 -570 -648 390 -168 -553 257 334 -799 -172 681 -293 -455 633 561 -462 105 731 56
1118 56 157 403 296 -302 409 399 -357 -77 479 -385 -429 335 149 -308 88 93 -549 -223 626 -108 -292 177
1140 177 159 -525 -272 305 -150 -591 422 -20 -277 372 331 -245 174 616 -209 -312 528 249 -332 269
1160 269 587 -29 -76 370 24 -307 285 331 -49 102 74 -303 -191 425 -207 -308 356 122 -330 80 -44
1181 -44 -214 -39 177 255 -12 57 367 -17 -85 592 139 -128 109 134 -359 -78 359 -104 274 17 -152 -355
1203 -355 -157 76 -255 -92 64 69 -363 33 132 -209 -88 62 -103 19 295 122 -184 -19 -143 -322 -31
1224 -31 -106 126 181 37 188 239 226 -31 90 229 312 307 -256 62 208 -118 -154 -71 -341 -499 -410 -413 -163 35
1248C5J85j35k08M87n41K07l73P06l86N5J18j20K8m6k01K90l3N5k39J65K53p6
1270B26j73K02l0l41L78l06j82J25R6J03m40K02K54l41K85J1j99j73N32l88P2
1291h7J3m6j14n8N09k73L6K81k65K74J52j05j15j2O6l9j26o7O7k17nK19l02J97
1315a7J07J2k60n1L19n80K47L89k88L3J26j20J0Q9J07l55q8J50J28k42K65J39
1337A20l10K80L36l81j2P5J46j3o3k9p1K62j5k46j47M5l8l85N02O8l61M68L4m58
1361a93k6J93J48l87J98K01m21j85O57k01o5j4J83j7j10J86n4m20N71k02k68L
1383b23M60l58j06O31m99k22N03K18j73j18j1J8m14O92n92l57M06R3j85J08J59
1404C0k49j42L69O6p18M00O08l47l55M32m0m44O02J09k87j36K48r9k23M09K72
$$ plain form
1248 35 220 85 -123 364 -177 30 -343 363 -23 32 150 30 58 12 -189 101 68 123 -116 49 302 226
1270 226 53 255 225 -116 262 -44 -226 -101 -5 98 -342 -140 114 -227 58 69 -130 -303 229 -159 -87
1291 -87 -74 -120 -234 -292 217 -56 -20 261 -4 270 422 317 202 190 256 217 91 24 91 -126 -131 88 -214 -17
1315 -17 90 102 -158 -209 110 -470 -223 166 -122 -89 37 -83 -73 16 123 -232 -320 -170 -42 -284 -19 120
1337 120 -190 90 426 45 33 108 254 241 178 149 78 340 325 79 -68 -23 -61 -446 56 124 -237 231 265 -193
1361 -193 -219 -26 122 -265 -67 134 -287 -472 185 -16 -81 -95 88 71 -39 147 93 -327 244 42 -226 -223
1383 -223 237 -121 -227 404 -95 -317 186 404 231 113 102 120 -294 398 -194 -551 -145 -52 -237 -129 30
1404 30 -219 -361 8 74 -644 -244 364 17 -338 94 54 -390 212 321 34 -102 146 47 -176 233 505
1425E05p96L45M3l02q7O33j02k21L60j31l79J92J79j87k35L16M2k68QJ13k09j01
1447b82P94n12m45N30L06o44K06L33n46L80L99n02j76M28O6n82k63P29k77r4L47
1468A95K2m82J23K10o02K68L88K52n92J96K99k87M8L15o78J48L95N6n60K20P09
1489F43o27l21O25o53k03N33p6m30L90K56m50l26Q24j12o38M26L06k07K14L28
1509E02n59n12O98Ln09K81J86k15n06Q62k90P0L36p7n26J94O82o23k65P12m02
1530D2l21J80M7l8K1M35o05k9M00J18o47J49N52k26J65K04k99k81L89K7p25J46
1552b96N58m70JM20p6l28L40L39o31k43P60r8l24M68j07k99m01M09j41l19O05
1573A67p1k40J72L02k52j73L99j40k51K2K10M8j42J74k80n5M86l64m48N34pl07
$$ plain form
1425 505 -291 54 97 -205 -292 341 239 18 378 247 -132 60 239 52 -183 133 175 -93 -85 28 -181 -282
1447 -282 512 0 -445 85 391 -253 -47 286 -260 120 519 17 -159 269 335 -247 -510 219 -58 -152 195
1468 195 217 -265 -142 68 -534 -266 122 374 -218 -22 277 -10 38 353 -325 -177 218 274 -286 -66 643
1489 643 16 -305 320 -333 -536 -3 -79 -509 -119 137 -313 -639 185 73 -565 -139 167 -40 174 502
1509 502 -57 -569 129 132 -377 -96 90 -125 -631 231 -59 11 347 270 -256 -62 620 -3 -268 444 42
1530 42 -279 -99 -52 -90 -69 366 -239 -268 132 250 -397 -248 304 78 243 447 148 -133 256 283 -442 -296
1552 -296 262 -208 -207 213 137 -191 149 488 -143 -386 374 276 -48 420 313 14 -387 22 -119 -438 167
1573 167 96 -144 28 330 78 -95 304 164 -87 -65 145 193 51 225 -55 -110 376 12 -436 98 91 -216
1595b16N4M20l97r5K30k10j41L49N58n23k79N03P8n75K00q7j26L71J24m02J81
1616A7J64l62j67M79m8j40J80k01J70j92J24K7j15K70j62q1R5J34j9j40j66j50
1638b83K73N3K29l24M5R3o2l61R3M10m62K78J04J24q5j06k5l86M31L29m34J8J19
1661G1Q3k75K07j67J97k84K55p4L7J62j52r8l4J57j23NK19l15j11O21o5l23k96
1684c03M18n21j43K69K32K38l75l10N19J67j60O4l07K87j61J59j82P8J04P2l82
1705b37J73P5p4J0R4J79L9k85L6j91K19J80L6k17j29lP5R3l22J22P8p0q0K77o3
1730A5j04R7j59J50K60r5p9M1k02K17p8l78K60k4J12m60M09p6K00m6O8k0L20m45
1754a7j1J44q7P8o9pm30k8L15J15k0J86J43k29k75J32O0K03m6l09o1N8J62k28
$$ plain form
1595 -216 -162 258 -139 -234 -4 -214 -355 -6 552 29 -250 253 331 -244 -44 -131 -257 114 238 -164 17
1616 17 181 -181 -348 131 83 -57 123 -78 92 -100 24 51 -64 206 44 -37 58 192 173 33 -133 -283
1638 -283 -10 43 272 -52 -7 86 24 -337 -244 166 -296 -18 86 210 125 19 -6 -392 39 368 -66 -48 71
1661 71 154 -121 86 -81 116 -168 87 13 50 212 60 -38 -72 85 -38 -33 186 -129 -240 381 316 -7 -303
1684 -303 115 -406 -549 -280 -48 190 -185 -495 24 191 31 95 -212 75 -86 73 -109 -31 73 145 -237
1705 -237 -64 11 -63 -53 41 220 259 -26 10 -181 38 218 254 37 -92 -95 -20 73 -249 -127 -49 -119 -199 78 15
1730 15 -89 8 -151 -1 259 164 85 126 -76 141 63 -315 -55 -79 33 -427 -18 -94 106 60 128 108 428 -17
1754 -17 -28 116 29 107 38 31 -399 -427 -112 3 -17 169 312 83 -192 -60 0 203 157 -152 -213 -155 7 -221
1778b21J42K31m45J25J01K5j1L11k62o8J23J67l77J39J83N6j42j21j28K39k67
1799b00j78J66k81M36j7k3R7j48N23p00Q5J93J05M16n47r0N0K85k21l72M13R7
1821H9Pr7L24j07j28M5k99K07K7k64k8R5J01J31Ll28J65m2J14R9k77K34J24k42
1845d7k20k4K69J27R3j58l13M76R0j60l75K96Q6o12N12l45M22k89K74l7Q9k84
1867a30J69l84q8Q98k96m8o5j92L80k45J9j41J01M40n43k96L80M7j25N3L45j46
1889A33M0r7N6Q8l91K15j07r1K60L0j73J27L89o27L34k12j19N0M52j92k47J44
1911F2J58l79J01J3j51K22j44L59k31K02n9J63l13j26L69l34j07K56p0L6k19L2
1933a60M1J78k24jQ7L68m27K0K9l1K58r3P9l42K58K95m86r0N69n8o50N50l83K10
$$ plain form
1778 -221 -79 152 -293 -168 -67 -42 -53 258 -4 -72 51 218 -159 -20 163 219 77 -44 -172 67 -200
1799 -200 -378 -212 -493 -57 -74 -97 0 -148 375 -325 -240 -47 58 474 -73 -163 -113 172 -49 -421 -8 89
1821 89 96 -1 323 216 88 133 -166 41 68 -196 -224 -129 -28 103 106 -222 -57 -99 15 114 -163 71 195 -47
1845 -47 -267 -291 -22 105 198 40 -273 203 293 133 -242 54 140 -472 40 -305 117 -172 102 65 154 -130
1867 -130 39 -345 -433 465 169 121 56 -136 244 -1 18 -123 -22 418 -125 -421 -41 6 -119 -66 279 133
1889 133 173 76 132 220 -171 44 -63 -154 106 136 -37 90 479 -148 186 -26 -145 -95 357 165 -82 62
1911 62 220 -159 -58 -45 -196 26 -118 241 10 212 153 316 3 -123 246 -88 -195 61 -9 27 -192 -160
1933 -160 -119 59 -165 -166 -79 289 -138 -118 -89 -120 138 45 124 -218 40 335 -151 -241 328 270 -380 170 -213 -3
1957cm9O4j87p2N04k22%m8J58j94p2K19q3Lo2j44j14o1O62k40k47k0J75p7j45
1982b55K24M7J57j54j77m7K69M1j68J59k6J42k87j33M9K50%Q2m18K88L38n46K4
2005a41J34J13m45K37LK21R2J7l79k38M52K86n34mL64p4k1k8j31P0L21k95Qr0
2029f2N2P5l35K76K29k22l77M64k62Q3L51l98l9l5L77k14O7L5j71R1P5j57J38
2052D1j57J09k01K39J64j08jk20K96m71J16J27M6q3L07l58O8J64J63j76m3l9J02
2075H5J42l41J39J7K57l56k41M09Q1o9qqM4k9OJ69o29N01l03O8J93j7J21l80j71
2100c20M24j35K52j52j00Q5j37J84m3l23R7J37k2J76j70K48N4k83K7k05K22P0
2122H6m19J27N7K81J07k77j66L38l04k8R8K31p9j08k6L31m55K41J04m09K33r6
$$ plain form
1957 -3 -52 12 -175 -247 257 35 35 -13 145 -49 -121 98 15 18 -44 -188 -302 -363 299 59 -188 -208 -33 -110 -255
1982 -255 -31 16 173 19 -158 -205 64 105 -63 96 70 212 -75 -208 -159 91 91 173 -245 43 381 -165 -141
2005 -141 -7 106 -339 -102 -99 122 214 231 -148 -386 66 352 -182 -186 178 104 83 55 -76 -6 315 20 28 -62
2029 -62 -10 65 -270 6 235 13 -364 100 -162 -79 272 -126 -165 -200 177 -37 30 65 -106 -15 60 -97 41
2052 41 -116 -7 -208 31 195 87 86 -134 162 -309 -193 -66 -20 -103 204 -154 -86 78 241 65 22 -17 85
2075 85 227 -114 25 42 299 -57 -298 111 192 123 115 107 151 122 128 297 -332 169 -134 -66 127 110 231 -149 -320
2100 -320 104 -31 221 69 -31 54 -83 101 58 -265 -168 -31 -53 123 -47 201 255 -28 -1 -206 16 86
2122 86 -333 -206 -149 132 239 -38 -204 134 -170 -198 -100 131 52 -56 -82 249 -206 35 139 -270 -37 -133
2144a33K03N8k35Q9K34k95l3L31J07m27L41j84m8lL21j94m5p4o2n8l0N49o45J53
2168h0k19P5L60j04n9Q4J4O3K5l88J17Q8LN5K62j04l12J59k07L42k33q2K79j70
2192c2N2j01L3K9K11k68j9K94m71K27j42J04K12k18q9k8J88K59j91k16L28n31
2214c69L09l6M8P2k43K42j35J37J15l42L39p0J15j39N2n2p7J19l17L0P5K23j70
2237g4J86q2K52l21J12k76J04J86p2M5n4J25p0J5O1j40K5M7n6R6l25L71j25j03
2261g3J66MM9l74K19J61r9p7J08J47j48K3j45R5R2j65k52J58K72j76K9L9J02k32
2285g7L51k52k2j02K93J0j89L0J60q8k03K05J23k85J27r0P8J49l75N7m4N1J56
2308F3J1k63O3K70j98P2n0L0K1r5K6o6K15n7P4M6j43K24k80m5K4m3J45k04L6P1
$$ plain form
2144 -133 70 128 -107 -18 216 -79 -112 219 326 -101 240 56 8 5 326 132 87 13 -49 -107 -137 412 -233 -80
2168 -80 -299 -224 136 32 -27 57 71 134 159 -229 -112 -24 -21 34 296 192 -120 39 -168 174 -59 -141 138 -32
2192 -32 20 -81 -48 -19 192 -76 -95 199 -272 -45 -187 -83 129 -89 -178 -206 -18 241 50 -166 162 -369
2214 -369 -60 -96 -48 24 -219 23 -112 25 140 -202 137 67 182 43 95 43 -34 85 -232 -202 -127 96 -74
2237 -74 112 30 282 -39 73 -203 -99 87 15 60 6 131 61 76 137 -3 22 69 13 109 -216 155 30 -73
2261 -73 93 97 146 -228 -9 152 53 -24 84 231 83 106 -39 56 148 -17 -269 -111 161 -15 14 53 155 -77
2285 -77 274 22 0 -102 191 201 12 42 202 114 -89 116 239 -46 81 -9 69 218 -157 -100 -144 -93 63
2308 63 74 -189 -126 144 -54 18 -32 -2 19 -76 -50 -116 99 42 116 162 19 243 -37 -82 -58 -101 44 -160 -124 -53
2334e3j77l0K21J24P4j28j60K61k91J20m7K91l31J46O8j61J48k7j59J18M9J38
2356A94l35O5j05L53k44N9p4L25k75j62J74Q6J97l00n9J51k4L3K60j56l57J55
2378c9K3O9J7n3J89k38k0o6J68r8P7L7j9k30J03j09J42J94l4K50n40j09L55q0
2402a1J7L8J42j24r1J4J64k57k2K18Rl28K04N0r2k35K3L63l20L13n8o8J51o9J99
2427B30K0j56j02O0j43j62o4J54K92N9l03J97J6p7q2k35J30J36l0o2O6mJ08j23
2451g5o4K40j73O4K0J99k78K18k28Q8m2j66J93j07K4N3L6K25l20k3K60k54L22
2474B12j83j4l9J11j8j46K31k07J01j93J24J06m9K4l7K9P6p1j88J45K01P3k39
2497D9j23K57l65k92O86j93j26J12k59L21j39J15j13J17J71k80K31j24J33j77
$$ plain form
2334 -53 -230 -260 -39 85 159 31 -129 132 -159 -39 -86 205 -126 20 88 -73 75 48 -111 7 56 194
2356 194 -141 -76 -181 172 -72 -13 -87 238 -37 -199 -25 61 258 -42 -101 50 26 59 319 163 -194 -39
2378 -39 -16 53 70 17 206 -32 -52 -118 50 -48 29 66 47 -183 -80 -189 -47 147 113 363 -177 -286 69 -11
2402 -11 6 44 186 62 -29 -15 149 -108 -130 88 97 -231 -27 23 -69 -304 -281 82 -238 75 17 -51 100 31 230
2427 230 250 94 -8 52 -91 -253 -317 -163 129 188 -115 82 98 21 -61 -296 -166 -30 -60 -122 -56 -60 48 -75
2451 -75 -139 101 -72 -8 12 211 -67 151 -77 11 -31 -197 -4 -111 -87 -34 2 227 -93 -116 144 -110 212
2474 212 29 15 -24 87 69 -77 154 -53 48 -145 -21 85 36 60 23 52 128 57 -131 14 215 288 49
2497 49 -74 183 -182 -474 212 19 -107 5 -254 67 -72 43 -70 47 218 -62 169 45 178 1
2517An8k26J70J54K41l57p3M6J69o8j95M16l4k41oj05K04O3n1k85k6N02n9m14
2541b32K56k13l7p7K39L4j73j05N07l21J36J03p5K29k56O7K51l37L23k76l0J47
2563A60k72P9N5j13j59N16j12p3M3j15r9L0j32L88k14j55P1K15j31J8r9O4l4o2
2587a31J06J78j45k35K00K36j96r1R8K16k45k87R9k7J05l0J77J31l62M27p1k59
2609a06J65o9p8J07k16O9J6J92l78K18L63l74J60J12p4k07J10Jp6L04j46P2k09
2632d4J73P9k31n3j23N06o73rL45p6N4K32k11J59l5k49L27j91j49Q1j13r5j0K16
2656i0K11Ol06J88O6j11Q8k49R4J6o4O2J90l5l5j95P8K38k98J48P1m8J96m10J81
2681hl1M3k45J31j17M91n7j72L5j56R9j52J74k42J57j46L75k91L6%J72k33K81
$$ plain form
2517 1 -57 -283 -113 41 282 -75 -148 -102 67 -1 -196 220 186 -55 -61 -166 38 101 50 -235 -261 241 182 -232
2541 -232 24 -189 -226 -303 -64 -30 -203 -308 199 -122 14 117 42 271 15 82 333 -4 319 43 13 160
2563 160 -112 -33 22 -91 -250 266 154 81 124 9 -90 -60 -192 196 -18 -173 -102 113 -18 0 -99 -35 -69 -131
2587 -131 -25 153 8 -227 -27 209 13 -78 20 236 -9 -296 -197 -224 -119 -149 28 159 -203 224 153 -106
2609 -106 59 -10 -88 19 -197 -128 -112 80 -298 -80 283 -91 69 181 107 -100 10 11 -65 239 93 165 -44
2632 -44 129 208 -23 -76 -199 307 -366 -375 -30 -106 -52 180 -31 128 93 -156 171 -20 -169 -88 -201 -296 -306 -90
2656 -90 121 127 -179 9 75 -36 52 -197 -103 -87 -151 -89 101 66 31 -164 -86 152 -146 2 73 25 221 -189 -8
2681 -8 -39 4 -241 -110 -227 264 207 35 70 -86 13 -139 35 -207 -50 -196 179 -112 -76 -76 96 -137 144
2704A44k94Q1Mqn2K98j20M6j49j73K93J58j93L7j55K54Ok49K56r0l6K3p6K7J53
2729A85l39Q7j64N6L41K3l15L12K14n04l7K96j78j17J8K8j64L03j96M60k55nk26
2752a77p9K38k03K72Mp8p4n8Q1J10j34J99k70J98m8J98l06K44r9k9J72j67r0J34
2776C8j5j54j0OJ54r9R6k07J68J6R4j39J49L4j29o4K3j61K04K4k3j40K88k94R3
2801d8L8r9J19J77m38L38j33J21k04m6K73k9j35j36J18J25M8j86k60M72M4k92
2823a33k0J53j02J28j2O0k0R6M6l72K44Q1j43q2K89o6oJ03m92N64m60j13M4L90
2847A77j27J26l5q6oK05l19l1K01n4Lk11M52m57M2L4N3J03N0j82J81Q7k48r2J44
2872A0J07n2k4k98M79k81m4K21k06j25K65N3J09k10L24l53J23O2j90k07L72M8
$$ plain form
2704 144 -150 -69 -65 -73 -125 173 53 99 -50 -223 70 228 35 72 -83 171 177 -72 184 94 58 81 5 32 185
2729 185 -154 -67 -231 -175 166 189 -126 186 400 -104 -141 155 -23 -140 -122 -94 -258 45 -151 309 54 49 -177
2752 -177 -256 -18 -221 51 55 -23 -97 -155 -74 36 -98 101 -169 29 -19 179 -127 117 18 -11 161 -6 -96 38
2776 38 23 -131 -141 -135 19 -80 16 -191 -23 -7 87 -52 97 131 2 -62 -39 -200 4 28 5 -135 153 -141 -48
2801 -48 -10 -109 10 187 -251 87 -46 75 -129 -175 98 69 -66 -202 -84 41 89 -97 -357 115 159 -133
2823 -133 -153 0 -102 26 14 74 54 150 196 -176 68 149 6 -76 213 147 141 244 -248 316 -144 -257 -213 177
2847 177 50 176 141 55 49 254 -65 -96 105 51 54 -157 295 -162 -120 -86 -33 70 120 -62 119 206 -42 -134 10
2872 10 117 65 41 -257 222 -59 -103 118 -88 -213 52 105 214 4 328 -25 98 160 -30 -237 135 183
2894A83k15k35L30j74N1L60j94j02n2r3P9L5J0J44k85K98r4J4O6r5j5l7J80m18
2918b59K96k15J53L2J58k19r4J90M5J33k89J00j8j87M37j15J6k04Q1r0Ro3K41
2941A38J83o65J98K79j76M7R2j32k37M14J13j91k8k46K07J18j50j35K54k57Q0
2962i4L2o4K27l34K56p9J38k49o0L73k60Nl7K5K04k66Q6j66M75q5k52J47k72N41
2986B91l43K43j12l85L58j74K90j84L50l42j07j26K99P6K3R4m54K5L48k09R6k39
3008a82K43j81k01M75p5j04Q9o9q2J43N2n2j69J88Ok12K49r2J67p0k3k12j46K55
3032cj08mJ48j4k3N7K73o68K79J48l42j4J09M8K74k4n2k33M03l15p0J77j58j22
3056b34M08j29j69M15l01M7k25K86Ko0q4K9J6K25q5L4J31n41M30l66K71j23J24
$$ plain form
2894 183 -32 -267 63 -111 -60 300 106 4 -48 -141 -62 -27 -17 127 -158 140 46 60 126 31 16 -21 159 -259
2918 -259 37 -178 -25 7 165 -54 -148 42 87 220 -69 31 13 -174 263 148 164 -40 41 -49 -40 -103 138
2941 138 321 -344 -146 133 -43 4 96 -36 -273 141 254 63 35 -211 -4 114 -36 -171 83 -174 -94
2962 -94 -62 -126 101 -233 23 -56 82 -167 -227 146 -114 -109 -146 -121 83 -183 -97 -263 212 127 -125 22 -250 291
2986 291 -52 191 79 -306 52 -122 168 -16 334 -8 -115 -241 58 134 157 251 -203 -178 170 -39 57 -182
3008 -182 61 -120 -321 154 79 -25 64 -5 -87 56 108 56 -113 75 81 -131 118 26 193 123 100 -112 -258 -3
3032 -3 -111 -115 33 19 -4 53 326 -342 -63 85 -257 -271 -162 -114 160 136 84 -149 254 -61 -131 46 -112 -234
3056 -234 174 45 -124 291 -10 37 -188 98 100 40 -44 -15 1 226 141 175 306 -235 195 -171 100 -23 101
3079A01j89J8K7l04M21K85l79j19j38J46J29J15j08K57oj07n8k13L84Kl62K20
3101A22j13Q7j05j61Q5j23K78j35J81R9l20J72k33P4o8J31l1J5J26J0k35J79m6
3124a1j88K08k77K17j00L41k16P5K23m58J83L23j16R5l51O6J4%j66j16J55J40
3146D1J22j97R6k27J42k1l6R6l80K4N37k28J51p4J35j55j10J05j88L53k32k10
3168b56K04J73k45J11J17j09q4K18j26m3J16k08K04J37k94m1J71j29j91K32K3
3189b0K37l7k06K18l87J29k34M20k30J24J12j5R7k98J68P2q7j72j09L44n5j64
3211i3J59o9j38J29k55M46j83J51k97J36M9L2j58M67k39p5n4j4J84j75J02j40
3233c5j1n5K14m08M8J55J73l2K11m08P5J80O2j66J44j6Oj60J89k10j60R3J61l1
$$ plain form
3079 101 -88 -70 -43 -347 74 359 -20 -139 -277 -131 -2 113 5 262 256 149 91 -122 262 264 -98 122
3101 122 9 96 -9 -170 -85 -208 70 -65 116 215 -105 67 -166 -92 -160 -29 -60 -45 81 91 -144 35 -11
3124 -11 -199 9 -268 -51 -151 190 -26 49 272 -186 -3 320 204 299 -52 14 28 28 -138 -254 -99 41
3146 41 163 -34 62 -165 -23 -44 -80 16 -364 -340 197 -31 120 46 181 26 -84 21 -167 186 -46 -256
3168 -256 -52 121 -124 -13 104 -5 -89 129 3 -40 76 -132 72 209 -85 -126 45 -84 -275 -43 -20
3189 -20 217 180 -26 192 -195 -66 -300 120 -110 14 126 111 208 -90 78 150 63 -109 -218 126 71 -93
3211 -93 66 -3 -141 -12 -267 179 -4 147 -150 -14 35 67 -91 376 137 62 8 -6 178 3 105 -35
3233 -35 -46 -101 113 -295 -247 -92 81 49 260 -148 -73 107 169 3 147 131 137 -23 166 -44 -204 -111 50 19
3257A9k03M48k82M60k38k51R8N2j61J04k73L76q9p7J38oP7l79J84L05l71J60k84
3280a93L22o0j96J54j10K67j32j3o5K33k02J2J65k47r9J64o7k48O68l12j28J98
3302A11l41J00J00m1k5q0M49n2l42q9K95K03k91j8l22m8L38J08K0k57L72l64J69
3325ej61M5j93L69J2P5O0l49M39l06Nm2k1j50J25J70l75lK71j23J26J43K4j4j52
3350c0j8L8n7q1Jr7L55l77J35N5qK41k98J29j61K41r0p8J58j83l3K79K76o3o94
3375c60K32J91J95j42o4j55j84K18J41l5k85N74k52jm8J36J18k34k25J94l75K56
3397a05qp3J95o3k6J44k86J88J08K7l6j59m3K77l72ON63l39l3Nnj9N6K49k68k3
3423d0Q6j99L25l07J76p9k10L76k39J54J09O3p2k13K34k36J47k52J95j74N1R1
$$ plain form
3257 19 -184 264 -18 442 204 -47 51 103 -58 46 -227 149 60 -17 121 115 192 -187 -3 302 -69 91 -193
3280 -193 129 69 -127 27 -83 184 52 39 -26 207 5 17 182 -65 -164 0 -67 -315 353 41 -87 111
3302 111 -230 -130 -30 -71 -96 -176 273 221 -121 -210 85 288 -3 -21 -343 -391 -53 55 75 -182 190 -174 -5
3325 -5 -166 -121 -314 55 67 142 202 -147 292 -14 -9 -51 -72 -222 -97 73 -302 -305 -34 -157 -31 112 136 122 -30
3350 -30 -48 -10 -67 -148 -147 -244 111 -266 -131 -76 -84 157 -141 -12 -173 68 -22 -100 58 -125 -158 121 397 334 -360
3375 -360 -128 63 258 116 52 -103 -287 -69 72 37 -248 326 74 73 25 161 279 45 -180 14 -361 -105
3397 -105 -113 -186 9 -54 -80 64 -222 -34 74 101 65 -94 -137 140 -232 -226 337 -2 -35 -30 -35 -54 2 251 -17 -40
3423 -40 46 -153 172 -135 41 -38 -248 128 -111 43 152 215 143 -70 164 -72 75 -177 18 -156 -105 -14
3445a4K0R5k27m2K29P0m25M32m5k7O8j3R6k06J07j50L49j56k45L03K1Q2m37n2
3469a67k0L97j49j60J02k51K86j34K46l53M19m36L24n2kM2j17N4jl7j57P1p3l4
3493b02J0Q1O07o62K52j11K29j64J11k02qN5k43M51j68R6j85J75l7p7n3l2N15
3516D38l06k44K79m1J58l00M05n33J11j1jN1m3L07l38L27l56j0k62L84j53K3n1
3539a66J67O7j51j8J50Pk1j27l1j2L29k90Q2j49N1K96r4k03J43p1kk3J0j26K86
3564A04O4k54O2J2k54M01j05R2k28M42n21O5m2N0k26K67J74N7k05J33M9l6q2j31
3588a12J26Qj39K90k26j03J81k38N30l88K23l6j08L9k77L53k48J43J9P5j8k92
3610a98N7P4n1K90j26j52L9k4K95j35Q3J46n11J60J8n5j03K47j70j47L51Q1l30
$$ plain form
3445 -14 6 101 -126 -168 61 131 -294 138 93 66 134 121 217 11 118 -32 317 161 -84 219 240 322 -115 -167
3469 -167 -187 210 61 -99 3 -248 38 -96 150 -203 216 -220 104 52 50 92 -25 29 28 -9 -166 -95 -168 -202
3493 -202 -192 -111 496 -166 86 -25 204 40 151 -51 -59 -4 -247 204 36 132 -53 122 85 8 -45 -77 438
3516 438 132 -112 167 126 284 -16 389 -144 -33 -44 -45 6 -37 270 -68 259 -97 -107 -369 15 -138 -115 -166
3539 -166 1 68 -83 -101 49 56 35 -92 -123 -135 194 -96 -14 -163 -112 184 90 -113 30 -41 -43 -66 -56 -182 104
3564 104 168 -86 -24 -12 -266 135 30 122 -106 336 -185 -120 -162 -112 -338 -71 103 160 -45 88 137 101 19 -112
3588 -112 14 22 -117 173 -53 -156 25 -213 317 -71 152 116 8 47 -230 123 -125 18 37 112 94 -198
3610 -198 -141 -67 -118 172 46 -106 -67 -91 204 69 152 298 -213 -53 -35 -90 -193 54 -116 -263 88 169 -161
3633a61j69M98r2k25J90j11J29K7n6p8J93O9j41k94J21J30k6j91L13njM0j91P6
3657D5Q4j25rn3J97j43k4K12Kk36O1k18K35j47L85m17L03J4j26p1J90j20J2j23
3681g2R0j75K25l1j12M9j85K99p3Q1j95K65l28L25m69J19K08R6k66J11L29m31
3703a40J32N4k30L91n64K33l0J58j05K22j39r5J37k26J85o4k2j14J81J20O9j06
3725D7%j41j49L15R6J75m87oJ06r6N9K85k32J38j5k82J61j00K78n6j79J45j74
3748a12J46p6K11m20J41M6l1j10K57J73j62j32K77N0l7j74l13K00kL53q7Qj92
3771A4j70j2K43k58j10M37L1j76j28L33l64q0K72J83rO4l59j6N04j66l7M9l38
3794i3J02Jj41J13J83l75K70l18J71K91l06O8q0j76L64j48P4K14k48j4j74M44
$$ plain form
3633 -161 -330 168 76 -149 41 -70 59 86 30 -48 145 214 73 -221 -100 30 4 -187 126 121 120 160 -31 45
3657 45 129 4 -5 -58 139 -4 -28 184 186 -50 11 -207 28 -119 266 -151 152 166 40 -31 159 39 51 -72
3681 -72 18 -157 68 37 -75 -26 -211 88 15 96 -99 166 -162 163 -306 -187 21 117 -149 -38 291 -140
3703 -140 -8 46 -184 207 -357 -124 -154 4 -101 121 -18 -113 24 -202 -17 -81 -103 -217 -36 84 153 47
3725 47 47 -94 -243 72 168 343 -144 -150 -44 -140 -81 204 -28 110 95 -187 -26 -126 152 96 -83 62 -112
3748 -112 34 -42 169 -251 -110 -64 -95 -205 52 225 63 -69 208 258 221 47 -266 -66 -68 285 198 206 14
3771 14 -156 -168 75 -183 -293 144 175 -1 -129 204 -160 -240 32 215 206 270 -89 -105 399 233 196 245 -93
3794 -93 9 10 -131 -18 165 -210 60 -258 -87 204 -102 -34 -114 -290 74 -74 0 214 -34 -48 -222 222
3816B22j42j35n1R3j25J75kq3l1N5M2N5k5m1o2K43p3l23K62J63k90Q3rj9r1m0
3842a49K07j62J24j60K90j5J53m31J31j74L99j54j57R3j5M2J11K9k98P6J08n2
3864dJ36q7j06rL52j76lN2k71l2R9L11l18K66j0rj79l7j09K64j94%r2M19J24l84
3890CL8P0J9k6k12R7L0k22J45J5mp0P6J12J15p1n9r3P2j36L69r1Nj03J0l0J38
3917A97j15l50K37N0j02K85j4p1m0m3p2l25K82J22K8j66p4K36N2j62j70K00Q3
3940F8j84L5l22M10J71p1q3P9J63l89j6M25j2k69j4N3J13k68M99l07j24j41L49
3963A65j06k80K3j25L05K4l04J71j6J03K52j91K26k86Ll80L81k48K20k8R8j73
3985a66K08pj52M75l97K67k03L9j49J41j86k9J96j5Q1j06K90j50l15P7J6J5L6
$$ plain form
3816 222 80 -55 -106 -13 -138 37 35 -48 -79 -24 18 73 48 7 -55 188 115 -208 54 217 -73 10 1 -18 -109 -149
3842 -149 58 -104 20 -140 150 135 288 -143 -12 -186 213 59 -98 -5 -20 22 133 162 -136 -60 48 -4
3864 -4 132 45 -61 -70 282 106 103 155 -116 -148 -49 262 -56 210 200 191 12 -25 -134 130 -64 -64 -156 263 387 3
3890 3 41 111 130 104 -108 -11 19 -203 -58 -43 -47 -117 -41 71 186 115 56 -37 35 -101 268 177 182 79 89 59 197
3917 197 82 -268 -31 19 -83 202 188 117 77 34 -38 -363 -81 41 69 -97 -171 65 117 -45 -215 -15 68
3940 68 -116 -81 -403 7 178 107 24 103 266 -123 -139 286 274 5 -9 44 157 -111 388 81 -43 -184 165
3963 165 59 -221 -198 -323 -18 6 -298 -127 -143 -40 212 21 247 -39 -36 -416 -35 -283 -63 -91 7 -166
3985 -166 42 35 -117 358 -39 228 25 64 -85 56 -130 -159 37 22 103 -3 287 137 -178 -101 -85 -70 -34
4008c4K47k49O3L0k73L26r5M3r7K9j68R7K35l97K44j00rM3N8j16l4K83j74nj98
4033b51J32Q1j49L24j80M1K86l02j2K3j91L86q8k3j11k49J69Q8Q9j78m4J51p9
4056h7j14L38k55J98L1j33l4K16j40l0M5n2J88l8J4j54p9K77l77L65j02J10l60
4079a73J46J01q5O4j82j2K45J73j80k76K67j2k03q4J26K30k62K5J67k58J51K1
4101a1n8P5k2k9j24L85k6k13j4L39p5k19M24n81L43k78K38j86P7L1j03K07m2m45
4125c07L92p8q1R4Nl13L34m29L92K17j34n6NK45l29J05j70J19j14KO3k70N28j30
4149I0j39J00j22L6J28k8Q5j98J70k60j74L00R1JQ4k19J15j21J53j60l8q4J92
4172BRq1j69M25r7r1moK27k62J16k40L73l07K43k04J6k94J41O1N4J27N4k58J70
$$ plain form
4008 -34 213 -36 27 57 -216 110 15 58 -39 -10 -178 -81 154 -243 1 -99 -108 -65 -7 -123 -157 126 -48 -53 -251
4033 -251 -119 -38 -187 137 -43 -2 284 -18 -30 -7 -198 188 100 77 -34 -283 -114 -26 63 -115 -159 -8 -87
4056 -87 -201 137 -118 80 111 -22 -56 160 20 -10 35 -17 171 133 147 -7 -86 191 -186 179 77 187 -173
4079 -173 -27 74 -11 53 -129 -141 104 277 97 -179 88 76 -127 -211 -85 145 -117 -92 75 -183 -32 -11
4101 -11 -69 6 -16 -45 -169 216 190 -23 -37 302 227 8 432 -149 194 -84 154 -32 45 76 -27 180 138 -307
4125 -307 85 7 -74 20 25 -288 46 -383 9 226 92 36 41 286 -43 62 -108 11 -103 -101 -38 -308 220 90
4149 90 -49 51 -71 -35 93 65 150 -48 122 -138 -312 -12 79 80 164 -55 60 -61 92 -68 -106 -190 2
4172 2 11 -70 -239 186 89 -2 -6 -12 215 -47 69 -171 202 -105 138 -66 -50 -344 -203 -142 -88 39 93 -165 5
4197Ek72R6J4p1k8L20j49k5n2K65j97j96K68KR3o2R3n13N11j83M17l65K04l63
4221a88L52L5k67K76K6j0l74j21j30L45J04L8j27M8O8j4K9r8j85J62Q3j15j72
4244b35M5K13J73k2k77j84%J98K26k57K04m1L6j40rJ04ll5K41l02J44o5j66L76
4268B24j88k38J02j65M85k54j37K53L6l20J1J49K65k71p4J80J16j23j36ll7J57
4290C2Ol25K24j23j33J55J27RL6l2n4J07l08L77n2Q3J7q8j3k5M9N3l46j0J97j
4316c8l8o7J08p6p1J16O9R5j26J68m67M45j28j3j02Q4K00k07j21N0J14j34K09
4339G0Krk60J52J88q8q6j26J45j89M59M7m31J60j28J59M4J32k88K49l58J97m4
4362cK0M4k5k24L01Kj58j22K76j61K10n18O60J02l24o5r3J97J10p3kl94N6K45
$$ plain form
4197 5 -267 -171 -157 -228 -256 64 -85 -110 -162 103 -94 -290 -22 -20 73 11 104 -409 102 -81 336 -29 175 -188
4221 -188 164 199 -68 208 234 224 -150 -271 -401 -56 48 86 -41 7 75 61 90 -8 -193 -31 52 -63 -235
4244 -235 -190 23 196 174 -103 -287 -287 -89 137 -120 84 43 79 -61 -70 34 31 -4 237 -65 79 14 -152 224
4268 224 36 -202 -100 -265 220 -34 -171 82 118 -202 -191 -42 223 -48 -122 58 174 51 -85 -88 -125 32
4290 32 38 -287 -63 -186 -319 -164 -37 -28 8 -24 -78 29 -279 98 46 129 146 58 45 20 69 122 -224 -234 -37 -38
4316 -38 -76 -143 -35 -111 -182 -66 3 98 -28 140 -327 118 -10 -23 -125 -41 159 -48 -169 -119 -5 -139 70
4339 70 72 63 -197 -45 143 55 -31 -157 -12 -201 258 305 -126 34 -94 65 109 241 -47 202 -156 41 -3
4362 -3 17 61 36 -188 113 115 -43 -165 111 -50 160 -358 302 404 80 15 -78 119 229 156 154 -240 -184 61
4386F1m1j02J28j90L6Kj83K14r7J75K4J83j69j08K79j61M8m29L09L6q7J90j40
4409b2L15l14j1L31k15o6l5pP4O0k62L46n9k73L89k20J1j85K69K7k28J2K43k52
4433g2J06l94K51L21J01j64J50l42k47N96l76j89J34N7j5K06o8LN4j14M1k40M80
4456B79j67J4O7N0j01j73J51m1k92L56N2k42j99M0R2J01l7o5p3J99K23j71q3k17
4480b37J22L20j85j17L47j11j2%N0k0k69J90q5J60n85O44l66J77J01J29l03K4
4502b6K3NJ77Qj92J31j31j52K31j60K71nl12K05R3l64J5J05n4k24J59J79l5R3
4526D0R4q2Jj44L50p7l72r5N91l95k64K45L10j63l0J65r7K23j37j97J7n9J37O
4550F7j71J29L7J12j09K3l80L36K4l34L49K4j55j5K56j28k2j55q9J55n7J32j34
$$ plain form
4386 61 20 -82 46 -144 -108 -106 -289 -75 -172 3 27 210 41 -67 212 51 99 -330 -21 15 -72 118 -22
4409 -22 293 -21 -32 299 84 18 -17 -24 50 110 -152 194 135 -138 251 31 42 -143 126 153 -75 -63 180 -72
4433 -72 34 -360 -109 212 313 149 299 -43 -290 306 -70 -259 -125 -68 -83 123 55 58 112 -2 39 -201 279
4456 279 112 126 193 243 142 -31 120 79 -213 143 195 -47 -246 -206 -114 -13 -50 -115 -188 11 234 63 -20 -237
4480 -237 -115 205 20 -97 250 139 127 127 177 157 -112 78 -7 153 -432 212 -154 23 124 253 -50 -26
4502 -26 -3 2 179 187 -5 126 -5 -157 74 -86 185 180 -132 73 166 -198 -183 -78 -132 -356 -197 -18 -53 40
4526 40 134 52 53 -91 259 182 -190 -285 306 -89 -353 -108 202 39 9 174 77 300 163 -34 -17 -76 61 67
4550 67 -104 25 62 174 65 88 -292 44 68 -266 83 107 -48 -63 193 65 43 -112 -201 -46 -103 29 -105
4573a05L80j88j08K52m71K89J49k66J28j17K14K1l2k19l1j8N6K20l19J64j12M22
4595C09l82L57k73j53j24K99N2J10K1l74K38J06j53j16K99k81J78l65J94n9N4
4616f3J57j50j54L93j9%l61K15k33L18Lj15M3l0K2l2K0N3k52NM01j90j79K81k50
4641a17lL40j82j76j01J12Q2J33j13K03l05j23L03j5q6J63J89m30J89P3LO6m00
4664a95M23k25J41j99l01O42n41L23j62L36q4k26J89J3j98n2MJ43j64O83m69j41
4686f0R6j05L38j66R4k29K65m67J08K4M7MJ96j62j14j11L71Jq1N0l04M23j3q4
4710A21j70m5q2L11j09K9l16J75P8j2N7j79J17K36n7j24L48m03p1K72q5l1k10
4733a50RJ61P1O9k29k97J14L19l02L48l67M62l02O8K80m08J73L22o9m39K81j70
$$ plain form
4573 -105 275 87 -21 231 -240 49 198 -68 60 -57 157 178 146 -73 -104 -122 -66 154 -165 -1 -113 309
4595 309 -73 284 11 -142 -266 33 85 195 216 -158 80 186 33 -83 216 -65 113 -252 -58 -117 -63
4616 -63 94 -56 -210 183 164 164 -197 18 -215 103 106 -9 34 4 26 -6 14 67 -185 -180 221 31 -148 133 -117
4641 -117 -120 220 38 -138 -239 -127 -45 88 -25 178 -127 -250 53 38 -48 115 304 -126 63 136 139 205 -195
4664 -195 228 3 144 -55 -356 286 -255 68 -94 242 158 -68 121 134 -64 -116 -112 31 -133 550 81 -60
4686 -60 36 -69 269 103 197 -32 233 -234 -126 -102 -55 -51 145 -17 -131 -242 129 130 49 99 -205 218 205 121
4710 121 -49 -94 -176 135 26 55 -261 -86 -8 -20 37 -142 -25 211 154 30 378 -25 -96 176 91 60 -150
4733 -150 -141 20 91 160 -69 -366 -252 67 -235 113 -254 208 -94 -26 254 -154 19 341 272 -167 114 -56
4755e6kK63j57K44l17J74k4k19l1J16l7K17J74j32m24L83l1j61K45j01j37j72
4777a85J29j41L13l21L47j41k6J47j22L4p0L3l0J06j42O0j6K57r0j99J00M7j47
4800e7J08k08K10Q7o4j78J78m1j41J06j2j42K02k17J90k23K13K14J4q1k55K0P7
4823@j43O2n4K79j95J50o1j81K57j43J92m12K76l83L85j8q2k5K0j05mK31k56L79
4847A69j46l20R6J15J55m0j30QP0J03k19K7L56j14j7j36R7l48L26R0ro8l7K13
4871B41l04J84j72K40j70j53K60p1k29K88j26K50l81K01L3j47NJ27q7m1K0k88
4893c20J27L83m55J66j51K63k25N8l6R6K98l22lM71l15j4J04j5k04n2J54O9n6
4916B1J4j47M3j85L61j81K46p0j86K27pl69M60j45j77K48j21q1k0K08J6k60L76
$$ plain form
4755 -56 -58 205 48 292 -25 149 125 -94 -125 -9 -46 171 345 213 -211 172 141 -20 225 124 -13 -185
4777 -185 -56 -197 116 -205 142 1 -25 122 0 34 -36 -3 -33 73 -69 -9 -25 232 142 -57 43 90 -57
4800 -57 51 -157 53 140 76 -102 76 35 -106 0 -12 -154 48 -169 21 -202 11 225 239 158 -97 -77 0
4823 0 -143 -81 -135 144 -51 99 38 -143 114 -29 163 -249 27 -356 29 11 -71 -96 -76 -181 -185 46 -210 169
4847 169 23 -297 -201 -86 69 29 -101 -93 -23 80 -139 -112 244 130 113 -23 74 -274 52 142 133 65 28 241
4871 241 -63 121 -51 189 19 -134 126 55 -174 114 -12 238 -143 58 91 -56 -51 76 -11 -52 -32 -320
4893 -320 -193 190 -265 -99 -250 13 -212 -154 -190 -94 204 -118 -121 350 35 21 125 110 -94 -146 8 77 21
4916 21 35 -112 -69 -254 107 -74 172 102 -84 143 136 -233 227 82 -95 153 32 -49 -69 139 155 -105 271
4939B71j47m58K73K6j0J43M9PQP9k47ll11K70J77N3m41J06L78j15qN5L6j34O4
4964A21l14M66k10N8o1P5k84K45j87K37l32L03R7m2j44l9K16p0R5m09J14q9N31
4987C77k78rm75M83Q3O0m03nL16j17L8k26J44J68j9k10K29j24o6N1j71o7K76P9
5011A34K9k95L72k59J12q7p6j64L99o5k13K46k15M5J80o7j96M59n84Q8K70j19
5033fk18K04j8k1K2J20j88K17n1J90l46L4K93r8L2M4j80o6Q4j59J39j3L8j4R7
5058A36J51j75m1j07L3L2r5J06k08L81R8l61l6K62k2m4l2n4k10J66L9rN4o1j07
5083a04j37K83K69j63J3k00L7M7k04K28j34K0K07k41j94J87J86L6j88j07L49j12
5105G8k05J35o8j77L15k3k70J00j08K54j92J58LJ10k05K64k63J05o9o2j39K56
$$ plain form
4939 271 124 -334 -61 -35 -45 98 147 154 162 241 -6 -9 -320 -50 127 180 -261 -155 223 108 100 155 191 57 121
4964 121 -193 273 63 121 60 135 -149 96 -91 146 -186 117 214 172 28 -11 205 135 230 -179 -65 -154 377
4987 377 99 90 -385 98 181 241 -162 -167 149 32 70 -156 -12 156 137 -73 156 32 -34 17 -154 -221 55 134
5011 134 163 -132 240 -19 93 6 -70 -234 165 100 -113 133 -82 -37 143 76 -120 339 -245 -157 113 -6
5033 -6 -224 -20 -38 -59 -37 83 -105 112 61 251 -95 -61 232 134 166 210 30 -36 48 -111 28 15 53 39 136
5058 136 287 112 71 -36 -3 29 -66 40 -168 213 311 -50 -86 176 154 110 78 24 -186 -20 19 10 64 3 -104
5083 -104 -241 42 311 148 161 -39 -2 45 -159 69 -65 -45 162 -79 -273 -86 100 136 -52 -159 190 78
5105 78 -127 8 -60 -237 78 55 -215 -115 -223 31 -161 -3 0 110 -95 169 -94 11 -58 -120 -259 -3
5127cJ80l12J12l9j70L10J34l27J55J60j08k47jL24k29Q5Q6j42o4p6K26p5l7n6
5151a14K56k10J95l2q6J06k01L77n27M66j03N9j76k07O13m07J28k15J89j23M70
5172D58l63J29k42Q8j24j1J80l27K08Q6k57K48J19j88J49j30j44K32q7j63Q2p9
5194a36K36j19k08P2K17n12L90K73m56K5L13Om7J4k49K70j29j72J02q9L13Ok8
5217I2O1l1j44p9R3J86k11J05K7k77N25l95J02J42j23R1k97O3J54o3J95k48J29
5240I7j36J91l50J96L82m28K27j68J38j88J1J55j50j67J45J70O1k72Q2r2J36M6
5262H6k05K10k52K42m8p9K5J97j21k45L93m53K8J86K08l79K55m35M25Q4j60J04
5284F6j80L59m28J56J37j28L28l08l1J24k42K36l8R0j18k09K42k4N6j83L15k12
$$ plain form
5127 -3 177 -135 -23 -62 -232 78 212 -115 40 200 92 -155 -156 168 -61 24 110 -32 -96 -172 54 -21 -58 -114
5151 -114 142 -68 127 95 9 115 -86 291 -236 230 127 186 10 -197 416 9 137 -78 111 -12 458
5172 458 95 224 -18 70 -54 -65 115 -212 -4 82 -175 73 192 4 153 23 -121 111 24 -139 -57 -136
5194 -136 100 -19 -227 -155 62 -450 -60 213 -243 -218 95 101 54 68 -181 89 -40 -212 -110 -199 114 120 92
5217 92 153 122 -22 -101 -8 178 -33 72 99 -178 347 -48 54 196 73 164 -133 -70 84 21 216 -32 97
5240 97 -39 152 -198 -2 380 -48 179 11 149 -39 -28 127 -23 -190 -45 125 186 -86 -4 -96 40 86
5262 86 -119 91 -161 81 33 -46 -21 176 55 -190 203 -250 -222 -36 172 -207 48 -387 38 122 -38 66
5284 66 -114 245 -183 -27 110 -18 310 2 -29 95 -147 89 51 141 23 -186 56 32 88 -95 220 8
5306Hj23L7o3L08kj99K4N0r2J33j98J48j55L74l03q3J33r9J40k65J50l4J14p8
5330g5o3N9O7o8J41k16M97m35Q9j5J55J4n5k14L7k4O1j74J77J79K7l18J03J01
5354E0k13O46n48K24l47q8K06J43j46R7j23K91k79L4Q1O9J52k51l00J26N0R9J64
5377A37j55K1k2J45k98J55r8J13J29l53K06j12P5qK03j27J61j31K3J53k25l2R0
5400E0J9j10N8j10K55Mj70J0Q5j75N5K9k69J19J45L1J05k87J99j29J86k28J13
5423a5j5j28J53O0J67l41J53Q0k37m6L49j58m8k0O0J1K9l3K91j68l77L31j51K06
5447A53l73K26P5l1J45j31j08j71J12MnJ17K37l04j05L04J61j07k77Q1L60j06
5469B57k40QP3k73O7J07J8n1j47K79j63m1K41k08J61p5K00l47j6Qp5K29r8R6L4
$$ plain form
5306 8 -115 -78 -141 167 165 -34 -10 40 -52 81 -117 31 -124 250 -53 -136 -3 -102 38 -227 -77 -111 3 -75
5330 -75 -138 -79 -12 -80 61 -155 342 -93 -4 -19 136 150 95 -119 -82 -106 -45 -219 -42 137 164 -154 -51 50
5354 50 -163 483 -65 159 -188 -276 -70 73 -73 24 -99 192 -87 -53 28 97 249 -2 -302 -176 -126 -27 137
5377 137 -18 3 -19 126 -172 -17 -115 -2 127 -226 -20 -132 -57 -65 138 11 172 41 64 217 -8 -40 50
5400 50 69 -41 17 -93 162 166 -4 6 91 -84 -29 0 -269 -150 -5 26 131 -156 43 -86 100 -128 -15
5423 -15 -30 -158 -5 55 222 -119 34 114 -123 -169 180 22 -26 -46 14 25 54 21 312 144 -233 98 -53 153
5447 153 -220 6 81 50 195 64 -44 -215 -103 -99 -104 13 250 -54 -159 145 306 199 -78 3 363 257
5469 257 17 25 98 -175 -108 -1 17 -34 -181 98 -65 -106 135 -73 88 13 213 -134 -150 -142 -217 12 -86 10 44
5494D4r1L84l47J16j92J94N6k90K32k71M06k42r2j3J94K48k56j77Q1k04L44k11
5516h7L30k51p6M55j87Pk17J82l07K16L81l15O8l03LO5p1K81rk12L88l10K39j70
5540A00j34K72j81R0J80l56J13l9l63M26j41%qj82K10N7lQ4j52ml51L25J57j8
5564H2k40O06o85M13j37l34K53J36j09N9m1l5P2rJ72j59q8Q3l3J77j77q9J56j17
5588d4j86J65n8k2L56J20m18J13J62j33j14O0J84j49k90K23k26M24k92P6r0K54
5610A15k48J42n3J5j0j44K89N1k68L1mn4L23j62j44K36j94R0J2%J7R1k79J26J52
5635A30j87L30j95k01j07J42K30j25j25K91l43J24k0J93l55M67k08J34l29J80
5655B6m2K7n0p5K65k21O7l67O82m03J96p5j19R9K12j97J3Q1K8j29l7j47J01K12
$$ plain form
5494 44 -47 337 -10 106 -86 108 164 -126 106 -165 241 -1 -93 -106 88 336 80 -97 -16 -220 124 -87
5516 -87 243 -8 -84 371 184 191 -26 156 -151 65 446 131 199 -104 -101 -36 -107 174 165 -47 341 31 270 100
5540 100 -34 238 57 147 327 -29 84 45 -318 108 -33 -33 -41 -223 -13 44 41 125 -27 -31 -382 -57 100 82
5564 82 -158 448 -237 176 39 -295 -42 94 -15 44 3 -32 40 31 203 44 -44 39 6 183 6 -83 73 -44
5588 -44 -230 -65 -123 -145 211 331 -87 26 188 55 -59 1 185 36 -254 -31 -257 167 -125 -49 -139 115
5610 115 -133 9 -44 -29 -39 -183 106 157 -111 -80 -84 -138 185 23 -121 115 -79 11 23 23 40 131 -148 -22 130
5635 130 -57 273 78 -123 -230 -88 142 17 -108 183 -160 -36 -56 137 -218 249 41 175 -154 26
5655 26 -16 11 -39 -114 151 -70 -3 -370 312 -91 105 30 -89 10 222 25 38 119 147 18 -19 -166 -65 147
5679A47R7pk71K09J02j52J2j68J38j18K06k40J44p3m7j20rJ94j85n4K28j12K16
5702A37j29J4p0J70P0k05J27l3M0l4k06K06R4k88Q3R1o5J50m8kJ13k79J76l19
5726b07K34j17j07L45j39k77M55P7k27Qj2rj20l8L12J22l84J90O5k06j08K45M2
5749A44j58j1k7L01l42J8n0J57oL0k98K82J50j0k44o3K38m5Q0Ol29K41j39J68
5773I3n6k47J00L5K96k12LJ93m98K63J44k58m9K12j4q1O1j34P1R2j46l3M96l0
5797C01l78j40J61p1N2P7m5J0j26R6L56k5k28O1o0m4N3P6m8j82J8R5K09l99N1
5822a30K23L4J4l5k59J53j09k2K30q4j38P2r6R7N7J68j16j80K24N5k63K76l9q1
5846E1K98k44l0L4k14P6O3o9nj02N5N2L2j63K69k53N1J08K33j73J06k6k20j6J11
$$ plain form
5679 147 244 237 -34 175 277 125 137 -31 107 -11 195 -45 99 26 -21 -141 -150 44 -141 -195 33 -79 137
5702 137 8 22 -48 122 192 -13 114 81 121 87 -119 87 181 -107 -24 67 2 152 104 102 215 -64 112 -207
5726 -207 27 -90 -197 148 9 -268 187 264 37 45 33 24 -96 -134 178 300 -84 106 171 -35 -143 102 144
5749 144 -14 -25 -52 249 -93 -75 -125 32 26 56 -242 40 190 180 -64 -127 111 66 146 152 -177 64 -75 93
5773 93 37 -210 -110 -75 221 9 12 205 -293 -30 114 -144 -193 19 5 -76 -15 -149 -78 14 -132 -165 331 301
5797 301 -77 -217 -56 -127 -75 2 -43 -33 -159 -63 293 268 40 101 41 -3 50 126 78 -104 -86 9 218 -181 -130
5822 -130 93 127 141 106 -153 0 -109 -131 99 15 -123 -51 -147 -50 7 175 59 -121 103 158 -105 171 132 51
5846 51 349 105 75 109 -105 -29 34 -35 -40 -142 -87 -35 -3 -166 103 -150 -99 9 242 69 175 149 -71 -87 24
5871B4J56j33j81K74j18j35Q8R4l20N13l55k8J49O2K21k16o2J37k46L6l7j07L35
5894A51p7Q1j59Pj9J52l15J59l6Qj41l6K16J5j03k15j42O62k5j42j01N3J0nk13
5919b15L83j31l6K39l23K00r6J11j96J66Ql29K56j90l1J40j24J05j19L38j60K14
5941B10j95K07l82J18K26k51K36n8k76q3L7M51l54J94k73J38N8JQ9k91J29K89
5963B20k83j8j23P0K56j43j15m5m7J82R2p0M0l4P1j8j73kN3o4L7O8J15o9l76L90
5989A4K4j89L34j67r4J17l8n4J74n0p8l32M42j81O1n1O7Pr0R9l6j1j03J09j20
6014a46J83K73l08l9j41nK6J07L71J1j99j43J94j98p7K8j78K74j04L28l67J34
6036B4L7O3j30k62L80o1j21O8j7R1j28J11mK69j64l35L06Q5l55R6k00L67p1k79
$$ plain form
5871 24 180 47 -134 140 22 -113 -25 69 -251 262 -93 -121 28 90 311 95 33 170 -76 -40 -77 -184 151
5894 151 74 155 -4 3 -16 136 -179 -20 -56 -48 -189 -225 -9 6 -97 -312 -454 208 183 41 -60 -7 3 -2 -215
5919 -215 168 37 1 240 -83 117 21 132 -64 102 110 -219 37 -153 -184 -44 -168 -63 -182 156 -4 210
5941 210 15 222 -160 -42 184 -67 169 111 -165 -248 -211 240 -114 80 -193 -55 3 4 93 -198 -69 220
5963 220 -63 -81 -204 -134 122 -21 -136 -181 -228 -46 46 -24 16 -18 53 35 -138 -140 -87 -151 -114 -46 69 0 -376 14
5989 14 38 -151 183 16 -78 39 1 -53 121 71 -7 -339 103 -78 -17 -68 -1 6 -84 15 -21 -32 -135 -26 -146
6014 -146 37 310 2 -37 -178 -183 -157 -50 321 332 133 -10 184 -14 -91 -63 -241 33 -71 257 -110 24
6036 24 61 124 -6 -268 112 51 -70 -2 -19 72 -56 55 51 320 156 -179 127 212 -143 -47 -247 120 49 -230
6060b30k3J32J26j51J15j93N39l32l12L75r1p7J42n6K7Q2l98K58J00k01J61k64
6082b71J10J16K47n4m0l5j12K92k02j7L28m45J07l31O5J16j6M87m49Q2K39l80
6104a63L94k6j28j14K48l46K47o8n8kn5K86j66q8J90Pj22j1o1K2q6J25k78L52
6128I9m27J16K82M0n3j46R3M9O0L1n5j3p9K25j13L06o00R5O5q5K64l27L55j61
6152B1j91n6K62o8K20k00r2L0J74j34J94l64K2J06L17j13r9p2l6p3P9K03j29Q2
6176H3M8k21J46Pj4J77O2j03q6K31m88K09p6j31L25k56j46J47K64l17K05k30O7
$$ plain form
6060 -230 -253 -121 5 -146 -31 -224 315 -17 -329 46 -45 -122 20 -36 -9 73 -325 -67 33 -168 -7 -271
6082 -271 -161 -45 202 148 108 73 -39 253 51 34 362 -83 24 -307 -242 -126 -142 345 -104 -22 217 -163
6104 -163 231 205 77 -37 211 -135 112 44 -14 -16 -71 215 49 -39 151 158 36 25 -36 -14 -100 25 -253 99
6128 99 -328 -212 70 110 57 -89 4 53 113 144 89 76 -3 222 109 415 -185 -90 -25 -110 154 -173 182 21
6152 21 -170 -226 36 -32 188 -12 -104 -74 100 -34 160 -204 -182 -76 241 128 29 -43 -79 -152 -73 130 1 83
6176 83 131 -90 56 63 49 226 288 185 99 330 -158 51 -25 -156 169 -87 -233 -86 178 -139 66 -164 -97
$$ [...]
8191F7
##END NTUPLES=NMR FID
##END=
